##TITLE=31Pdec_LR-688-C4-AK
 D2O, 124 sc
 3.6.2020
##JCAMPDX= 6.0         $$ Bruker NMR JCAMP-DX V2.0
##DATA TYPE= NMR SPECTRUM
##DATA CLASS= NTUPLES
##ORIGIN= UXNMR, Bruker Analytische Messtechnik GmbH
##OWNER= root
$$ XWIN-NMR		Version 3.5
$$ Wed Jun  3 10:41:58 2020 Russian Standard Time (UT+4h)  she@DPX200
##.OBSERVE FREQUENCY= 81.013821
##.OBSERVE NUCLEUS= ^31P
##.ACQUISITION MODE= SIMULTANEOUS
##.ACQUISITION SCHEME= undefined
##.AVERAGES= 124
##.DIGITISER RES= 17
##SPECTROMETER/DATA SYSTEM= spect
##.PULSE SEQUENCE= zgpg30
##.SOLVENT NAME= CDCl3
##.SHIFT REFERENCE= (INTERNAL, CDCl3, 0, 182.463)
##AUDIT TRAIL= $$ (NUMBER, WHEN, WHO, WHERE, WHAT)
$$ ##TITLE= Audit trail, XWIN-NMR		Version 3.5
$$ ##JCAMPDX= 5.01
$$ ##ORIGIN= Bruker BioSpin GmbH
$$ ##OWNER= she
$$ F:/spectra/data/she/nmr/P31/1/pdata/1/auditp.txt
$$ ##AUDIT TRAIL=  $$ (NUMBER, WHEN, WHO, WHERE, WHAT)
(   1,<2020-06-03 10:39:58.23 +0400>,<she>,<DPX200>,
      <continue with go, POWCHK disabled, PULCHK disabled
       configuration hash MD5:
       00 E9 B6 7A A2 85 ED C7 34 08 36 98 17 FE 4E 26
       data hash MD5: 32K
       C9 E2 DE 53 CA 03 37 AB 4F 26 88 69 CF 6C FC A4>)
(   2,<2020-06-03 10:41:19.84 +0400>,<she>,<DPX200>,
      <Start of raw data processing
       efp BC_mod = 2 LB = 1 FT_mod = 6 PKNL = 1 PHC0 = -1883.22 PHC1 = 566.002 SI = 64K 
       data hash MD5: 64K
       87 FC DE D4 DE 89 0A 47 65 87 20 17 75 28 88 3A>)
$$ ##END=
$$ 
$$ hash MD5
$$ F6 35 10 D9 FE 8C 0B B0 32 B0 80 36 96 E3 45 0E
##$RELAX= 
##$RELAX= 
##$RELAX= 
##$RELAX= 
##$RELAX= 
##$RELAX= 
##$RELAX= 
##$RELAX= 
$$ Bruker specific parameters
$$ --------------------------
##$DU= <F:/spectra>
##$EXPNO= 1
##$NAME= <P31>
##$PROCNO= 1
##$TYPE= <nmr>
##$USER= <she>
##$AMP= (0..31)
100 100 100 100 100 100 100 100 100 100 100 100 100 100 100 100 100 100 
100 100 100 100 100 100 100 100 100 100 100 100 100 100 
##$AQSEQ= 0
##$AQ_mod= 1
##$AUNM= <au_zg>
##$AUTOPOS= <>
##$BF1= 81.014009
##$BF2= 200.13
##$BF3= 200.13
##$BF4= 200.13
##$BF5= 200.13
##$BF6= 200.13
##$BF7= 200.13
##$BF8= 200.13
##$BYTORDA= 1
##$CFDGTYP= 0
##$CFRGTYP= 5
##$CHEMSTR= <none>
##$CNST= (0..31)
1 1 145 1 1 1 1 1 1 1 1 1 1 1 1 1 1 1 1 1 1 1 1 1 1 1 1 1 1 1 1 1 
##$CPDPRG= <waltz16>
##$CPDPRG1= <>
##$CPDPRG2= <waltz16>
##$CPDPRG3= <>
##$CPDPRG4= <mlev>
##$CPDPRG5= <mlev>
##$CPDPRG6= <mlev>
##$CPDPRG7= <mlev>
##$CPDPRG8= <mlev>
##$CPDPRGB= <>
##$CPDPRGT= <>
##$D= (0..31)
0 1 0 0 0 0 0 0 0 0 0 0.03 2e-05 3e-06 0 0 0 0 0 0 0 0 0 0 0 0 0 0 0 0 
0 0 
##$DATE= 1591166215
##$DBL= (0..7)
120 120 120 11 120 120 24 19 
##$DBP= (0..7)
150 150 150 150 150 150 150 150 
##$DBP07= 0
##$DBPNAM0= <>
##$DBPNAM1= <>
##$DBPNAM2= <>
##$DBPNAM3= <>
##$DBPNAM4= <>
##$DBPNAM5= <>
##$DBPNAM6= <>
##$DBPNAM7= <>
##$DBPOAL= (0..7)
0.5 0.5 0.5 0.5 0.5 0.5 0.5 0.5 
##$DBPOFFS= (0..7)
0 0 0 0 0 0 0 0 
##$DE= 6
##$DECBNUC= <off>
##$DECIM= 4
##$DECNUC= <off>
##$DECSTAT= 4
##$DIGMOD= 1
##$DIGTYP= 9
##$DL= (0..7)
0 0 52 120 120 21 21 25 
##$DP= (0..7)
$$ [...]
##$SUBNAM2= <"">
##$SUBNAM3= <"">
##$SUBNAM4= <"">
##$SUBNAM5= <"">
##$SUBNAM6= <"">
##$SUBNAM7= <"">
##$SUBNAM8= <"">
##$SUBNAM9= <"">
##$SW= 369.568048894756
##$SWIBOX= (0..15)
0 1 3 0 0 0 0 0 0 0 0 0 0 0 0 0 
##$SW_h= 29940.119760479
##$TD= 32768
##$TD0= 1
##$TE= 0
##$TE2= 300
##$TE3= 300
##$TEG= 300
##$TL= (0..7)
0 120 53 12 22 120 120 120 
##$TP= (0..7)
150 150 150 150 150 150 150 150 
##$TP07= 0
##$TPNAME0= <>
##$TPNAME1= <>
##$TPNAME2= <>
##$TPNAME3= <>
##$TPNAME4= <>
##$TPNAME5= <>
##$TPNAME6= <>
##$TPNAME7= <>
##$TPOAL= (0..7)
0.5 0.5 0.5 0.5 0.5 0.5 0.5 0.5 
##$TPOFFS= (0..7)
0 0 0 0 0 0 0 0 
##$TUNHIN= 0
##$TUNHOUT= 0
##$TUNXOUT= 0
##$USERA1= <user>
##$USERA2= <user>
##$USERA3= <user>
##$USERA4= <user>
##$USERA5= <user>
##$V9= 5
##$VALIST= <valist>
##$VCLIST= <CCCCCCCCCCCCCCC>
##$VD= 0
##$VDLIST= <DDDDDDDDDDDDDDD>
##$VPLIST= <PPPPPPPPPPPPPPP>
##$VTLIST= <TTTTTTTTTTTTTTT>
##$WBST= 1024
##$WBSW= 4
##$XGAIN= (0..3)
0 0 0 0 
##$XL= 0
##$YL= 0
##$YMAX_a= 22019
##$YMIN_a= -24437
##$ZGOPTNS= <>
##$ZL1= 120
##$ZL2= 120
##$ZL3= 120
##$ZL4= 120
##$ABSF1= 0
##$ABSF2= 0
##$ABSG= 0
##$ABSL= 0
##$ALPHA= 0
##$AQORDER= 0
##$ASSFAC= 0
##$ASSFACI= 0
##$ASSFACX= 0
##$ASSWID= 0
##$AUNMP= <proc_1d>
##$AZFE= 0.1
##$AZFW= 0.5
##$BCFW= 0
##$BC_mod= 2
##$BYTORDP= 0
##$COROFFS= 0
##$CY= -3
##$DATMOD= 1
##$DC= 0
##$DFILT= <>
##$DTYPP= 0
##$F1P= 0
##$F2P= 0
##$FCOR= 1
##$FTSIZE= 65536
##$FT_mod= 6
##$GAMMA= 0
##$GB= 0
##$INTBC= 1
##$INTSCL= 5.30512e-09
##$ISEN= 30
##$LB= 1
##$LEV0= 0
##$LPBIN= 0
##$MAXI= 10000
##$MC2= 0
##$MEAN= 0
##$ME_mod= 0
##$MI= 50
##$NCOEF= 0
##$NC_proc= -8
##$NLEV= 6
##$NOISF1= 182.463
##$NOISF2= 159.3651
##$NSP= 0
##$NTH_PI= 0
##$NZP= 0
##$OFFSET= 182.463
##$PC= 4
##$PHC0= -1883.22
##$PHC1= 566.002
##$PH_mod= 1
##$PKNL= yes
##$PPARMOD= 0
##$PSCAL= 0
##$PSIGN= 0
##$REVERSE= no
##$SF= 81.0140089999434
##$SI= 65536
##$SIGF1= 159.3651
##$SIGF2= -187.1042
##$SINO= 113.3802
##$SIOLD= 16384
##$SREGLST= <1H.CDCl3>
##$SSB= 0
##$STSI= 65536
##$STSR= 0
##$SW_p= 29940.119760479
##$SYMM= 0
##$S_DEV= 0
##$TDeff= 32768
##$TDoff= 0
##$TI= <>
##$TILT= no
##$TM1= 0
##$TM2= 0
##$TOPLEV= 0
##$USERP1= <user>
##$USERP2= <user>
##$USERP3= <user>
##$USERP4= <user>
##$USERP5= <user>
##$WDW= 1
##$XDIM= 65536
##$YMAX_p= 348326178
##$YMIN_p= -102907053
$$ End of Bruker specific parameters
$$ ---------------------------------
##NTUPLES= NMR SPECTRUM
##VAR_NAME=  FREQUENCY,     SPECTRUM/REAL,   SPECTRUM/IMAG
##SYMBOL=    X,             R,               I
##VAR_TYPE=  INDEPENDENT,   DEPENDENT,       DEPENDENT
##VAR_FORM=  AFFN,          ASDF,            ASDF
##VAR_DIM=   65536,         65536,           65536
##UNITS=     HZ,            ARBITRARY UNITS, ARBITRARY UNITS
##FACTOR=    0.456856943014862, 1,           1
##FIRST=     14782.0589164792, 0,            0
##LAST=      -15158.0608439998, 0,           0
##MIN=       -15158.0608439998, -102907053,  0
##MAX=       14782.0589164792, 348326178,    0
$$ Real data points
##PAGE= N=1
##DATA TABLE= (X++(R..R)), XYDATA
$$ [...]
43629 -13810012 -23677261 -27851832 -23121274 -16479934 -13245864 -13410368 -16715322 -21871544
43621 -21871544 -22581281 -13334185 1806721 13532480 18178994 17626718 13267656 8873663
43613 8873663 13045412 26446617 32592070 17420888 -5633703 -8926595 11424917 31135076
43605 31135076 34169517 31446604 35056992 36008126 22810209 4944086 -656129 5037018
43597 5037018 9177603 9461987 12222345 14611743 7972902 -3782523 -7864734 -4660756
43589 -4660756 -7823968 -19480186 -23402460 -9927802 8322561 15977821 16664353 21485330
43581 21485330 26047042 17131789 -1066345 -7037078 6450888 17348718 2961839
43574 2961839 -26934081 -41214351 -27616792 -5319263 4290000 2879888 3446871 7496693
43566 7496693 7264336 2227257 -1011323 -1086136 -865450 2739273 14133575 26257030
43558 26257030 27707613 22542573 26055641 37854962 37558648 15508601 -9147807 -13817866
43550 -13817866 -2715497 3499539 -901357 -2889195 5226326 14033096 11760713 -161234
43542 -161234 -10471030 -11341296 -5342924 -1119371 -2754827 -4577427 -172625 5492324
43534 5492324 1974265 -7991186 -8397756 6018656 18884061 15215569 3554334 1747914
43526 1747914 9961765 13769862 8334821 2580458 1271622 -806701 -5528410 -6411535
43518 -6411535 -90379 8350927 14345164 18570331 20702970 17789836 11141628 6467175
43510 6467175 5154565 2898386 -2158509 -7619887 -13074816 -19337550 -21538588 -13191075
43502 -13191075 1444849 9420800 6460395 2844174 8212411 18707423 23320064 16506651
43494 16506651 1560662 -12572292 -16113371 -6393658 7678381 14632165 13100841 9256130
43486 9256130 5559764 2595254 8108972 28724533 52853700 59147547 45394581 31523440
43478 31523440 28212838 21900772 1795768 -17149964 -15470331 363738 8566403 4820358
43470 4820358 4298676 14462413 25084258 26421905 20973072 13621578 3737807 -7568779
43462 -7568779 -12908216 -7577096 3786588 14101122 21486647 25860715 23620719 12006905
43454 12006905 -3122708 -9387865 238785 19179443 32944073 33544459 26163038 20101247
43446 20101247 17193065 14496852 14678304 23555730 36701261 39699501 26664369 9374765
43438 9374765 2070546 5520345 12532215 19970114 26120784 24262620 10686932 -5418788
43430 -5418788 -11261702 -7066809 -3827512 -6988908 -11839650 -13108690 -9737231 -1447774
43422 -1447774 10283058 18350291 15481908 3693471 -8257485 -15604343 -19339322 -19665026
43414 -19665026 -15118089 -6473436 4808218 18647192 30248053 27992913 8011074
43407 8011074 -13625496 -15864685 1727161 19756460 24051565 18554265 14393996 17815546
43399 17815546 28418466 38398870 35337703 17543728 2931355 7259217 17150203 5518676
43391 5518676 -25308696 -39963938 -17960081 16828389 28873839 15772226 2971521
43384 2971521 5911989 16252014 20563093 16637397 11129270 10471259 14223065 13849287
43376 13849287 2407723 -12535580 -14473608 -188240 14519478 17058851 13842181
43369 13842181 15722802 19990617 17719950 8688191 -2027665 -12751996 -20229921 -16864549
43361 -16864549 -4398317 1278676 -7850096 -16984321 -10452234 3724362 8610984 5306179
43353 5306179 4073465 -278660 -18476641 -38833231 -36875834 -11846777 12215617 22325835
43345 22325835 27211009 29947505 19049136 -4216898 -16505408 -4725220 13135128
43338 13135128 13779226 -2165299 -19318776 -28943041 -28460238 -16516151 -2326501 -3833195
43330 -3833195 -22082452 -33218981 -21141848 -1502263 4529211 3371068 13271589 29329632
43322 29329632 30895056 16194369 2927989 -2607970 -11228035 -24936911 -29981404 -21092914
43314 -21092914 -11346137 -9849339 -7235556 7155744 27242612 38601272 35050336 20015104
43306 20015104 382305 -14959791 -18491531 -11699559 -3781535 -332121 341440 -414330
43298 -414330 -3617657 -6025111 -1826663 6736773 10482777 7336183 4656830 4776513
43290 4776513 48274 -12509186 -22364160 -18000309 -532009 19846350 33215380 32784140
43282 32784140 18314768 693940 -6921317 -6134382 -10288998 -21411738 -25231298 -15614788
43274 -15614788 -7127082 -12031742 -20626884 -19389460 -14528641 -19012260 -27511506 -25830410
43266 -25830410 -18105608 -21338875 -35186079 -40531414 -30469435 -20603043 -22002715 -23893950
43258 -23893950 -13802879 1107751 5822643 -291748 -5541783 -3287619 3162427 8124607
43250 8124607 7677716 506613 -8733226 -11638649 -7743674 -8419689 -21962173 -39695813
43242 -39695813 -44903409 -32380716 -11945711 4489525 11811186 9849025 975069 -9353336
43234 -9353336 -15072060 -14179186 -9045357 -3520841 -1860013 -7082878 -16375658 -21213404
43226 -21213404 -16756425 -8339408 -3684177 -1897528 3309927 11831663 16595476 15070802
43218 15070802 14044147 20379477 31838734 39757470 38216541 29300890 21165969 20905252
43210 20905252 27636379 33614089 33183908 27209079 17047622 1330746 -15210280 -17742995
43202 -17742995 1961951 29186985 40808416 34839222 29530699 31903751 27166379 7904708
43194 7904708 -6426417 3276101 23077793 22621446 -2071467 -24874107 -27653789 -19899129
43186 -19899129 -15942279 -13731222 -6850591 -874128 -3260781 -7746129 -3524181 6144552
43178 6144552 7681797 -3665466 -19234227 -29004560 -28752062 -17731331 929418 18288672
43170 18288672 25976363 23640307 14538204 -1205546 -20238467 -29132214 -17730236 2943513
43162 2943513 10800289 1126652 -9774520 -11153247 -11505927 -19831016 -29084410 -28334966
43154 -28334966 -18981465 -8156556 3394415 15923789 23235196 22479240 21999505 26699547
43146 26699547 25355992 8090901 -12222629 -15207571 -4419946 -2270890 -14482298
43139 -14482298 -21914675 -12227843 1372710 2313799 -5718535 -8904558 -3500758 6069548
43131 6069548 18203992 30686138 34871184 25664971 11102738 1115134 -7157965 -21510219
43123 -21510219 -37283373 -40380967 -26183683 -5493412 7980547 9102141 2494953
43116 2494953 -1181906 6506815 20492192 23514294 6211635 -19160000 -33725757 -34805672
43108 -34805672 -32589743 -29598710 -18674202 -537992 12180737 12566747 9439915 14591057
43100 14591057 28025788 39701933 39898664 26652001 9246195 3477535 15219302
43093 15219302 29967749 28524510 11582878 -2910116 -5091151 -964236 4710643 14476414
43085 14476414 23278089 18396916 3658895 2903414 24262050 40239351 24743492 -4867428
43077 -4867428 -9330344 16379460 36916589 27158543 1805192 -12975996 -13200912 -8611185
43069 -8611185 111325 16283858 29922247 25583938 5620092 -10062049 -9269272 -501371
43061 -501371 2822646 718919 2408697 10463901 18113758 20500326 19971152 18264913
43053 18264913 11300330 -2502035 -14367770 -14400351 -6524012 -4526413 -12576897 -19730365
43045 -19730365 -16670465 -7410578 974110 9455923 19449112 23971647 17807509 8974975
43037 8974975 7508157 8987990 3117283 -6607207 -8217485 -3384601 -5637337 -15504566
43029 -15504566 -16795008 -3280768 8979751 5540272 -5238923 -6599286 2669489 11058272
43021 11058272 12546872 10118957 7048581 4794446 4943745 5653248 1641709 -6371084
43013 -6371084 -10218782 -8400892 -10642105 -19532245 -20466554 -3473356 16479626 18297706
43005 18297706 5243789 -2434865 1230285 5369612 7003586 14040112 22392637 15257784
42997 15257784 -7567680 -22630032 -16218769 -4313430 -5166881 -11002781 -5578404 5491205
42989 5491205 4915773 -4541811 -2515430 16633561 35790739 42251483 43648575 50040352
42981 50040352 56239843 52253835 40202850 29899425 24643411 21661681 21925612 28884584
42973 28884584 38595020 40460389 29649835 12425632 -2776566 -13786756 -21353447
42966 -21353447 -23148276 -17194950 -8727897 -6587555 -11630700 -14183038 -5759563 10598776
42958 10598776 24524233 28941317 22830228 7767678 -11840556 -27094597 -30472845
42951 -30472845 -24359043 -18627466 -19207168 -23684758 -27660228 -29031619 -25560933 -15679046
42943 -15679046 -3947404 1410951 -492572 -1630225 2108375 4417162 184155 -4432172
42935 -4432172 -1312994 6770918 11739456 13377919 16356065 17712285 9932224 -3290914
42927 -3290914 -6929782 5318203 20538160 22640207 12383882 4316111 7430695 16042164
42919 16042164 19422279 14493007 6203399 -1664880 -11129029 -23499325 -32138515 -28428260
42911 -28428260 -15749635 -9751685 -19119438 -31794734 -28666601 -8352439 10660340
42904 10660340 12766527 1923692 -6428874 -3295174 7117286 13596878 8008353 -7415126
42896 -7415126 -21293202 -24437332 -19523814 -15537294 -14772071 -12625111 -9254738 -11361565
42888 -11361565 -19741301 -24634684 -18477793 -5546103 5952432 13344006 15601119 9425585
42880 9425585 -2219367 -6193470 4873517 18931256 19427569 9309557 5522175 11402885
42872 11402885 11140646 -5248593 -27237915 -41024454 -47471975 -52510325 -51073344 -34534938
42864 -34534938 -8180527 12166518 18670280 15626824 7552299 -4809175 -17181540
42857 -17181540 -23066126 -24257163 -28233239 -32217415 -22854355 2093416 24229316 26312300
42849 26312300 13764179 3949296 3045904 5917200 10455231 16086921 13646338 -4693100
42841 -4693100 -26965023 -32174465 -21128126 -16475349 -27260648 -35171807 -26153701 -13885427
42833 -13885427 -15064725 -20059020 -10336325 8454532 16068335 12011714 13450105 22058740
42825 22058740 21076118 8136556 3218081 14726078 22619696 9416462 -12660673 -22178750
42817 -22178750 -19078032 -16092401 -13347860 -2845040 10123118 11926253 4325771 3688228
42809 3688228 15372612 25572426 22235257 10489162 2411185 2207612 6930711 13724505
42801 13724505 20586991 24652689 23963017 19041127 11992784 6013250 3898840 3599574
42793 3599574 -1851405 -15159446 -28465818 -31627246 -23797862 -11582416 -439315 5199595
42785 5199595 -464060 -15854641 -25047818 -12872569 13698753 32143187 33096483 29057295
42777 29057295 31767303 35433370 29722408 17361743 8262696 3392973 -5043508 -20261088
42769 -20261088 -35330248 -40077461 -29996242 -10671302 4887766 7955461 5048385
42762 5048385 10741492 26513507 34997200 21783026 -4154172 -20897683 -20146553 -13275093
42754 -13275093 -12219518 -14886961 -12747450 -4813908 2418477 5351872 6732538 8667296
42746 8667296 8563880 5434220 4883819 10785489 15075783 6431109 -9828414 -13231838
42738 -13231838 3919618 22456339 21557930 7498087 1830439 9420338 18102578 25146155
42730 25146155 39253300 54065261 46388989 12404598 -16606286 -11414340 18471823
42723 18471823 42011257 45984515 38293807 24887400 6967124 -5256003 -160212
42716 -160212 13923456 15460990 -122513 -15558100 -19828732 -21793609 -28934513 -30798043
42708 -30798043 -15976015 7026513 19769388 17878580 12907318 13908962 18237913 20450677
42700 20450677 21260616 24378958 29191037 30586229 25343548 15862074 6027457 -4500692
42692 -4500692 -17769110 -29847890 -32138540 -22874511 -10620968 -2009645 6640749 18996026
42684 18996026 28076391 25991099 17886581 14094037 13297667 7704985 2008809 10480392
42676 10480392 33609136 53535145 57461102 51943297 48466943 47858861 45809143 41944026
42668 41944026 35821834 24697741 12617565 10367174 17880673 18694226 3130876 -13935113
42660 -13935113 -12227950 5658066 20439015 24219848 25101094 26232048 18774086 -276368
42652 -276368 -18087464 -21370113 -12481404 -3433810 -609830 -1930590 -4483837 -7964055
42644 -7964055 -11481142 -11994541 -7844290 -2554055 -2788487 -10320515 -16954681 -12048606
42636 -12048606 3151220 13601125 6975754 -11339319 -24107327 -20428118 -4199458
42629 -4199458 12494491 19874784 16630669 9641792 6044133 4552587 -198834 -3859777
42621 -3859777 6185147 28713821 39884770 20627036 -14512452 -33093169 -26716000
42614 -26716000 -18532394 -26496409 -38582759 -34394813 -16164514 -3491108 -5504226 -13576163
42606 -13576163 -19484005 -26818842 -40464595 -53842695 -53794596 -36029473 -10581810 9265731
42598 9265731 20097556 26834023 30242399 23717207 5834392 -11552888 -15903107 -10358273
42590 -10358273 -8430179 -14938657 -22104745 -23332116 -20220670 -15616377 -10293812 -7263077
42582 -7263077 -8215619 -5142925 10921405 30754977 32900506 14622462 -466381 4073843
42574 4073843 13530423 6678202 -10751246 -17298955 -10143302 -5692317 -10647001 -15016374
42566 -15016374 -13824694 -14507411 -19106620 -18036033 -7470468 3230543 7576942 10283668
42558 10283668 13112434 7799152 -8070165 -21925792 -23183570 -17706286 -15225067 -13351594
42550 -13351594 -5094267 7502964 18672954 29342323 41043429 47522218 43905267
42543 43905267 36826946 34261185 32982654 27340883 21355626 19081387 12975592 -2241257
42535 -2241257 -14085151 -10028092 -1978715 -9963436 -27689314 -31312414 -19898472 -16201881
42527 -16201881 -23821459 -17679589 10238397 28469900 11096466 -21425298 -32704792
42520 -32704792 -20645183 -8175340 -761257 12931241 27077138 21198812 -2886703
42513 -2886703 -18628330 -15087706 -11554235 -22725053 -34936585 -30688017 -16231997 -9134782
42505 -9134782 -13445864 -21676907 -29261670 -33481089 -28127423 -12180743 3866297 10881539
42497 10881539 12598763 15110346 14092101 3406515 -11402403 -19407563 -18260282 -13012413
42489 -13012413 -7915692 -7167884 -14151710 -20549690 -8240026 24366232 49459940 41224568
42481 41224568 11732184 -4437315 4246059 18057940 20882708 18516120 17802330 10977589
42473 10977589 -8101248 -29543473 -41543533 -45752221 -46980810 -39495345 -17225227
42466 -17225227 10244592 25485127 23834484 16351522 14596455 19982411 25826477 23964776
42458 23964776 11854929 -2590386 -6896925 1954393 14673284 23548927 30812992 38127916
42450 38127916 38127621 26318309 13334754 12869153 21923658 25504697 18503535 10438341
42442 10438341 8912442 10816057 11987479 14039787 17049819 14976795 4644426 -7180823
42434 -7180823 -11884339 -10040210 -8990867 -12117029 -15399637 -13778308 -7476282 -1704183
42426 -1704183 -1541125 -7447181 -15854295 -23815270 -30982108 -36154623 -35682779 -28913586
42418 -28913586 -22044733 -21235549 -23698655 -21386504 -12438590 -2840021 2566778 3645852
42410 3645852 -516104 -12156699 -27250301 -35442226 -32514211 -26709310 -27049894 -30446371
42402 -30446371 -26800860 -13401023 2250912 11784632 12082746 3801772 -9324692 -19196635
42394 -19196635 -17530223 -4309177 10704027 16836436 11791229 2330567 -2128450 3217867
42386 3217867 14968995 24313582 25035222 19557302 16682439 23703560 40338047 57585760
42378 57585760 61506929 42882682 8135746 -21926923 -30449089 -21270256 -12075062 -11931074
42370 -11931074 -13643117 -9961747 -7436588 -16467247 -33541296 -43675518 -40004042 -31924574
42362 -31924574 -30797722 -34344043 -30997200 -16942792 -2668383 -1069311 -12575120 -25493600
42354 -25493600 -30375159 -29659064 -30299619 -30808093 -23128888 -8046458 172821 -8922424
42346 -8922424 -25447296 -28616354 -10856244 15482357 34290254 39271911 31053112 12457264
42338 12457264 -7760798 -16047554 -7681303 6085088 11826400 9420568 5728536 -675523
42330 -675523 -15756181 -33276884 -36286204 -19362649 1401079 6566894 -5869390 -22727731
42322 -22727731 -31308815 -26954448 -11995695 4599023 10657566 2274677 -9688850 -11364963
42314 -11364963 -2827112 3504265 586906 -5057364 -4693189 625580 4546410 7302932
42306 7302932 15997425 32678197 47453714 47167408 29702161 6674979 -8285983 -11236259
42298 -11236259 -7202524 -1803332 2894188 7057445 12587753 22099883 32836056 33864161
42290 33864161 17843837 -4996260 -15888634 -13168169 -15420503 -31327437 -40864173
42283 -40864173 -22412960 11163024 25076397 9675489 -7206361 -511806 20082375
42276 20082375 30430134 26760841 22253219 19855306 9996580 -7268051 -17883215 -15060061
42268 -15060061 -8909932 -8964290 -10591472 -6615234 -952621 -800799 -3895990 -4080033 -2824943
42259 -2824943 -4149046 -3767561 3700610 10150427 1553983 -19318423 -32630133 -28135682
42251 -28135682 -18269215 -17543929 -21881113 -19252274 -10389503 -4944944 -3457848 1747392
42243 1747392 10081702 11853605 4927818 -918668 703255 4811579 6473683 9167863
42235 9167863 15864523 21453316 21395483 20216097 23703217 28911765 29671521 26811576 24990161
42226 24990161 23590162 18980166 13028513 11414465 14797156 18566310 20852984 25051967
42218 25051967 34329454 47470200 59458220 63826318 57154460 43767962 32049216
42211 32049216 23746696 13122416 79139 -4950326 3286119 12795705 8592501 -7276490
42203 -7276490 -21085612 -26698739 -26578049 -19371390 -2885652 13240348 15854750 10103374
42195 10103374 14695601 31610942 39000559 22091961 -5399080 -21076440 -20896762 -15020116
42187 -15020116 -9767212 -7346884 -12735954 -25279839 -30702873 -17070181 5466310 15192846
42179 15192846 6601575 -5585889 -8498289 -3932522 1329995 5617797 9778315 13623001
42171 13623001 17902394 23543906 28132511 28903516 28222484 29769731 31622942 30735951
42163 30735951 30926199 36245559 39220035 28702045 9315963 -1103701 3690782 10336416
42155 10336416 7900544 3240016 4925592 5358948 -6331578 -21859498 -21370280 -1929889
42147 -1929889 16821379 18343290 8080509 1228663 1880314 2970551 504179 -2912909
42139 -2912909 -7322878 -17558998 -32507836 -40473968 -32583785 -16240715 -6256072 -4034705
42131 -4034705 3946842 24261586 43595857 44907718 28832620 9754970 -3671913
42124 -3671913 -12642763 -16143766 -8795634 6821362 17574553 15202586 6263931 1621492
42116 1621492 3146941 5971555 6953429 4773940 -2213571 -11212650 -13157128 -3470421
42108 -3470421 8816890 10641628 1714854 -5654479 -2640486 7180673 14940367 15873431
42100 15873431 10659026 3344533 -167603 3702286 11544212 16315382 16820950 19409786
42092 19409786 27631757 34444365 29469549 12620700 -3881165 -7959655 402779 10914392
42084 10914392 14743889 12369279 10373115 13535263 21732765 32129001 40784834 42788032
42076 42788032 35128386 20982678 8097712 1235808 -1149806 -1589903 810437 6208537
42068 6208537 9396560 5069290 -3527537 -7016194 -1748536 5973540 9989672 13801478
42060 13801478 24336533 37457111 37007058 13571617 -18730925 -32151149 -15250012
42053 -15250012 12695815 23174195 10539439 -5760770 -9633029 -7391556 -13368132
42046 -13368132 -26322407 -30799145 -18866017 -642599 8292245 3774954 -5034665 -7372579
42038 -7372579 -2638319 -869820 -10564017 -26388748 -33552665 -26163784 -14841175 -11508066
42030 -11508066 -13890485 -13256632 -10685967 -12963306 -15689199 -6095490 15006277 28669764
42022 28669764 21410656 1338639 -16682860 -30154404 -42507327 -47642887 -35958280
42015 -35958280 -12134239 6846771 11597968 7642146 2736093 -2533634 -9598921 -16653810
42007 -16653810 -21522634 -22583452 -15492611 2272806 21317430 25078534 10443807 -5087281
41999 -5087281 -4381033 8320567 16201695 13855601 11332456 16519898 24905030 28240828
41991 28240828 23689594 11333456 -8417587 -29472647 -39371329 -31869981 -16849948
41984 -16849948 -10341953 -15983702 -22969885 -21815550 -14427658 -6301296 3513355 18004326
41976 18004326 31797507 33685031 20837585 4551987 -1469665 4545420 12587244 13046089
41968 13046089 6007699 -221256 2215997 12260718 18988381 11825704 -6356157 -19885632
41960 -19885632 -17111100 -2568066 11772825 21628701 28630548 28525827 14667384 -5994273
41952 -5994273 -14485571 -3175351 14167172 23131975 27627079 36836287 43706911 32740280
41944 32740280 4800627 -21924371 -35034026 -37545118 -34515780 -26026178 -16778814 -16761233
41936 -16761233 -25145143 -26987067 -14544861 332044 4950786 4978969 12017969 21887974
41928 21887974 21358974 11130493 5582742 10864978 18272582 20552429 20856762 22182394
41920 22182394 20559962 14291119 9591216 10356051 10515935 3957896 -3918183 -2374626
41912 -2374626 9836873 22224145 24323415 15654970 4278209 -2054359 -2896973 -3305485
41904 -3305485 -5118057 -3390334 5061664 13474984 12473512 3570402 -3037281 -3331968
41896 -3331968 -2056387 368244 11081698 29908090 43254494 41760160 34264628 33065568
41888 33065568 33282838 21199123 -838944 -13836733 -8128727 4176517 8072220 4985284
41880 4985284 4303797 4213277 -6438615 -28804862 -47989223 -50363522 -39791508 -30382689
41872 -30382689 -26818957 -19904429 -2558893 17485749 26533980 22089030 13944250 9749975
41864 9749975 7522937 3656951 392965 1239576 4859748 8212006 11237231 14082082
41856 14082082 14285652 11531874 10494223 13469958 15326908 12873608 13896968 26371220
41848 26371220 41310297 39108707 15350273 -10823344 -19549065 -12844558 -7481956 -11965803
41840 -11965803 -19603026 -21539343 -17224969 -10225247 -675657 12959052 26849825 31924619
41832 31924619 23853791 11068206 8036699 18152319 27214317 19560135 -753690 -12413225
41824 -12413225 -2711418 16481119 24551387 18285175 12712760 17460411 23681768 19118540
41816 19118540 6875211 54035 2649208 6700515 7480968 9853942 16405983 20379992
41808 20379992 17250103 13827395 16291722 17202696 7134486 -6148173 -5548347 9532309
41800 9532309 20939301 17229375 5833645 -4100822 -14258046 -25000562 -27599291 -20722691
41792 -20722691 -19756845 -34018017 -46628322 -35088090 -3475661 23959703 34097624
41785 34097624 30462571 14302605 -15696804 -45863656 -54386158 -40173898 -23582360
41778 -23582360 -14064841 -325720 20186227 28099250 13473386 -2421634 3003390
41771 3003390 19322803 20814088 5274058 -8307384 -11349618 -10459098 -6278624 7040794
41763 7040794 21832244 20526938 2977595 -10780646 -9881828 -4743438 -3767447 1112289
41755 1112289 14938506 24951526 20593201 13637489 20688559 35345283 36377942 19097871
41747 19097871 1068829 -3239276 1793163 5531185 6769606 10557163 17093342 20407786
41739 20407786 15352755 2662193 -11072816 -17270656 -11633941 1996394 14848632
41732 14848632 19963181 15566902 4928244 -4704058 -6566436 -1870410 300750 -4702956
41724 -4702956 -8908374 -3283044 5611369 1513926 -17522600 -32139040 -24927752 -2834695
41716 -2834695 11683045 7144383 -7499754 -17225674 -16124000 -8022484 372897 4024900
41708 4024900 2018041 -1418314 -789627 4191776 8389538 8365538 6614081 7103598 9518240
41699 9518240 10280179 7326440 1612908 -4703503 -9364643 -10040293 -5253026 4174112
41691 4174112 14529651 19931724 15557595 3225419 -7078363 -6005376 3500618 8090133
41683 8090133 336389 -11310138 -13126125 -2791350 10291623 18635765 23104652 25569568
41675 25569568 23017822 13293486 2194474 -843466 6083671 14014620 12470518 1119095
41667 1119095 -9343727 -8351199 3861815 18230790 27657399 31810560 31795306 26540078
41659 26540078 17325360 9787770 6374920 1955365 -7009544 -14300029 -13362779 -10252219
41651 -10252219 -15550966 -25000677 -21864445 -1888747 16652669 15120069 -2413191 -16653243
41643 -16653243 -17130998 -9698821 -3796968 -1463044 608017 3825657 4394397 -3449178
41635 -3449178 -19328926 -32503367 -31175463 -17232752 -4815631 -1581366 85526 8117162
41627 8117162 16689402 16422326 10999034 11496195 18513522 22761126 21443781 20605373 20716517
41618 20716517 14209938 1626451 -3350141 6501875 17696756 12554187 -6148575 -18516085
41610 -18516085 -12725900 4273523 20775118 32965599 39554000 34882811 17287806
41603 17287806 -999591 -3478462 11133503 28156346 36752153 40161911 42069212 34812169
41595 34812169 12654151 -10812987 -14089337 4247820 23389945 28458249 26640866
41588 26640866 29631776 34139508 30821800 22456583 19681093 23736171 26313416 24769496
41580 24769496 25802950 32800144 38646037 34218722 19132716 2538751 -4036113 4263964
41572 4263964 20730529 32968762 35366184 31591208 23682197 7866126 -13209836 -24739419
41564 -24739419 -17536755 -4119476 -3612698 -15000117 -19360281 -6549019 14472273 31606850
41556 31606850 41653078 44268753 37204633 22323977 6869225 -4706247 -12513423
41549 -12513423 -14564177 -8043344 2602495 9654233 14134602 21474361 25447277 12488299
41541 12488299 -14439439 -32876599 -28932560 -13643046 -3205250 2236101 9112332
41534 9112332 13264755 6514909 -8152655 -20678734 -26850978 -27082526 -19932307 -7414026
41526 -7414026 946222 692151 1850516 14059354 29590756 34385860 29619584 27523360
41518 27523360 30076295 27263191 14760467 -1033309 -14807680 -25423529 -28040623
41511 -28040623 -18380512 -6102985 -7784159 -21658412 -24663253 -3595587 23024808
41504 23024808 26202736 2482059 -23376254 -28939289 -15982030 -453944 9218552
41497 9218552 16168988 21641901 18640637 4514722 -7418775 -546988 20805560 32026495
41489 32026495 18281456 -6813690 -20880058 -21246472 -21464186 -26521609 -27412309 -19061772
41481 -19061772 -8401491 -1656809 3528378 8219126 5560835 -8341050 -24427399 -29829799
41473 -29829799 -23232588 -14437375 -10867551 -10707984 -9233737 -6204851 -3733531 390605
41465 390605 11526372 28085156 37637906 29735094 10530299 -3879592 -8627497 -13830874
41457 -13830874 -24271592 -28311566 -16014461 2118488 6910475 -4961306 -19716205
41450 -19716205 -25333028 -20840307 -10739591 -1029755 2173446 -497841 -247262 5828238
41442 5828238 6920573 -3462100 -11118577 -132457 19041648 21699078 5535583 -8095919
41434 -8095919 -9495973 -11877188 -22447069 -27980058 -20030817 -11449848 -13126902 -14124757
41426 -14124757 -2124015 12963438 14751698 6752117 3605031 6008675 4005679 -2075027
41418 -2075027 -3726378 -2856271 -8986343 -19458019 -20696351 -10416374 -2112775 -3988502
41410 -3988502 -7512279 -1936578 11070658 22587772 27327189 24485230 15205725 4329184
41402 4329184 -892803 1206381 3620779 41219 -4548160 2812188 27147431 54639813
41394 54639813 62440162 42999063 14834956 2248716 7206061 11636911 6183641 1264343
41386 1264343 5078706 7449847 -2761636 -17334705 -20796450 -13726897 -8215852 -6663560
41378 -6663560 -1741712 6361886 9485070 7258435 7704265 11623865 11223111 5971446
41370 5971446 5468752 13180087 20218896 19246656 12804846 4094583 -8334327 -21323537
41362 -21323537 -23796750 -9908990 12377973 31183785 41803338 44220762 38636968
41355 38636968 28809647 21762995 18680891 13240553 3359088 -3805456 -3756727 -2627053
41347 -2627053 -6625584 -12093222 -13911295 -15611160 -21424032 -25138670 -18471832 -6529642
41339 -6529642 -2842098 -9719791 -14477210 -7024302 7588738 17333773 17338823 12313552
41331 12313552 9499375 12734318 20638778 27615913 28041858 21610196 14229386 13019980
41323 13019980 20730726 34197801 46221922 49077726 39507335 23147815 12973721
41316 12973721 19447096 39774110 58403235 60854351 46733537 27103431 10943071
41309 10943071 -741747 -7985116 -7367546 853540 7546426 4332236 -4371173 -6200268
41301 -6200268 3232233 15616221 20871932 17117675 9566455 4311181 3327212 2056968
41293 2056968 -6501908 -21439708 -31113255 -26651304 -14425761 -6864922 -4513707 1606899
41285 1606899 11606818 14677333 7903204 3196815 8961120 16772883 15459939 8994850
41277 8994850 9324641 17521423 23749515 23488419 23089779 28619424 37472665 43130223 42365453
41268 42365453 35449906 23744913 10296959 485867 -1404419 3306533 8676535 11237046
41260 11237046 14564166 23300795 33186127 33067505 19403979 2414666 -6904317 -9114789
41252 -9114789 -8942003 -3537446 10452594 23983795 24564455 16019435 13828642 20298246
41244 20298246 20693652 7598883 -7022952 -10501912 -5564275 28198 6230549 13669531
41236 13669531 15798445 8184967 -3981261 -15471578 -27029049 -34460540 -25964184 -1385646
41228 -1385646 19283476 19401874 5418722 -8824877 -22106996 -34570541 -33817069 -14904112
41220 -14904112 -208020 -11912774 -33844299 -30997977 -3114313 13560221 464907
41213 464907 -19493366 -21407678 -11919534 -8403847 -9821756 -7586564 -6738820 -15840180
41205 -15840180 -27912881 -29200351 -18298542 -2880101 13176722 26637376 29452831
41198 29452831 20503992 13216390 17239991 22149847 14806176 3247060 4844723 18040367
41190 18040367 26531663 27571835 33841139 46548682 49106065 33986692 16612428 12395293
41182 12395293 15235131 10966525 668151 -3152828 2985409 9906040 10120544 5138728
41174 5138728 -1338600 -8729845 -16139447 -19721464 -16647848 -9244274 -3443501 -3938154
41166 -3938154 -10665835 -18737322 -21997624 -17818172 -8722103 260061 4883455 3557403
41158 3557403 -726423 -39127 12302879 32170544 44972808 40712379 27149102 22102798
41150 22102798 32092647 44774126 45644628 36361693 29842086 30331899 27500314 12105856
41142 12105856 -10659189 -28788387 -38539235 -44419693 -47441056 -42786863 -30286177 -18872543
41134 -18872543 -16208734 -19433338 -21645265 -23852482 -33533082 -51482005 -66348522 -65592911
41126 -65592911 -49161984 -29072311 -16662687 -13739301 -16220260 -21498195 -28308483 -32474837
41118 -32474837 -29242558 -20307876 -12852040 -9845896 -6614577 881205 10627275 20818712
41110 20818712 34241177 50419221 60329964 57243436 47077495 38378431 27660879
41103 27660879 7250071 -16155860 -26150112 -19848004 -10858734 -6579529 890495 14981856
41095 14981856 22506829 12755595 -4063386 -10962030 -7713457 -6812786 -12725618 -18807026
41087 -18807026 -20596309 -19489604 -16030969 -10811383 -8856243 -11885577 -10165435 4765317
41079 4765317 22445616 24313333 12106318 8624174 25928902 48304440 54422602 43306352
41071 43306352 28493348 17067703 6464833 -4404951 -12891570 -19113253 -25383946
41064 -25383946 -30108186 -29541591 -24886566 -21374786 -20768652 -20044775 -16637267 -9739059
41056 -9739059 2385480 19769507 34917227 36529592 22533836 5090273 -1257897
41049 -1257897 5868446 16803198 21932590 19779828 14561328 10779390 11281941 16332350
41041 16332350 21794457 21165649 12868542 3743602 1887928 7536036 14594286 19031962
41033 19031962 20359162 16463719 4866385 -9712533 -17101494 -14369046 -9500644 -8304952
41025 -8304952 -5734868 3194969 11654173 9857573 521023 -5217071 -4275749 -2910499
41017 -2910499 -2975438 855352 8513230 11030046 4489721 -2143551 -34838 5503552
41009 5503552 2127654 -11242440 -20516362 -12151838 10439549 28689711 28146792 14687166
41001 14687166 7304533 14153697 23226390 21386316 13332416 11263827 13670715 10258208
40993 10258208 4374072 11355948 31794261 44946792 36311582 15995481 580934
40986 580934 -8012045 -13935248 -12646142 -1042180 8636667 3681231 -6654937 -2293260
40978 -2293260 16908012 29951541 25052408 13974107 11756398 16825238 18427698 13476517
40970 13476517 8536408 10862653 21596725 33169147 32913875 16384589 -2747214 -5200538
40962 -5200538 10155218 24947557 26130852 21197780 23624479 33429106 39539238 33755767
40954 33755767 15352383 -11111308 -35087931 -43457006 -32837181 -14287268 499428
40947 499428 11991887 24747532 33533225 28549132 11183622 -6571082 -17825332 -26077622
40939 -26077622 -34293461 -38114282 -32747956 -20088173 -6727322 600427 -1819852 -9820467
40931 -9820467 -10879989 2805278 20746640 24190037 11940380 3938147 12815951 24249871
40923 24249871 17455116 -3496985 -14392880 -4095703 12544061 17111554 8951951
40916 8951951 -1693284 -9817318 -15497074 -15885351 -8606902 551152 3437775 1363856
40908 1363856 1796424 4036444 -1308267 -16243063 -28755383 -27881883 -18038796 -11409829
40900 -11409829 -11436607 -12078602 -10626686 -12100323 -19647321 -27557279 -27404468 -17650833 -4159065
40891 -4159065 7093636 15361952 23187215 30309925 31614799 23920871 14107938 14545175
40883 14545175 27088179 37560962 32991769 19804040 14975579 21037505 22521310 10091975
40875 10091975 -5084820 -9658831 -9934817 -21640014 -42756536 -52005154 -36467549 -8259679
40867 -8259679 11641965 16453533 13163801 7023086 -2417849 -11963108 -12831612 -2299204
40859 -2299204 9487385 10688302 3212719 518177 9277231 19533520 17792603 5641646
40851 5641646 -2926682 -2572095 -4594265 -17862488 -30720300 -23960273 1485143 23497993
40843 23497993 26823948 18496777 10412279 1523812 -11096806 -16127467 -1172438 23132839
40835 23132839 31406736 16636185 -2561279 -10826727 -13267438 -15941968 -9028764 13963142
40827 13963142 34421195 27843498 -683416 -20856700 -16561440 -2108793 3265073
40820 3265073 -1466250 -8081694 -14314779 -19167521 -15833465 -2119234 10699580 11887869
40812 11887869 7592392 10468412 17764939 14062164 -4641045 -22818465 -24563016 -10800528
40804 -10800528 6685437 19851060 27045136 27043151 18223373 3051747 -11574244 -19756711
40796 -19756711 -20170746 -13396277 1496842 23541213 43116448 45436728 26842282 3236172
40788 3236172 -6734590 -4780052 -8076514 -21819803 -31858833 -29204885 -24908757 -29760970
40780 -29760970 -35096333 -30102928 -24811372 -34166802 -47750531 -40764728 -13482872 5665607
40772 5665607 -19378 -16595774 -27360978 -35368544 -45591871 -46821415 -30028124 -9071199
40764 -9071199 -3147967 -9021775 -9625753 -2686414 -1931782 -13745569 -29476471 -39273582
40756 -39273582 -39679276 -29793809 -13237323 -1779557 -4311484 -14332263 -19760457 -20296081
40748 -20296081 -21303285 -16811460 2202841 25356239 30711827 17602007 9838112 19451364
40740 19451364 28221337 16628052 -7365978 -23769934 -30177693 -37582501 -45457819 -40267645
40732 -40267645 -17403159 10055894 26001803 25285121 12937017 -2429015 -13865895
40725 -13865895 -20509579 -26476119 -31983770 -29634158 -15307771 1614163 7070670 -580496
40717 -580496 -9739590 -10634273 -4108454 3939825 9496030 10679095 7140267 1600756
40709 1600756 -1515162 -563682 2139737 3662468 3154257 1820022 1906999 5067010 10989817
40700 10989817 18792355 28621537 38156092 39098030 24535716 919292 -15474657 -16802411
40692 -16802411 -10112472 -3127997 4789813 12064935 9646033 -2272314 -5499644 11574703
40684 11574703 30675414 25364410 414329 -13561650 -4405847 6929551 1722404
40677 1722404 -9899362 -9714244 690595 8918199 13951087 20875697 23214435 10203909
40669 10203909 -12256976 -25898204 -25181031 -22499971 -26281581 -28485775 -19792280 -6071837
40661 -6071837 -1281875 -9780986 -23186788 -32528821 -37633953 -43587676 -50674551 -50602629
40653 -50602629 -35020886 -7580447 16856759 28076761 31664803 39211407 50332746
40646 50332746 51849458 35321687 8675163 -12666047 -21773925 -23390528 -23445614 -20496711
40638 -20496711 -10079496 4386296 10355168 -146648 -18412974 -27566447 -23433122
40631 -23433122 -18833906 -23934762 -31186190 -27074719 -11998755 1265479 5030427 2737395
40623 2737395 -216844 -1540038 1357645 9534568 16257055 12203884 -935289 -10677027
40615 -10677027 -9558010 -2132163 5387284 12118459 16007481 11709704 743656 -6733163
40607 -6733163 -7056978 -9159405 -17157468 -18704932 -3329856 17643036 25475164 21435558
40599 21435558 21817088 29271556 29418669 17357179 7031806 7678943 9646656 4091000
40591 4091000 269042 8955738 21515459 22187588 12479505 5878072 4028462 -2980537
40583 -2980537 -14350371 -16083265 -4125268 7459080 8157803 5407715 7782838 7527625
40575 7527625 -6264050 -25832851 -31881213 -19914186 -5654558 -3062860 -8423576 -10031663
40567 -10031663 -4735122 1290933 3266993 2725897 2371060 626722 -6234002 -17473926
40559 -17473926 -26507313 -28522810 -27196983 -28724359 -29896763 -19860318 3354158 25757154
40551 25757154 32488906 23669500 9172111 -4746563 -14415940 -12035616 5828668 26139480
40543 26139480 30797607 20317043 11423270 9842395 2980430 -14290581 -24853083 -13509822
40535 -13509822 7425575 12885703 -2328272 -21021943 -28421562 -23997323 -11481457
40528 -11481457 6305942 20977252 21543453 9114423 -1469958 567228 10306998 16494637
40520 16494637 14502435 6360059 -4192800 -11568729 -9339199 3063904 17830594 26095091
40512 26095091 25143005 17964527 10603962 10433832 20556895 34040899 39710535 35157191
40504 35157191 27513856 20727671 11477098 539188 -2842072 5247135 14586686 14475496
40496 14475496 8307956 4533893 167079 -13661000 -33133297 -42767870 -36079948 -23195205
40488 -23195205 -14724821 -9059497 -1463463 3578801 -1553330 -13492276 -19162854 -11580116
40480 -11580116 2071354 10262239 10730738 11170685 18823019 33295893 49091206 60628157
40472 60628157 62996101 52458680 31344600 10434245 766510 2906890 8651952 12443295
40464 12443295 15289785 18091019 19063110 19239262 22083363 24831815 19602675 7955047
40456 7955047 4068418 15147588 28018736 26708561 16168328 14229253 23413473 26475863
40448 26475863 11879709 -9750298 -19785610 -12751639 1848732 11881319 12012662
40441 12012662 5534357 80314 -1107160 -2939401 -9157907 -12544176 -3064877 15951942
40433 15951942 30127724 32068193 25781325 13535395 -6720489 -27677059 -33164675
40426 -33164675 -20687219 -8608803 -10041562 -13694465 -4823665 7681840 4033382 -14628317
40418 -14628317 -27686839 -25555515 -19029971 -17445211 -16281053 -10647553 -4241541 1609141
40410 1609141 13244621 31492584 46075055 51109560 53843558 59072439 57592180 42121857
40402 42121857 23593855 16829334 18137051 13375387 2722352 -728801 4663007 5380160
40394 5380160 -3222526 -7304000 3067899 17397536 22041063 21571107 28364163 38994155
40386 38994155 37640097 20917048 4102802 457087 6591828 12379896 15182605 18677296
40378 18677296 25158039 34465443 44483958 48151742 36932790 13541564 -5002394
40371 -5002394 -5064200 6846418 12946287 6745786 -1802732 -2039943 5508685 13256288
40363 13256288 14401096 5643127 -9937686 -20831496 -15913096 1421817 14948412
40356 14948412 14922228 8755002 8636192 16490965 27123064 38168011 47687279 47693182 31675639
40347 31675639 7113280 -9955656 -13552322 -12000184 -12679645 -12748261 -9040508 -7380535
40339 -7380535 -13588350 -20841773 -16024490 2024229 19236902 23829329 20402691 21358194
40331 21358194 28339958 30124426 20009008 7887163 8953070 23776506 37157806
40324 37157806 36986713 26973437 18034719 13960663 11126568 7661898 6011916 8247021
40316 8247021 14431823 24155131 34412900 37784811 29257841 14645588 5976997 7750971
40308 7750971 13227682 14922125 12772602 10488607 9932234 11896021 17370526 24819461
40300 24819461 29992900 30882713 29398180 26996468 23605196 22104218 26794706 33720901
40292 33720901 29799197 8193628 -20388664 -38576748 -40534891 -32445651 -19491879
40285 -19491879 -2564610 13379225 19023267 12391475 2975739 -171898 1487661 1998481
40277 1998481 1102314 2351505 5070101 5466337 4488986 7415017 14280315 16977087 9826395
40268 9826395 -938695 -3762927 3039174 8039198 331204 -17828306 -35215752 -44841091
40260 -44841091 -47387915 -43187674 -28937386 -5954469 14474536 20757285 14068672 6043162
40252 6043162 4246914 5761844 5461302 3877405 3545709 2976109 -131654 -2404714 2216819
40243 2216819 13042393 21847822 23542784 22864585 26478213 31739288 29408508 17401293
40235 17401293 5445915 2818781 6220398 5265922 -2442414 -8183009 -4118260 7623732
40227 7623732 19523433 26815019 28487974 25736913 23484895 28188327 38428300 42347196
40219 42347196 32069880 17217059 14126717 22373813 23580612 7082893 -14276317
40212 -14276317 -21635196 -14841097 -8911148 -10434188 -9971333 1496146 19534284 33545885
40204 33545885 38601864 34742105 21784333 2727648 -11832915 -11823830 -315231 9029969
40196 9029969 8395503 3503054 2888270 6354692 9160180 12288721 20453129 31344410
40188 31344410 35505306 29625471 23309386 27255258 38214075 41688526 29086226 7417323
40180 7417323 -9017860 -13086455 -9358807 -6771548 -9477454 -14973857 -19500760 -22788087
40172 -22788087 -25506410 -23800648 -12002817 6773113 18474246 12940575 -2197524
40165 -2197524 -10195845 -6534289 -2574815 -7077311 -14571971 -16618544 -14399078 -12142648
40157 -12142648 -6868835 4170808 12230828 7093878 -4188619 -3408388 12439114 25102091
40149 25102091 20104961 4980714 -4569401 -5050963 -2130951 3016002 12349416 22023803
40141 22023803 26199163 25512477 21661995 9079994 -15530542 -39950040 -47899972 -42138948
40133 -42138948 -40024806 -45423204 -43230428 -26995619 -13163636 -16378364 -25995169 -22500225
40125 -22500225 -6451038 5876189 8683658 10383529 13778220 10743423 -722640 -9706348
40117 -9706348 -8457425 -3367134 -3279917 -6417012 -6108355 -1738582 3984912 12791082 26843095
40108 26843095 39669844 39963080 25788434 9212877 3751894 9808250 15685390 12694158
40100 12694158 5617644 4910509 10904867 13114614 7273243 4292849 14787277 31554978
40092 31554978 38915365 36091854 37507067 48753797 56573720 48853873 32784830 23886626
40084 23886626 25218632 27944093 27803247 30286031 39569023 49913681 50566507 37284935
40076 37284935 18937827 11554106 21537271 35445472 33846515 16237529 2320895
40069 2320895 5129411 14813794 16639038 12965056 14955337 21810620 23842542 21016834
40061 21016834 22028040 26317813 22904010 9071254 -3640992 -5852573 -1349791 1857852
40053 1857852 1040720 -4084050 -13373883 -21479422 -20780520 -13304850 -10467616 -16975413
40045 -16975413 -24659404 -26556969 -26521299 -29013713 -29757991 -23855033 -14048780 -3936428
40037 -3936428 7347943 16242413 12027260 -6231157 -20547603 -15373642 244455 6677579
40029 6677579 2714049 3021595 10808323 13112655 5019059 -500505 6308220 16378108
40021 16378108 16564796 8692708 4062095 6730374 11306536 12214837 7884552 -123596
40013 -123596 -6529122 -5231192 2407526 7334485 5853075 6727009 18228997 33306259
40005 33306259 36547160 23661383 5818514 -4775010 -6178859 -2939221 2218687 9928378
39997 9928378 20886979 33438408 43424310 46367575 40958704 29724845 15791932 1543554
39989 1543554 -8513381 -8376645 1767300 12191606 13570929 8114241 5141616 7452646
39981 7452646 9031203 6250009 4197097 9424858 21308939 32833821 36236726 26990084
39973 26990084 7224325 -12766732 -21247813 -16193011 -6123998 1815626 9124208 18010378
39965 18010378 22656412 15589879 -221959 -13015357 -15579726 -11289218 -7260683 -7442153
39957 -7442153 -12755480 -21596226 -28235440 -26692680 -19242277 -15591853 -19703984 -22963243
39949 -22963243 -16105043 -2999113 5174587 5822954 4972869 2873349 -7538866 -24172363
39941 -24172363 -30985116 -19140599 -2823406 -742702 -8423302 -5030875 14313787 31075045
39933 31075045 31623165 25336214 25705442 29183813 26058883 19512596 17174001 13295852
39925 13295852 -767507 -13697642 -4503494 23345235 40338288 29882116 8809667
39918 8809667 -558905 529962 431109 2031446 14179093 28705761 28109458 12766949
39910 12766949 874058 1224191 3626820 -1261265 -8714551 -11335960 -10116413 -8214759
39902 -8214759 -4698564 -112095 1249509 -463351 580711 4423955 2541051 -7925543
39894 -7925543 -17075450 -16254649 -9747738 -4392224 3446994 19839873 38384780 44984257
39886 44984257 35654402 20822381 12703531 14527998 20485354 21080342 11184732 -2343663
39878 -2343663 -4823686 9066597 26782401 33138143 29318642 28384494 35581358 43254464
39870 43254464 44446832 41605285 39741131 38646677 35281771 28982999 21189469 12790206
39862 12790206 4382363 -1180288 1974958 17546864 37780973 43736495 24575146 -4038684
39854 -4038684 -13824148 475464 14592891 11538091 6797689 20766493 42406403 45264450
39846 45264450 30665643 25291126 35507101 34718574 6746872 -24432695 -26609700 -3098890
39838 -3098890 15980232 15338956 6626315 3424691 4200851 3234455 3370646 9602061 17317447
39829 17317447 15904014 4009529 -4964887 2272783 20282452 29120776 20127605 7816645
39821 7816645 7853507 13406374 8259897 -4165405 -5681934 4929112 9288644 3228530
39813 3228530 8007459 35210286 62625609 63404681 42489623 24045014 16232017 10567182
39805 10567182 6026864 8856101 12551035 2469603 -18183217 -28128401 -17784173 -975446
39797 -975446 8096570 12015828 16523844 15831137 3916440 -9841865 -10005096 3556375
39789 3556375 14612860 11499376 1375363 -209514 9939422 19104704 17713898 14171928
39781 14171928 21278546 32681360 28803890 8135896 -5843961 2236949 17591574
39774 17591574 20279396 14954907 15820236 17020853 4402405 -12645678 -11358415 4850366
39766 4850366 8071642 -9267026 -22110657 -14582964 -3808066 -5967535 -6517479 11787118
39758 11787118 32481118 26817389 885118 -8562496 15349775 48445599 60304459
39751 60304459 50305569 38689967 35068897 29706061 12654614 -9940736 -22965540
39744 -22965540 -20737867 -11552685 -4083893 2599173 11285211 17917016 19771330 24185960
39736 24185960 35717124 41428170 27097662 4170980 -1937491 8707143 8291395 -14510416
39728 -14510416 -34409617 -27644462 -5965450 6986821 12039049 22795325 34185592
39721 34185592 31111500 19162630 18562310 31107960 38663902 33580317 26823185 25079433
39713 25079433 22533843 17940456 18240629 21364671 16115180 3728180 -1146279 3427129
39705 3427129 1265310 -12838455 -20609375 -9373405 6706578 10744749 10877971 24012178
39697 24012178 45003442 54482210 50397820 49604417 59305711 66551806 59107058 41204962
39689 41204962 24110250 13373825 9951309 13005315 16204788 10736690 -1588373 -6034661
39681 -6034661 7006650 27638336 37993318 33780505 25498920 20690487 15700775 6901158
39673 6901158 -299819 -159382 3046191 2395004 1726856 10702289 27124663 36307338
39665 36307338 31982177 26456142 31755181 39973427 34841144 18088368 9396583 18292063
39657 18292063 29653968 25104982 10193039 8925052 32466122 62990059 72955357
39650 72955357 55209661 27904924 11738212 10425450 15728607 22304178 28736122 29833384
39642 29833384 20829770 8834124 7487887 17726492 25908073 24817683 23288573 28554988
39634 28554988 33033419 28859422 22936081 24776809 30243550 31212084 30712092 32370525
39626 32370525 25629933 2324917 -19701251 -14210706 14152250 33342536 29574189
39619 29574189 24692156 39704947 63530523 71616174 58920816 39559953 25126689
39612 25126689 17077706 13369832 11747758 10744230 13012155 21901896 32787346 37664720
39604 37664720 40172650 52595194 74063583 86901735 80770061 64913734 49605540
39597 49605540 33368333 18228487 17366183 32274190 41263387 30393916 18996714
39590 18996714 30505505 51771696 50342402 24796026 6674568 12135290 22155712
39583 22155712 18307778 10743095 16116779 28627995 31515682 24762613 23219131 32705720
39575 32705720 42999721 43746766 36538012 29568396 27003622 26317520 23465801 18227828
39567 18227828 13307696 8874094 2086555 -5516349 -5402706 7156867 23677417 31708110
39559 31708110 30773953 29986179 31452065 27349667 15313269 5735828 8487563 20395572
39551 20395572 31634656 37970547 40336412 37975777 30640398 25534698 32991164 52477722
39543 52477722 69208198 70203288 60651392 57096239 64434599 69239679 61288074 51814291
39535 51814291 57963294 75033972 81391096 71035190 62311993 68430080 78452543 79049344
39527 79049344 77290497 84551764 91827544 82735612 63064863 54714362 62641190 68894912
39519 68894912 60784637 46316000 38318077 39466440 47126805 58579245 66876803 64083996
39511 64083996 52769426 43600294 39872485 36253115 33470743 39823013 55282133 68144787
39503 68144787 71330684 69378409 66962362 64449035 66777615 80391505 97701701 101839973
39495 101839973 91784763 84680317 87549534 87581552 79567515 80028190 98637326 116138582
39487 116138582 110682797 90199186 77479778 76239638 74367703 70287172 71830979 75388480
39479 75388480 70572020 63060995 69371084 88176659 98747785 91487507 80305815 79137705
39471 79137705 83897135 85201137 83878191 84800414 86572787 85772853 83421863 81463733
39463 81463733 80312396 83675543 96791886 115376215 125817121 122742003 118192007 125409423
39455 125409423 138920176 138923561 113985362 74223615 42344664 34063297 46743024 65996612
39447 65996612 82283349 97496001 114041275 125023367 123344817 115840029 117306699
39440 117306699 131119535 146041827 152905769 153861881 152791754 147628340 137765510 130143408
39432 130143408 130484457 134086367 132476487 126053035 123832043 131414934 143517008 149564018
39424 149564018 145978133 142129433 151393248 174600843 196712990 204509955 202851454 205778649
39416 205778649 215384826 220113852 212891568 199328615 186515474 175547311 169113967
39409 169113967 174800934 193172231 210777464 213409109 201763157 188036239 181592584
39402 181592584 183454566 190591191 199845577 209923962 222669801 239353784 254697586
39395 254697586 260670170 258201860 257385281 262629033 266714707 265372695 267780315 282353371
39387 282353371 299183541 299439378 280337009 259597224 254067243 262437688 271266495 271835993
39379 271835993 268019038 270067208 281850018 294466634 295747588 286827400 282612072 292011282
39371 292011282 305890796 312013726 313347733 319282128 324820982 315384669 292504471 277638582
39363 277638582 284122438 299070544 302462991 293651180 287636933 292380495 302591888 312706555
39355 312706555 322929433 331135935 330054572 317806789 304387869 301683531 310246633
39348 310246633 320638007 326040415 329059604 335585123 344888283 348326178 338999492 322236673
39340 322236673 313384608 321889253 339168942 347463104 340979534 331546319 330070768 330016501
39332 330016501 317736762 294858364 278713790 279323105 286839854 286806119 278645274 271299216
39324 271299216 267695859 263763514 259090598 257808421 259747670 260745567 262049973 268752522
39316 268752522 276601613 272146445 252536315 235121628 237409878 254159240 265686622
39309 265686622 264621250 260834915 260080051 253365272 234897428 218064429 220006970 235694408
39301 235694408 242428681 231205253 219202248 224149976 238407543 241242344 229934389
39294 229934389 222439924 229215471 238684152 236856610 227587910 222686629 221937467 216245265
39286 216245265 204867484 195636100 190263475 182740105 172634632 167560435 170212454 173978268
39278 173978268 174228925 173621244 173516839 171489493 171137979 181589270 200480973 210141697
39270 210141697 200756881 186014958 182753802 184644108 173162218 149979608 138933784
39263 138933784 152618893 173176725 174427974 152551699 125908928 111371319 110349665
39256 110349665 115114995 119368007 120634583 118472408 115050984 115856458 125283997 139682803
39248 139682803 147592955 140747359 124490054 113624621 117244407 130600264 141712799
39241 141712799 141611074 128198661 106942359 90391204 90053768 103792178 116581421
39234 116581421 118328253 114598710 113775315 111444402 98270378 78751215 68948059 74937250
39226 74937250 84989636 86628816 82213829 82433667 91095124 102310241 108764606 107316039
39218 107316039 98388771 84799016 71973742 66753741 73421822 89230231 104388922
39211 104388922 109626165 105005994 98137926 92715919 84480704 71763551 62712769 64410222
39203 64410222 70209330 68054533 58765363 54857122 61018393 67125092 63947836 55886358
39195 55886358 52569482 55357319 58676392 59593709 59375501 58170125 54079744 47487064
39187 47487064 42809157 44752763 53058605 61218943 62382929 58042964 57751219 66848501
39179 66848501 78166911 81419499 77321373 74582018 75059178 71707332 62197321 55280906
39171 55280906 60046309 74880333 89324987 92157409 78438391 55863432 43329049
39164 43329049 53705802 77093768 90491545 84581659 70138949 57755481 46101887
39157 46101887 34387698 30400914 37298875 45998755 50680700 58709158 73558407 81525976
39149 81525976 71139328 54752058 52691544 63771739 70695484 69096605 70127913 76151760
39141 76151760 75922460 66746963 60736998 62676738 60480160 46937101 34423080 35992387
39133 35992387 44951616 46461260 39674828 35003251 36480538 39908541 43531999 47722778
39125 47722778 47057538 35531591 19546451 14438247 26070640 44465871 57374706
39118 57374706 62040365 61427271 57361748 52124571 50317671 53083080 54299324 48320101
39110 48320101 39296703 37091208 44338799 52637388 52430667 42274787 26806636 10587748
39102 10587748 -1776629 -3384070 9402570 28407352 37728247 30685990 18455381
39095 18455381 16857178 27366560 36858748 34743707 23968063 14449009 11932352 16115427
39087 16115427 24359874 32215890 33339601 25152008 14894519 14674723 27489911 41434385
39079 41434385 42135267 29785759 18742954 19388318 26355541 28571185 25060053 23151983
39071 23151983 24648683 24062482 20258367 18516494 18431675 11772422 -1893212 -9748087
39063 -9748087 -5304604 -1723499 -11883408 -24732601 -19675154 418448 11381641 3955525
39055 3955525 -2971017 7806501 27296854 37241405 36678226 36520778 37744528 32371587
39047 32371587 22548514 21988782 35450508 48635305 44808379 25654167 9481945 9532491
39039 9532491 18231929 16391480 -2054700 -20183473 -18276219 871506 16462989 17043844
39031 17043844 10216150 4223729 -3625974 -12931243 -10742253 10296109 35829792 47143460
39023 47143460 46198461 47266483 50850645 45368750 31719055 24910787 28502885 27433144
39015 27433144 13875614 3027427 11530363 32500720 44950199 40499479 28785278
39008 28785278 20790673 17803331 15832095 12757482 10269221 12729635 23150147 37670181
39000 37670181 46897627 45971728 40299553 38217176 41496271 46538872 50847366 53303441
38992 53303441 50714295 39385091 19712692 -3562302 -24389398 -36886435 -36875579 -25727766
38984 -25727766 -11507450 -3378996 -4644584 -11177759 -14929082 -9889714 1555409 8678805
38976 8678805 4019222 -5044822 -3187566 12817963 28577984 30055794 19774780 10607070
38968 10607070 10737124 20536429 36916936 52604414 56581950 44453473 25708983 13480561
38960 13480561 10148401 9865724 10899005 16255432 24576599 29935648 30217597 27899079
38952 27899079 23507425 16105998 9064267 7022096 8024171 7319633 8046139 18095272
38944 18095272 35689881 48282230 48032729 39105715 27382563 13159670 -1730820
38937 -1730820 -9293225 -4536275 7051589 16458124 20391707 20329177 18887877 20556742
38929 20556742 28731235 38095366 37933235 27845128 21552693 28513197 39975602 41384387
38921 41384387 31383122 19434416 10922978 4781684 967348 -541819 -4939042 -16015732
38913 -16015732 -26349277 -24591712 -11783817 -308779 3408452 5073745 10224461 15638974
38905 15638974 16291557 13210711 10843530 11914172 16684166 22408191 23727421 20028546
38897 20028546 21293712 37140108 59103941 65080566 46219699 19579325 7041779
38890 7041779 9832339 12750204 7476802 648725 456782 5495608 9474850 10244004
38882 10244004 10058672 10159008 9024311 5567642 1237394 -2505695 -7160249 -14457931
38874 -14457931 -20623792 -17990952 -4993437 10091105 19819025 27017651 36648495 43137054
38866 43137054 36549677 19575821 6106338 1716368 -1906748 -9837613 -14766623 -11665523
38858 -11665523 -8474701 -11785347 -12964885 -1737234 14642827 20719536 16330218 15101798
38850 15101798 21211848 23424012 14359402 1698809 -4448588 -3887810 -636557 5295596
38842 5295596 14183518 22533103 28886466 36963309 47195561 51780867 45040844 33086873
38834 33086873 25401247 20922952 10934811 -6393142 -22911536 -31958758 -35078170 -35411540
38826 -35411540 -31485956 -22007981 -12107464 -8706590 -10788037 -9710368 -596208 10743085
38818 10743085 15309045 12593471 10298431 13166543 17167510 16331065 11098806 7114008
38810 7114008 8620038 15318063 22702447 23683805 14571584 2654470 2109434 16683663
38802 16683663 31666750 30803786 17003617 6690628 6319137 6194934 -1798252 -12228969
38794 -12228969 -15806724 -11217061 -2158601 9169086 19973066 25325516 24424454 22296849
38786 22296849 20523514 13791323 1816719 -3849903 5154523 18148267 16498422 -1337472
38778 -1337472 -17101413 -16224114 -4544770 1914001 -2946083 -10338185 -8826189 2548988
38770 2548988 14120322 17693986 16148339 17076836 18468127 9380680 -11760166 -29263314
38762 -29263314 -29356314 -20078928 -19851843 -29588545 -30138514 -9284834 21041091 39792031
38754 39792031 39978529 30497866 21489305 15273144 8957865 16563 -10679055 -18848664
38746 -18848664 -20303682 -15007363 -6064166 4723646 16913064 27201783 29656735 21804012
38738 21804012 7678377 -5917767 -13857641 -14444983 -10664132 -8676262 -10254747 -7816697
38730 -7816697 6752123 28539423 42169303 39433570 27524266 17517953 11642525
38723 11642525 5681805 -1729984 -6797042 -4661188 5960433 19259882 24661766 18531019
38715 18531019 11601677 15619246 24162996 20111886 3743412 -3228076 11022634 29276969
38707 29276969 29695276 15744751 6573367 8760858 15113425 22622203 31827625 34461087
38699 34461087 23479709 12422497 21281781 42490476 46387332 26332366 12078736
38692 12078736 25622356 48290191 51255377 38676054 35108955 43129739 42524086 27813597
38684 27813597 18254989 25641475 35619207 30987081 16017679 6062141 6152575 11801093
38676 11801093 20542963 29572523 29068378 11989763 -11725173 -22705611 -14341091 1717805
38668 1717805 12594857 17328188 20668622 22900751 21811176 19243888 18779949 18730092
38660 18730092 13004471 -649766 -16355618 -24303149 -17966775 944362 22079396
38653 22079396 33195703 31655931 28077088 33685559 45015080 47947379 37640488 25809080
38645 25809080 24017113 28322328 28327244 24486510 25372834 31366370 33321524 27178654 18255738
38636 18255738 9817603 -714549 -11568292 -15474196 -13578352 -17141198 -27867709 -30531575
38628 -30531575 -16648860 -2167449 -5399459 -17666676 -15658543 3203911 19703584
38621 19703584 25076670 30414137 40240919 41224991 27979011 18436432 26977765 38876078
38613 38876078 31461366 9658038 -1133619 7720129 19124618 18114626 8863914 -200937
38605 -200937 -10495178 -23389000 -29019199 -17023508 6812212 23962550 22218491 6844090
38597 6844090 -5875521 -3619721 11664626 26672746 30740931 25609780 18709927 10655651
38589 10655651 -2917747 -18502928 -24169344 -15240148 -1728416 5365723 7901263 13671325
38581 13671325 21302943 21233480 10118211 -3929421 -11684084 -12400896 -10625131 -7729145
38573 -7729145 -960899 9463901 15977394 9982824 -6934392 -21807395 -23591820 -14989343
38565 -14989343 -6354696 -721920 6958765 15995494 16228744 3369514 -10876887 -12703169
38557 -12703169 -4605638 -38688 -2654918 -2136069 7819005 17596564 13854028 -1811444
38549 -1811444 -13188976 -7480091 11716564 30253041 38746444 38927999 35770591 28609429
38541 28609429 14712606 -687800 -5554150 4827868 20242031 26524106 20655662
38534 20655662 10643191 3870266 1221431 827576 1592319 2599615 2812840 1452793
38526 1452793 -3198639 -12698180 -22925707 -23640642 -9382324 11718610 26023373 28806646
38518 28806646 24265951 15019215 1615769 -9027193 -6856400 7005414 19684210
38511 19684210 24032115 26422476 32109426 33808965 23609152 7894341 91717 3698881
38503 3698881 11775399 18647619 22251884 18476945 4276638 -14117976 -25348794 -25435375
38495 -25435375 -18643107 -7527295 8321644 23877922 29658393 23736067 14317320 8029628
38487 8029628 3814487 335806 -137566 1243823 -1271177 -7095756 -6428000 5404087
38479 5404087 19438793 26031369 27520121 29501890 28724033 21212930 14606072 18002473
38471 18002473 24568304 20234036 7526739 3297701 11138896 14211320 2165930 -11235527
38463 -11235527 -8558956 5500585 11951067 3520837 -9802988 -16744007 -14891810 -7385497
38455 -7385497 776366 4190098 1926520 -1081120 -2735876 -8187671 -18054014 -19813056
38447 -19813056 -3180694 21177850 32797170 28584991 23409704 24978684 26629769 27581965
38439 27581965 39080392 60242039 66871842 41583313 3177926 -12729599 3369956
38432 3369956 28404213 40052861 38956935 35839745 32588763 24100522 10081749 -2667179
38424 -2667179 -6628460 909716 15845498 29584103 36125294 36668183 34898447 30783710
38416 30783710 23693795 17858950 17504245 19275344 17661175 15450726 18880671 23971742
38408 23971742 19848882 6676827 -2786246 -3218302 -4661685 -13248204 -17306475 -4713571
38400 -4713571 15539089 23695103 15950704 5874456 955088 -6378470 -20764106 -30970349
38392 -30970349 -23606610 -1295736 21833348 37504769 47143405 51650808 47731365 35598762
38384 35598762 21725676 10381050 -752141 -12104828 -16354312 -8473539 3707503
38377 3707503 9065142 10225755 18351053 30715685 29118487 7354925 -14287855 -14173678
38369 -14173678 1969189 12071278 8728653 1662284 -4500987 -13090269 -16720646 196001
38361 196001 33160942 53301000 43599561 21919713 13697669 17613651 16193626 7154553
38353 7154553 1790831 -258988 -9936642 -22777523 -17828698 10211726 36571505 35764605
38345 35764605 13358062 -3377436 763368 15731638 23877165 21137752 18492802 26403185
38337 26403185 41023195 47940528 40134962 28001996 26914853 38175970 49140666
38330 49140666 50033158 42142957 30099801 16270717 5150677 3201523 8857707 10691110
38322 10691110 2561714 -5065170 3166527 27077278 49287023 53780443 41099273 24449751
38314 24449751 14800565 12365863 11508596 10439328 12262748 16420157 15037205 3078235
38306 3078235 -11382953 -14666521 -4969462 5042642 4676797 -2729509 -7429870 -6774273
38298 -6774273 -5750581 -7526347 -9371608 -8133540 -5858868 -7293623 -11818292 -10747732
38290 -10747732 3108247 23486219 34806538 31251837 24540224 26959306 34383495 35396601
38282 35396601 30140124 26834056 24049158 12727118 -4176720 -10619082 152596 16681114
38274 16681114 27336333 32796654 35029013 29796856 19298838 17207765 28739485 38110335
38266 38110335 29329287 8973649 -5559667 -10418345 -12436636 -11163172 -2189359 7360687
38258 7360687 6382876 1212344 10491244 36543178 58468465 58035343 38988930 16673052
38250 16673052 956554 -5873872 -5250801 -1789303 925249 5956438 16215035 22747673
38242 22747673 12134687 -12646553 -31830409 -33272890 -24929793 -18594519 -14607175 -9779105
38234 -9779105 -7764633 -11635363 -15819187 -15398158 -15634409 -22826656 -32649080 -36906626
38226 -36906626 -35712145 -33756386 -30330494 -23085912 -17377715 -21539762 -34462539 -45666391
38218 -45666391 -46389222 -35375450 -17428425 -2086961 1046014 -7078562 -13122760 -7386600
38210 -7386600 2639969 2427296 -10500048 -26476029 -38416968 -46017558 -47438258 -38062882
38202 -38062882 -18977053 1114391 13544416 14231089 2918648 -15195280 -29388044
38195 -29388044 -32537777 -28534350 -24276571 -18816188 -9093792 -829514 -1302451 -5064550
38187 -5064550 -1119966 7694317 8412563 963451 -295888 8556814 13107055 5189263
38179 5189263 -1848624 6161667 22305336 30276647 26857098 19818691 12979715 6616021
38171 6616021 4644538 7982997 7528812 -3436353 -16699418 -21871243 -23523949 -29990449
38163 -29990449 -33084375 -19129159 3731307 11443029 -1456319 -14310532 -11782637
38156 -11782637 -2696519 -78381 -1642637 -1387794 -3996288 -13279097 -18416674 -6770499
38148 -6770499 17052530 37077711 44197974 38432479 21558177 -371413 -14642284
38141 -14642284 -15268817 -13173132 -20529702 -31246343 -31489889 -24218317 -25767637 -39236429
38133 -39236429 -48567141 -41692143 -24803956 -9988027 -1953382 -1006394 -5993362 -8591233
38125 -8591233 3158916 27969884 47233977 45229940 26613203 8640966 3194311
38118 3194311 10864761 24679035 34342999 33755465 28229457 26901007 26438475 14025437
38110 14025437 -9830031 -26069856 -22494489 -9991940 -2667753 3719895 18711407
38103 18711407 35351676 39968405 34812710 31503668 28642891 17022683 2889493 2925263
38095 2925263 16143958 23909507 20876167 22177038 33077903 35808036 19405219 1323561
38087 1323561 2150075 15625545 22748245 22003406 24229418 26920710 17036459 -3555784
38079 -3555784 -16828883 -14260585 -6074781 -2104388 680680 7157062 14347968 18253666
38071 18253666 19482924 17858778 11933866 7215439 12706479 24236107 24167803 5634330
38063 5634330 -15012709 -20309827 -15253678 -15468387 -20979694 -19447726 -11709298 -13961025
38055 -13961025 -30250424 -40487234 -26615859 1341839 18947202 20054028 20542097
38048 20542097 30742875 40162418 35696407 22615072 16405949 20623314 25523042 26459483
38040 26459483 30055724 39002264 42940040 32329765 13324249 -97729 -3382882 -1867616
38032 -1867616 1178620 6121002 9216959 5451160 -731938 272980 6382413 4828583
38024 4828583 -5002730 -4651992 16343393 38658110 34876462 7039231 -14842665 -10940914
38016 -10940914 8475649 24189981 32300710 38549528 41854777 37244457 28947363 27400758
38008 27400758 34191406 39471622 34394968 18995439 -1068902 -17435936 -19313938 -931019
38000 -931019 27973698 47140359 46067368 33576297 23420822 17655070 10926750 4735909
37992 4735909 6745717 17296274 26660674 27969319 25211710 24898242 25948387 22627445
37984 22627445 13451040 2331748 -6613615 -11074833 -9340361 -1787405 6738996 9827204
37976 9827204 5525056 -2363856 -8584623 -10275919 -7668615 -3461054 -909772 -514945
37968 -514945 361734 2647676 2485089 -3614587 -12322127 -16385419 -12731910 -3287378 10440881
37959 10440881 27080722 40196872 41402111 30939197 18261925 9609789 2604046
37952 2604046 -3705742 -3399032 4642353 9121286 1312471 -9366570 -8005367 2163540
37944 2163540 4279954 -5165426 -11048103 -4833745 1995713 -1638751 -7224522 -649376
37936 -649376 14614545 22235407 15517436 3217048 -3266744 1515304 16295041 30138300
37928 30138300 25988969 601006 -23247783 -19799345 6237479 25316702 21702077
37921 21702077 8441069 1469640 -481068 -1669733 4946965 22610830 36001847 29491969
37913 29491969 11256560 2027206 5854832 9292376 6433958 7091025 18671155 34799146
37905 34799146 45764653 49054963 46011840 37502058 26459111 17514490 12067857 9609946
37897 9609946 12743133 22615681 31124239 28599798 18986250 15111949 17703431 13034764
37889 13034764 -4476696 -21768250 -26918381 -26423326 -31884058 -39792247 -37888735 -25682879
37881 -25682879 -15293522 -13688193 -15357955 -13370524 -8955092 -7517760 -10056808 -10845366
37873 -10845366 -2699832 14416373 30140287 33385790 26066045 20564649 21375415 18297749
37865 18297749 3500091 -13995201 -20207316 -15446107 -10732519 -10213300 -9324166 -7246681
37857 -7246681 -7697307 -7478921 2058655 18781820 27314732 19343520 7036991 7858455
37849 7858455 21679582 31594909 25385700 8797408 -3181928 -2897805 4577972 9448888
37841 9448888 6615426 -2652493 -13860253 -20787733 -17309853 -3893857 8770624 9779404
37833 9779404 2069018 -1516746 2817334 5387913 951288 -2055725 1775960 2425425
37825 2425425 -7963461 -16890173 -9136266 5270606 2418397 -18679840 -33557621 -29380826
37817 -29380826 -21797706 -26359250 -33779094 -27324339 -9190226 5957192 12517996 13721173
37809 13721173 8561313 -4890335 -17883178 -17636368 -4040542 11918740 24194876
37802 24194876 34485178 40733546 35755612 19479925 2427965 -6532516 -9183434 -12568583
37794 -12568583 -20243885 -30320774 -37468216 -36160735 -25869418 -12520711 -1283083
37787 -1283083 9583421 22922799 34556541 38334169 36448693 35843553 35843552 29241708 15885574
37778 15885574 4884496 1396075 1490509 3311768 12000781 26894953 34425569 24844746
37770 24844746 9866827 11041273 31725051 52091957 54384635 43220203 35091671
37763 35091671 35314529 35074195 29178295 25671771 32790786 43839512 44349945 32228289
37755 32228289 20822456 20005098 24018107 23551268 20301358 19485122 15247703 -1712350
37747 -1712350 -23795755 -30115852 -14885310 2364574 3680735 -2577409 2949158 18835678
37739 18835678 23331410 6118711 -15537088 -17877743 1691000 24129778 29848359
37732 29848359 15121038 -7641130 -20654748 -14850844 2133446 13411932 10491147
37725 10491147 798583 -3877832 -1319219 2691724 4796586 6512350 9046457 12002610
37717 12002610 15422704 17123596 10562436 -6554298 -22921905 -23066638 -7754808 5311878
37709 5311878 5037854 330341 2813508 6931981 -38578 -14455254 -18354647 -5138646
37701 -5138646 10926714 15202177 10823574 9092719 11171788 9878648 4813919 3841554
37693 3841554 8737033 9326502 -2907449 -21225789 -30317218 -24412742 -12033285 -2558703
37685 -2558703 4059012 10080242 10539222 1234748 -7583241 538375 23494911 37813275
37677 37813275 28847094 12148388 12136455 27861815 36102166 25180596 8618917 3317591
37669 3317591 9568954 17881559 22460720 20684543 10056691 -5673841 -15205574 -12566846
37661 -12566846 -5326258 -3320756 -5389171 -4216895 1446240 6993128 10094407 11782740
37653 11782740 12783176 14262091 18656102 25292540 29681238 30989938 33832179 37910979
37645 37910979 34065082 18183548 1536566 -2344689 4639724 10433466 10499012 8863384
37637 8863384 5108259 -6721807 -25389089 -38975722 -37186401 -21615168 -3207322
37630 -3207322 6570099 4524034 580254 9799203 33512628 53515452 52594976 35114179
37622 35114179 17930876 7389382 -1905917 -10291891 -10864553 -3769172 2090563 3858491
37614 3858491 8551390 19435144 30171725 35143123 34482315 26881311 10022338 -8252188
37606 -8252188 -12372469 790837 14844361 13991692 1716610 -6747353 -2756083 10621764
37598 10621764 24475992 29493653 21743853 7655998 -1690913 -2925836 -886080 2283245
37590 2283245 8391581 13696494 11067969 3621647 2172312 6016619 2347662 -9843748
37582 -9843748 -13515533 -805626 11552699 7681069 -3089034 -4246973 -33811 -4992570
37574 -4992570 -16239312 -18342069 -9625676 -1627302 4451628 18540925 38341870 46205499
37566 46205499 34027702 14261692 1094476 -4510421 -6383330 -4358671 68157 1814982
37558 1814982 1642148 6184356 14161493 15255357 8306798 7085180 19572907 33821569
37550 33821569 34986797 26393877 21937025 25181109 28357576 27118535 24096387 20195739
37542 20195739 13524696 6726932 5847287 10830857 14810920 14084312 11837553 10078626
37534 10078626 4702447 -7034405 -18394462 -18369960 -5208550 9158419 11001724 211245
37526 211245 -9491039 -6992331 3270356 8548939 4530955 -2043701 -6323299 -11654146
37518 -11654146 -19897511 -24113725 -17605142 -4452433 6435535 13326053 19092762 19966325
37510 19966325 8220130 -12801181 -27503013 -27251948 -22037210 -25142536 -32716461 -29293743
37502 -29293743 -11327921 6396254 10220189 3448153 -2596861 -4803104 -7182643 -9669282
37494 -9669282 -9134707 -9453318 -18208897 -30744796 -28984539 -3678440 29344452 43945557
37486 43945557 31605649 7568997 -8224473 -8407745 2822140 18892945 34627626
37479 34627626 45449092 48198037 43221625 34251377 25945463 21257858 20266665 20967758
37471 20967758 20774717 17074945 8144489 -3824459 -11621609 -9023799 1697052 12263367
37463 12263367 18537287 22773619 25201306 21469086 12423231 8041498 13998118 20628156
37455 20628156 14919473 -391031 -10303071 -8469728 -3282008 -2026072 -846321 4202476
37447 4202476 6079622 -3908013 -20518177 -28060269 -19374407 -3858508 5439612 6596388
37439 6596388 6385264 7539687 5743854 -899592 -7153092 -9113715 -10978248 -17144028
37431 -17144028 -22811650 -21108736 -15927821 -16620916 -21034152 -16589057 -443660 14390552
37423 14390552 17933633 15674258 15371265 14255841 9070683 6731509 12093946 14901770
37415 14901770 3797623 -13487238 -19030477 -9004848 5615473 18466019 32076540
37408 32076540 44774464 49359436 45739126 41319484 38146332 32214734 25111642 22806307
37400 22806307 23045509 18148591 10420422 9545725 13860566 10756512 -1780156 -10912830
37392 -10912830 -9984785 -6649317 -5235828 684194 11055260 13467920 4603601 -346579
37384 -346579 7800961 14998936 6210145 -9883235 -15385676 -10249590 -6604769 -5489151
37376 -5489151 1371300 11907899 14196339 5020297 -6454682 -11955483 -9411000 989458
37368 989458 13850498 16939247 6526714 -815107 11809016 33473211 36290319 14605764
37360 14605764 -6529777 -6950950 3444988 5119472 -1005257 1238469 16068686 29092073
37352 29092073 27339741 14971261 5757692 6279166 11255647 13135266 10997487 8134618
37344 8134618 5139324 871521 -1585446 2446028 9816573 11333645 6220509 5559214
37336 5559214 15186347 24183399 19828507 7123357 1996301 8914342 17010365 17483600
37328 17483600 13974133 14078644 18956252 23862004 23635018 16466450 6036565 -691681
37320 -691681 -1173363 -377861 -2416333 -3294280 2094585 9717505 10652615 3392038 -5165354
37311 -5165354 -9775639 -11838686 -15127038 -21003643 -26754742 -26541240 -17800756 -8210734
37303 -8210734 -9213929 -19795590 -25906411 -20119356 -10243988 -2494221 8840934 24358217
37295 24358217 28772795 13912880 -2357548 -1650272 2990546 -12834659 -40677270 -45842495
37287 -45842495 -18269592 13164840 23112891 18765570 16523312 15780927 11127828 9289144
37279 9289144 15742427 19607425 9091944 -8924976 -19194994 -18235994 -11536932 -822676
37271 -822676 12590855 20580327 17616950 10243932 5648297 -937330 -14679903 -25235051
37263 -25235051 -18159540 1891628 14887545 12241024 6921036 14152985 31388219 41630160
37255 41630160 32390162 8982473 -10027347 -11136295 752648 10037204 9308871 4090758
37247 4090758 818413 471150 4481944 14808455 25486323 26748187 21265685 22690266
37239 22690266 33532768 40222887 36666943 34478062 39170100 35672914 14164053 -6886438
37231 -6886438 -4777545 13036351 21623132 16271591 12716424 15156032 10601800 -4073170
37223 -4073170 -14188526 -12087297 -9328471 -16254094 -26196317 -28568391 -24139083 -19019553
37215 -19019553 -14309778 -9146348 -5707303 -5765144 -8785447 -15012281 -22470582 -22143508
37207 -22143508 -8207911 7405457 5990591 -10221382 -18372232 -8411078 1909829
37200 1909829 -4381399 -16813235 -14486555 2831938 18121995 24032551 28739488 37848599
37192 37848599 46415143 49405301 46895480 37329700 17451035 -7918623 -25902113 -29447688
37184 -29447688 -23940507 -17361488 -11593822 -6447205 -3534341 -856659 8108859 22147757
37176 22147757 26528972 10801476 -11743639 -16457716 -351497 11571004 -661147
37169 -661147 -25672406 -38822089 -36157884 -33676187 -37752054 -36703706 -25089893 -16823386
37161 -16823386 -23069281 -31775894 -24517113 -4784724 7454651 5920481 5448581 16507261
37153 16507261 27008654 18374305 -7630346 -27374156 -20188620 9989072 39143749
37146 39143749 47813374 38984686 30189358 31175460 36002498 36973569 36381875 38741831
37138 38741831 39780326 32699770 20935273 14981882 18298367 24666730 28355442 28974064
37130 28974064 26780943 20976383 13559447 8705434 7235283 6053140 2777119 -2999839
37122 -2999839 -11383872 -20414505 -24369205 -18783371 -6098570 6980886 15180764 15289324
37114 15289324 6758865 -3891252 -5919247 2183053 8843527 6027459 1816106 7404392
37106 7404392 19800840 28719919 32867722 36240900 35574180 26801626 18047735 19460406
37098 19460406 24828071 21036563 11510155 10250816 15476449 11864536 -910475 -6154830
37090 -6154830 18264 2042650 -4920078 -3836811 13451987 28600965 25751346 16714149
37082 16714149 18579145 25063444 21689446 14019579 16548744 23940038 18555186 2039474
37074 2039474 -4308092 8704991 25829253 30372635 24333820 20922328 27482937 39557325
37066 39557325 45566812 36970999 18521287 5407658 5186691 8418459 3986242 -4041084
37058 -4041084 -4560316 2824161 10002122 14697296 20088319 23958288 20446511 10478386
37050 10478386 478577 -6135010 -7482740 355800 14173030 18033114 1624198 -20662933
37042 -20662933 -25089910 -10490896 1275037 -4100714 -18554794 -28417484 -30185704 -26194601
37034 -26194601 -18376635 -10955698 -8630110 -8862223 -5141521 1578789 5109477 6899678
37026 6899678 13891690 23263136 23486501 13010061 4331844 6100349 13746013 20906092
37018 20906092 27169845 31075196 28624653 22727341 21263623 22485319 16420326 4090919
37010 4090919 -1001311 4382608 6986754 1327708 1100943 14522847 26691823 22653726
37002 22653726 12441161 14072715 23548680 22465070 7739228 -6733577 -13480579 -16831638
36994 -16831638 -17251250 -9693744 1577340 4232295 -2795888 -5969595 3475812 19846840
36986 19846840 35196089 47456292 52800812 44486921 26347787 15029361 19850742
36979 19850742 29837650 29607203 20019713 13242177 13453355 13502755 8330637 1633600 -1580006
36970 -1580006 -1419362 274493 4353860 11613532 17804951 15381098 2018018 -13777711
36962 -13777711 -18879580 -9325928 4756757 11616558 12922401 20405626 37856073 53946003
36954 53946003 56149419 45681806 33667726 27236064 25887891 28608495 36213941 45606265
36946 45606265 48945611 42765608 33764431 30777316 33318212 33388566 27902431 22770528
36938 22770528 22207478 20489157 10995498 -307599 -155292 12104471 19794903 10110404
36930 10110404 -7512427 -13392305 -3578988 7372561 8945277 7600121 12811067 21165948
36922 21165948 23350372 19866056 18695817 20381738 17168233 7753700 1348301 2248083
36914 2248083 476122 -13170406 -29114483 -27876816 -6422442 15176874 17124842 1752362
36906 1752362 -13863510 -20808838 -24927172 -32254666 -37421890 -30861388 -12821161 5011864
36898 5011864 11203965 5038508 -4453544 -7790190 -3143007 3330482 4529082 -53662
36890 -53662 -4277849 -3179066 801130 1622133 -1406855 -2723319 -62373 -293601 -10732910
36881 -10732910 -26851561 -35172343 -29065007 -15433554 -3631708 5320883 13685705 17794572
36873 17794572 12283875 414328 -8598662 -11805526 -14012512 -17189833 -17143359 -12377796
36865 -12377796 -7677597 -5548395 -1746369 6458105 14102840 14830012 7682140 -5247886
36857 -5247886 -20702279 -30609377 -25851924 -9348247 3822251 6179356 7540243 15965745
36849 15965745 20804808 9496533 -7601780 -8179181 9361010 23400189 20496759 10906796
36841 10906796 7946403 9140207 6838277 3409005 4158884 5050547 -197684 -6861220
36833 -6861220 -4763265 5725248 13327980 11106879 3942855 -567440 -2373960 -6299943
36825 -6299943 -11576504 -9143902 6993627 27635808 34994311 24645106 13003498 15562250
36817 15562250 25228871 24024359 10752495 1227782 2142859 2083744 -7719302 -19888717
36809 -19888717 -25092363 -25833683 -27795115 -29447950 -28786794 -29333755 -31073828 -26546453
36801 -26546453 -14530787 -5772266 -5649959 -4220874 4862684 9597925 -595109 -13082257
36793 -13082257 -9370801 5152670 10173913 2933510 -1194679 1816676 -1250717 -14432643
36785 -14432643 -23302091 -19974156 -17551303 -28072030 -41394767 -39612309 -22576542 -6087295
36777 -6087295 35021 1269446 7419194 19303706 27042371 20420008 2445110 -9646536
36769 -9646536 -2212739 18247728 33547334 36086202 33102306 31131047 28810095 25287395
36761 25287395 22555229 17544627 5139536 -8415384 -9214991 3646519 15919206 20661285
36753 20661285 25487340 31131355 23624704 836848 -13042305 978989 25575082
36746 25575082 29628024 11185985 -6013002 -11976318 -19605349 -34401022 -41353098 -29991532
36738 -29991532 -12154122 -4078769 -5451543 -6225716 -2311620 5239327 16846753 30505086
36730 30505086 38484019 36306246 29569356 25481949 23087285 17301616 7135886 -4612023
36722 -4612023 -13807232 -13578177 1353859 23912518 37022732 33430230 24706725 22996271
36714 22996271 23415054 15626695 4641732 5133339 18024189 27293341 21544674 7386561
36706 7386561 -1498706 59547 7045326 11854103 11351443 10195875 16129713 27818499
36698 27818499 31831985 19659698 3068591 638185 11139875 14420151 238739
36691 238739 -18134763 -23939346 -17558768 -10138689 -7648581 -9479159 -13818950 -16104094
36683 -16104094 -9776853 3639219 12409300 9769502 3772957 4816190 11578697 17168995
36675 17168995 20105043 19988265 12217339 -1305114 -5813869 7573371 24496399 24638642
36667 24638642 10523070 2277520 7962258 16844036 19712291 17492779 10393322 -2572281
36659 -2572281 -12030041 -5156289 13002010 23382558 20745268 17598983 16745736 4192168
36651 4192168 -20587133 -31446033 -9710850 26925324 48398904 50457943 49189183
36644 49189183 49463971 41292568 22509501 5109960 -1207329 1391635 4753273 972980
36636 972980 -12843527 -27577325 -27163898 -10004449 4422905 1913077 -5048739 2150175
36628 2150175 17317409 19370140 6028684 -4806762 -4997659 -5404251 -13202971 -19865101
36620 -19865101 -17255581 -10089771 -6182392 -5946560 -6468686 -7223995 -9008367 -13489860
36612 -13489860 -22297767 -30231317 -25652352 -7354756 7331872 4439444 -6049783 -7915248
36604 -7915248 -5960949 -13107831 -19853804 -5834586 21680173 32689527 20176418 8818063
36596 8818063 11481004 10427570 -5214863 -15793309 -4787143 11645006 12205237 4310047
36588 4310047 4958686 7577506 -3368970 -18580246 -14564752 8395209 25215359 20727797
36580 20727797 4083981 -9615554 -13308216 -5688035 7601941 12380114 1543381
36573 1543381 -10467986 -5160902 10790391 11794395 -10891617 -36771224 -43045621 -30384916
36565 -30384916 -17297199 -18464177 -32388933 -44549467 -41511626 -24859141 -7977352
36558 -7977352 2545101 12506653 22515231 20201540 2369850 -10177050 852233
36551 852233 20742401 20107973 -2713166 -21011593 -18770612 -6750503 1183924 4296829
36543 4296829 2912919 -7965233 -24544630 -31571084 -22965765 -10936253 -6959192 -7141861
36535 -7141861 -3505401 3587608 11842234 23225402 35860569 41302190 37447023 32948503
36527 32948503 31673652 25069392 8672733 -6171284 -8166249 -2889858 -1171778 191080
36519 191080 11012963 26253286 28260197 11427837 -8305887 -12918802 -2563053 8897496
36511 8897496 12770819 12973090 15829725 19478011 17900133 12303250 11359693 18870988
36503 18870988 27904136 30607743 27250749 20610819 8896645 -7601992 -18974508 -15084095
36495 -15084095 778230 16493489 25430331 27188194 19973307 4952518 -5770900
36488 -5770900 -38728 16505837 26613577 24294214 18038671 13271614 8071963 6632967
36480 6632967 18659708 40653859 53805824 46774572 27642507 9393872 -2249577
36473 -2249577 -3351136 8470750 22466799 20438261 2915665 -6807249 4819672 21164793
36465 21164793 20017542 3685942 -10228911 -15238060 -16459327 -14217691 -4372624 10013358
36457 10013358 21503238 29009035 34609532 35126995 28291325 21927182 25081625 33845228
36449 33845228 36595298 29772493 19148589 9611812 2470160 -1770285 -6026585 -15971668
36441 -15971668 -28405597 -28162533 -7527834 18279331 27404639 17888562 5809904 1908193
36433 1908193 3254537 4977981 6678226 7418095 5476820 3524127 5463364 8931156
36425 8931156 8624096 5298731 4119675 6442577 10054538 14234008 17926683 17396565
36417 17396565 12903503 12742379 22932895 37539830 45905145 43757591 31771180 12572973
36409 12572973 -3337023 -625592 20422788 37433189 32902051 16945180 9346923
36402 9346923 11321133 12332691 12243094 14833772 10133556 -10779906 -30352719 -22565363
36394 -22565363 5762321 20732714 10340177 -1245712 5938013 21454139 28687349
36387 28687349 28855271 27301245 19304703 5612801 2052450 16208207 30807137 27164685
36379 27164685 10954881 -1369834 -7746167 -14624685 -18472965 -12499281 -3169602 -1434643
36371 -1434643 -3590246 1783330 12489722 15378413 8122545 2769968 7429332 16999319
36363 16999319 22698528 20939497 13232746 5754544 7091334 18147222 27307420 24491755
36355 24491755 16539132 18648608 33368098 48678944 54986923 52882294 44775093 30852851
36347 30852851 15823984 9258119 13962949 20347717 17239817 5042697 -5343083 -5649513
36339 -5649513 -566767 -3580299 -20361105 -37933959 -37032948 -16625996 2510037 3407011
36331 3407011 -7150902 -12563132 -11482780 -15946997 -28954857 -38654333 -35733298 -23981157
36323 -23981157 -10454561 3365207 14934000 15178320 -848183 -22689632 -33625726
36316 -33625726 -30838477 -28265967 -36274041 -45225449 -36938761 -10564165 12663184 14602556
36308 14602556 2086328 -4246799 3214297 14670494 21677602 25415240 24893623 12975661
36300 12975661 -8505397 -23033644 -19364520 -7406937 -3395457 -7773541 -9765192 -6514128
36292 -6514128 -3495033 -140893 10017572 25027209 33094530 27585813 14073707 1219000
36284 1219000 -7074366 -10017134 -8824897 -7770282 -8618641 -4694973 10269812 27758139
36276 27758139 30533791 16039766 2364789 4418326 13418356 9664095 -9264883 -24051682
36268 -24051682 -18541573 -571462 8346924 878143 -7549256 -1655243 10601256 9117354
36260 9117354 -7134195 -15541789 -1419558 20447045 26302192 13744225 -2085460
36253 -2085460 -13213117 -22582802 -28274329 -22845319 -8831915 1591962 4916705 9715221
36245 9715221 19099455 24473370 21091387 15851300 14229923 12854543 10953887 15242905
36237 15242905 25634082 29720616 21208473 11167517 9963555 10691643 4309142 -656548
36229 -656548 8515414 23644986 24679764 11964269 9078716 29015068 54045182 57466290
36221 57466290 34424528 3324153 -15446966 -15003239 -2373337 9011458 9762760 2275586
36213 2275586 -3283481 -2069260 155086 -3507067 -11367859 -16363828 -15001339 -9253176
36205 -9253176 -2494663 2717368 4894866 4815679 4886878 5184897 2495857 -4407196 -11494796
36196 -11494796 -14749406 -16073691 -19930530 -26034070 -30012022 -30560756 -31254486 -34661987
36188 -34661987 -38431035 -38341822 -32667623 -22978595 -12905022 -5873114 -1361057 5720520
36180 5720520 18027092 29128499 29642293 20413170 12545964 11996805 11979474 5571278
36172 5571278 -2052502 -2012923 4026573 8362548 11470718 18947087 25878994 19459449
36164 19459449 1125037 -8015769 7319883 35617090 53047455 51723543 43125798
36157 43125798 38967256 40623603 45208591 49824738 48316979 34471918 12929933 -524020
36149 -524020 4797801 21540209 31562996 24110750 4613099 -12132981 -15013653 -4373106
36141 -4373106 10414718 19907913 20873905 14837054 4176125 -7503616 -13801020 -9554011
36133 -9554011 2657039 13364620 15113166 8764408 151352 -7416697 -15097458 -23454936
36125 -23454936 -28521189 -25983776 -18554084 -14344146 -15735612 -15056763 -6158301 4765588
36117 4765588 7507880 2896838 -466390 -1515612 -5943132 -11075642 -7363895 2194710
36109 2194710 1727392 -11021103 -15901032 -695108 16163009 10613631 -11945919 -26551653
36101 -26551653 -24572805 -18207756 -14860163 -10142146 -5308257 -8862037 -17530610 -16130604
36093 -16130604 -1994528 8867456 6905671 3181077 9551033 19912519 22070218 16597194
36085 16597194 12732015 13589322 15178515 14970441 14437588 16248793 21596367 26623444
36077 26623444 23271393 10736119 1977784 7457216 16924484 13211496 805037 646475
36069 646475 16914945 31959427 37221037 43762250 54749045 54396001 37175729 22497832
36061 22497832 23862065 27485776 20262902 14217441 19837235 19346578 -3697570 -28440892
36053 -28440892 -24998484 -4257410 -2176922 -22735658 -35111195 -25631783 -14046601
36046 -14046601 -13881886 -13471921 -6577981 -8364320 -25753136 -39963844 -35625758 -23949575
36038 -23949575 -20037625 -18237631 -8342542 1776387 -535636 -10071446 -12856475 -8246958
36030 -8246958 -6017808 -9105884 -12757556 -14243280 -12725590 -6610266 481362 191695
36022 191695 -6276738 -5606670 7237090 18965534 18668613 14646320 17896981 22997127
36014 22997127 20901665 17261357 19712700 19234694 5782530 -7113718 1869304 26320814
36006 26320814 38143132 29293074 22074582 32479203 46863003 45646782 31002276
35999 31002276 17419326 8854189 -217156 -10065448 -15547685 -15879400 -14325932 -11847761
35991 -11847761 -9164131 -10858417 -18743890 -24245801 -16606829 1911413 17171688 20520078
35983 20520078 17612124 16837711 15591967 5176858 -12761371 -23314434 -15760691 1802999
35975 1802999 12125599 10162258 6173157 8049545 11396192 10945443 10806521 15140387
35967 15140387 17592817 11264065 3189121 5916367 17254004 21447728 10860789 -5226600
35959 -5226600 -14775071 -14679498 -6392705 7999365 20946069 22197313 13047522 8000275
35951 8000275 14629471 20935514 12462516 -5194200 -12501393 -948218 19038717 33599928
35943 33599928 38103519 33250583 18756601 -3717045 -26553442 -40205113 -40146376 -28751354
35935 -28751354 -12823226 -315340 3590793 -232258 -6056246 -8478422 -5816579 794935
35927 794935 8978437 14953897 14237372 4923815 -9716130 -23009747 -29796884 -29818847
35919 -29818847 -26574741 -23046971 -18753623 -11327652 -861323 8194013 10326208 4448202
35911 4448202 -4081364 -7473294 -2171849 8513030 18474859 23925257 22867337 12344259
35903 12344259 -7801716 -28046836 -33613347 -20230959 376067 15745066 26159476
35896 26159476 35018048 34785624 18174869 -641128 3736533 32103950 54136040 47714250
35888 47714250 27830763 21618845 29056481 28438498 11888979 -7174149 -19045095 -27773365
35880 -27773365 -34387464 -31320979 -19358269 -11201403 -10782466 -7417309 579002 -3249336
35872 -3249336 -24688555 -40059944 -26793198 1429384 13587049 5280016 -2453717
35865 -2453717 -2436884 -9129309 -24369422 -25717099 -1465768 27191502 36211822 32307732
35857 32307732 36966734 50510175 53861100 39409303 19708253 6760010 -665840
35850 -665840 -8112943 -17267726 -28324042 -39963157 -46295291 -43028071 -35877600 -33309398
35842 -33309398 -32789857 -25565723 -13680969 -8841629 -13421416 -16419082 -11436039 -5176742
35834 -5176742 -3343311 -1608186 2485215 1698446 -7530814 -15591381 -14686347 -12838430
35826 -12838430 -19597787 -26656154 -19234963 -1856286 5488524 -2952867 -10438006 -3687349
35818 -3687349 9063368 14817680 17110916 27224052 42281106 47459523 38125486 25506540
35810 25506540 17741000 8104349 -10693652 -30220056 -35475889 -26117605 -16919174 -17005196
35802 -17005196 -19628378 -16011046 -9031148 -5890003 -5003542 -161534 6466849 6228207
35794 6228207 -1820155 -8324588 -6761159 -1075794 2161596 2368685 2841552 5487810
35786 5487810 10088694 14398334 14052319 7270192 -525149 -2799613 -1477793 -2354886
35778 -2354886 -2729088 4316834 12920896 7533477 -11356808 -20927062 -6708682 14206994
35770 14206994 15575770 -2607228 -17863922 -17363631 -8243350 758837 9358143 16323625
35762 16323625 16598875 11886308 11182684 17035721 22395171 23319628 22686561 19010808 5758438
35753 5758438 -13058701 -20783584 -10229764 3550319 2447551 -11647263 -22767214
35746 -22767214 -22527362 -15766760 -9701281 -6885106 -6135652 -3806405 2718070 8713948
35738 8713948 5679604 -3916419 -4542995 11534242 30633514 36383171 33658120 38654428
35730 38654428 50654271 52156196 37117088 20549321 14833302 12819283 3423909 -9262469
35722 -9262469 -14020217 -10243624 -5361439 -749064 7435541 16910228 20820079 19396281
35714 19396281 18950178 19560832 15544569 9718421 14094642 30539253 42570000 36079600
35706 36079600 19442740 11376862 15094315 18151211 14546271 11069371 10540031 5195722
35698 5195722 -7135155 -15368405 -13481158 -12716017 -21516231 -25165743 -5241779 26576613
35690 26576613 37169708 16472313 -8535011 -12248747 -2742184 -1587707 -7976202 -3709856
35682 -3709856 14170551 28141265 27887449 23526491 25358104 27234411 21233458 16732009
35674 16732009 28999536 52680638 62476941 44432262 15399477 3178567 13561081
35667 13561081 27192429 27175015 17960404 12759644 13102375 11469678 8266990 12066081
35659 12066081 22209975 24770564 12176341 -3292738 -4293874 10396772 28564118
35652 28564118 42008582 49536053 46421017 26153453 -4008906 -21955109 -13274508
35645 -13274508 11942465 31642950 35477126 28766149 18325448 5342578 -7586848
35638 -7586848 -12703209 -5566042 8287108 20273632 28537997 35433924 38459774 31544689
35630 31544689 16049375 3173147 1461103 6629763 8366835 3863535 -628554 169795
35622 169795 4384525 6791871 4790829 255616 -2041661 1497178 9008215 15253705
35614 15253705 19616453 26651690 34835221 33025790 17375512 3899620 9235124 23322034
35606 23322034 20645429 -453846 -12172544 702012 15594935 5952876 -17691427
35599 -17691427 -23895574 -7226120 6959337 2340787 -8811770 -10489153 -5601057 -4004531
35591 -4004531 -4330548 17654 7209884 10417950 8321277 4083622 -44351 -350426
35583 -350426 9219830 27568320 41504276 38797288 23238303 9949956 8276732 15160676
35575 15160676 22533022 24486972 18354614 5331851 -8357110 -14646859 -10363356 -577979
35567 -577979 5649512 4833121 5144897 18638283 43270058 58068128 45076158 12697259
35559 12697259 -14526251 -27648414 -39320621 -56079027 -64079103 -52953893 -36526620
35552 -36526620 -32612459 -34479535 -23235680 -1674624 7797109 -685881 -5447621 9993456
35544 9993456 32150250 37774897 25221929 11259367 5181315 1591800 -3881035 -6126639
35536 -6126639 -573586 8436120 14433653 18152566 24657567 33861678 39243812 36511930
35528 36511930 29534250 24870797 22834996 18942817 14284527 17522228 31716955 44687659
35520 44687659 41362974 24426892 12892392 17389590 25706491 19366663 -1165299 -16397175
35512 -16397175 -11955746 4321565 11971508 1002179 -17971066 -26729461 -20329395 -11677957
35504 -11677957 -14012210 -23372791 -24957222 -15179072 -7564734 -12858034 -22462014 -20390041
35496 -20390041 -5888083 7219259 12069877 17067171 29193450 40328734 38611250
35489 38611250 26428100 16733692 14116933 9978540 -2277096 -16440389 -21994883 -16576738
35481 -16576738 -4693564 10397365 26441129 37241583 36513558 27020099 18945451 17458191
35473 17458191 17465567 12478022 2978945 -6664531 -14059568 -18010664 -17256013 -14533871 -16903047
35464 -16903047 -26439278 -35138156 -35477784 -31413156 -30457393 -28787281 -15752097 7164034
35456 7164034 24162977 25368113 18416627 14285537 11504145 2833458 -9993708 -18554592
35448 -18554592 -20634930 -20932849 -20901231 -17377933 -11123514 -7805303 -8852459 -8810306 -4181823
35439 -4181823 1509352 4268411 5476465 7706083 9420683 7768707 3391192 -702610
35431 -702610 -2101344 1437237 11129712 22342574 25098466 15105352 1701084 -1452118
35423 -1452118 7201788 15847795 14514403 5486552 -2784278 -5835029 -3941644 1466800
35415 1466800 6566572 4589780 -5844083 -13435606 -4080256 19894385 38563602 37664232
35407 37664232 26362996 23990140 33731992 40422714 33982399 22621993 17543123 15410006
35399 15410006 6590833 -5453498 -6589981 5778203 14990865 4993135 -19851390 -40956988
35391 -40956988 -45987359 -36512369 -19729714 -1578764 12390324 18095329 18365105 21376835
35383 21376835 29011674 31050215 17181531 -7118861 -24085295 -24553174 -18400818 -19322055
35375 -19322055 -24858030 -20426744 -1970187 15699640 17464450 7044433 480721 5359719
35367 5359719 14895047 20271591 19483397 13228876 1360652 -12241993 -18076621 -10585152
35359 -10585152 3491084 10950204 4994134 -10199526 -25259132 -32846062 -30884954 -21849148
35351 -21849148 -9241606 5060656 18587675 25417528 20862047 9408765 2044318
35344 2044318 3687796 8727431 10755843 10060420 8945799 7450254 7426219 12012654 16118738
35335 16118738 8316448 -9753463 -17977387 -4498802 13213390 11300976 -4910129
35328 -4910129 -9593073 3666964 15164636 13514369 10712607 15022036 14336450 1238120
35320 1238120 -7301611 5255858 27449443 38331861 39589109 45271926 50180319 36533723
35312 36533723 8663719 -7179590 -963266 8393626 5200667 -1662557 -483574 1379010
35304 1379010 -7221188 -20144447 -25168141 -24423859 -26425210 -26726604 -14917775 4296317
35296 4296317 15522428 16701366 20797539 31664934 35965327 25954392 15008625 18861685
35288 18861685 31511864 33454597 19217494 3262226 -1172187 3580247 10098281 19229393
35280 19229393 34080459 47541497 47328606 32712115 16702743 10028566 11102149 14153966
35272 14153966 18207415 22629078 21829767 12439665 591929 -5776179 -7620829 -10084953
35264 -10084953 -11855737 -8648549 -3344025 -1747940 -1097204 4969383 11679738 7465764
35256 7465764 -6262340 -14589244 -11374746 -6647726 -6560100 -2662085 9553349 17840816
35248 17840816 13092210 8370680 20014448 38984932 41523828 24682402 10558334
35241 10558334 13227427 20358129 14894310 140051 -7825520 -4157679 95938 -4504564
35233 -4504564 -12555670 -11378566 1662843 14842948 17684457 16015148 22734419 34842259
35225 34842259 33119850 10124189 -15344170 -22767898 -16550360 -12658708 -9326246 7276064
35217 7276064 32423844 42048165 26502795 4757509 -2269138 4469236 12461914 15269514
35209 15269514 10569213 -3815992 -20485297 -22797394 -7231787 6964374 4037391
35202 4037391 -4378748 2075233 20091625 28672973 22040652 15621705 18821167 21279612
35194 21279612 12228478 -1140576 -3473803 8552780 22624983 23708764 8390579
35187 8390579 -10064717 -12049014 7297559 29310783 31683703 15137815 839959
35180 839959 2491064 12593950 17770916 15229130 9130121 1596315 -5168041 -5721184
35172 -5721184 1605785 9306049 8679983 -157534 -10297103 -15678626 -13354936 -4028376
35164 -4028376 5168492 4617036 -5272218 -11132052 -2798438 12769998 21111483 18969181
35156 18969181 14464258 12211120 9133751 4773415 4883889 11465200 17629730 17288542
35148 17288542 14143032 15823619 22729025 27679765 25167954 17388749 11577678 13156850
35140 13156850 20512299 25438441 20631144 8498501 759465 6622588 21743863 31386687
35132 31386687 25709826 10858377 2996715 10588671 24467175 28333140 18230489 6563242
35124 6563242 5112247 10313487 10989538 5630096 2887984 6602507 10765329 11127263
35116 11127263 11481971 13848170 12278081 3835518 -3073233 -1516823 -26789 -10531398
35108 -10531398 -26414504 -28566551 -14260327 -3550002 -10500732 -22679959 -20464527
35101 -20464527 -5890408 2151819 -4172105 -13570968 -14752837 -10083662 -7020919 -6407798
35093 -6407798 -4269346 1674282 11257789 21869202 26347224 17548481 -782123 -13661788
35085 -13661788 -10542816 3148916 14592612 18487586 17626968 13733840 6281692 -1448606
35077 -1448606 -3562613 565028 6295300 12271203 21674583 32616725 34996910 23119546
35069 23119546 6914707 2892813 14366120 27067259 26209710 12860166 -17501
35062 -17501 -3949265 -1986855 -771096 -2213690 -5398720 -11074551 -18852033 -23031610
35054 -23031610 -18039732 -7931154 -3973155 -10568100 -18792504 -17271095 -5583757 6744120
35046 6744120 11404396 7436447 -1439344 -11122837 -19139037 -24930590 -27662609 -23394790
35038 -23394790 -8423123 12098632 24176200 19602166 7313544 3049734 9316847
35031 9316847 13590378 6792987 -4949567 -10541675 -9226553 -9878824 -17847331 -27497007
35023 -27497007 -28252392 -16693302 -2285391 1038353 -8448137 -15355248 -5288971 14458438
$$ [...]
##END NTUPLES=NMR SPECTRUM
##END=
