##TITLE=31Pdec_LR-686-C1
 CDcl3, 88 sc
 18.9.2019
##JCAMPDX= 6.0         $$ Bruker NMR JCAMP-DX V2.0
##DATA TYPE= NMR SPECTRUM
##DATA CLASS= NTUPLES
##ORIGIN= UXNMR, Bruker Analytische Messtechnik GmbH
##OWNER= root
$$ XWIN-NMR		Version 3.5
$$ Wed Sep 18 14:35:49 2019 Russian Standard Time (UT+4h)  she@DPX200
##.OBSERVE FREQUENCY= 81.013821
##.OBSERVE NUCLEUS= ^31P
##.ACQUISITION MODE= SIMULTANEOUS
##.ACQUISITION SCHEME= undefined
##.AVERAGES= 88
##.DIGITISER RES= 17
##SPECTROMETER/DATA SYSTEM= spect
##.PULSE SEQUENCE= zgpg30
##.SOLVENT NAME= CDCl3
##.SHIFT REFERENCE= (INTERNAL, CDCl3, 0, 182.463)
##AUDIT TRAIL= $$ (NUMBER, WHEN, WHO, WHERE, WHAT)
$$ ##TITLE= Audit trail, XWIN-NMR		Version 3.5
$$ ##JCAMPDX= 5.01
$$ ##ORIGIN= Bruker BioSpin GmbH
$$ ##OWNER= she
$$ F:/spectra/data/she/nmr/P31/1/pdata/1/auditp.txt
$$ ##AUDIT TRAIL=  $$ (NUMBER, WHEN, WHO, WHERE, WHAT)
(   1,<2019-09-18 14:34:58.84 +0400>,<she>,<DPX200>,
      <continue with go, POWCHK disabled, PULCHK disabled
       configuration hash MD5:
       00 E9 B6 7A A2 85 ED C7 34 08 36 98 17 FE 4E 26
       data hash MD5: 32K
       C3 29 1C 2A DD 97 49 69 3F D7 45 0B FC 28 11 24>)
(   2,<2019-09-18 14:35:01.45 +0400>,<she>,<DPX200>,
      <Start of raw data processing
       efp BC_mod = 2 LB = 1 FT_mod = 6 PKNL = 1 PHC0 = -417.0222 PHC1 = 103.8003 SI = 64K 
       data hash MD5: 64K
       FF D9 C4 19 2A E2 A5 3E D9 EB 62 7E A7 5C EC 0C>)
(   3,<2019-09-18 14:35:07.73 +0400>,<she>,<DPX200>,
      <abs ABSG = 5 
       data hash MD5: 64K
       77 09 35 15 43 53 28 A0 BA 38 DF B1 BC 03 F5 39>)
(   4,<2019-09-18 14:35:23.81 +0400>,<she>,<DPX200>,
      <pk PHC0 = 16.20752 PHC1 = 0 
       data hash MD5: 64K
       7C 90 00 85 E9 B6 93 D9 B9 F1 6F F9 B4 72 2E 00>)
$$ ##END=
$$ 
$$ hash MD5
$$ 4A A4 50 0A F1 33 BE 67 90 BD 7E 95 9B 52 81 68
##$RELAX= 
##$RELAX= 
##$RELAX= 
##$RELAX= 
##$RELAX= 
##$RELAX= 
##$RELAX= 
##$RELAX= 
$$ Bruker specific parameters
$$ --------------------------
##$DU= <F:/spectra>
##$EXPNO= 1
##$NAME= <P31>
##$PROCNO= 1
##$TYPE= <nmr>
##$USER= <she>
##$AMP= (0..31)
100 100 100 100 100 100 100 100 100 100 100 100 100 100 100 100 100 100 
100 100 100 100 100 100 100 100 100 100 100 100 100 100 
##$AQSEQ= 0
##$AQ_mod= 1
##$AUNM= <au_zg>
##$AUTOPOS= <>
##$BF1= 81.014009
##$BF2= 200.13
##$BF3= 200.13
##$BF4= 200.13
##$BF5= 200.13
##$BF6= 200.13
##$BF7= 200.13
##$BF8= 200.13
##$BYTORDA= 1
##$CFDGTYP= 0
##$CFRGTYP= 5
##$CHEMSTR= <none>
##$CNST= (0..31)
1 1 145 1 1 1 1 1 1 1 1 1 1 1 1 1 1 1 1 1 1 1 1 1 1 1 1 1 1 1 1 1 
##$CPDPRG= <waltz16>
##$CPDPRG1= <>
##$CPDPRG2= <waltz16>
##$CPDPRG3= <>
##$CPDPRG4= <mlev>
##$CPDPRG5= <mlev>
##$CPDPRG6= <mlev>
##$CPDPRG7= <mlev>
##$CPDPRG8= <mlev>
##$CPDPRGB= <>
##$CPDPRGT= <>
##$D= (0..31)
0 1 0 0 0 0 0 0 0 0 0 0.03 2e-05 3e-06 0 0 0 0 0 0 0 0 0 0 0 0 0 0 0 0 
0 0 
##$DATE= 1568802766
##$DBL= (0..7)
120 120 120 11 120 120 24 19 
##$DBP= (0..7)
150 150 150 150 150 150 150 150 
##$DBP07= 0
##$DBPNAM0= <>
##$DBPNAM1= <>
##$DBPNAM2= <>
$$ [...]
##$SUBNAM3= <"">
##$SUBNAM4= <"">
##$SUBNAM5= <"">
##$SUBNAM6= <"">
##$SUBNAM7= <"">
##$SUBNAM8= <"">
##$SUBNAM9= <"">
##$SW= 369.568048894756
##$SWIBOX= (0..15)
0 1 3 0 0 0 0 0 0 0 0 0 0 0 0 0 
##$SW_h= 29940.119760479
##$TD= 32768
##$TD0= 1
##$TE= 0
##$TE2= 300
##$TE3= 300
##$TEG= 300
##$TL= (0..7)
0 120 53 12 22 120 120 120 
##$TP= (0..7)
150 150 150 150 150 150 150 150 
##$TP07= 0
##$TPNAME0= <>
##$TPNAME1= <>
##$TPNAME2= <>
##$TPNAME3= <>
##$TPNAME4= <>
##$TPNAME5= <>
##$TPNAME6= <>
##$TPNAME7= <>
##$TPOAL= (0..7)
0.5 0.5 0.5 0.5 0.5 0.5 0.5 0.5 
##$TPOFFS= (0..7)
0 0 0 0 0 0 0 0 
##$TUNHIN= 0
##$TUNHOUT= 0
##$TUNXOUT= 0
##$USERA1= <user>
##$USERA2= <user>
##$USERA3= <user>
##$USERA4= <user>
##$USERA5= <user>
##$V9= 5
##$VALIST= <valist>
##$VCLIST= <CCCCCCCCCCCCCCC>
##$VD= 0
##$VDLIST= <DDDDDDDDDDDDDDD>
##$VPLIST= <PPPPPPPPPPPPPPP>
##$VTLIST= <TTTTTTTTTTTTTTT>
##$WBST= 1024
##$WBSW= 4
##$XGAIN= (0..3)
0 0 0 0 
##$XL= 0
##$YL= 0
##$YMAX_a= 7360
##$YMIN_a= -8787
##$ZGOPTNS= <>
##$ZL1= 120
##$ZL2= 120
##$ZL3= 120
##$ZL4= 120
##$ABSF1= 182.463
##$ABSF2= -187.1042
##$ABSG= 5
##$ABSL= 3
##$ALPHA= 0
##$AQORDER= 0
##$ASSFAC= 0
##$ASSFACI= 0
##$ASSFACX= 0
##$ASSWID= 0
##$AUNMP= <proc_1d>
##$AZFE= 0.1
##$AZFW= 0.5
##$BCFW= 0
##$BC_mod= 2
##$BYTORDP= 0
##$COROFFS= 0
##$CY= -3
##$DATMOD= 1
##$DC= 0
##$DFILT= <>
##$DTYPP= 0
##$F1P= 0
##$F2P= 0
##$FCOR= 1
##$FTSIZE= 65536
##$FT_mod= 6
##$GAMMA= 0
##$GB= 0
##$INTBC= 1
##$INTSCL= 5.30512e-09
##$ISEN= 30
##$LB= 1
##$LEV0= 0
##$LPBIN= 0
##$MAXI= 10000
##$MC2= 0
##$MEAN= 0
##$ME_mod= 0
##$MI= 50
##$NCOEF= 0
##$NC_proc= -9
##$NLEV= 6
##$NOISF1= 182.463
##$NOISF2= 159.3651
##$NSP= 0
##$NTH_PI= 0
##$NZP= 0
##$OFFSET= 182.463
##$PC= 4
##$PHC0= -400.8147
##$PHC1= 103.8003
##$PH_mod= 1
##$PKNL= yes
##$PPARMOD= 0
##$PSCAL= 0
##$PSIGN= 0
##$REVERSE= no
##$SF= 81.0140089999434
##$SI= 65536
##$SIGF1= 159.3651
##$SIGF2= -187.1042
##$SINO= 113.3802
##$SIOLD= 16384
##$SREGLST= <1H.CDCl3>
##$SSB= 0
##$STSI= 65536
##$STSR= 0
##$SW_p= 29940.119760479
##$SYMM= 0
##$S_DEV= 0
##$TDeff= 32768
##$TDoff= 0
##$TI= <>
##$TILT= no
##$TM1= 0
##$TM2= 0
##$TOPLEV= 0
##$USERP1= <user>
##$USERP2= <user>
##$USERP3= <user>
##$USERP4= <user>
##$USERP5= <user>
##$WDW= 1
##$XDIM= 65536
##$YMAX_p= 457386364
##$YMIN_p= -145309516
$$ End of Bruker specific parameters
$$ ---------------------------------
##NTUPLES= NMR SPECTRUM
##VAR_NAME=  FREQUENCY,     SPECTRUM/REAL,   SPECTRUM/IMAG
##SYMBOL=    X,             R,               I
##VAR_TYPE=  INDEPENDENT,   DEPENDENT,       DEPENDENT
##VAR_FORM=  AFFN,          ASDF,            ASDF
##VAR_DIM=   65536,         65536,           65536
##UNITS=     HZ,            ARBITRARY UNITS, ARBITRARY UNITS
##FACTOR=    0.456856943014862, 1,           1
##FIRST=     14782.0589164792, 0,            0
##LAST=      -15158.0608439998, 0,           0
##MIN=       -15158.0608439998, -145309516,  0
##MAX=       14782.0589164792, 457386364,    0
$$ Real data points
##PAGE= N=1
##DATA TABLE= (X++(R..R)), XYDATA
$$ [...]
4016c9351303M715662j5709533j2167656J2692094L0802414K7624140J1638373
4009B0244191n884210j9114773j9599097j860084K0315861K2548094K160747j4316304
4001D494425o374129J1945297J3729777j406272r843667j873084N645140j308583
3993A5008904j3118094j5544179j1427956r182869m948621O627403J6547087J5471330
3985e66995J2269697J7310470J8430136K4295k2507887j9739878K940818R376625
3977A7537281r764572k1050542l127034J8906365J5561722k324635q359929m120603
3969C258053o727550j2531821o329615N804380M839266p348746j1098448j129192
3961c1263673R776365J4170360J3171052L176447j5073261k1415947O23617L0500309
$$ plain form
4016 -39351303 -34635641 -50345174 -62512830 -49820736 -19018322 8605818 20244191
4009 20244191 14359981 -4754792 -24353889 -26213973 -5898112 16649982 18810729 4494425
4001 4494425 -1879704 10065593 23795370 22389098 12545431 10672347 16317487 15008904
3993 15008904 1890810 -13653369 -25081325 -34264194 -39212815 -32585412 -16038325 -566995
3985 -566995 11702702 29013172 47443308 47467603 24959716 5219838 8160656 17537281
3977 17537281 7772709 -13277833 -16404867 2501498 18063220 15738585 7378656 3258053
3969 3258053 -3469497 -16001318 -22330933 -16526553 -11687287 -19036033 -30134481 -31263673
3961 -31263673 -21487308 -7316948 5854104 9030551 -6042710 -27458657 -26835040 3665269
3953C665269L2273864Q146764m104738R137961J7212032k547893k7227275k5235496
3945A1320488m322810M084564p986154j9899333j6076911j977219J0791261J6888220
3937g177894J4440549M396828m749535k370724J0153559J7828459R386972p640370
3929C4267844j5059190p184682J122206m638445j5922335j2456077N074778J2394436
3921b401465j129818j2666230L15043K3054591K3590776r1921j9107102j6685850
3913e121976o183898l186168l140964M703137J7974922K4901169J7430844l224489
3905D4152577k5940523l5527865k8254738j6950265j0965387j900145J5441317
3898e9945029K3121566O423893j2855491k895703K5780756L2857133J1572102
$$ plain form
3953 3665269 35939133 44085897 39981159 49119120 66331152 63783259 36555984 11320488
3945 11320488 6997678 11082242 3096088 -16803245 -32880156 -34857375 -24066114 -7177894
3937 -7177894 7262655 11659483 6909948 4539224 14692783 32521242 41908214 34267844
3929 34267844 19208654 12023972 13146178 8507733 -7414602 -19870679 -14795901 -2401465
3921 -2401465 -3531283 -16197513 -15882470 7172121 30762897 30670976 11563874 -5121976
3913 -5121976 -11305874 -14492042 -17633006 -12929869 5045053 29946222 47377066 44152577
3905 44152577 18212054 -17315811 -45570549 -62520814 -73486201 -75386346 -59945029
3898 -59945029 -36823463 -30399570 -43255061 -46150764 -20370008 12487125 24059227
3891B4059227l059232N058669R881845m232757j2242978L968690J8286473L662850
3883D5382787k0392021k0271098j989434N612372O92109K208503Q642014K096963
3875B1982195j4422551j9651570r974007j746150j597973k539561m358436r914120
3867d2222173p451957J3835041L6504497L4175117J2983313R98012J298890o784150
3859D3336590k1101442j4356215J4183636K7597920Q258234j3054280p320530
3852C7543913P916070J871880j9508188k8683749k1185687j2616949m969437J1272051
3844b8360096K8294648K5494295L261808j3773547j1199952j202212R19720j996628
3836A438036L72294P697755J1156612N855095n691328j6683465j8326192n662944
$$ plain form
3891 24059227 20999995 26058664 35940509 31707752 19464774 23433464 41719937 45382787
3883 45382787 24990766 4719668 2730234 8342606 9034715 11243218 19885232 21982195
3875 21982195 7559644 -12091926 -22065933 -23812083 -25410056 -27949617 -32308053 -42222173
3867 -42222173 -49674130 -35839089 665408 34840525 47823838 48821850 50120740 43336590
3859 43336590 22235148 7878933 22062569 49660489 57918723 44864443 37543913
3852 37543913 45459983 47331863 27823675 -860074 -22045761 -34662710 -39632147 -28360096
3844 -28360096 -65448 25428847 28690655 14917108 3717156 2514944 3434664 1438036
3836 1438036 1810330 9508085 20664697 26519792 20828464 4144999 -14181193 -19844137
3828a9844137J3618328K2266988J2218495l988430q609831k670912l082648j3980388
3820d072535j5601765O508061L2545399K9473477j340978k2065301j1244856O264829
3812B0466331q19891k2623907k6818218r915594K229549j009950l760539J494686
3804d0757533J186514q747939j0578272L553462J5835579J4511519J3669952K1721416
3796A0394698J8657874p746326k8456441j1670244K2761447K7921435L21631j6836345
3788A5347729j904999J6372396R882082p666549j1409143n983216q823619j5260914
3780i446233r473243L407194M258036q051368j6616964j4372662q813002j539216
3772f0647458J2569214K4834212J6939580p397399j8540718r74191K2850010K4421890
$$ plain form
3828 -19844137 -6225809 16041179 28259674 24271244 15661413 12990501 9907853 -4072535
3820 -4072535 -19674300 -13166239 19379160 48852637 47511659 25446358 14201502 20466331
3812 20466331 19646440 -2977467 -29795685 -39711279 -37481730 -38491680 -42252219 -40757533
3804 -40757533 -39571019 -48318958 -58897230 -55343768 -39508189 -24996670 -11326718 10394698
3796 10394698 29052572 21306246 -7150195 -18820439 3941008 31862443 32184074 15347729
3788 15347729 13442730 29815126 39697208 32030659 20621516 14638300 5814681 -9446233
3780 -9446233 -18919476 -15512282 -11254246 -19305614 -35922578 -50295240 -59108242 -60647458
3772 -60647458 -48078244 -23244032 -6304452 -13701851 -32242569 -33216760 -10366750 14055140
3764A4055140P941247k273378l5879N84440n167061o185091N14181K526036m722150
3755G237485p747904J567168R708471K907208q514499m367971J4323803K5608079
3747D0721840J5660895o681044k3873092k5598631j0711998J3796211L2470013
3740C5784194L0543160Q809304j6187428k8706798k5281565j1095903N543133
3733e91903J4126399Q051422n891480j2676622p808177k268624m161361n808323
3725a7028669K233628J3062486J1850983j385370j0493649n947251K346301N63726
3717d797815q378126q645032N461336J9114538J4781400m141587j6301091j0072734
3709a2979111J445671J96142j0115332r925809O228543K0991894J9037528O419432
$$ plain form
3764 14055140 21996387 19723009 19687130 20271570 15104509 8919418 9433599 11959635 7237485
3755 7237485 -510419 1056749 10765220 13672428 5157929 789958 15113761 40721840
3747 40721840 56382735 49701691 25828599 229968 -10482030 3314181 35784194
3740 35784194 66327354 75136658 58949230 30242432 4960867 -6135036 -591903
3733 -591903 13534496 21585918 15694438 3017816 -4790361 -7058985 -11220346 -17028669
3725 -17028669 -14795041 -1732555 10118428 8733058 -1760591 -7707842 -5361541 -4797815
3717 -4797815 -13175941 -21820973 -16359637 2754901 17536301 13394714 -2906377 -12979111
3709 -12979111 -11533440 -11337298 -21452630 -31378439 -25149896 -4158002 14879526 21298958
3701B1298958k977104p878431j4087654j7321267p423591J2666857K6595222K4557933
3693C5430923J1981003k890117j7138209k5206806j7051496N965828K3862525
3686A4953651J9680274K575188m022279N706461J4600185R841396m3646k036756
3678F1254474J267047j01891m640802k950646M438113P259916K750303r95027
3670F8281487o56508l358384j1996096j6980670j0249806J434516N234301k030356
3662B9678484j3187432j9416532j4462336J800254J7889097J7986725K367467
3655B2655727r420344n208900J527469o286167k0128349j7821802J908057J8198374
3647a4575935J9603900J5378262J3274192P629270l859208j0820454p381127k817012
$$ plain form
3701 21298958 18321854 10443423 -3644231 -20965498 -28389089 -15722232 10872990 35430923
3693 35430923 47411926 44521809 27383600 2176794 -14874702 -8908874 14953651
3686 14953651 34633925 37209113 33186834 38893295 53493480 63334876 63291230 61254474
3678 61254474 62521521 62419630 57778828 54828182 59266295 66526211 69276514 68281487
3670 68281487 67624979 64266595 52270499 35289829 25040023 26474539 31708840 29678484
3662 29678484 16491052 -2925480 -17387816 -15587562 2301535 20288260 22655727
3655 22655727 13235383 8026483 9553952 3267785 -16860564 -34682366 -32774309 -14575935
3647 -14575935 5027965 20406227 33680419 41309689 37450481 26630027 19248900 16431888
3639A6431888m990781p405208l336867O96690k299389n567645l39883Q197139
3631A385944R932750N836593J587974n435770j7087067k0785120m439743J9030717
3623i973722K3194514N155341r686140n424530K793232k428955r052611N001073
3615d21798K9752625K8591074q002862l9276111k4728374J7301168L0335282k618810
3607C0932194l4446786k0844379J7264824K7068953R65312j8494394p057907R492353
3599D880170M075563q626400l066020J0537933L634713k0435996k7425089k229519
3591c8654645K9359505L4920871J2961037j0841681j3717381L009893J7529008
3584C4566607J2164542m092930o250860R393116J5127853p564936l4804657l1205757
$$ plain form
3639 16431888 11441107 4035899 699032 1395722 -903667 -6471312 -6811195 1385944
3631 1385944 11318694 17155287 18743261 13307491 -3779576 -24564696 -29004439 -9973722
3623 -9973722 13220792 18376133 8689993 3265463 6058695 3629740 -5422871 -421798
3615 -421798 29330827 57921901 49919039 10642928 -14085446 3215722 33551004 30932194
3607 30932194 -3514592 -24358971 -7094147 19974806 20940118 2445724 -4612183 4880170
3599 4880170 8955733 329333 -2736687 7801246 11435959 -9000037 -36425126 -38654645
3591 -38654645 -9295140 25625731 38586768 27745087 14027706 17037599 34566607
3584 34566607 46731149 42638219 36387359 45780475 60908328 53343392 18538735 -12667022
3576a2667022k388722J2154231m758766k7654558k7194571l885130K2649228L5742440
3568h002870K7221457J921168j7906268j3186250L844412N679221m976696J697195
3560c708631K6756409L0145386m406204l1915895r681848L2603776L2355922j4085226
3552E8063689m8797115l6776382m933961R643497O441155J311184l239773o623275
3544b4910981J485759J9003341K2260955K189104j2857559K406576K5770499J6659624
3536E2007318k0696714l9606133j7915291J1566310J0998322q965439r002937
3529b1614564J8716265L7361609J6564647k3496312l6026366r100712J8480944
3522H85511J1372778j2162027q045078K5360418M1005062J2296480k5813325k7161632
$$ plain form
3576 -12667022 -15055744 -2901513 -7660279 -35314837 -62509408 -66394538 -43745310 -8002870
3568 -8002870 19218587 21139755 3233487 -9952763 -6108351 -429130 -5405826 -3708631
3560 -3708631 23047778 53193164 48786960 16871065 7189217 39792993 72148915 58063689
3552 58063689 9266574 -27509808 -32443769 -22800272 -16359117 -15047933 -18287706 -24910981
3544 -24910981 -23425222 -4421881 17839074 20028178 7170619 9577195 35347694 52007318
3536 52007318 31310604 -8295529 -26210820 -14644510 -3646188 -12611627 -21614564
3529 -21614564 -2898299 34463310 51027957 27531645 -8494721 -17595433 885511
3522 885511 12258289 96262 -7948816 17411602 58416664 70713144 44899819 17738187
3514A7738187J280429J7205885P198668m333420k745117l35329l626708n11547
3506C1871048J0580996J2015907J89531m243356N046195L738061j9501371l5222446
3498D474565j8480257O359736K972405j6576526j1866466J8037746L2997047J6493626
3490C4411876k674635j004128P532030L876405o141255j1720786j7324032k3967114
3482a7011639j6987503O269504K0415993P604840j1031543n712415J6302130K3761360
3474B3610727R494006m195913m361581l114962j0961735j8450469j3867983k872440
3466b4720350Q86111l719332m072982Q305025K4217119K5009634O088090j2719411
3458A9273904r259022J0798567J9766231N634767j2928459j5846466p797080l158098
$$ plain form
3514 17738187 19018616 36224501 43423169 39089749 36344632 36009303 32382595 31871048
3506 31871048 42452044 54467951 54657482 50414126 55460321 59198382 39697011 4474565
3498 4474565 -14005692 -7645956 -4673551 -21250077 -33116543 -15078797 17918250 34411876
3490 34411876 31737241 30733113 38265143 42141548 36000293 24279507 6955475 -17011639
3482 -17011639 -33999142 -27729638 -7313645 291195 -10740348 -16452763 -150633 23610727
3474 23610727 33104733 28908820 24547239 21432277 10470542 -7979927 -21847910 -24720350
3466 -24720350 -23834239 -27553571 -31626553 -23321528 895591 25905225 31993315 19273904
3458 19273904 10014882 20813449 40579680 46214447 33285988 17439522 9642442 6484344
3450F484344j603744M669540J2236103J2883349R279221P557226L374808q036290
3442D6844557j7506140j5536994j0689175j4622659j8211999n664156J4530613
3435b0855953J8404937L492933q541072o529273j817583k320817P95081J2732659
3427d639088K1875395J6421388o18489j8981774l0279481k7164570q641464J1764461
3419d0263622J8347522J3837138J1573679J0625478N14592j2120192r110715N657184
3411i38936Q246792n110257j2460452q660841j5714528l4817297k9307320J5251480
3403h3511359N0678223K7285670k9593818n0712514j7575474K1215812K5945812
3396e6267648J1496550O806473R255187J590006j2628345j5718990m759204O450150
$$ plain form
3450 6484344 4880600 9550140 21786243 34669592 43948813 51506039 54880847 46844557
3442 46844557 29338417 13801423 3112248 -11510411 -29722410 -35386566 -20855953
3435 -20855953 -2451016 1041917 -7499155 -14028428 -15846011 -18166828 -17371747 -4639088
3427 -4639088 17236307 33657695 33039206 14057432 -16222049 -43386619 -52028083 -40263622
3419 -40263622 -21916100 -8078962 3494717 14120195 14634787 2514595 -6596120 -938936
3411 -938936 7307856 2197599 -10262853 -18923694 -34638222 -69455519 -98762839 -83511359
3403 -83511359 -32833136 -5547466 -35141284 -85853798 -103429272 -82213460 -56267648
3396 -56267648 -44771098 -37964625 -28709438 -27119432 -39747777 -55466767 -60225971 -53775821
3388e3775821Q513357N295096M076445O465302Q967935P813149K930763k136484
3380a1850258m740967n130287k384567O078235J6768557J9089994R029968l491402
3372B3369273r437926j3820301k2099518k3315763n177002J9266591K1683034
3365i531612l040097k7609157k6685109m029067K0080258L2135479K8606773J1772760
3357B1700228p014796j2817854o758257q209963k5909580l9905757k8145718q8679
3349a07150376J6422306J5202620J4841899K2183421J9388671k520380k0984768
3342d2616607j2183743J1799697J9831660P584908L79827J0546829J9298576J0316682
3334B4957829l135312k096214N784060R16262j2495644j1722628N767695J4452291
$$ plain form
3388 -53775821 -45262464 -39967368 -35890923 -29425621 -20457686 -12644537 -9713774 -11850258
3380 -11850258 -16591225 -21721512 -24106079 -18027844 -1259287 17830707 26860675 23369273
3372 23369273 13931347 111046 -21988472 -45304235 -50481237 -31214646 -9531612
3365 -9531612 -12571709 -40180866 -66865975 -70895042 -50814784 -18679305 9927468 21700228
3357 21700228 14685432 1867578 -4890679 -13100642 -39010222 -78915979 -107061697 -107150376
3349 -107150376 -90728070 -75525450 -60683551 -38500130 -19111459 -21631839 -42616607
3342 -42616607 -54800350 -43000653 -23168993 -15584085 -15204258 -4657429 14641147 24957829
3334 24957829 21822517 19726303 25510363 26426625 13930981 2208353 7976048 22428339
3326B2428339k012634k5823793k8360372n729330J9457418K4028857M535611k2021448
3318a3497352l2126043j5976230J1997148K7134701K0191301L700636n798205
3311d374044l624223L496164L935385j1010648l4498903m2285617j8618025J7531601
3303h9448310L0323466J2539482o423365k203581J5530477K3571208J5238918
3296h71705k56183j1735550r822526P201361K3493813J9061978m99007q825131
3288A7747050J03690K847488j0518859j6673814j959186Q272524p212256k2528373
3280b9921736k880205L5602212M6327529K0159277q507305j7112747j5968981
3273B7698044j5118374r108805J72297q69339j1795556j5880847q577869k255993
$$ plain form
3326 22428339 20415705 -5408088 -33768460 -39497790 -20040372 3988485 8524096 -13497352
3318 -13497352 -45623395 -61599625 -49602477 -22467776 -2276475 1424161 -4374044
3311 -4374044 -7998267 -4502103 -566718 -11577366 -46076269 -88361886 -106979911 -89448310
3303 -89448310 -59124844 -46585362 -53008727 -55212308 -39681831 -16110623 -871705
3296 -871705 -1127888 -12863438 -22685964 -15484603 8009210 27071188 26572181 17747050
3288 17747050 17850740 20698228 10179369 -6494445 -8453631 -181107 -7393363 -29921736
3280 -29921736 -32801941 2800271 49127800 69287077 60779772 43667025 27698044
3273 27698044 12579670 3470865 3643162 2773823 -9021733 -24902580 -33480449 -35736442
3265c5736442q7533P293221J6489312J1774205m535006j0756918o33197Q598798
3257g593560Q527724J0485519J6970180J3243331j529586n214772J0333273K0976936
3249F6199045O583501j7737876k4709485j0638944P180172J3105060K406824j6368883
3241B6019414k2308034m157580J6332026Q068463k0561106k8814041n036355J6985130
3233a3472083J4445651O150693P693567P09761k3604386l3029055n964474K2159781
3225b4910545J0881548j6482517q948418K7560916L9199504J0045855j7590848
3218A9755495j3220670K371347J869035o318302j129527J5261945K4566116J6948739
3210F0104178m167802k7012046l4693953j8905090N726884J5847161Q480694N1269
$$ plain form
3265 -35736442 -35823975 -28530754 -12041442 -267237 -4802243 -15559161 -16192358 -7593560
3257 -7593560 934164 11419683 28389863 41633194 40103608 34888836 45222109 66199045
3249 66199045 72782546 55044670 30335185 19696241 26876413 39981473 42388297 26019414
3241 26019414 3711380 -446200 15885826 23954289 3393183 -25420858 -30457213 -13472083
3233 -13472083 973568 7124261 14817828 15527589 -8076797 -41105852 -47070326 -24910545
3225 -24910545 -14028997 -30511514 -39459932 -11899016 27300488 37346343 19755495
3218 19755495 6534825 8906172 10775207 4456905 3327378 18589323 43155439 60104178
3210 60104178 55936376 28924330 -5769623 -24674713 -18947829 -3100668 5380026 5431295
3202E431295r91409p54310j305445K130093N533798L39847o189676J399981J7099441
3193B2693615J6743738m206089k0833682j4457194L526516J1599989L227709j3900438
3185D394164k6010212j8241006Q630690K6851714J2013363j5941583j4081215
3178b2384085J7805717L1991514O065983k0854149j0749590J3405036Q315519
3171B3595945j8256887k3010528J119215J6360345K482452j4676812p118359J5720054
3163c784575K6420529J6154754k724813j5413934j4416236j945947Q613385K758428
3155A5661591j7247645l2131408k6696250l635835K3607192M0668198L5388022
3148C5613865P040828k3068755k6110691O49033K7901374L0649679J6529636O808971
$$ plain form
3202 5431295 4439886 3685576 2380131 4510224 10044022 10383869 4194193 5594174 22693615
3193 22693615 39437353 35231264 14397582 -59612 3466904 15066893 18294602 4394164
3185 4394164 -21616048 -39857054 -31226364 -4374650 7638713 -8302870 -22384085
3178 -22384085 -4578368 27413146 33479129 12624980 1875390 15280426 23595945
3171 23595945 5339058 -17671470 -16552255 -191910 2290542 -12386270 -19504629 -3784575
3163 -3784575 22635954 38790708 36065895 20651961 6235725 4289778 12903163 15661591
3155 15661591 -1586054 -33717462 -60413712 -64049547 -40442355 225843 35613865
3148 35613865 42654693 19585938 -6524753 -5875720 22025654 52675333 69204969 76013940
3140G6013940M820500J110891k624606J386352M244425j0295543l2888515l3494744
3132H272700p916051Q929506o226814k6761947j5672831J5995140K5305358L121464
3124E046525j5343032q479510K063991n635233j5366582k481940K2216736K7743818
3116I764773Q753144j0896541j3091057q89838J5294722K5604493J9900900l3601
3108E4406995j2237448j85962J8038958J0885415j8625580l4111519j8564618
3101c93759L022953M074067p241764q924945r65472J317778l468453k094813R800128
3092d874280K1099415K1447810J1983480l29099j0683898j8127719k3436280k4543971
3084b7464542j4485333R359587L3168912L5057089J1521371j4877104k2933806
$$ plain form
3140 76013940 80834440 81945331 79320725 80707077 84951502 74655959 41767444 8272700
3132 8272700 356649 9286155 3059341 -23702606 -39375437 -23380297 1925061 5046525
3124 5046525 -10296507 -18776017 -16712026 -22347259 -37713841 -40195781 -17979045 9764773
3116 9764773 18517917 7621376 -5469681 -6359519 8935203 34539696 54440596 54406995
3108 54406995 42169547 41983585 60022543 70907958 52282378 18170859 -393759
3101 -393759 2629194 6703261 -538503 -9463448 -10428920 -9111142 -12579595 -14674408 -4874280
3092 -4874280 16225135 37672945 49656425 49327326 38643428 20515709 -2920571 -27464542
3084 -27464542 -41949875 -32590288 578624 35635713 47157084 32279980 9346174
3077I346174j8218819j9021271k4837064j6885024R037483K8256644J7407586
3070a4914291j0829522j9792792L717396L0308772K6292205j575698j7812503
3063d606433q631757L719514P74098m511908M950878J7707050J1405153j0987639
3055I818956k6342716k3268766p280578J4863938L1845367K1701871j9189220
3048B148852n0340566k8822386K5249129M6768991J5008938j9181099j1105381
3041b0273522J6386894J6870282j0019958k8306440k1383262l202549J1199845
3034c8728710J5825219N894404j2858633j7433667M382868K9136656K6088750
3027A2306887J232933j3111925n579266M158373j81870j1199435j2992561O46746
$$ plain form
3077 9346174 -8872645 -27893916 -52730980 -69616004 -60578521 -32321877 -14914291
3070 -14914291 -25743813 -45536605 -41819209 -11510437 14781768 13206070 -4606433
3063 -4606433 -13238190 -9518676 -8744578 -13256486 -8305608 9401442 20806595 9818956
3055 9818956 -16523760 -39792526 -47073104 -32209166 -363799 21338072 2148852
3048 2148852 -48191714 -77014100 -51764971 -4995980 10012958 -9168141 -20273522
3041 -20273522 -3886628 12983654 2963696 -25342744 -46726006 -49928555 -38728710
3034 -38728710 -22903491 -17009087 -29867720 -47301387 -42918519 -13781863 12306887
3027 12306887 13539820 427895 -5151371 -992998 -1174868 -12374303 -25366864 -24720118
3019b4720118K1947127L1237489J2216717k1793197l2263946m839498K4088153
3012E872727J5931040j3564640k0270559N87697J3651484L499378q139016o332821
3004h764710j601465J568888J3462168K6516704J5548600j4970345k5475746k899737
2996C384357J3735281m156166k6551521j4396755J6929120K5842936J0219181
2989B5006433q01356k348530j2979930k8145774k3443662l283155Q72311j3694712
2981e8818375j3198278J2182639K5924692N801538j4799351P28480L1442462L1314671
2973B0578478J123496j6744651o250885M763565j754974n580803J0682564K7033059
2965C3849849J8023065m496349r778397L986062R864187m026565j8999036j8020786
$$ plain form
3019 -24720118 -2772991 28464498 40681215 18888018 -13375928 -18215426 5872727
3012 5872727 21803767 8239127 -12031432 -11443735 2207749 5707127 -2431889 -8764710
3004 -8764710 -10366175 -8797287 4664881 31181585 46730185 31759840 6284094 3384357
2996 3384357 17119638 12963472 -13588049 -27984804 -11055684 14787252 25006433
2989 25006433 24205077 21856547 8876617 -19269157 -42712819 -45995974 -45123663 -58818375
2981 -58818375 -72016653 -59834014 -33909322 -28107784 -42907135 -42178655 -10736193 20578478
2973 20578478 21701974 4957323 -1293562 3470003 1715029 -3865774 6816790 33849849
2965 33849849 51872914 47376565 37598168 41584230 51448417 47421852 28422816 10402030
2957A0402030r129517o120789n001282M366461J4819557Q692627j4076326l0187581
2949b6234820k0330492O394618K2426193J3583062n441162j0075846L763621J5858532
2941e6294R483026o503606j1369889j146147Q932291P522865j340272r897996
2933d376022j4929825j1973320K468468J7347240J2967802r721276k2764860q439116
2925c9420909J2936823J1947145n751156r458147P617051J7436609L08274k5261572
2917b9645882k9091386r712494P703630O212233m971701p222749L340469J3581380
2909d9806500J1976803L616581K867079J3585446K3797340K1353159O956718j1503527
2901B2843099k7956326l5679533k7007567n722195J0031590R690684N911072J3301968
$$ plain form
2957 10402030 1272513 -4848276 -9849558 -5483097 9336460 18029087 3952761 -26234820
2949 -26234820 -46565312 -40170694 -17744501 -4161439 -9602601 -19678447 -15914826 -56294
2941 -56294 9426732 2923126 -8446763 -9592910 -660619 6862246 5521974 -4376022
2933 -4376022 -19305847 -31279167 -28810699 -11463459 1504343 -8216933 -30981793 -39420909
2925 -39420909 -26484086 -14536941 -20288097 -29746244 -22129193 -4692584 -4384310 -29645882
2917 -29645882 -58737268 -68449762 -60746132 -54533899 -59505600 -66728349 -63387880 -49806500
2909 -49806500 -37829697 -34213116 -31346037 -17760591 6036749 27389908 34346626 22843099
2901 22843099 -5113227 -40792760 -67800327 -73522522 -63490932 -53800248 -47889176 -34587208
2893c4587208K1299983R720401j3603114j7034315Q518311L1965212K3077960
2886B9357230p438762k5305794j8169314n509643o923137j6985082j6417930M60165
2878f6932267J7553064J7047457K391801o235261K97731Q001364K894601n283540
2870c0265050K116273K0715960K5906887Q523122j1256429j1848317L638889J7507322
2862B5038657K0126327J2475134k420360j8122800k2358423r089664R599987J4458517
2854B9707375J936836j2074539j2525125k258844M591006J374576n007410o085385
2846c41510k781233m33606R17657L461697L445223l081255r425932o836227j932278
2837a7007464q012553j9023800j4567702N383473J7377639J4265548J6527818
$$ plain form
2893 -34587208 -13287225 -3566824 -17169938 -34204253 -25685942 6279270 29357230
2886 29357230 21918468 -3387326 -21556640 -27066283 -33989420 -50974502 -67392432 -66932267
2878 -66932267 -49379203 -32331746 -29939945 -36175206 -35877475 -27876111 -24981510 -30265050
2870 -30265050 -28148777 -7432817 18474070 26997192 15740763 3892446 7531335 25038657
2862 25038657 45164984 57640118 55219758 37096958 14738535 5648871 15248858 29707375
2854 29707375 31644211 19569672 7044547 4785703 9376709 10751285 5743875 -341510
2846 -341510 -3122743 -3556349 -2638692 823005 4268228 1186973 -8238959 -15075186 -17007464
2837 -17007464 -25020017 -44043817 -58611519 -53228046 -35850407 -21584859 -5057041
2830e057041K8965086K3113256j0492261l0732680o834377K3130863P230386l3242863
2822c919631l5285346K355497J9597994j276104r277474K0390487M0076956J3079943
2814D5742322k2731182k0978235j026988k809268j3547988M2568K0767154O987562
2806A2445945l0242370l9116259q910190J6807113R866044q812636j1613640M34954
2798e9141039J2997703J7173463P800272j0435912j6082075L266078K3834454
2791b0587056J5196304r496551r329209K0252944L8326670J8975675j5108091
2784C8230686k9638481j9254201o74483R455663K062521j6689748k2110844J061601
2776c7557286K7964697J9427903k0894472m7233145l3363512n87149K1837412
$$ plain form
2830 -5057041 23908045 47021301 36529040 5796360 -1038017 22092846 29323232 -3919631
2822 -3919631 -39204977 -36849480 -17251486 -18527590 -27805064 -7414577 32662379 45742322
2814 45742322 23011140 2032905 1005917 -1803351 -15351339 -15308771 5458383 12445945
2806 12445945 -17796425 -56912684 -65822874 -49015761 -39149717 -47962353 -59575993 -59141039
2798 -59141039 -46143336 -28969873 -21169601 -31605513 -47687588 -44421510 -20587056
2791 -20587056 -5390752 -14887303 -24216512 -3963568 34363102 53338777 38230686
2784 38230686 8592205 -10661996 -11336479 -1880816 181705 -16508043 -38618887 -37557286
2776 -37557286 -9592589 9835314 -11059158 -58292303 -91655815 -92242964 -70405552
2769g0405552K9503522K6330182J0232553r793030j3151206O39573Q386292L943428
2761a4314238R769190L1984763L9697003J3019840k0592988k6674893j2922332
2754A9966345p171074j0085680m149914P568291O915164m871427r738478m459653
2746f026426k713062r172461j4351978j1813975j882751J5000541L0520546K4733225
2738B4293659p460703l5691734k6320190R759389K8366208J0375647j7134822
2731a3812546k1602105l045409J6598475K3136308J8090826Q840700Q64182m577158
2723B4493273q803141r899928k258535J2593234K1111027J3213202k674791j0558027
2715C7216314p821295m058228m145319n263055p018061j1257253j3727032q085955
$$ plain form
2769 -70405552 -40902030 -14571848 -4339295 -14132325 -27283531 -26643958 -18257666 -14314238
2761 -14314238 -4545048 27439715 67136718 80156558 59563570 32888677 19966345
2754 19966345 12795271 2709591 -1440323 6127968 13043132 8171705 -1566773 -6026426
2746 -6026426 -8739488 -17911949 -32263927 -44077902 -45960653 -30960112 -439566 24293659
2738 24293659 16832956 -18858778 -45178968 -35419579 -7053371 3322276 -13812546
2731 -13812546 -35414651 -38460060 -21861585 1274723 19365549 28206249 29070431 24493273
2723 24493273 15690132 5790204 3531669 16124903 37235930 50449132 47774341 37216314
2715 37216314 29395019 25336791 21191472 15928417 8910356 -2346897 -16073929 -24159884
2707b4159884K844051J0058227J0556674P560481K797033j845758j096584M036454
2699A0750694J236668j3913952k2068261l539778K6939639L2588233L765187k8367618
2691G390812l4622022k2191072j2957876o643895J2181526L8422813M2764556
2684B4344842J0929789k9196280l4904468j58015L4548241K9910640n352686k8127598
2676A994465j5661614J1288662K2192942J4180843M537592P67939m748380j6196494
2668A8355955k5357936k1424356k830366J8789039K4790088Q195536j1961776
2661H556184r312311J2343536K0116201P52865j5928585k009702K3494469K3613231
2653F1625888m72276j7210809j6790891j6278781j7818916m849231J5734616J1514992
$$ plain form
2707 -24159884 -21315833 -11257606 -700932 6859549 9656582 7810824 6714240 10750694
2699 10750694 11987362 -1926590 -23994851 -27534629 -594990 31993243 35758430 7390812
2691 7390812 -27231210 -49422282 -62380158 -69024053 -56842527 -18419714 24344842
2684 24344842 35274631 6078351 -28826117 -28984132 5564109 35474749 30122063 1994465
2676 1994465 -13667149 -2378487 19814455 33995298 38532890 39300829 34552449 18355955
2668 18355955 -7001981 -28426337 -31256703 -12467664 12322424 20517960 8556184
2661 8556184 -756127 11587409 31703610 32456475 16527890 14518188 38012657 61625888
2653 61625888 61153612 43942803 27151912 10873131 -6945785 -11795016 3939600 15454592
2645A5454592k0970657l9934776j8624255J3170300J5556700l340833q385527
2638d7074456O896152K1910524K9572301L6451779L2318027J539679l5350441
2631D6263565l4190762P253358L4900202J1234913k9468786l0171259O552073
2624A2373304K4723913k158668l4923538k7309934J1081530L4050575K1955380
2617C9792562k606600j5348434j7854786j9616404j6372154o88985J9249599K6604899
2609A3159697J6779772J347310o087763k056519N268640L704734q579058j6306549
2601G230264m764539J6004821K0654444M873697q769674q659696j1293967k4493238
2593i217888k2904122J0334116M1917977K8533550j5466816l5271857j5807189
$$ plain form
2645 15454592 -5516065 -45450841 -64075096 -50904796 -35348096 -38688929 -47074456
2638 -47074456 -40178304 -18267780 11304521 47756300 80074327 81614006 46263565
2631 46263565 12072803 19326161 54226363 65461276 35992490 5821231 12373304
2624 12373304 37097217 34938549 15011 -27294923 -16213393 17837182 39792562
2617 39792562 37185962 21837528 3982742 -15633662 -32005816 -32694801 -13445202 13159697
2609 13159697 29939469 31286779 25199016 23142497 28411137 32115871 23536813 7230264
2601 7230264 2465725 18470546 39124990 43998687 35229013 26569317 15275350 -9217888
2593 -9217888 -32122010 -21787894 20130083 48663633 33196817 -2075040 -17882229
2586a7882229K668238n597924j5159181r30904J7022098J0003910r671117r091502
2578b8638611J4602267L4094351L0675057R440325j4423868k5400146j3874493
2571F474882J0938025K4731241J7289774L825003l131052j1450234k4152361k2920409
2563A604869l66378J6408837M479771j4694403q446478J2473477J2598279p753784
2555A6304190j4520466K364647J6837349J3871917P093948L457339q846221k6433510
2547A0129193k3825322L152850K1581630Q319355j6916077k4639093j4630805
2540c6828269k013418J0222483K2841571K5858424J3835016j182868q286948j1312261
2532A3133730j1869555k624685R731573M251478j5311249j5819184R438572K0507741
$$ plain form
2586 -17882229 -15213991 -20811915 -35971096 -36902000 -19879902 -9875992 -19547109 -28638611
2578 -28638611 -14036344 20058007 50733064 60173389 45749521 20349375 6474882
2571 6474882 17412907 42144148 59433922 63258925 60127873 48677639 24525278 1604869
2563 1604869 1238491 17647328 22127099 7432696 -1013782 11459695 24057974 16304190
2555 16304190 1783724 4148371 20985720 34857637 41951585 45408924 36562703 10129193
2547 10129193 -13696129 -10543279 11038351 19357706 2441629 -22197464 -36828269
2540 -36828269 -38841687 -28619204 -5777633 20080791 33915807 32732939 24445991 13133730
2532 13133730 1264175 -1360510 8371063 12622541 -2688708 -18507892 -9069320 11438421
2524A1438421k708347j8317758Q216785L8071665K5896149J2278617O1544076
2517A36419608J27245659Q7710695o6157562j83301754j44705774j8809918M5112480
2510a6486566J2781011l1044423l0289168j2311180o802614o37407J2816882J1850530
2502f0122935l892455j161496K5399050L3553808L734099k1578655m660238K5893672
2494b835150K3827286r20128o746932P086410O104095j4724641k5018966j5097300
2486b8325326q742674j4845078j2114374O339663J5577164L784268l633233J1601679
2478c0357911K5882944J2411508j3027572j8607861q043652q506136j9695630
2471e9944310j4369777J2776758L3725007K9966442J4554041K265949j1863648
$$ plain form
2524 11438421 8730074 -9587684 -1370899 36700766 62596915 74875532 136419608
2517 136419608 263665267 351375962 285218400 101916646 -42789128 -61599046 -16486566
2510 -16486566 -3705555 -34749978 -65039146 -77350326 -84152940 -84790347 -71973465 -60122935
2502 -60122935 -64015390 -65176886 -39777836 -6224028 -2489929 -24068584 -28728822 -2835150
2494 -2835150 20992136 20072008 13325076 20411486 26515581 11790940 -13228026 -28325326
2486 -28325326 -37068000 -51913078 -64027452 -57687789 -42110625 -38326357 -41959590 -30357911
2478 -30357911 -4474967 7936541 -5091031 -23698892 -31742544 -40248680 -59944310
2471 -59944310 -74314087 -61537329 -27812322 2154120 16708161 18974110 7110462
2464G110462k9508526l2290766j0211551J3342332J0584414r074936j2595481
2457f2644052P417964K3396441J4428418o590698j5685364q962740J205236P969959
2449c9464836J3299932J6261151J2452171M486040J963678Q506327J6036200J4920892
2441D8461555M952988o357007j2406346j1590865o442851k749353o975904j8989211
2433a2096994k7619694j9905281K236611K0030261J8044166K527822p613919n100376
2425b9497404J101464N275271J4378746L0437990L7171656J9484129j0726656
2418F7625196k5677626j7149736l788163j331183l732572o09645M066630K883837
2410B2286738P30140M660867Q172122J875295p304796n082255N854738Q084905
$$ plain form
2464 7110462 -22398064 -54688830 -64900381 -51558049 -40973635 -50048571 -62644052
2457 -62644052 -55226088 -31829647 -17401229 -23991927 -39677291 -48640031 -47434795 -39464836
2449 -39464836 -26164904 -9903753 2548418 7034458 8998136 17504463 33540663 48461555
2441 48461555 53414543 47057536 34651190 23060325 16617474 13868121 6892217 -12096994
2433 -12096994 -39716688 -59621969 -57385358 -37355097 -19310931 -16783109 -24397028 -29497404
2425 -29497404 -28395940 -23120669 -8741923 21696067 58867723 78351852 67625196
2418 67625196 41947570 24797834 21009671 19678488 15945916 15336271 19402901 22286738
2410 22286738 23016878 27677745 35849867 37725162 30420366 25338111 31192849 39277754
2402C9277754m659079k0429520k8621734k9909377k4312835p276830J5798238
2395f0133383K7344055J9555586N718200K23164l54715n284602j0579961o309347
2387b9821003M429439Q802389L824883L27422P415508K1412759L0172829K3488642
2379G0052868K133381j9195449k3338169j0306301J050973l247562j5222490j8950641
2371a7023390j1924785j978261P537375J6063326J7405904Q543520P79188N428380
2363B4831257J3130760N820448j3662172k4486534k0347751j6540544j9859869
2356e1114405j4899498P705068K9190709K6373615N004472q651126k999016Q762747
2348f27434J1348533N119179j121176l520169l708896k243179J817787N675718
$$ plain form
2402 39277754 34618675 14189155 -14432579 -44341956 -68654791 -75931621 -60133383
2395 -60133383 -32789328 -13233742 -7515542 -7292378 -7647093 -12931695 -23511656 -29821003
2387 -29821003 -25391564 -16589175 -12764292 -12436870 -5021362 16391397 46564226 70052868
2379 70052868 72186249 52990800 29652631 19346330 20397303 17149741 1927251 -17023390
2371 -17023390 -28948175 -30926436 -23389061 -7325735 10080169 18623689 19402877 24831257
2363 24831257 37962017 43782465 30120293 5633759 -14713992 -31254536 -51114405
2356 -51114405 -66013903 -58308835 -29118126 -2744511 2259961 -6391165 -9390181 -627434
2348 -627434 10721099 15840278 14719102 11198933 7490037 5246858 7064645 12740363
2340A2740363K634019q970137j9023307j4678229K264936J4799737J2046813K476055
2332D290250j548859k139702o227946p218690M849680J9690503J5585045o721951
2324B0558330k0924067j2332373K087382J116505j0634278j3368881p20179J4805288
2316a9412273J7571199K705919j7984824k2019163j230556J9125260P384299k4897365
2308c8757504k9437403R491121M4562425L0098403j1364868k4454992k900643
2301b2763461R714883n667696j7437803o74652K2727574K2124565L501652q410843
2293C114219r434100j0890878j2477323p133432j789941o692311j0587607O199128
2285d9692245L4544718L9847965J0472796k0461037j6802491J3011306K8671708
$$ plain form
2340 12740363 15374382 6404245 -12619062 -27297291 -25032355 -10232618 1814195 4290250
2332 4290250 2741391 601689 -5626257 -12844947 -7995267 11695236 27280281 20558330
2324 20558330 -365737 -12698110 -10610728 -9494223 -20128501 -33497382 -34217561 -19412273
2316 -19412273 -1841074 864845 -17119979 -39139142 -40369698 -21244438 -13860139 -38757504
2308 -38757504 -68194907 -58703786 -14141361 15957042 4592174 -19862818 -22763461
2301 -22763461 -13048578 -18716274 -36154077 -36828729 -14101155 8023410 11525062 3114219
2293 3114219 -6319881 -17210759 -29688082 -36821514 -38611455 -45303766 -55891373 -49692245
2285 -49692245 -15147527 24700438 35173234 14712197 -2090294 10921012 39592720
2278C9592720J0405817k0610266l4001770k4946403j0373624k804888N78384O993377
2270c5166653J5771627J8074416N800154j7378360l2629372k0787521J3309561
2263e3006148L8522384K9844768j380084k1567965j5827537M8311P779338Q385070
2255g201863R762107R684409L354350l621617k807224L802311R069416J2296449
2247C4338338J4349353Q283323j0923395l0524092k9106635m220927K0487502
2240B683467K1391297J607482j4451136j0926449J350507M55748j5764859k4206283
2232c7860226p750160J7327975J9184865p502821l3443059l1202048n410083J8189754
2224f8465803K1474368O739581q488464n990025J3856389K7802369J7368734l703787
$$ plain form
2278 39592720 49998537 29388271 -4613499 -29559902 -39933526 -42738414 -42160030 -35166653
2270 -35166653 -19395026 -1320610 4479544 -12898816 -45528188 -66315709 -53006148
2263 -53006148 -14483764 15361004 13980920 -7587045 -23414582 -23366271 -15586933 -7201863
2255 -7201863 2560244 12244653 15599003 11977386 9170162 12972473 22041889 34338338
2247 34338338 48687691 56971014 46047619 15523527 -13583108 -17804035 2683467
2240 2683467 24074764 25682246 11231110 304661 1655168 2110916 -13653943 -37860226
2232 -37860226 -45610386 -28282411 -9097546 -16600367 -50043426 -81245474 -86655557 -68465803
2224 -68465803 -46991435 -40251854 -48740318 -54730343 -40873954 -13071585 4297149 593362
2216E93362r076385j314782m575595j7050959r459687J9519538K9272685R56096
2208H864273k5675180j1860644J9387718K2557453M76044j0526810m797058o231986
2200g806190j5075852o741699J8574287L0999874J8372884m29457j0610432j3516517
2192A3766898n925331J3945940K2929053j930135l6439363l3875831K808448K4022927
2184f97394J2982094N473490J7847185J6240257j6246668l8876804j7526048J7390809
2176c413079J9347053n577832k0508573j6677896q547996L443127K3467609L4251295
2168B5783708J9272449n388755j4572618j1579654j1492749q518965O432435J7068453
2160A7004304O790511p409869l090945N839313m393308j8817318p451978J6926146
$$ plain form
2216 593362 -8483023 -9797805 -14373400 -31424359 -40884046 -21364508 7908177 8864273
2208 8864273 -16810907 -28671551 -9283833 13273620 13749664 3222854 -1574204 -7806190
2200 -7806190 -22882042 -29623741 -11049454 19950420 38323304 37893847 27283415 13766898
2192 13766898 7841567 21787507 44716560 42786425 6347062 -27528769 -24720321 -697394
2184 -697394 12284700 17758190 35605375 51845632 35598964 -3277840 -20803888 -3413079
2176 -3413079 15933974 10356142 -10152431 -26830327 -35378323 -31935196 -8467587 25783708
2168 25783708 45056157 39667402 25094784 13515130 2022381 -6496584 -64149 17004304
2160 17004304 23794815 16384946 13294001 19133314 14740006 -4077312 -11529290 5396856
2152E396856J4372860j5449875l0924495j3180223J1987769K0975041J9346117
2145A2524050J5099208L600486j1035215j3027400k802092J678032k239846K255422
2137F052645J6564505J8688484n23761k1002796k3261929j0702154M563006J4463859
2129D841859R315629j4586490l6829254k9461510J860713K0238093Q504372r065672
2121d5182260n491181J3803532K5844973J8866093k875217k4204594k4242607
2114d3481261L307066L3269148L5032119J4607651L203064N710692l571523k9692733
2106A8384223m1888154k3376010J129994O804079M032543J0371252J7767001J3190947
2098F415875O654271J2280082K1073467J6643842J965564j0137248j8111702k5347239
$$ plain form
2152 5396856 19769716 4319841 -26604654 -39784877 -27797108 -6822067 12524050
2145 12524050 27623258 31223744 20188529 7161129 4359037 6037069 3797223 6052645
2137 6052645 22617150 41305634 40781873 19779077 -3482852 -14185006 -9622000 4841859
2129 4841859 14157488 -429002 -37258256 -66719766 -64859053 -44620960 -36116588 -45182260
2121 -45182260 -50673441 -36869909 -11024936 7841157 4965940 -19238654 -43481261
2114 -43481261 -40174195 -6905047 28127072 42734723 45937787 51648479 48076956 18384223
2106 18384223 -23503931 -46879941 -45749947 -38945868 -34913325 -24542073 -6775072 6415875
2098 6415875 13070146 25350228 46423695 63067537 65033101 54895853 36784151 11436912
2090A1436912k7397112k0890201j1046410J16098J5023998K2639796N019688k7254299
2082c2351530l5977903p983759K2918766K5488776J1258396L107168k650424j3757943
2074b9948453j3784561Q087631K5995083J3970375r443300j1939158j348111o765141
2066b5175635k3902165k4498652p601289M189347J0483505K8047838M5289299
2059F832248L1612302n256433k0172744J058498J9203764L679127k2733513k3151728
2051h928479N99897J8274836J3495305l823085j3870469m505181J5821202K0399119
2043C7463145m122608l1501246k6124185K744316J0052186j7046143l7353009
2036f5887544j6474717K4619824M3885372L3271459J4332544N43871q913915j1990601
$$ plain form
2090 11436912 -15960200 -36850401 -47896811 -47780713 -32756715 -10116919 -5097231 -32351530
2082 -32351530 -68329433 -76313192 -53394426 -27905650 -16647254 -13540086 -16190510 -29948453
2074 -29948453 -43733014 -35645383 -9650300 4320075 -5123225 -17062383 -18410494 -25175635
2066 -25175635 -49077800 -73576452 -81177741 -76988394 -66504889 -38457051 6832248
2059 6832248 38444550 33188117 13015373 14073871 33277635 36956762 14223249 -8928479
2051 -8928479 -8328582 9946254 23441559 19618474 5748005 1242824 17064026 37463145
2043 37463145 33340537 1839291 -24284894 -21540578 -11488392 -28534535 -65887544
2036 -65887544 -82362261 -57742437 -13857065 19414394 33746938 34290809 25376894 13386293
2028A3386293n819795J539272R39766k125720L209538J4361899J8610656R683836
2020E3785745q339804k6635046l3870551k2224147J426639J9491012K3801508
2013G435356K0605750J3184944l163747k3302602k9711229j7907823n212012k882352
2005d0953715J01347J1846697J8149943O917140p887799q175480O693K976500
1997a7018674O754981K0999984L0617070J4950555j3636119k2877206q625528
1990A1165063K213387k801246n350033P782514K1737037J8607676K959759j0039891
1982D6274266j4254636j0207811L00979P962875P68926j5580980j8593185n81905
1974c911471J7391209J5498479K626787j701877J542892k789417j5707311k2202723
$$ plain form
2028 13386293 7566498 9105770 10045536 7919816 11129354 25491253 44101909 53785745
2020 53785745 45445941 18810895 -15059656 -37283803 -35857164 -16366152 7435356
2013 7435356 28041106 41226050 38062303 14759701 -14951528 -32859351 -38071363 -40953715
2005 -40953715 -40852368 -29005671 -10855728 -3938588 -11826387 -20001867 -19995174 -17018674
1997 -17018674 -10263693 10736291 41353361 56303916 42667797 19790591 11165063
1990 11165063 13378450 10577204 5227171 13009685 34746722 53354398 56314157 46274266
1982 46274266 32019630 21811819 22112798 30075673 30844599 15263619 -3329566 -3911471
1974 -3911471 13479738 28978217 31605004 29903127 31446019 28656602 12949291 -9253432
1966i253432j4732062j874599O076436O826958J557010p257901j2451099o672248
1958c7780937P707765K0079665K3513407J9961531J4982550J2134019R908032
1951G0506032P01161k0451286m0988658l6096242q03910L3761545L3778388N548466
1943D5955496j5113047j1545992o6674M297382O990109J0800920K634205j9427762
1935B4524637l0387624j2807284J1606392J1111717q692836j4937393K834023
1928a6748368K2165126K4880611J7018980R112901J536495n704553j0305156j7959012
1920B3997024l2966203l7527900r251391L5252832M8358128J7438684j1843035
1913C3458139j951012K0288338R090506k5624881l5547952j2695154Q81663j4822446
$$ plain form
1966 -9253432 -23985494 -25860093 -19783657 -12956699 -11399689 -18657590 -31108689 -37780937
1958 -37780937 -30073172 -9993507 13519900 33481431 48463981 60598000 70506032
1951 70506032 71207193 50755907 9767249 -26328993 -27132903 6628642 40407030 45955496
1943 45955496 30842449 19296457 19229783 23527165 30517274 41318194 43952399 24524637
1935 24524637 -5862987 -18670271 -7063879 4047838 -4644998 -19582391 -16748368
1928 -16748368 5416758 30297369 47316349 56429250 57965745 52261192 41956036 23997024
1920 23997024 -8969179 -46497079 -55748470 -20495638 27862490 45301174 33458139
1913 33458139 31507127 51795465 60885971 35261090 -286862 -12982016 -12100353 -26922799
1905b6922799k5993148m381194K3218259J6889321j2198017j7416739J4191536
1898c2612781M4181786L6980104L618293j9940102j8512045o097005K28657k762177
1890E084730j1105478k1166964k6253140j8128212J98495J2664178J0937226Q239623
1882c9529542J8872537L1822059K4734062J378069r695247J130151Q887981m229403
1874C3370667j7365895m710625J9535331K1015999p21585j1980982K093281J6955814
1866E8192005R004159j1660116k2814105k2106585j9507693j4000813Q00720J5235809
1858f856619R338030j7080974l5651260k0703637J6876392L8607521K3321431
1851G850884p502334j8545357n945191L844164k798510r707647m258085o98259
$$ plain form
1905 -26922799 -52915947 -57297141 -34078882 -17189561 -29387578 -46804317 -32612781
1898 -32612781 11569005 48549109 52167402 32227300 13715255 7618250 7846907 5084730
1890 5084730 -6020748 -27187712 -53440852 -71569064 -71370569 -58706391 -47769165 -39529542
1882 -39529542 -20657005 11165054 35899116 37277185 27581938 28712089 37600070 33370667
1874 33370667 16004772 11294147 30829478 51845477 51123892 39142910 41236191 58192005
1866 58192005 67196164 55536048 32721943 10615358 -8892335 -22893148 -22092428 -6856619
1858 -6856619 2481411 -14599563 -50250823 -70954460 -54078068 -15470547 7850884
1851 7850884 348550 -18196807 -24141998 -20297834 -23096344 -32803991 -37062076 -37760335
1843c7760335j2141051k2581529j2166974P916756J5006041J4146298K3610699
1836b3970095L2712611J4976647j9131113k6403544L995224L0462599J9761437
1829C2403766q505392j9235501j1650812n584582l329865N117289J4649796J0839882
1821A4704581m521685j4920230j1695409j171798N195737o54591j5702111k2006978
1813e0772484n155593J9680689K1122692k604147j7375729l983199J4203197J2162793
1805a2721781J380355J954683N093607m416924j1860409M294274K9296593K9762058
1797D2782456M045515k0045147k8818446k8932467j8551101R221756L7292683
1790c004751L7209320J2236333o962405r864607j2402839j5223084O65773K7300281
$$ plain form
1843 -37760335 -49901386 -72482915 -84649889 -76733133 -61727092 -47580794 -23970095
1836 -23970095 8742516 23719163 4588050 -21815494 -17820270 12642329 32403766
1829 32403766 23898374 4662873 -6987939 -12572521 -15902386 -10785097 3864699 14704581
1821 14704581 10182896 -4737334 -16432743 -17604541 -12408804 -13063395 -28765506 -50772484
1813 -50772484 -55928077 -36247388 -15124696 -17728843 -35104572 -39087771 -24884574 -12721781
1805 -12721781 -11341426 -9386743 -4293136 -8710060 -20570469 -16276195 13020398 42782456
1797 42782456 46827971 26782824 -2035622 -30968089 -49519190 -40297434 -3004751
1790 -3004751 34204569 46440902 39478497 29613890 17211051 1987967 2653740 29954021
1782B9954021K4314285j8915713n5085130m1251699J689079K2909844J0797258
1775b5588055n248756n640128J285845N615913J0303114J7757465K2827744K1653718
1767D2966860J4481906J442191j3470512j9381164j1431718o34271J484023O36346
1759A6093661P665486J6284124J1406075m072197j0776784k213028O038458J189205
1751D1615000r282628j2810789j0685818j1514333j5202775j4312831o386487
1744c8580661L588841R720931Q366525p01070j0507867j0018887J678378J0512155
1736b5941655O073341j505974L323324J4613601J1590603p438195j8751723p920995
1728b5957673Q988031J1108391J870290l486979l703969n760041o934337l651473
$$ plain form
1782 29954021 54268306 35352593 -19732537 -60984236 -59295157 -36385313 -25588055
1775 -25588055 -30836811 -36476939 -35191094 -29575181 -19272067 -1514602 21313142 42966860
1767 42966860 57448766 58890957 45420445 26039281 14607563 13973292 15457315 16093661
1759 16093661 23759147 40043271 51449346 47377149 36600365 34387337 40425795 41615000
1751 41615000 32332372 19521583 8835765 -2678568 -17881343 -32194174 -38580661
1744 -38580661 -34991820 -25270889 -16904364 -17605434 -28113301 -38132188 -36453810 -25941655
1736 -25941655 -19868314 -21374288 -18050964 -3437363 8153240 715045 -18036678 -25957673
1728 -25957673 -16969642 -5861251 -3990961 -7477940 -11181909 -16941950 -23876287 -27527760
1720b7527760n430872j6207318j5133287J3744426M3359388L2596612r906749
1713A5494440l1570045j0095407J8924690J9884196K829968o384877n178689j697907
1705B206369N208752J1891613N030184j0120188q241532J1200077J4889875p458181
1697B4606969k0296559l805551R330666n349366j7047117Q75017J6561317J568698
1689F444074o186979K7855423N5632108K7242797K765832O6363354J56359162
1682C36475771J20910593m6932530j72075181j39715583m2740128j5496334m0975289
1675e48681k6667172K1161217K4847101j5926807k7212479O866786K4943435J770725
1667I234125j5104329L517616K1197955M110080k5927257l3220621j6826518M261070
$$ plain form
1720 -27527760 -32958632 -49165950 -64299237 -50554811 -7195423 25401189 15494440
1713 15494440 -16075605 -26171012 -7246322 12637874 15467842 9082965 3904276 2206369
1705 2206369 7415121 19306734 24336918 14216730 5975198 17175275 32065150 24606969
1697 24606969 4310410 504859 9835525 4486159 -12560958 -11685941 4875376 6444074
1689 6444074 257095 28112518 83744626 110987423 113753255 180116609 336475771
1682 336475771 457386364 410453834 238378653 98663070 55922942 40426608 -548681
1675 -548681 -27215853 -6054636 18792465 2865658 -24346821 -17480035 7463400 9234125
1667 9234125 -5870204 -2352588 18845367 22955447 -2971810 -36192431 -53018949 -48757879
1659d8757879J8570762J9740821P080280k769445P511857K5601266K4927888P592986
1651E9498536j590843p4836p698611k2408261j8158698O810542K0340773O450048
1643D3168650j1052169q629185M942128J0823400P409297K172385j478015p19831
1635D6636660M960001M140438j1221828k3804100j1912182J0904254J1564190
1628C1267433q275967j3858772K770597R347674p865163j7954061m0036J8207199
1620A3598904O845034j6572823j7909630j74794R129509M698196K768251O760407
1612I143054N518495j468648m082280k062356l386958o914965n773015k875808
1604a1902481n459119r175344m160049P073568J2371839P246175k347377j0446822
$$ plain form
1659 -48757879 -30187117 -10446296 -3366016 -6135461 1376396 26977662 51905550 59498536
1651 59498536 57907693 57832857 50134246 27725985 9567287 16377829 36718602 43168650
1643 43168650 32116481 23487296 28429424 39252824 46662121 48834506 47356491 46636660
1635 46636660 51596661 55737099 44515271 20711171 8798989 19703243 31267433
1628 31267433 22991466 9132694 11903291 21250965 13385802 -4568259 -4608295 13598904
1620 13598904 20443938 3871115 -14038515 -14213309 -5083800 -385604 2382647 9143054
1612 9143054 14661549 13192901 9110621 7048265 3661307 -3253658 -9026673 -11902481
1604 -11902481 -17361600 -26536944 -30696993 -23623425 -11251586 -4005411 -6352788 -16799610
1596a6799610j4119480j0410046J106192J5886480K8026555L0756928J5941170
1589E0388189j2676501k8529640q358355K7517616L0578169q955331m2525992
1582G438155l0701779J885181R581406m507549l268941J7598894K5350624R242755
1574C2618746l014669L498848N279829j5166246l3706337k0615968J0637439K1124377
1566F56019K171837j5724204r142327Q552622J2782867M471492M025415J5768281
1558B3562002J8326658l324884l1123721l4268496j0442943J0680461O803370
1551a9787553j0604276j6360606l881068J3577349K3317171K1815297R922323
1544A7998637o986682j7208514j2890432r00025N806782N780979Q213000J5531123
$$ plain form
1596 -16799610 -30919090 -41329136 -40222944 -24336464 3690091 34447019 50388189
1589 50388189 37711688 9182048 823693 28341309 58919478 49964147 7438155
1582 7438155 -23263624 -21378443 -11797037 -16304586 -19573527 -1974633 23375991 32618746
1574 32618746 29604077 33102925 38382754 23216508 -10489829 -31105797 -20468358 656019
1566 656019 2827856 -12896348 -22038675 -13486053 -703186 3768306 7793721 23562002
1558 23562002 41888660 38563776 7440055 -26828441 -37271384 -26590923 -19787553
1551 -19787553 -30391829 -46752435 -50633503 -37056154 -13738983 8076314 17998637
1544 17998637 11011955 -6196559 -19086991 -19987016 -14180234 -8399255 -186255 15344868
1536A5344868J7962769Q455523n739574j2329600j0310199j0063907j6728780
1529a3408900j9996289p111155J6199108K8411098J9706287N243085J768936L085216
1521C3897386n165966j6401319j2220694L018460M109837j3945587k3840888o643048
1513c7191819J9222560K6177301J5339565P069462Q249620R111226L970559k100041
1505D9848433k486529N648732J7997316J9128258l639294l4689766l8913043r757796
1497C136311J4404964K831112k1372881j6910351J1933251K3934667M716745j6822078
1489E851740j6827517m940844L620161J1680149K1381090J8945642k489602k3474344
1481A3746475k1269466p32168J4594998J4061130O780029J616193l777812j1945543
$$ plain form
1536 15344868 33307637 41763160 36023586 23693986 13383787 3319880 -13408900
1529 -13408900 -33405189 -40516344 -24317236 4093862 23800149 29043234 30812170 33897386
1521 33897386 28731420 12330101 109407 3127867 7237704 -6707883 -30548771 -37191819
1513 -37191819 -17969259 8208042 23547607 30617069 38866689 47977915 51948474 49848433
1505 49848433 47361904 53010636 71007952 90136210 86496916 51807150 12894107 3136311
1497 3136311 17541275 20372387 -1000494 -17910845 -5977594 17957073 22673818 5851740
1489 5851740 -10975777 -15916621 -12296460 -616311 20764779 39710421 37220819 13746475
1481 13746475 -7522991 -8255159 6339839 20400969 27180998 28797191 25019379 13073836
1473A3073836j5963920q811721K727782L867306o501426j0562401L312288K0150103
1465A291847J8827481N018864K83805K536524r501048k7994587j4254066L4071911
1457A0280731N7069454J2334918n3791749o5191964k2564111P681408o95256n598328
1449f0474897J9388349L9388610K2411740o429141j1301809k908734q466976j8230771
1441b6623629o587452J6518977K0059893M247096l797836O24125m141333k0738253
1433b0438412k2579554J831329K6275851K3222083j29942j7576184j8849452j2907619
1425d1151900p129010M18747J0380200J5813714J0189767k376942q923404j692205
1417b4471033J0978764J2708992p49627j5581389j7642491r222439j739681K129622
$$ plain form
1473 13073836 -2890084 -11701805 -8974023 -5106717 -11608143 -22170544 -18858256 1291847
1465 1291847 20119328 25138192 25421997 27958521 18457473 -9537114 -23791180 10280731
1457 10280731 67350185 79685103 25893354 -39298610 -61862721 -54181313 -54876569 -60474897
1449 -60474897 -41086548 -1697938 20713802 14284661 2982852 74118 -8392858 -26623629
1441 -26623629 -33211081 -16692104 3367789 7614885 3817049 4441174 299841 -20438412
1433 -20438412 -43017966 -41186637 -14910786 8311297 8181355 -9394829 -28244281 -41151900
1425 -41151900 -48280910 -47862163 -37481963 -21668249 -11478482 -13855424 -22778828 -24471033
1417 -24471033 -13492269 -783277 -1532904 -17114293 -34756784 -43979223 -45718904 -43589282
1409d3589282R224249K0578212K5243715J3433234q520325k1540145j4194982
1402a9365324K226917N012961j0629097k1358996m488065K8456380M1886431K0616691
1394D2357898j1016173k0204016l013574J7825914K2601023J1510787l270391
1387E6791468j2831424j7665159k1314890k0059819n119161K0143302L4177024
1380C4121341K0869359o925634k3029612k2028583j8492021j6208674l881496
1373c5575320J6003793K2020926P673802m849703J111415J1348231O215954q879255
1365A5069843j7033960j6568513j5083741j1550845k628365O092514J0492317
1358c1210750J4649025J4183239m991054l3377028l1041603J6568629O0791180
$$ plain form
1409 -43589282 -34365033 -13786821 11456894 24890128 16369803 -5170342 -19365324
1402 -19365324 -17138407 -12125446 -22754543 -44113539 -48601604 -20145224 21741207 42357898
1394 42357898 31341725 11137709 8124135 25950049 48551072 60061859 56791468
1387 56791468 43960044 26294885 4979995 -15079824 -20198985 -55683 34121341
1380 34121341 54990700 48065066 25035454 3006871 -15485150 -31693824 -35575320
1373 -35575320 -19571527 2449399 10123201 5273498 6384913 17733144 23949098 15069843
1365 15069843 -1964117 -18532630 -33616371 -45167216 -47795581 -41703067 -31210750
1358 -31210750 -16561725 -2378486 -7369540 -40746568 -71788171 -55219542 5571638
1351E571638M6808717q189860l7579730j6980485J3829924K0708825J7053434
1344D1222463K2173720K2767282K499919k1658017k2749326m852086N279029l778153
1336D0904831j9765302k8790217k7748603j8690614m815910Q458430J6076046
1329c4371339J6402157J0273698J452451k776450R96554N733563L594976j427512
1321a21902k033261l059997j1989213j9401024j0460638O804261J0143364P42276
1313b9376134L222650K1993309K9051884Q955569j4076888j4080316j976222j455721
1305B258131q029900j180937J7029021K4617501J3492456l902740j5905449j8470775
1297I907308q180831R906118J5316574l323442k3851469j6726253R451883J8088187
$$ plain form
1351 5571638 52380355 44190495 6610765 -10369720 3460204 24169029 41222463
1344 41222463 63396183 86163465 88663384 67005367 44256041 39403955 44682984 40904831
1336 40904831 21139529 -7650688 -35399291 -54089905 -58905815 -50447385 -34371339
1329 -34371339 -17969182 -7695484 -6243033 -9019483 -8022929 -2289366 1305610 -121902
1321 -121902 -2155163 -5215160 -17204373 -36605397 -47066035 -40261774 -30118410 -29376134
1313 -29376134 -26153484 -4160175 24891709 33847278 19770390 5690074 3713852 2258131
1305 2258131 -5771769 -6952706 10076315 34693816 48186272 44283532 28378083 9907308
1297 9907308 1726477 11632595 26949169 23625727 -225742 -16951995 -7500112 10588075
1289A0588075k01786j4687507m093500J2043602P419396j0718672j6503858m117150
1281b0271400J0347302J6258133J7414174J7249981J2297793J718043q230529
1274D6783497j1665162q729300l956319l713195j2539405k5784457k8434266r312788
1266e7351395K2737968M2959158L3616165Q21386l1345433m0941268k3654551
1259e3157970O622730K9971151L5152945K5301240J1024853m14885q352600j3654492
1251C2492972j5043078j2368925r768855j0357980q785685L752882K4261897L5302457
1243C9485685K4986557M141434o739785m308604l018570r620175j3562410p888409
1235B3475723k432503n259265o828456J349077O220686o702943k2271516j2434565
$$ plain form
1289 10588075 10386289 -4301218 -8394718 3648884 11068280 349608 -16154250 -20271400
1281 -20271400 -9924098 6334035 23748209 40998190 53295983 55014026 46783497
1274 46783497 35118335 26389035 22432716 18719521 6180116 -19604341 -48038607 -57351395
1266 -57351395 -34613427 8345731 41961896 42783282 11437849 -29503419 -53157970
1259 -53157970 -46535240 -16564089 18588856 43890096 54914949 54500064 46147464 32492972
1251 32492972 17449894 5080969 -4687886 -15045866 -23831551 -20078669 4183228 39485685
1243 39485685 64472242 68613676 61873891 57565287 54546717 44926542 31364132 23475723
1235 23475723 21043220 15783955 8955499 10304576 16525262 9822319 -12449197 -24883762
1227b4883762J7140549K7164985K96599l0702764k7579635K152274K1219394J5296406
1219A04046L889842N075020J4972414K2921138K4418258J4572397j0409911l7072331
1211C8470873l9341878j2325270J3602646Q389072j8455644l1200450j3877372
1204e4738023J4852321L0025482K5408100Q902676r199092j7415814q189234Q792779
1196a560805J0979546q228543k5716178j7142099Q995413K1911246R207079j0347238
1188a1901579j5688273q258027j746673r17953p54583J777934N038572P000158
1180b5450424M850436m560129j6375222j5792086M722410K9236876L1907742Q534030
1172A7073633j6474025j9503319m687356O242880L440118l688101o170598q118823
$$ plain form
1227 -24883762 -7743213 19421772 19718371 -10984393 -38564028 -36411754 -15192360 104046
1219 104046 3993888 9068908 24041322 46962460 71380718 85953115 75543204 38470873
1211 38470873 -871005 -13196275 406371 8795443 -9660201 -40860651 -54738023
1204 -54738023 -39885702 -9860220 15547880 24450556 15251464 -2164350 -10353584 -1560805
1196 -1560805 9418741 1190198 -24525980 -41668079 -32672666 -10761420 -1554341 -11901579
1188 -11901579 -27589852 -35847879 -37594552 -38512505 -39267088 -37489154 -32450582 -25450424
1180 -25450424 -20599988 -25160117 -41535339 -57327425 -52605015 -23368139 8539603 17073633
1172 17073633 599608 -18903711 -23591067 -17348187 -13908069 -17596170 -23766768 -31885591
1164c1885591j3920234j4403900J622048K6366876L7606087K6333817P776138
1157C9495241o07182q25610m711789j2024296j2182980l819962K310222P78146
1149H411790j545583M28359R46077n357457j2737900j2479744n109693K667221
1141b4776930Q175887J3201403J7776231J9235121J5236355M648646j0850250
1134D2646463k3807340k5366813j5955006n527473J59295N753667J4105182J7424938
1126I432913R323351k159622m617026N86881J772100l932131o289235K548083
1118F665314J6801516K2905766J1913647j2370815l3338699l4039171j5575878
1111c7038320K743838Q374166J1014435K1150516K4856156K686162l0704023l4948384
$$ plain form
1164 -31885591 -45805825 -60209725 -58587677 -32220801 5385286 31719103 39495241
1157 39495241 38888059 38062449 33350660 21326364 9143384 5323422 7633644 8411790
1149 8411790 6866207 7294566 8240643 2883186 -9854714 -22334458 -27444151 -24776930
1141 -24776930 -16601043 -3399640 14376591 33611712 48848067 53496713 42646463
1134 42646463 18839123 -6527690 -22482696 -28010169 -27850874 -22097207 -7992025 9432913
1126 9432913 18756264 16596642 11979616 12566497 14338597 10406466 4117231 6665314
1118 6665314 23466830 46372596 58286243 45915428 12576729 -21462442 -37038320
1111 -37038320 -34294482 -25920316 -14905881 6244635 31100791 33786953 3082930 -31865454
1103c1865454k78095L1486556K1007598j3835552k3602947L251546K7941457K0739012
1095C4844121K342045Q605390L4541679M0602184R955397k7731980l8472040k8130716
1087C6556080k5415523l3882549k7978977K233747K9522022K6694009N713648
1080A3442457j485826R912395J4155997l583435k6123742l0874360j8609237n454209
1072d8619960n9702m19343l530873o107574k010466R406087J6007422N236375
1064c0098034j6353017k5588261q511112K1326646L5367660K0985258l517694
1057f388554r109351R350422K6638684J9745544l070602j7299197j7506670j8291183
1049a5930907k2612771j4272389R795147K3701537P416757j9216718k0300337
$$ plain form
1103 -31865454 -32143549 -656993 20350605 6515053 -17087894 -13836348 14105109 34844121
1095 34844121 37186166 45791556 80333235 120935419 130890816 103158836 64686796 36556080
1087 36556080 11140557 -22741992 -50720969 -48487222 -18965200 7728809 13442457
1080 13442457 11956631 21869026 36025023 32441588 6317846 -24556514 -43165751 -48619960
1072 -48619960 -48679662 -49099005 -52629878 -58737452 -60747918 -51341831 -35334409 -30098034
1064 -30098034 -46451051 -72039312 -80550424 -59223778 -23856118 -2870860 -6388554
1057 -6388554 -15497905 -6147483 20491201 40236745 37166143 19866946 2360276 -15930907
1049 -15930907 -38543678 -52816067 -43020920 -19319383 -11902626 -31119344 -51419681
1042e1419681O465678K7070883J6995890j0667475k6528929j8155903L641402
1035e2598135J9498764J6545371k122567j8111641j4835605L422699J6702461
1028c1498653J4495150N947266K584656K460091j553084o802243m135178P450012
1020a1051983J7449419J4945857o77422j9043799k7009571k0116558p308811j226686
1012e4039554l469765m613084M81225N491282N104729O241957J7399333L1119533
1004C715656K9123599P192878j4929150j5609073J844200J3568155O023383p736755
996B3192893q675793j03854k089344j8946959k8781563j3713629J2710723K3052965
988a3354561J3425716N281716J0760080J5670847M253406j4976469k1257150j0456838
$$ plain form
1042 -51419681 -44954003 -17883120 -887230 -11554705 -38083634 -56239537 -52598135
1035 -52598135 -33099371 -16554000 -18676567 -36788208 -51623813 -48201114 -31498653
1028 -31498653 -17003503 -11056237 -8471581 -6011490 -7564574 -14366817 -18501995 -11051983
1020 -11051983 6397436 21343293 20665871 1622072 -25387499 -45504057 -52812868 -54039554
1012 -54039554 -57509319 -62122403 -61641178 -56149896 -51045167 -44803210 -27403877 3715656
1004 3715656 32839255 40032133 25102983 9493910 11338110 24906265 30929648 23192893
996 23192893 14517100 14413246 12323902 -6623057 -35404620 -49118249 -36407526 -13354561
988 -13354561 71155 5352871 16112951 31783798 36037204 21060735 -196415 -10653253
980a0653253K399845O376834O732556J1039058J3762984L049293j9777166l5640197
972b2710046k7218340Q0758K3614802L0528877K9907351L2374507K8992051N618022
964A01187982k7447083m1009944k5935402o940972p211053j6163145q453965J6765562
956a5208020L5150631L0985105J3247473k143798r780695j1102049p058087n31521
948C3559039L182142L223298L057599Q25143j0299541k6858750l0832957j1394037
940c5538064J4871859J8866113m607608k6888614j9057510J1815262L1318076
933i220486K1087370l48480o273978K330654M766899l941755p362373K088242
925C126093J0197970O567722J945360O422302R732794J422907o927132k355171
$$ plain form
980 -10653253 -8253408 -1876574 4855982 15895040 29658024 32707317 12930151 -22710046
972 -22710046 -49928386 -49847628 -26232826 4296051 34203402 66577909 95569960 101187982
964 101187982 73740899 32730955 6795553 -145419 -7356472 -23519617 -31973582 -15208020
956 -15208020 19942611 50927716 64175189 62031391 52250696 41148647 34090560 33559039
948 33559039 36741181 39964479 43022078 43847221 33547680 6688930 -24144027 -35538064
940 -35538064 -20666205 -1800092 -6407700 -33296314 -52353824 -40538562 -9220486
933 -9220486 11866884 11518404 5244426 7575080 12341979 8400224 1037851 3126093
925 3126093 13324063 19891785 21837145 28259447 37992241 39415148 32488016 30132845
917C0132845K136148j1025232k7321083j9078278M734875P046170j5373519k0256165
909d9004239J4269838N0534945M4161803N819470k1123324k1987761j5205377
902G465355j0662626j133958R717808O154175r231580j3285645J891244J5172912
894F087685Q629204o262255p446731O140603J5251983O920032r191654j1649084
886H479783O989881K7019216K1380219q916379l1635950k4106747k398028M982944
878A794939k977455q115524p789533j2098117j4496851Q46754K3312195K3017172
870C493580j091890j6384689r736977p097986k1961503k4116033R451801M6023176
862b1420521M0428596M641067j1188218L946257J1122691j0434477l0383077j8006329
$$ plain form
917 30132845 32268993 21243761 -6077322 -25155600 -20420725 -13374555 -28748074 -49004239
909 -49004239 -34734401 15800544 59962347 65781817 44658493 22670732 7465355
902 7465355 -3197271 -4331229 5386579 11540754 2309174 -10976471 -9085227 6087685
894 6087685 14716889 8454634 1007903 7148506 22400489 29320521 20128867 8479783
886 8479783 15469664 42488880 63869099 54952720 23316770 -789977 -3188005 1794939
878 1794939 -1182516 -9298040 -17087573 -29185690 -43682541 -42835787 -19523592 3493580
870 3493580 2401690 -13982999 -23719976 -30817962 -52779465 -76895498 -67443697 -21420521
862 -21420521 19008075 23649142 12460924 16407181 27529872 17095395 -13287682 -31294011
854c1294011J0527806J9754784N393983q954235j1138455j0193317j1610247o826938
846d4340630P879125J9194895J3892266q21414o005937K401479Q040756j075198
838h34658j3965507j3151516j028881N548833K571294J866267O595236N104983
830g293949n332612j0857284o743614p318352j5820560j0077554J9010555L9387472
822e045898K0650131j3917240j7989164N773526J0034731k0035558m1518929k0529426
814h2577827J7679160K9958173J3724443m267121j1565999j1300977J16394K2550536
806b5683218L2179335P239556l1081125l7617421n212764K4327200J9728750M52879
798a5666808J55402J4672652J3315744r835877k5622228j3444020R240469J3916681
$$ plain form
854 -31294011 -20766205 -1011421 4382562 -4571673 -15710128 -25903445 -37513692 -44340630
846 -44340630 -36461505 -17266610 -3374344 -4195758 -10201695 -7800216 240540 -834658
838 -834658 -14800165 -27951681 -28980562 -23431729 -20860435 -18994168 -12398932 -7293949
830 -7293949 -12626561 -23483845 -30227459 -37545811 -53366371 -63443925 -44433370 -5045898
822 -5045898 15604233 1686993 -16302171 -10528645 -493914 -20529472 -62048401 -82577827
814 -82577827 -64898667 -34940494 -21216051 -25483172 -37049171 -48350148 -48233754 -25683218
806 -25683218 6496117 13735673 -17345452 -54962873 -60175637 -35848437 -16119687 -15666808
798 -15666808 -15511406 -838754 12476990 2641113 -22981115 -36425135 -27184666 -13267985
790a3267985J301757m435772N094123J1327883Q44836j1930437p686578O740845
782a2011328R371830k515083j0175414m419376K263254q22923n957382k741525
774b7007947M885510Q116465P609638P055475K385965j0199482k1852139j8569743
766d7576258J028309K2814973L0477168J8807063j867402j2884315n279431Q867144
758A4387251J1452612L039770p68685L609623L517703m220148o376873m47117
750B4194136l577637j9817454k4236149j844560K1205035J4454624p785679r107299
742f514983R853653J4665827l799284j4575040J501793K1747772J9021193K25960
734D2126891j1196403r677800n898440o157002r023625j1095509n556319J2487364
$$ plain form
790 -13267985 -11966228 -16402000 -11307877 20006 864842 -11065595 -18752173 -12011328
782 -12011328 -2639498 -5154581 -15329995 -19749371 -17486117 -18309040 -24266422 -27007947
774 -27007947 -22122437 -14005972 -6396334 659141 3045106 -7154376 -29006515 -47576258
766 -47576258 -46547949 -23732976 6744192 25551255 23683853 10799538 5520107 14387251
758 14387251 25839863 28879633 28110948 31720571 35238274 31018126 24641253 24194136
750 24194136 20616499 799045 -23437104 -25281664 -4076629 10377995 2592316 -6514983
742 -6514983 3338670 18004497 14205213 -369827 1131966 22879738 41900931 42126891
734 42126891 30930488 21252688 15354248 9197246 173621 -10921888 -16478207 -3990843
726c990843L1561756L0546338Q215754j1635875j3827771j0037423j1566144p858469
718A1407323Q843123K0296591R355832q126630p727532K035053l938039j9609001
710A2536720j4992501J0433303K1799607M708059j1250571j974562J2409169L802296
702C7471520j6091967j6299714K312531J0744569k52345q557754J222546J5598763
694B6148149J5531732J050278j5758124k5846320k3760688p908836J1880558J9790317
686A127066J3732184P277074O874205K992333q171072j2245136J13065J2990405
678B4690124O127166j4433112k4621273j4056388O678184K3209154K6073286J1031826
670D4698967j1620423j7734107K31140J4414251j014171k4919704j6592715J7734812
$$ plain form
726 -3990843 27570913 58117251 66333005 54697130 40869359 30831936 19265792 11407323
718 11407323 20250446 40547037 49902869 41776239 34048707 36083760 32145721 12536720
710 12536720 -2455781 7977522 29777129 34485188 23234617 21260055 33669224 37471520
702 37471520 21379553 5079839 7392370 18136939 17884594 9326840 10549386 26148149
694 26148149 41679881 42730159 26972035 1125715 -22634973 -30543809 -18663251 1127066
686 1127066 14859250 22136324 29010529 32002862 23831790 11586654 11699719 24690124
678 24690124 30817290 16384178 -8237095 -22293483 -15615299 7593855 33667141 44698967
670 44698967 33078544 15344437 15575577 29989828 28975657 4055953 -12536762 5198050
662E198050K8914080P54137k4142367j1929384J3249994J5924551N615747Q249989
654D1834797J3156911m939077l1405432k8775567J64197J3893805k852167j9214887
646a8137420j0085113J1007914K1835425K0470398J1712577m986531j9827218
639A1990032j2588406J5600627L4000356K1676317n420536k1066251k1781323
632B2410816j7711048j0067604L897278J7154876K0093116J2079769k691277j8362717
624B6803209k2029294m613627J6598171J0670073k0658175l5861880r713145K9250257
616i554411L9123569J9098354k204997j2487960j9875523k5148785k0108054o963631
608c8121438M561611J2538231J6048758N904926j6020801k4074572k811440K1412821
$$ plain form
662 5198050 34112130 34866267 10723900 -1205484 12044510 27969061 33584808 41834797
654 41834797 54991708 50052631 18647199 -10128368 -9964171 3929634 1077467 -18137420
646 -18137420 -28222533 -17214619 4620806 25091204 36803781 31817250 11990032
639 11990032 -598374 15002253 49002609 70678926 65258390 44192139 22410816
632 22410816 4699768 -5367836 -1470558 15684318 35777434 47857203 45165926 26803209
624 26803209 4773915 160288 16758459 27428532 6770357 -29091523 -38804668 -9554411
616 -9554411 29569158 48667512 46462515 33974555 14099032 -11049753 -31157807 -38121438
608 -38121438 -33559827 -21021596 -4972838 932088 -15088713 -39163285 -41974725 -20561904
600b0561904J5075537r388845j2780114P254159J4902444j880277j3263801j222992
592b1865793J0883615J069846j4403352j0891166M866780R919143R32245p591362
584b7080044o867597K254643J5829086K2885306J0279405j3932731j9294264O780448
576i145748L3860865K5776956r183747l0006300j8733564L51246j050953j8636559
568b6767804k5827452r608979J3823436J8983983K795062r879605K038202K5421844
560i021313K8779537O165767j4553253j1225552O039280J6694708J6505183R058410
552D8442767p881180k8449740l0031212k309266K8692970L0216253O292018j2331361
544C2641249j2296366n598594j040324L297113K238787j2131954k7260923k0200233
$$ plain form
600 -20561904 -5486367 -14875212 -27655326 -20401167 -5498723 -7379000 -20642801 -21865793
592 -21865793 -10982178 -9912332 -24315684 -35206850 -30340070 -20420927 -19488682 -27080044
584 -27080044 -33947641 -31692998 -15863912 7021394 17300799 3368068 -15926196 -9145748
576 -9145748 24715117 50492073 41308326 11302026 -7431538 -7080292 -8131245 -26767804
568 -26767804 -52595256 -62204235 -48380799 -29396816 -26601754 -36481359 -34443157 -9021313
560 -9021313 19758224 25923991 11370738 145186 6184466 22879174 39384357 48442767
552 48442767 40561587 12111847 -17919365 -20228631 8464339 38680592 44972610 32641249
544 32641249 20344883 14746289 13705965 17003078 19241865 7109911 -20151012 -40351245
536d0351245N034592J8391079Q407163k474380L447859J3844116J3273250P830626
528B7403060N274110l810387k3472897l3804361j9250350M027803J4345958J8293968
520a0993096K8814937K9347305r13564l8338462l7709437l204078J1332270j5702039
512c7366164l8241662j3223753L3689786M8233297K4182555o33842o791301q835399
504A013517j5110688j3514254j351328N692896L160324O353744J8744132K0388170
496B5376513K536296j2216016l703092J3143177J1588019o767177j8137215j2036733
488b16228J230944J0864821J2862814L215285j5901247k7407202j6590925N493903
480b6447835J4411475N351633m948423n800509j053858P127945J8575405J9717548
$$ plain form
536 -40351245 -35316653 -16925574 -8518411 -10992791 -7544932 6299184 19572434 27403060
528 27403060 32677170 28866783 5393886 -28410475 -47660825 -43633022 -29287064 -10993096
520 -10993096 17821841 47169146 46255582 7917120 -29792317 -32996395 -21664125 -37366164
512 -37366164 -75607826 -88831579 -55141793 -6908496 17274059 16640217 9848916 1013517
504 1013517 -14097171 -27611425 -28962753 -23269857 -20109533 -13755789 4988343 25376513
496 25376513 27912809 15696793 11993701 25136878 36724897 29957720 11820505 -216228
488 -216228 1014716 11879537 24742351 27957636 12056389 -15350813 -31941738 -26447835
480 -26447835 -12036360 -6684727 -11633150 -17433659 -18487517 -11359572 7215833 26933381
472B6933381l799785l4328389l2511990P741405M3731697M0648761J5730749K532842
464F6678671j809680j9942842m3751380m1493667j0828467J4112407J3718606
457b3316352O808622J2594224J9710847J1611380j485618J54741J1438745R708854
449D7225443r745882k6543536k3399075n511734J0177127J3192648M780541n530910
441D644622o336730M994863J6305919J2285929o373426k2692281k4243946j6091293
433c7506343q687215j630227J1055738K3991362K1608782r0916k2223508k1892229
425c5374556P75202K2610454K4727081J2115540K379600J821340Q73637q792670
417B1135628k1852897k7110824k1090453q575767N815474J9173475K5225427J7132808
$$ plain form
472 26933381 23133596 -11194793 -43706783 -35965378 7766319 48415080 64145829 66678671
464 66678671 64868991 44926149 1174769 -40318898 -51147365 -37034958 -23316352
457 -23316352 -16507730 -3913506 15797341 27408721 25923103 26077844 37516589 47225443
449 47225443 37479561 10936025 -12463050 -17974784 -7797657 5394991 10175532 4644622
441 4644622 -1692108 3302755 19608674 31894603 25521177 2828896 -21415050 -37506343
433 -37506343 -46193558 -47823785 -36768047 -12776685 8832097 8741181 -13482327 -35374556
425 -35374556 -34599354 -11988900 12738181 24853721 27233321 29054661 29928298 21135628
417 21135628 -717269 -27828093 -48918546 -57494313 -51678839 -32505364 -7279937 9852871
409I852871j129752j3623992r476300L289658Q735079M749049L201264Q121569
401A3719446P206794p485324k1884702j6747765L238378J3311184K696986j0778911
393a6723914p282240O534489Q091518q518520k4612668k2127554n115509R090311
385f0664087J2426804J1719987J4327130J6940936J2351652K145518m235248k827490
377B185202q97996o101036j4760718j6169797o053311R321851K0835063K3377989
369A1737247J6679485N187727l291080m657839m404014j0543909k0026449j9045004
361b8363836l71942K4182597L3240169J7415580r948689k4117459j2767815J1166711
353A0435316K3787682J7285445N421169L75481l308024j3207331k0802090j4631430
$$ plain form
409 9852871 8723119 -4900873 -14377173 -11087515 -2352436 2396613 5597877 13719446
401 13719446 20926240 13440916 -8443786 -25191551 -21953173 -8641989 -5945003 -16723914
393 -16723914 -24006154 -17471665 -9380147 -17898667 -42511335 -64638889 -69754398 -60664087
385 -60664087 -48237283 -36517296 -22190166 -5249230 7102422 9247940 5012692 2185202
377 2185202 1287206 -4813830 -19574548 -35744345 -41797656 -32475805 -11640742 11737247
369 11737247 28416732 33604459 30313379 25655540 21251526 10707617 -9318832 -28363836
361 -28363836 -28735778 -4553181 28686988 46102568 36153879 12036420 -731395 10435316
353 10435316 34222998 51508443 56929612 57305093 53997069 40789738 19987648 5356218
345E356218k201404P91062k889199J593236J0924848N407210j6235784k9830072
337b7083885k1391946n398335K865036Q712660J8072623K0257102Q743705k383088
329B393872k397792l400900j4167973j6796513K778354K1269123R729316j5469159
321a6061672j2594235K0256279M0012513K1709100j0148896k2449341j3594975
314G128773o2060R711714J2851669N116616q862963j4729906q249667q23274R60526
305C041428K902857M949762k277181j4462466j1460966R205406K0710519N795761
297A8405120j4435704j1447664Q512744J6293443K270962j5534833j9718306j1245749
289b6899987j517851O49729l392918j441895J5357657L4608304L3173599J0258403
$$ plain form
345 5356218 3154814 3945876 1056677 2649913 13574761 18981971 2746187 -27083885
337 -27083885 -48475831 -53874166 -51009130 -42296470 -24223847 -3966745 4776960 2393872
329 2393872 -3920 -3404820 -17572793 -34369306 -31590952 -10321829 -592513 -16061672
321 -16061672 -28655907 -8399628 31612885 53321985 43173089 20723748 7128773
314 7128773 7066713 16778427 29630096 34746712 25883749 11153843 2904176 2080902 3041428
305 3041428 5944285 10894047 8616866 -5845600 -17306566 -8101160 12609359 18405120
297 18405120 3969416 -7478248 1034496 17327939 19598901 4064068 -15654238 -26899987
289 -26899987 -28417838 -27768109 -31161027 -32602922 -17245265 17363039 50536638 60795041
281F0795041r115713j1227607j0634713j7767837j7290620K51072J2335361p02803
273F642181j7616219q140214J4766054J4694829p024190j3611884N405789J8484941
265A3601287N870820j0455507n592145J1860542J9733417J3051344j480098j9466089
257B7123571l2007533k5527339l668975R262991R47633j1178907q570243J495753
249d2123049L735563P69810K284068M392512J6245l183756M769296J6505705J8748352
240E914746J3347024R069851L459615p806154j4651675p639457O20449o431944
232d117545j7802809r390118J4085994K2229530O183181q402957m308316J401001
224a22039r164552k1074213j0082619J6637009K8843818J5219088n579812j4165932
$$ plain form
281 60795041 51679328 40451721 29817008 12049171 -5241449 -4990377 7344984 6642181
273 6642181 -10974038 -19114252 -4348198 10346631 3322441 -10289443 -4883654 13601287
265 13601287 19472107 9016600 3424455 15284997 35018414 48069758 46589660 27123571
257 27123571 -4883962 -30411301 -34080276 -24817285 -23869652 -35048559 -43618802 -42123049
249 -42123049 -38387486 -37617676 -35333608 -30941096 -30924851 -34108607 -29339311 -12833606 5914746
240 5914746 19261770 28331621 31791236 23985082 9333407 1693950 2314399 -4117545
232 -4117545 -21920354 -31310472 -17224478 5005052 11188233 2785276 -1523040 -122039
224 -122039 -9286591 -30360804 -40443423 -23806414 5037404 20256492 14676680 510748
216E10748j1004928n047230J517963R390603J3273262O272751r192920k0301274
208a4581025j5009620N533583K6018386L0807598J9411044M552831n323533j3745207
200C7664057k2678705k2029456m247660J7093582J9164482N00538j5400836j1431576
192a365574K422007P788595M018085K348101L464601j739499j1881051j3345697
184h290432k100962Q039290N940939q67132n94146K931146j772351j2085976j3346761
175b2146385l031828K197919r112016k2022498j0484995K7452624O0056326N3712087
167G6621234J1126722k9369172l4599392j0324645J1201658J1122714m97907p489401
159B7791811r464461j3444045j7549794j6152913j2142561r691019j911975J7630266
$$ plain form
216 510748 -10494180 -15541410 -14023447 -4632844 8640418 14913169 5720249 -14581025
208 -14581025 -29590645 -24057062 1961324 32768922 52179966 56732797 51409264 37664057
200 37664057 14985352 -7044104 -11291764 5801818 24966300 25466838 10066002 -1365574
192 -1365574 1056433 8845028 12863113 15211214 18675815 16936316 5055265 -8290432
184 -8290432 -10391394 -2352104 3588835 2721703 2127557 5058703 3286352 -8799624 -22146385
175 -22146385 -25178213 -22980294 -32092310 -54114808 -64599803 -37147179 22909147 76621234
167 76621234 87747956 58378784 23779392 13454747 24656405 35779119 35281212 27791811
159 27791811 18327350 4883305 -12666489 -28819402 -40961963 -50652982 -52564957 -34934691
151c4934691L5851621L2154968R416798o991104m769466Q85087m211722j0829878
143A6571613n673781M318662M694898j687240j446670N356259O463313j560133
135B7036921j0327829j4992482j6913953j3279728l65355J3600284J5376553P438533
127G572944N305390J2037085J2928028P72492j1023341r541927j628944r41617
119A5480110p631449j2628802j2560693q778146Q0589J2304107J6761755N465315
111H492786j1576280j6297885n394574P130986Q712863N60082p105002m449733
103a9926757J0420336K5781092K3093082p73257k3434932k1706346k381080O787643
95b140219m696115j8123812j4576091J332941J3932669J7910508J6892946J1820985
$$ plain form
151 -34934691 916930 33071898 42488696 35497592 30728126 31613213 27401491 16571613
143 16571613 10897832 15216494 19911392 18224152 16777482 22133741 28597054 27036921
135 27036921 16709092 1716610 -15197343 -28477071 -28842426 -15242142 134411 7572944
127 7572944 12878334 24915419 37843447 38615939 27592598 18050671 16421727 15480110
119 15480110 7848661 -4780141 -17340834 -26118980 -26038391 -13734284 3027471 8492786
111 8492786 -3083494 -19381379 -24775953 -17644967 -8932104 -8372022 -15477024 -19926757
103 -19926757 -9506421 16274671 39367753 38594496 15159564 -6546782 -8927862 -2140219
95 -2140219 -6836334 -24960146 -39536237 -38203296 -24270627 -6360119 10532827 22353812
87B2353812K670512m736582m043482K750536Q219705P721092R46128q670059j2910807
78A4300855n763949M572800J797833j4174137k2142658q945242R534682J1017936
70i801880j311946p539172k419660K878070M846007J0437710J6883203J2080421
62B6052753j687349o797470Q83218L961616o621287j4927701o454946P553805
54A962639Q881644M76428k538979J059982N66006n353899p158505j311007N483466
45B067775O792762R97301r887313j6995126q913744R953004J7017267K361348
37C393274j1412451j168614J7411960J1223166j6163891k6268483m720966J6605727
29a1100278R505031j0020407j2056714J454748P326219O14126l755761O51218
$$ plain form
87 22353812 25024324 20287742 16244260 18994796 27214501 34935593 35881721 27211662 14300855
78 14300855 8536906 13109706 14907539 733402 -21409256 -30354498 -20819816 -9801880
70 -9801880 -11113826 -18652998 -21072658 -18194588 -13348581 -2910871 13972332 26052753
62 26052753 24365404 17567934 18451152 22412768 15791481 863780 -5591166 1962639
54 1962639 10844283 11320711 8781732 9841714 10407720 5053821 -2104684 -3415691 2067775
45 2067775 8860537 9857838 -29475 -17024601 -25938345 -15985341 1031926 3393274
37 3393274 -8019177 -9187791 8224169 19447335 3283444 -22985039 -27706005 -11100278
29 -11100278 -1595247 -11615654 -23672368 -22217620 -14891401 -14277275 -18033036 -17381818
21a7381818P110183J4261726K5615010L2437516J9873679p688915k7205786k6920389
13B0101206j8162591j2955990q265975n15472J841314o455810j2466834j278150
5c8158302J9257121K5355076P738823j6775868k5353010
0b7936160
$$ plain form
21 -17381818 -10271635 3990091 29605101 62042617 81916296 74227381 47021595 20101206
13 20101206 1938615 -11017375 -19283350 -19798822 -17957508 -24413318 -36880152 -38158302
5 -38158302 -18901181 6453895 14192718 -2583150 -27936160
0 -27936160
$$ Imaginary data points
##PAGE= N=2
##DATA TABLE= (X++(I..I)), XYDATA
65535a9794319K3169732J3979737o968344k0269073j1937211J0596604K3791946
65528A2569072J4997655j654759m556420O005529J0728074J509060p631285m625314
65520B7341612J520640l087179j3918474j5929719p646806j188813j457970j442813
65512a5809522J983049L310329J438629K469527O219239M943764k88285J647520
65504E914250J0266378Q620146q552589j9326724m504315K0032111K1791521l932818
65496C0307960k8741213k9384765j3369419k960031p241686j5922699j3719268
65489h1031121L017986K1792964K7206455J9266654J1558024R470562L144727
65482A4426251j1194945j8905003r415084L891874M482237Q0015O953821J8001575
$$ plain form
65535 -19794319 3375413 17355150 10386806 -9882267 -21819478 -11222874 12569072
65528 12569072 27566727 25911968 21355548 27361077 38089151 39598211 31966926 27341612
65520 27341612 28862252 25775073 11856599 -4073120 -11719926 -12908739 -14366709 -15809522
65512 -15809522 -13826473 -10516144 -9077515 -6607988 -388749 4555015 4266730 5914250
65504 5914250 16180628 24800774 16248185 -3078539 -7582854 12449257 34240778 30307960
65496 30307960 1566747 -27818018 -41187437 -44147468 -51389154 -67311853 -81031121
65489 -81031121 -78013135 -56220171 -29013716 -9747062 1810962 11281524 14426251
65482 14426251 3231306 -15673697 -25088781 -21196907 -16714670 -16634655 -9680834 8320741
65474H320741J3639453j997532n607763N826636J0740737J347755m625628J463303
65466B9107702L176699r308550j9224726j1639528K514628R061359J4349539K5462460
65458D3499583K7697888P106048j9882953k5561193r834519L942102M501602Q70207
65450C2338765j86430k764785q783731j4150771j7484159j9033113j4303436j726085
65442d6093745R021032J0017241Q964691J4776787J8308877O542184j1579319
65435I957748j5428904m296303L960201L504158N945048J4284827J5437802L902412
65427C7266989q358215j2409972j3666377j5611981j0762196K719794J1580648
65420i241310N793247n663137p249496L822445J7738800K3384845J5009551l543263
$$ plain form
65474 8320741 21960194 19962662 14354899 20181535 30922272 32270027 27644399 29107702
65466 29107702 32284401 22975851 3751125 -7888403 -5373775 3687584 18037123 43499583
65458 43499583 71197471 78303519 58420566 32859373 23024854 26966956 31468558 32338765
65450 32338765 32152335 29387550 20603819 6453048 -11031111 -30064224 -44367660 -46093745
65442 -46093745 -37072713 -27055472 -18090781 -3313994 14994883 21537067 9957748
65435 9957748 -5471156 -9767459 -5807258 -2303100 3641948 17926775 33364577 37266989
65427 37266989 28908774 16498802 2832425 -12779556 -23541752 -20821958 -9241310
65420 -9241310 -3448063 -9111200 -16360696 -12538251 5200549 28585394 43594945 40051682
65412D0051682j7884628j5467260j178748Q446855O373750m09991n481176q044673
65404F405811n290591L765162Q333415j210095j1872276k675989J8652636K1131083
65396C7239156k160508k2197859j9810382j1847502j5025775j5316173K244379
65389d6874664K1009128J9637596Q892449R518235J2921218k24975j7317477r818857
65381b257347J5793319K3774957N070642j1663516r375727m986642j2464734j8935825
65373a5044873j2987890o097654p824524o494637N724836J2685281J248158j2405922
65365d1197225p642064O359440O978253l874490n246003O787039J5356286J2987779
65357i490985J0544744J3743085J3279050M554430j969934Q12548L495360l354219
$$ plain form
65412 40051682 22167054 6699794 5521046 13967901 20341651 19931660 14450484 6405811
65404 6405811 1115220 4880382 13213797 12003702 131426 -2544563 16108073 37239156
65396 37239156 35078648 12880789 -6929593 -18777095 -33802870 -49119043 -46874664
65389 -46874664 -25865536 -6227940 2664509 12182744 25103962 24878987 7561510 -2257347
65381 -2257347 13535972 37310929 42381571 30718055 21342328 16355686 3890952 -15044873
65373 -15044873 -28032763 -34130417 -41954941 -48449578 -42724742 -30039461 -28791303 -41197225
65365 -41197225 -48839289 -42479849 -35501596 -39376086 -44622089 -37835050 -22478764 -9490985
65357 -9490985 1053759 14796844 28075894 32630324 30660390 31472938 34968298 31614079
65349C1614079j1540183p690472L696269M949635p321962j4043925l66581J9535237
65341A8832097J8319605n682364k2119741q968387J5642311J8587164q15513j2033513
65333B1761659q90949J1100429M275759q011519m707936O500113L590835j1062860
65325B2555531j4489379j322350R195689N717389j427496l850110p277704j1310025
65317b208455k383631J8279136K3398396j992299k9698132k3067618R304297K5059281
65309A6690975R038151r717161o879442L222615j792096j4216550j2739712J7895
65301a6375325L879491l157600l297237P737139J2594269L417696l801994J892700
65293B889139N261645q738242k4140246j3779576J8055780L7616309K6131660
$$ plain form
65349 31614079 20073896 12383424 16079693 21029328 13707366 -336559 -703140 18832097
65341 18832097 37151702 31469338 9349597 381210 16023521 34610685 33795172 21761659
65333 21761659 20870710 31971139 36246898 28235379 23527443 30027556 33618391 22555531
65325 22555531 8066152 6743802 15939491 21656880 20229384 16379274 9101570 -2208455
65317 -2208455 -4592086 13687050 37085446 35093147 5395015 -17672603 -8368306 16690975
65309 16690975 25729126 16011965 9132523 12355138 10563042 -3653508 -16393220 -16375325
65301 -16375325 -12495834 -15653434 -18950671 -11213532 1380737 4798433 996439 2889139
65293 2889139 8150784 -587458 -24727704 -38507280 -20451500 17164809 43296469
65286D3296469M56243j4390730j3432109n442318L200946P069100j372381j9688632
65278c03412l0313839k0729670j477536Q314208O657525O601372J3449404J8696552
65270H94604J5280920N802826m767308j3244409j4732856o194300N029346O737506
65262e193671j699429p600976k011451R765177J6441605J1873620k398442j7019966
65254B156467j7996615j212862J6387258J3779100m739440j3629954l731054M074528
65246d912572o385070j7973248n667917K2882066L5350721J7856814j1163667
65239B9987127k8528596k7838987j2863381J0101319K7668473K4842961M006479
65232B7375395j4122122j5578116p336846o30196N216995J2686646J4208355M530393
$$ plain form
65286 43296469 43752712 29361982 15929873 10487555 13688501 20757601 19385220 -303412
65278 -303412 -30617251 -51346921 -52824457 -44510249 -37852724 -31251352 -17801948 894604
65270 894604 16175524 21978350 17211042 3966633 -10766223 -16960523 -11931177 -5193671
65262 -5193671 -6893100 -14494076 -16505527 -6740350 9701255 21574875 19176433 2156467
65254 2156467 -15840148 -17053010 -665752 13113348 8373908 -5256046 -8987100 -4912572
65246 -4912572 -11297642 -29270890 -34938807 -12056741 23293980 41150794 29987127
65239 29987127 1458531 -26380456 -39243837 -29142518 -1474045 23368916 27375395
65232 27375395 13253273 -2324843 -9661689 -10291885 -5074890 7611756 21820111 26350504
65224B6350504n778272m956814k67098o379233j8749839j7958542k75211J5437033
65216a2577472J5620795Q893476O934650M921129n924182j8217226j6846609j776239
65208a8971678J2205417J5896858J2607430O241895l268240j0987991p559886
65201F163805N618620J3243767N463963q581359j4025243q813230p12530O141629
65193D499422J1311982J1276571M596520q87955J248028K489316q012751k0154261
65185F366872j2229379J3306932K5035699M331971k6645912l4366364j6404737
65178d0604918M317157J5479917K1727273K1603576N754813j8822924k7970777
65171a8515883j3409376L833627M847270r28840L683153J3169128J0165159l724752
$$ plain form
65224 26350504 20572232 15615418 15348320 8969087 -9780752 -27739294 -28014505 -12577472
65216 -12577472 3043323 11936799 18871449 23792578 17868396 -348830 -17195439 -18971678
65208 -18971678 -6766261 9130597 21738027 27979922 24711682 13723691 6163805
65201 6163805 11782425 25026192 30490155 21908796 7883553 -929677 -1642207 4499422
65193 4499422 15811404 27087975 31684495 30796540 32044568 34533884 26521133 6366872
65185 6366872 -5862507 7444425 32480124 36812095 10166183 -24200181 -40604918
65178 -40604918 -36287761 -20807844 919429 22523005 28277818 9454894 -18515883
65171 -18515883 -31925259 -28091632 -23244362 -24173202 -20490049 -7320921 2844238 -880514
65163h80514j0825863o951397n225087r105879m010188J6230746L3330268K7804420
65155D0366506N422335j3371716k1195775k5577148k8312854k0231054J067233
65148f1832473K1615506K5820655J3521017k867470j2630383j3132905o653098
65141c6159151K600586R422123J0231544N309732k906656j1746185j6701990j1886893
65133e1836890K716784J6489080J7192614N448537n540128o368456j522548L46665
65125b3074342N8923M591610J2908818J4036866K001102j3276232j5503358j350313
65117a9606926J4101608J3529958k315884j4172286o683945J1809203J8588115
65110A5249843N859962q937666q268206j91332n145317k1407214k2903709K695283
$$ plain form
65163 -880514 -11706377 -18657774 -23882861 -32988740 -36998928 -20768182 12562086 40366506
65155 40366506 45788841 32417125 11221350 -14355798 -42668652 -62899706 -61832473
65148 -61832473 -40216967 -14396312 -875295 -3742765 -16373148 -29506053 -36159151
65141 -36159151 -33558565 -24136442 -13904898 -8595166 -11501822 -23248007 -39949997 -51836890
65133 -51836890 -49120106 -32631026 -15438412 -9989875 -15530003 -21898459 -23421007 -23074342
65125 -23074342 -23015419 -18423809 -5514991 8521875 10522977 -2753255 -18256613 -19606926
65117 -19606926 -5505318 8024640 5708756 -8463530 -15147475 -3338272 15249843
65110 15249843 21109805 12172139 3903933 3712601 -1432716 -22839930 -45743639 -43048356
65102d3048356L1169643L1406454O946526j0388270m180362R201544R731097P37489
65094C1575765l748532l413968p407189j4455129j5167619j1073715j3042589
65087c6732976j9073059j2305926J1385899L0807870K7201318J1152279N277430
65080A7712835R874863O263996r761111k0282879j3986303k004312K450039K383559
65072g349313M843784O562364M275763M957329J1205305R848041p297766k3014629
65064D030878j6311687L562610Q500314o559276j7791867r408124Q113219K1029395
65056d834538K8930029L0234777J5970386q484935j8366204m565004O009511j2248963
65048C2645059m1483868m2546170j0789795J9003396K2737242J4080659J3913572
$$ plain form
65102 -43048356 -11878713 19527741 26474267 16085997 11905635 21107179 30838276 31575765
65094 31575765 27827233 24413265 17006076 2550947 -12616672 -23690387 -36732976
65087 -36732976 -55806035 -68111961 -56726062 -25918192 1283126 12435405 17712835
65080 17712835 27587698 33851694 24090583 3807704 -10178599 -12182911 -9732872 -7349313
65072 -7349313 -2505529 4056835 8332598 13289927 24495232 34343273 27045507 4030878
65064 4030878 -12280809 -8718199 -217885 -6777161 -24569028 -33977152 -25863933 -4834538
65056 -4834538 24095491 54330268 70300654 61815719 43449515 38884511 44894022 32645059
65048 32645059 -8838809 -51384979 -62174774 -43171378 -20434136 -6353477 7560095
65041G560095J6963483N351243j8644449l2513347k3707569n239760L300260J177774
65033d5752270L570599J5276478K0112452M946877j5571404j5221798N458291
65026b7180775J7737732O312157r564947q471293J082019O07553m031881N252220
65018a8257215K2728828K4248020O282868q293566o295949m40738l048803p158800
65010I764645l863696J708475L254714M883141Q146703L485600j2331580k4275572
65002i227570j8865942m686834R85895l337441o331775l617220j77565J966387
64994d3292065N163144P953517O691844L478363L262534N038031L980956Q1059
64986g642617k816820m216237o068189o690583k330645O209546J3610511J5832862
$$ plain form
65041 7560095 24523578 29874821 11230372 -21282975 -44990544 -50230304 -46930044 -45752270
65033 -45752270 -42181671 -26905193 -6792741 -1845864 -17417268 -32639066 -27180775
65026 -27180775 -9443043 -3130886 -12695833 -21167126 -20085107 -19477554 -23509435 -18257215
65018 -18257215 4471613 28719633 35002501 26708935 20412986 19972248 16923445 9764645
65010 9764645 5900949 7609424 10864138 15747279 23893982 27379582 15048002 -9227570
65002 -9227570 -28093512 -32780346 -31794451 -35131892 -41463667 -45080887 -45258452 -43292065
64994 -43292065 -38128921 -30175404 -23483560 -20005197 -16742663 -11704632 -7723676 -7642617
64986 -7642617 -10459437 -14675674 -20743863 -27434446 -29765091 -23555545 -9945034 5887828
64978E887828J2860437P668211M160307K792043k045798j4261932k5450374k1449586
64970b9838864k619415J2637668J0591070n48292l358021O257340J7084574J7755048
64962B7961108P072032p073496j4895380j4196248j2882192j6234861j5509654
64955d5758691j535555J4237975J1867555l873474p246522N900468Q537992j0796992
64947b8667244k2758258l258041K2616178J6275108j4379619k8412364j3093440
64940g1677680P890677K0990788L5159926M5974049L0475483r984095l8986106
64933A9843042l4307163j6622653j1071914j0539402K71967J1815852R007183
64926c1603088K683146J1334720K5520919K0959592j155012j6046031j3817928
$$ plain form
64978 5887828 18748265 26416476 30576783 33368826 31323028 17061096 -8389278 -29838864
64970 -29838864 -32458279 -19820611 -9229541 -9777833 -13135854 -6878514 10206060 27961108
64962 27961108 35033140 27959644 13064264 -1131984 -14014176 -30249037 -45758691
64955 -45758691 -47294246 -33056271 -21188716 -25062190 -32308712 -26408244 -17870252 -28667244
64947 -28667244 -51425502 -54683543 -32067365 -15792257 -30171876 -58584240 -71677680
64940 -71677680 -63787003 -42796215 -7636289 38337760 68813243 58829148 19843042
64933 19843042 -14464121 -31086774 -42158688 -52698090 -52426123 -40610271 -31603088
64926 -31603088 -28919942 -17585222 7935697 28895289 27740277 11694246 -2123682
64919b123682q688768j0008733j0115341m744972j509624j193732P166623K2505664
64911h712565K3905405J654184k0875713j6279809O582939J3944523m383398k1394127
64903b5558561j3591539N582270P886037p477428j3856637L552838K7390760L2362131
64895A6289871J6111971k585598p789607R0058R386786Q352174n375400k1147698
64887A3332557k4345599j2208588M000730J3941291J6813949J3070211O27217
$$ plain form
64919 -2123682 -10812450 -20821183 -30936524 -35681496 -37191120 -38384852 -31218229 -8712565
64911 -8712565 15192840 16847024 -4028689 -20308498 -13725559 218964 -4164434 -25558561
64903 -25558561 -39150100 -33567830 -25681793 -33159221 -47015858 -43463020 -16072260 16289871
64895 16289871 32401842 29816244 22026637 22116695 31503481 39855655 34480255 13332557
64887 13332557 -11013042 -23221630 -19220900 -5279609 11534340 24604551 25231768
$$ [...]
##END NTUPLES=NMR SPECTRUM
##END=
