##TITLE=31Pdec_LR-685B-M
 CDcl3, 24 sc
 26.7.2019
##JCAMPDX= 6.0         $$ Bruker NMR JCAMP-DX V2.0
##DATA TYPE= NMR SPECTRUM
##DATA CLASS= NTUPLES
##ORIGIN= UXNMR, Bruker Analytische Messtechnik GmbH
##OWNER= root
$$ XWIN-NMR		Version 3.5
$$ Fri Jul 26 15:23:11 2019 Russian Standard Time (UT+4h)  she@DPX200
##.OBSERVE FREQUENCY= 81.013821
##.OBSERVE NUCLEUS= ^31P
##.ACQUISITION MODE= SIMULTANEOUS
##.ACQUISITION SCHEME= undefined
##.AVERAGES= 24
##.DIGITISER RES= 17
##SPECTROMETER/DATA SYSTEM= spect
##.PULSE SEQUENCE= zgpg30
##.SOLVENT NAME= CDCl3
##.SHIFT REFERENCE= (INTERNAL, CDCl3, 0, 182.463)
##AUDIT TRAIL= $$ (NUMBER, WHEN, WHO, WHERE, WHAT)
$$ ##TITLE= Audit trail, XWIN-NMR		Version 3.5
$$ ##JCAMPDX= 5.01
$$ ##ORIGIN= Bruker BioSpin GmbH
$$ ##OWNER= she
$$ F:/spectra/data/she/nmr/P31/1/pdata/1/auditp.txt
$$ ##AUDIT TRAIL=  $$ (NUMBER, WHEN, WHO, WHERE, WHAT)
(   1,<2019-07-26 15:22:12.85 +0400>,<she>,<DPX200>,
      <created by zg, POWCHK disabled, PULCHK disabled
       configuration hash MD5:
       00 E9 B6 7A A2 85 ED C7 34 08 36 98 17 FE 4E 26
       data hash MD5: 32K
       74 DB 36 0F 82 9C E7 42 94 72 6C 42 D7 7C C2 34>)
(   2,<2019-07-26 15:22:15.64 +0400>,<she>,<DPX200>,
      <Start of raw data processing
       efp BC_mod = 2 LB = 1 FT_mod = 6 PKNL = 1 PHC0 = -420.7049 PHC1 = 130.4 SI = 64K 
       data hash MD5: 64K
       7B DC D0 7A 50 75 8B 3F DF 4A 19 3A 1D C5 D3 91>)
(   3,<2019-07-26 15:22:31.46 +0400>,<she>,<DPX200>,
      <pk PHC0 = 17.10243 PHC1 = 0 
       data hash MD5: 64K
       62 C5 7B 05 72 D3 F6 F2 D3 99 60 51 37 88 3C C5>)
(   4,<2019-07-26 15:22:34.78 +0400>,<she>,<DPX200>,
      <abs ABSG = 5 
       data hash MD5: 64K
       4A 44 70 23 8C EB 84 21 BE 34 2E 49 F6 A2 D3 06>)
$$ ##END=
$$ 
$$ hash MD5
$$ 03 31 F9 A4 0E C0 A2 0E C6 0C F8 CC 6B AC C8 EC
##$RELAX= 
##$RELAX= 
##$RELAX= 
##$RELAX= 
##$RELAX= 
##$RELAX= 
##$RELAX= 
##$RELAX= 
$$ Bruker specific parameters
$$ --------------------------
##$DU= <F:/spectra>
##$EXPNO= 1
##$NAME= <P31>
##$PROCNO= 1
##$TYPE= <nmr>
##$USER= <she>
##$AMP= (0..31)
100 100 100 100 100 100 100 100 100 100 100 100 100 100 100 100 100 100 
100 100 100 100 100 100 100 100 100 100 100 100 100 100 
##$AQSEQ= 0
##$AQ_mod= 1
##$AUNM= <au_zg>
##$AUTOPOS= <>
##$BF1= 81.014009
##$BF2= 200.13
##$BF3= 200.13
##$BF4= 200.13
##$BF5= 200.13
##$BF6= 200.13
##$BF7= 200.13
##$BF8= 200.13
##$BYTORDA= 1
##$CFDGTYP= 0
##$CFRGTYP= 5
##$CHEMSTR= <none>
##$CNST= (0..31)
1 1 145 1 1 1 1 1 1 1 1 1 1 1 1 1 1 1 1 1 1 1 1 1 1 1 1 1 1 1 1 1 
##$CPDPRG= <waltz16>
##$CPDPRG1= <>
##$CPDPRG2= <waltz16>
##$CPDPRG3= <>
##$CPDPRG4= <mlev>
##$CPDPRG5= <mlev>
##$CPDPRG6= <mlev>
##$CPDPRG7= <mlev>
##$CPDPRG8= <mlev>
##$CPDPRGB= <>
##$CPDPRGT= <>
##$D= (0..31)
0 1 0 0 0 0 0 0 0 0 0 0.03 2e-05 3e-06 0 0 0 0 0 0 0 0 0 0 0 0 0 0 0 0 
0 0 
##$DATE= 1564140132
##$DBL= (0..7)
120 120 120 11 120 120 24 19 
##$DBP= (0..7)
150 150 150 150 150 150 150 150 
##$DBP07= 0
##$DBPNAM0= <>
##$DBPNAM1= <>
##$DBPNAM2= <>
$$ [...]
##$SUBNAM3= <"">
##$SUBNAM4= <"">
##$SUBNAM5= <"">
##$SUBNAM6= <"">
##$SUBNAM7= <"">
##$SUBNAM8= <"">
##$SUBNAM9= <"">
##$SW= 369.568048894756
##$SWIBOX= (0..15)
0 1 3 0 0 0 0 0 0 0 0 0 0 0 0 0 
##$SW_h= 29940.119760479
##$TD= 32768
##$TD0= 1
##$TE= 0
##$TE2= 300
##$TE3= 300
##$TEG= 300
##$TL= (0..7)
0 120 53 12 22 120 120 120 
##$TP= (0..7)
150 150 150 150 150 150 150 150 
##$TP07= 0
##$TPNAME0= <>
##$TPNAME1= <>
##$TPNAME2= <>
##$TPNAME3= <>
##$TPNAME4= <>
##$TPNAME5= <>
##$TPNAME6= <>
##$TPNAME7= <>
##$TPOAL= (0..7)
0.5 0.5 0.5 0.5 0.5 0.5 0.5 0.5 
##$TPOFFS= (0..7)
0 0 0 0 0 0 0 0 
##$TUNHIN= 0
##$TUNHOUT= 0
##$TUNXOUT= 0
##$USERA1= <user>
##$USERA2= <user>
##$USERA3= <user>
##$USERA4= <user>
##$USERA5= <user>
##$V9= 5
##$VALIST= <valist>
##$VCLIST= <CCCCCCCCCCCCCCC>
##$VD= 0
##$VDLIST= <DDDDDDDDDDDDDDD>
##$VPLIST= <PPPPPPPPPPPPPPP>
##$VTLIST= <TTTTTTTTTTTTTTT>
##$WBST= 1024
##$WBSW= 4
##$XGAIN= (0..3)
0 0 0 0 
##$XL= 0
##$YL= 0
##$YMAX_a= 16860
##$YMIN_a= -17252
##$ZGOPTNS= <>
##$ZL1= 120
##$ZL2= 120
##$ZL3= 120
##$ZL4= 120
##$ABSF1= 182.463
##$ABSF2= -187.1042
##$ABSG= 5
##$ABSL= 3
##$ALPHA= 0
##$AQORDER= 0
##$ASSFAC= 0
##$ASSFACI= 0
##$ASSFACX= 0
##$ASSWID= 0
##$AUNMP= <proc_1d>
##$AZFE= 0.1
##$AZFW= 0.5
##$BCFW= 0
##$BC_mod= 2
##$BYTORDP= 0
##$COROFFS= 0
##$CY= -3
##$DATMOD= 1
##$DC= 0
##$DFILT= <>
##$DTYPP= 0
##$F1P= 0
##$F2P= 0
##$FCOR= 1
##$FTSIZE= 65536
##$FT_mod= 6
##$GAMMA= 0
##$GB= 0
##$INTBC= 1
##$INTSCL= 5.30512e-09
##$ISEN= 30
##$LB= 1
##$LEV0= 0
##$LPBIN= 0
##$MAXI= 10000
##$MC2= 0
##$MEAN= 0
##$ME_mod= 0
##$MI= 50
##$NCOEF= 0
##$NC_proc= -6
##$NLEV= 6
##$NOISF1= 182.463
##$NOISF2= 159.3651
##$NSP= 0
##$NTH_PI= 0
##$NZP= 0
##$OFFSET= 182.463
##$PC= 4
##$PHC0= -403.6025
##$PHC1= 130.4
##$PH_mod= 1
##$PKNL= yes
##$PPARMOD= 0
##$PSCAL= 0
##$PSIGN= 0
##$REVERSE= no
##$SF= 81.0140089999434
##$SI= 65536
##$SIGF1= 159.3651
##$SIGF2= -187.1042
##$SINO= 113.3802
##$SIOLD= 16384
##$SREGLST= <1H.CDCl3>
##$SSB= 0
##$STSI= 65536
##$STSR= 0
##$SW_p= 29940.119760479
##$SYMM= 0
##$S_DEV= 0
##$TDeff= 32768
##$TDoff= 0
##$TI= <>
##$TILT= no
##$TM1= 0
##$TM2= 0
##$TOPLEV= 0
##$USERP1= <user>
##$USERP2= <user>
##$USERP3= <user>
##$USERP4= <user>
##$USERP5= <user>
##$WDW= 1
##$XDIM= 65536
##$YMAX_p= 366070236
##$YMIN_p= -8743977
$$ End of Bruker specific parameters
$$ ---------------------------------
##NTUPLES= NMR SPECTRUM
##VAR_NAME=  FREQUENCY,     SPECTRUM/REAL,   SPECTRUM/IMAG
##SYMBOL=    X,             R,               I
##VAR_TYPE=  INDEPENDENT,   DEPENDENT,       DEPENDENT
##VAR_FORM=  AFFN,          ASDF,            ASDF
##VAR_DIM=   65536,         65536,           65536
##UNITS=     HZ,            ARBITRARY UNITS, ARBITRARY UNITS
##FACTOR=    0.456856943014862, 1,           1
##FIRST=     14782.0589164792, 0,            0
##LAST=      -15158.0608439998, 0,           0
##MIN=       -15158.0608439998, -8743977,    0
##MAX=       14782.0589164792, 366070236,    0
$$ Real data points
##PAGE= N=1
##DATA TABLE= (X++(R..R)), XYDATA
$$ [...]
47922 -2805525 -3164557 -1987459 -1272081 -1655178 -1604340 -24029 2126352 3405067 3556007
47913 3556007 2893948 1478516 -146271 -722579 -29195 206031 -1446300 -3767502 -4361093
47904 -4361093 -2982348 -1695069 -1757022 -2058045 -1158890 522225 1459256 1079697 148624
47895 148624 -428627 -361392 240585 1114728 1884630 2370147 2896949 3882928 5084020 5695248
47885 5695248 5347527 4582169 4068287 3743771 3161476 2361023 1766143 1380612 898343
47876 898343 690024 1698290 3835656 5363621 4747535 2584595 794499 380930 1011584
47867 1011584 2293479 3982401 5024494 4079054 1509804 -553627 -852620 -416947 -476721
47858 -476721 -287602 1539305 4388324 5986472 5251234 3451129 2357834 2212139 1808564
47849 1808564 38632 -2781376 -4849797 -4409753 -1713083 976375 1776996 949877 -283849
47840 -283849 -1660100 -3387110 -4540984 -3669123 -896108 2041507 3909282 4801931 4900414
47831 4900414 3947823 2211810 528479 -906826 -2378761 -3146469 -1965492 386925
47823 386925 1233045 -276924 -1613227 -613563 1138741 824063 -1256159 -2446523 -1943615
47814 -1943615 -1378429 -1427016 -736032 1226189 2810726 2778603 2218454 2537140 3100068
47805 3100068 2345803 211085 -1874741 -2698129 -1937291 108768 2388290 3300613 2128461
47796 2128461 -17788 -1416728 -1495366 -801363 92357 809243 870515 147739 -685459
47787 -685459 -920960 -731259 -697816 -883817 -1045435 -1248999 -1554435 -1632169 -1437558 -1613854
47777 -1613854 -2382303 -2801037 -2178897 -1402420 -1513257 -1739164 -650498 1222985 1898328
47768 1898328 998859 341114 1134521 2373840 2589022 1685286 462690 -362942 -229990
47759 -229990 785031 1218201 -422967 -3100652 -3869610 -1754443 889186 1755619 1253278
47750 1253278 607382 -398683 -1937663 -2501256 -1156028 220299 -378122 -1507340 -360747
47741 -360747 2494071 3769313 2562927 1457735 2193506 3488072 4041833 4634739 5779284
47732 5779284 5969765 4169215 1952813 1208556 1422198 1250479 1248051 2675634 4565401
47723 4565401 4423985 1672135 -1541822 -2998118 -2399506 -811936 419429 159512 -1712104
47714 -1712104 -3684616 -3830769 -1864067 794945 2901372 4300609 5006617 4693263 3593191
47705 3593191 2846153 3173408 3814145 3519514 2272665 1319645 1523998 2271106 2288640
47696 2288640 1263819 172139 -86261 140098 -46300 -562767 -392169 768452 1847427
47687 1847427 1847917 1167413 799124 856714 755249 470240 664421 1601913 2721638 3441434
47677 3441434 3826832 4234114 4616132 4438216 3311922 1708633 820798 1320147 2369701
47668 2369701 2482487 1351497 22423 -829483 -1651454 -2592533 -2646386 -1249042 331671
47659 331671 582056 -11239 157796 1136767 1357635 268000 -713096 -380404 575837
47650 575837 909452 741317 1099727 2160413 2961584 2712450 1665646 655590 213471
47641 213471 240685 348134 387135 548724 864673 845561 39746 -1016868 -884299 1333140
47631 1333140 4669953 6799651 6181603 3672720 1610512 1200613 1446073 1057990 461595
47622 461595 728510 1274366 508702 -1342511 -2236046 -1590408 -1249941 -2150936 -2466673
47613 -2466673 -859630 692057 -155855 -2120991 -2241015 -556858 450141 331469 943396
47604 943396 2356937 2317702 494240 -393186 946331 2091017 935127 -973135 -1313320
47595 -1313320 -578983 -278300 149753 1746618 3140572 2323234 173272 -750939 -159319
47586 -159319 99477 -410606 -249261 831761 1157854 -53318 -1479172 -1878212 -1482993
47577 -1482993 -691739 660997 2053488 2141355 752018 -510289 -488322 77993 142110
47568 142110 69492 789335 2240231 3568966 4162785 3918435 3256551 3197873 4374082
47559 4374082 5588905 4670515 1424574 -1574164 -2059827 -739007 209597 121659 -134983
47550 -134983 -289786 -1057807 -2554317 -3820328 -4184369 -4036194 -3917902 -3614874 -2528232
47541 -2528232 -554924 1580146 2683863 1969411 -69480 -1877518 -2338542 -1796087 -1161752
47532 -1161752 -497238 683217 1972938 2068732 514755 -1403517 -2063186 -1293950 -227061
47523 -227061 285080 454129 812024 1287090 1362450 943124 682844 1294263 2659936 3827413
47513 3827413 3932087 3008141 1824482 1043083 685047 376453 -92676 -603325 -1019483
47504 -1019483 -1410492 -1799548 -1862411 -1221092 -79407 767719 725971 -50716 -1011110 -1697141
47494 -1697141 -1653730 -433085 1669953 3260051 3074938 1538006 294563 136758 235030
47485 235030 -313487 -1067273 -981883 46173 1095516 1368306 845985 49255 -348029
47476 -348029 73492 939817 1232445 567509 36003 971380 2975183 4063855 2963757
47467 2963757 465591 -1784740 -3002738 -3268110 -2677396 -1462623 -503501 -612555 -1323431
47458 -1323431 -1363349 -508357 -29194 -869117 -2217435 -2573734 -1640963 -404838 267399
47449 267399 325994 99994 -50165 237096 927372 1337293 972193 403471 440857 659133
47439 659133 -42837 -1380198 -1614880 -35525 1864703 2499278 2223169 2170667 2184898
47430 2184898 1343318 -220696 -1584156 -2652604 -3895511 -4697853 -3753817 -1374685 208222
47421 208222 -485079 -2406890 -3574477 -3444166 -2931636 -2847976 -3149862 -3319638 -2881880
47412 -2881880 -1828531 -840943 -661223 -1034762 -911041 -8623 558107 -263637 -2035907
47403 -2035907 -3496214 -4092038 -4083853 -3519271 -2044862 201243 2198718 2870353 2096036
47394 2096036 783099 -19614 -106340 -220793 -1086384 -2444635 -3348347 -3327584 -2830513
47385 -2830513 -2477490 -2359944 -2239994 -2039229 -1924265 -2156123 -2862944 -3623143 -3394215
47376 -3394215 -1469434 1399867 3417967 3485150 2119467 634842 -34619 327803 1321179
47367 1321179 2100350 2009811 1291249 766328 829472 1280080 1987128 2918194 3591816 3447854
47357 3447854 2793652 2425023 2326996 1849736 1105892 802667 645206 -396483 -1919294
47348 -1919294 -2085301 -438109 1255763 1914649 2767566 4692108 6070653 5254451 3323376
47339 3323376 2129047 1212466 -740023 -2745276 -2812026 -1500164 -1095785 -1731665 -1499237
47330 -1499237 -195323 443196 431483 1845381 4632103 5741056 3909214 1882292 1851040
47321 1851040 1941189 -39370 -2219502 -1467266 1429623 3066597 2687378 2450359 3035822
47312 3035822 2758288 1254443 491593 1183019 1313903 -356818 -1968024 -1499993 49059
47303 49059 388690 -732700 -1895853 -2490683 -2778145 -2331173 -583963 1391885 1723684
47294 1723684 462389 -354626 267646 905856 112850 -1280036 -1386296 138593 1859681
47285 1859681 2399914 1581164 153155 -731956 -121901 1744144 3241432 2998409 1575211
47276 1575211 711775 1145604 2129490 2852418 3035101 2112086 -567494 -4107001 -6057858
47267 -6057858 -5074593 -2570740 -771049 -144804 88215 8551 -743545 -1403723 -735702
47258 -735702 749755 1012764 -657255 -2496071 -2634397 -1411356 -526712 -789743 -1593805
47249 -1593805 -2104804 -2157053 -2056573 -1921651 -1352239 63077 1796636 2514785 1750297
47240 1750297 808410 1032672 1777620 1490956 370690 141363 1207502 2014443 1650914
47231 1650914 1070194 941130 332054 -1192848 -2039575 -890793 875844 988381 -517384
47222 -517384 -1795802 -2085794 -2101221 -2021708 -1172774 298911 1245508 1250217 1077478 1199092
47212 1199092 1204911 870952 562760 377907 40969 -237954 -7099 224049 -643834 -2450051
47202 -2450051 -3586591 -3067092 -1624822 -397318 238318 89064 -1188639 -3028360 -3733213
47193 -3733213 -2341274 59934 1699575 2046745 1620040 776632 -259960 -824792 -425099
47184 -425099 380379 653198 324279 -103827 -696091 -1795198 -2813898 -2702727 -1891117
47175 -1891117 -2381703 -5023107 -7649541 -7233941 -3622594 114981 1249745 191860
47167 191860 -810830 -701413 -211251 -53247 -21063 44690 -213286 -698975 -636062 -10272
47157 -10272 -125703 -1760271 -3682155 -4128243 -3078554 -1955063 -1695936 -2281301 -3489146
47148 -3489146 -4731291 -4687626 -2676743 -84537 1103473 901950 861860 1401632 1588529
47139 1588529 1405128 1890964 2742060 2234438 296906 -769992 185096 1248863 606905
47130 606905 -551249 -283763 805787 876841 71119 -82268 455513 482236 147181 799828
47120 799828 2369199 3197175 2657445 1903259 1734480 1619498 1231818 1174703 1594073 1574124
47110 1574124 512358 -1096751 -2562865 -3470680 -3195273 -1502344 204228 59170 -1379289
47101 -1379289 -1378426 982235 3044721 2171637 -578661 -2186736 -1880990 -1516956 -2239795
47092 -2239795 -2813998 -1586943 1325787 4420892 6534160 7570750 7843107 7211388 5174690
47083 5174690 1876121 -1395824 -3303940 -3875629 -4054383 -4010019 -3050965 -1341518 -260400
47074 -260400 -369879 -339538 1063104 2951107 3494292 2338345 621913 -778254 -1709963
47065 -1709963 -1934589 -1266243 -352631 -43789 -37722 655166 1922683 2493798 1861608 1049369
47055 1049369 1046841 1555278 1868277 2082523 2642096 3286391 3331203 2776107 2348222 2353801
47045 2353801 2141335 1168696 250157 901207 3142633 4785579 3859297 1283000 -250854
47036 -250854 -4441 -58662 -1831129 -3582139 -2882031 -221948 1708535 1547000 186006
47027 186006 -1235313 -2233434 -2177051 -764572 598009 24216 -1924015 -2680218 -1553032
47018 -1553032 -790497 -1752726 -2462110 -777777 1945875 2677990 974802 -858509 -1116759
47009 -1116759 6029 1999152 4580075 6540581 6187031 3590602 845780 -539012
47001 -539012 -1149239 -1920851 -2293658 -1258835 615310 1551941 858910 -139759 180402
46992 180402 1592679 2168068 684528 -1625733 -2402685 -1085474 450358 454650 -603763
46983 -603763 -1244576 -1207998 -1255017 -1498262 -1423327 -1187907 -1361266 -1507481 -606976 1013290
46973 1013290 1771542 1205133 700582 1279303 2177913 2512607 2958102 4492096 6395315
46964 6395315 6858848 5192950 2441151 107085 -952188 -727527 60839 468436 229430
46955 229430 -92539 -106679 -129203 -331186 -176770 621450 1375552 1506379 1656424 2697826
46945 2697826 4125059 4492538 3186581 903516 -1305763 -2659456 -2790045 -2227644 -2275038
46936 -2275038 -3327447 -3793595 -1994772 1198550 3124818 2641974 1124471 48075
46928 48075 -699653 -1575773 -2145331 -2124107 -2364264 -3555678 -4819298 -4817383 -3650279 -2472229
46918 -2472229 -1690170 -802218 174040 412760 -357707 -1238136 -1351887 -940955 -802229
46909 -802229 -1166853 -1648937 -1926930 -1919706 -1510972 -700013 39364 198446 112667 613895
46899 613895 1438556 944195 -1596168 -4157166 -3983946 -1278825 939267 982895 439032
46890 439032 950843 1271075 -382722 -2723226 -3027314 -1567086 -1189192 -2416264 -2357779
46881 -2357779 408426 3014928 2424573 -37416 -854260 589474 1871693 1603853 790318
46872 790318 228632 -793243 -2547840 -3676913 -3012354 -1297192 -136413 -57782 -345567
46863 -345567 -221418 354097 694886 -8708 -1702112 -3110160 -2976935 -1640281 -662898
46854 -662898 -893868 -1709382 -2266570 -2581297 -2997487 -3368725 -3313145 -2846475 -2361436 -2221758
46844 -2221758 -2493319 -2770619 -2329997 -935166 583985 1146864 756376 344724 357495
46835 357495 356757 132945 241379 1015556 1807683 1723243 627789 -874971 -1947175 -1810018
46825 -1810018 -231899 1923543 3252775 3287785 2895917 2974335 3406731 3604444 3342966
46816 3342966 2665850 1687616 913328 953477 1410046 950189 -763067 -2097411 -1448671
46807 -1448671 455594 1480663 941414 199945 395735 895193 538858 -487946 -874595
46798 -874595 10706 1238483 1411133 259120 -1274812 -2466579 -3611805 -4891942 -5174063
46789 -5174063 -3221812 11542 1824756 1019843 -669046 -1225406 -1037844 -1612460 -2761202
46780 -2761202 -2901481 -1616555 -80620 933315 1730958 2292445 1944067 886414 479005
46771 479005 1321349 2398660 2841859 3143998 3666728 3330062 1259951 -1217343 -1947920
46762 -1947920 -908186 -103246 -506254 -771138 452820 2341836 3092973 2447231 1796559
46753 1796559 2100231 2898999 3488372 3882210 4031102 3119975 795192 -1443652 -1548719
46744 -1548719 257144 1386652 211237 -1826909 -2428938 -1559794 -791246 -354489 1035128
46735 1035128 3387639 4589557 3185771 430616 -1540445 -2372862 -3068199 -3838262 -3896880
46726 -3896880 -3008678 -1861052 -915714 -34223 637572 468667 -592709 -1528102 -1330870
46717 -1330870 -186205 767393 593115 -718862 -2399338 -3540881 -3731263 -3221730 -2507810
46708 -2507810 -1860245 -1354201 -1110239 -1179389 -1299344 -1124666 -706425 -439254 -478430 -478875
46698 -478875 -52853 656174 1018238 580136 -347340 -902860 -613822 15730 141852 -305609
46688 -305609 -622329 -495285 -571271 -1489018 -2759686 -3124615 -1934121 122875 1600319
46679 1600319 1504989 131423 -1215463 -1542766 -1169588 -1058100 -1363741 -1426536 -1175962
46670 -1175962 -1438927 -2434155 -3057691 -2426275 -1189249 -371455 235390 1377779 2702510
46661 2702510 3097289 2287910 945631 -414230 -1502007 -1720443 -908635 -167205 -429749
46652 -429749 -678038 566874 2333667 2152944 79802 -900941 631181 2281442 1683132
46643 1683132 204992 508756 2185636 2602431 1145869 -175795 -112752 407953 441434
46634 441434 309589 207886 -452366 -1565814 -1950550 -1299050 -921932 -1574220 -2085413
46625 -2085413 -1438145 -828446 -1909348 -3825013 -3968850 -1589037 1138086 2044581 1499718
46616 1499718 1171170 1377113 966741 -548656 -2073460 -2446259 -1921182 -1508487 -1513355
46607 -1513355 -1595492 -1875464 -2870471 -4318459 -5194190 -5206877 -5166624 -5329444 -4606776 -2400533
46597 -2400533 -110390 582116 102261 5973 227792 -638004 -2387017 -2822608 -1027093
46588 -1027093 989163 1115641 10926 -370957 102836 -56227 -1216218 -1930496 -1134581
46579 -1134581 318855 782238 -311555 -2074108 -3211032 -3179445 -2462800 -1787247 -1230345
46570 -1230345 -495583 99618 -182820 -1117456 -1424649 -643099 37701 -299063 -710182
46561 -710182 -29762 949552 675681 -479206 -784526 -157560 -359338 -1834623 -2550588
46552 -2550588 -959606 1683565 3231826 3409904 3205274 2676538 1145279 -992848 -2334407
46543 -2334407 -2277957 -1497551 -658955 172454 826837 875362 383764 -113083 -526771 -1150016
46533 -1150016 -1559363 -783350 957889 1865256 791944 -1051828 -1711602 -1118502 -788866
46524 -788866 -1286779 -1583089 -1113054 -829574 -1382295 -1623894 -317655 1508397 1620725
46515 1620725 -155117 -1364399 -18604 3049888 5511548 6049852 4810837 2527455
46507 2527455 358676 -279618 838516 1911547 1124859 -743587 -1231653 303681 1780312
46498 1780312 1478063 380195 334710 1127525 934303 -833445 -2641887 -2885633 -1707757
46489 -1707757 -435581 8317 -329138 -957999 -1502336 -1837988 -2011556 -2102910 -2095996 -1881872
46479 -1881872 -1421354 -877804 -503837 -347281 -183009 92869 139040 -357815 -912521 -602844
46469 -602844 512543 1074037 129702 -1532788 -2645487 -3372500 -4647784 -6006808 -5785635
46460 -5785635 -3697205 -1595447 -1064679 -1632147 -2103279 -2300593 -2477059 -2244357 -1346772
46451 -1346772 -542092 -406105 -80165 1394273 3175417 3578537 2488162 1290206 693498
46442 693498 196655 -392868 -571678 -459714 -912804 -1841388 -1831714 -155554 1951341 2770661
46432 2770661 2011769 589445 -709727 -1590557 -1843807 -1324481 -150085 1406965 2965681
46423 2965681 3879826 3532797 2027505 260650 -744526 -345094 1481999 3760451 4841502
46414 4841502 4122937 3070537 3276982 3894435 2755745 -21958 -1764062 -1154873 -137753
46405 -137753 -646718 -1575806 -919403 756425 1345745 619744 89074 -48 -932269 -2749203
46395 -2749203 -3682796 -2916536 -1765279 -1309272 -853617 152361 535534 -647004 -1962293
46386 -1962293 -1317556 932877 2454126 2173821 1255385 796003 387628 -401608 -707553
46377 -707553 259067 1517083 1414012 18498 -954583 -592697 189018 434009 600628
46368 600628 1288793 1575085 111206 -2497918 -4003678 -3454873 -2469135 -2916808 -4393971
46359 -4393971 -4904735 -3381235 -606447 1945102 3293966 3216485 2197665 1205225 948312
46350 948312 1264107 1521934 1487121 1453195 1721385 2293311 2861502 2849340 1874819 526332
46340 526332 117155 1112190 2378438 2726692 2572428 3013730 3742064 3291744 1394561
46331 1394561 -315348 -435430 451280 829411 275041 -330519 -163648 647429 1352952
46322 1352952 1396444 939614 698516 1133922 1859271 2129670 1793689 1322878 1010102 719744
46312 719744 417434 301952 310929 124635 -165802 18073 927960 2084738 2841713 2892500
46302 2892500 2193241 975835 -116260 -573528 -737341 -1196479 -1477794 -454624 1637238
46293 1637238 2842464 1878584 -200218 -1699468 -2642781 -4067821 -5629516 -5661929 -3748878
46284 -3748878 -1660311 -1003878 -1065923 -91196 1854078 2648304 1000157 -1536071 -2354662
46275 -2354662 -1064589 302773 387472 288020 1388889 2748462 2354327 356086 -948506
46266 -948506 -433295 485955 378649 -124978 126529 672282 280797 -1025421 -2170856
46257 -2170856 -2621498 -2578066 -2149018 -1483778 -1197571 -1524536 -1585389 -686156 231603 -171228
46247 -171228 -1405785 -1752258 -867782 -114132 -200634 -222197 467918 971442 275850 -1119720
46237 -1119720 -1861140 -1301351 199882 1850743 2761553 2350351 967323 -320136 -834429
46228 -834429 -663104 78220 1399710 2616478 2547245 1192006 187676 726770 1908165
46219 1908165 2195568 1752863 2006037 3270832 4237268 3887535 2683539 1512038 550365
46210 550365 -214145 -256632 749959 1944358 2018819 865144 -407348 -1160969 -1928330
46201 -1928330 -3003772 -3411160 -2296724 -617883 -48104 -500536 -339242 858854 1572583
46192 1572583 978933 423525 1008451 1496800 513063 -619485 256816 2264415 2364657
46183 2364657 49298 -1789710 -1374423 -576848 -1428505 -2492152 -987214 2843183 5777329
46174 5777329 5511144 2755288 -257977 -1876888 -1773591 -847094 -460973 -1005687 -1401603
46165 -1401603 -660927 561572 848301 2370 -828439 -738698 131499 1187140 1934765
46156 1934765 2037936 1484824 675198 23153 -252162 132390 1174660 1720581 188668
46147 188668 -3074723 -5410621 -4927995 -2835399 -1434625 -1008469 -369015 588519 960010
46138 960010 784223 790289 643407 -375110 -1265667 -279558 2054618 3359232 3057819
46129 3057819 2970289 3776062 3755882 2162504 1037104 1938843 3299315 3107597 2106271
46120 2106271 1936343 1957769 751686 -528046 516627 3335801 4628364 2937208 386426
46111 386426 -730577 -726667 -1006902 -1830143 -2758197 -3749736 -4553527 -4214796 -2415862 -422071
46101 -422071 419751 402186 637445 1179464 1146020 372525 -210411 105919 935783 1363971
46091 1363971 839324 -480743 -1748802 -1849785 -432244 1401512 2046181 1245927 433596
46082 433596 893427 2146254 2730769 2157928 1261411 749426 399246 -55933 -224532
46073 -224532 115533 305974 -160324 -552154 -27302 615861 -151817 -1960683 -2553254
46064 -2553254 -979815 824673 670975 -1020388 -2292644 -2501266 -2491998 -2641026 -2478486
46055 -2478486 -2022118 -1803490 -1517556 -265013 1543963 2089663 613916 -1311885 -1847467
46046 -1847467 -1149426 -580048 -503526 -108266 939533 1855709 1858064 1077139 51276 -1112897
46036 -1112897 -2586640 -3971275 -4114559 -2241764 685109 2301936 1140775 -1591351
46028 -1591351 -3208226 -2514173 -839218 30783 36208 347915 1389200 2322158 2374941
46019 2374941 1830749 1429386 1301512 921007 -31098 -1123346 -1618870 -1264313 -391201
46010 -391201 644611 1653347 2136156 1290397 -898908 -3001868 -3437761 -2330988 -1230946
46001 -1230946 -952537 -681868 413471 1648431 1668922 293356 -1255376 -1666239 -476506
45992 -476506 1961439 4637921 6087368 5296309 2806046 509565 -5018 1196844 2758380
45983 2758380 3452562 3055035 2094029 1186488 678050 552617 405033 -286192 -1498141
45974 -1498141 -2408948 -2260138 -1395849 -819460 -680485 -75729 1277814 2156897 1448043
45965 1448043 -128030 -993928 -876700 -792332 -1273407 -1967941 -2760780 -3745547 -4079423
45956 -4079423 -2585493 134393 1894649 1867732 1623015 2335466 2781118 1568706 -245847
45947 -245847 -751184 -266608 -597842 -1796971 -2041414 -787736 221902 -256491 -1069242
45938 -1069242 -579915 907137 1819476 1508243 642284 -36532 -332474 -222699 282899
45929 282899 885741 1125179 833716 235285 -336223 -636459 -540183 -36923 812920 1851960
45919 1851960 2629991 2483818 1281872 18910 61717 1591220 3268266 3745403 3132311
45910 3132311 2593629 2778101 3140050 2796625 1609955 187864 -919227 -1628848 -1999921
45901 -1999921 -2027397 -1995879 -2463478 -3317421 -3362444 -1814441 80344 225196 -1379955
45892 -1379955 -2302206 -894633 1501600 2521671 1697138 157564 -1447873 -3045906
45884 -3045906 -3909006 -3270441 -1985050 -1790292 -2800683 -3335405 -2447094 -1061664 -242294
45875 -242294 159799 564064 758888 645536 708712 1054115 1041686 504584 224921 530242
45865 530242 629053 225105 564056 2598341 5009147 5538167 3903165 2076395 1764607
45856 1764607 2730451 3689869 3856134 3166707 1642606 -721163 -3288745 -4476784 -2920939
45847 -2920939 650705 3373925 2971114 216253 -2223188 -3014426 -2952430 -2795356 -2105885
45838 -2105885 -687368 466586 515892 -106368 -580655 -563536 286207 2157405 3860230
45829 3860230 3507344 1348958 51267 913626 1875466 1040658 -3412 987132 2535590
45820 2535590 1310015 -2408364 -4701045 -3622475 -1491918 -738655 -550887 693438
45812 693438 2082044 1472596 -1155489 -3627893 -4297185 -3410394 -2099272 -1145303 -672713
45803 -672713 -335886 223697 868175 1119864 891997 648215 770640 1228965 1893291 2695032
45793 2695032 3507258 4265699 4956343 5081954 3808406 1431608 -137083 353382 1420199
45784 1420199 678426 -1745110 -3523423 -3565677 -2933735 -2252647 -696090 1714539 3156535
45775 3156535 2625182 1602825 1721577 2422184 2444444 2151322 2616008 3470336 3413231 2214626
45765 2214626 757084 -387796 -1165052 -1297784 -468065 1081233 2826236 4306350 4792307
45756 4792307 3690194 1862127 1156134 1746834 1493789 -896033 -3765725 -5092048 -5375596
45747 -5375596 -5885509 -5716050 -3357997 -116750 1104945 42060 -876924 -677011 -1012883
45738 -1012883 -2679070 -3851983 -2985654 -1136993 -92642 -95247 -705649 -2110426 -4048634
45729 -4048634 -4906744 -3555419 -1173234 131027 -214592 -1225834 -1939676 -1859452 -636283
45720 -636283 1396651 2880067 2786807 1783942 1278815 1504121 1536491 882071 1650
45711 1650 -599507 -839533 -617462 205539 1170833 1263516 -2818 -1836204 -2814208 -2264297
45701 -2264297 -898819 -29431 -198764 -800990 -1104064 -1185255 -1471742 -1827834 -1767387 -1247279
45691 -1247279 -521890 445118 1580518 2159599 1779816 1410290 1994222 2421530 924062
45682 924062 -1544784 -1862105 615035 2617467 1694675 -162582 49275 1458381 1009697
45673 1009697 -1280293 -2398200 -1403187 -769579 -1924798 -2798059 -1454928 553766 724178
45664 724178 -463335 -672313 418979 1024865 585368 585748 1701497 2417567 1543701 412847
45654 412847 1083544 3281452 4671155 3894253 1986627 624457 125550 -236051 -757490
45645 -757490 -1039114 -892731 -661359 -514823 -62406 1004924 2267979 2932428 2624063
45636 2624063 1546809 70100 -1412554 -2269773 -1824419 -132952 1639278 2109168 1110830
45627 1110830 -72823 -213311 376792 375825 -614250 -1436816 -1027136 29025 311135 -494570
45617 -494570 -1343919 -1379626 -868722 -527489 -634341 -939196 -878376 72766 1570518 2099456
45607 2099456 534143 -1988836 -3032403 -2001054 -927708 -1452573 -2461012 -1928352
45599 -1928352 48994 1649673 2081028 2250016 2839699 3252532 2739486 1451453 13583
45590 13583 -1141480 -1743889 -1620154 -890130 108139 1022633 1385733 836760 -43833 101903
45580 101903 1477094 2144272 346396 -2726041 -4135335 -2954894 -1109680 -466741 -936418
45571 -936418 -1727181 -2491896 -2559441 -1003810 1452679 2416731 1049875 -343134 446591
45562 446591 2275967 2659134 1718028 1574752 2480725 2408644 739820 -303574 1033984
45553 1033984 3303366 3829959 2134296 15662 -929491 -620773 148491 544130 105689
45544 105689 -800436 -1020953 280850 2633163 4748629 5764871 5617627 4576975 3050912
45535 3050912 1703086 1163816 1520428 2347749 3162940 3654183 3719521 3609291 3775066
45526 3775066 4185449 4061258 2812437 1057344 84717 297639 800294 690023 195472
45517 195472 158630 737306 1113764 520602 -724314 -1432715 -860491 371451 1032459
45508 1032459 963036 1359567 2935510 4476046 4249253 2589979 1756527 2914820 4563604
45499 4563604 4754309 3760848 3279209 3668071 3528686 1925042 -401252 -2253013 -3127769
45490 -3127769 -2754302 -825422 1948074 3585227 2829312 850840 -111315 539457 1391069
45481 1391069 1050839 -556512 -2744879 -4655655 -5137268 -3365022 -245397 1799609
45473 1799609 1353681 -303236 -898200 -76766 425126 -655484 -2510890 -3538476 -3285528
45464 -3285528 -2463070 -1622891 -725278 105103 301357 -333534 -1178085 -1678351 -2209740
45455 -2209740 -3330486 -4453827 -4255595 -2587135 -1035561 -1017462 -2032655 -2542555 -2029294
45446 -2029294 -1293953 -1058123 -1257965 -1623464 -1988845 -1958026 -1178440 -120492 294840
45437 294840 58490 111895 683138 648089 -768984 -2585376 -3279578 -2750681 -2034023 -1509842
45427 -1509842 -518042 1327896 3390334 4668001 4546082 2943649 458263 -1604796
45419 -1604796 -2128792 -1391598 -884189 -1719593 -3550096 -5062583 -5137973 -3588754 -1292560
45410 -1292560 357187 612595 33010 -377473 -487666 -877320 -1568536 -1854287 -1513878
45401 -1513878 -1281010 -1748322 -2568880 -3125054 -3250230 -2855690 -1631374 237855 1707773
45392 1707773 1979665 1515434 1235373 1104660 315483 -1337251 -3027913 -3849153 -3671874
45383 -3671874 -3079681 -2778790 -2909178 -2709601 -1288120 946733 2286755 1803871 764897
45374 764897 1017348 2485023 3459157 3087670 2210702 1679086 1222909 387953 -589203
45365 -589203 -1404396 -2202005 -2878194 -2754219 -1614482 -356944 19007 -515591 -1405827
45356 -1405827 -2244703 -2643356 -2184179 -1079707 -103137 613240 1691720 2860421 2583522
45347 2583522 405103 -1757331 -2219215 -2136713 -3454169 -5272789 -4931516 -2406680 -731775
45338 -731775 -1477231 -2511459 -1490338 708574 1733503 1214403 568053 484428 439718
45329 439718 27811 -790059 -2213688 -3978839 -4758503 -3637742 -1791189 -1295989 -2551379
45320 -2551379 -4158649 -5034828 -5270556 -5125845 -4614421 -4034529 -3599346 -2648743 -606994
45311 -606994 1434923 1754032 690630 488030 1995310 3336116 2654697 499289 -1595506
45302 -1595506 -3291719 -4727464 -4930372 -2897559 288417 2228311 2067882 1192452 1027124
45293 1027124 1499424 1976853 2436557 2949493 2851152 1421891 -801978 -2186186 -1699035
45284 -1699035 -45380 1240125 1607115 1839228 2506522 2823279 1730398 -358122 -1873644
45275 -1873644 -2048915 -1556257 -1149447 -797404 -468089 -597573 -1186128 -1486162 -1293717
45266 -1293717 -1489916 -2438793 -2974763 -2182030 -1160284 -1468319 -2545273 -2480881 -1002991
45257 -1002991 216416 293694 241549 820798 1049309 -152157 -2122436 -3367923 -3390675
45248 -3390675 -2598215 -1191988 706509 2306595 2670667 1901798 995803 529225 109028
45239 109028 -870717 -2364880 -3564085 -3463212 -1821883 244347 1127494 546855 -60524
45230 -60524 535871 1737571 2224083 2011182 2152641 2666779 2235913 284267 -1905743
45221 -1905743 -2791382 -2334943 -1484732 -764360 -267891 -338848 -1088284 -1558101 -557087
45212 -557087 1596141 3124407 2771143 955430 -1115930 -2535678 -2686179 -1308424 729878
45203 729878 1690518 935405 -43043 427695 1801503 2071494 560277 -1421492 -2649829
45194 -2649829 -3272316 -3713308 -3676983 -2894671 -1745374 -420295 1441569 3413589 3727295
45185 3727295 1439266 -1554955 -2250534 -120515 2409170 3142143 2459086 2130319 2948097
45176 2948097 4231578 4935794 4517883 3097635 1386345 340905 486945 1519060 2581597
45167 2581597 2848447 2009052 564956 -437120 -431495 -86351 -545898 -1899407 -2950048
45158 -2950048 -2615809 -1025136 908443 2386589 2936433 2358165 1000336 -227342 -565174
45149 -565174 -7561 947312 1803516 2131472 1631410 586527 -101445 138755 756292
45140 756292 736515 -65439 -760165 -595168 185298 776258 728936 228866 -297440 -643298
45130 -643298 -984640 -1646575 -2576269 -3095161 -2529256 -1186670 -226562 -192852 -192173 720691
45120 720691 1692133 826309 -1967838 -4206575 -3798288 -1728981 -516099 -826724 -1370676
45111 -1370676 -1698324 -2851673 -4840682 -5709739 -4296995 -2129735 -1051800 -479502 1089041
45102 1089041 3010224 3264608 1798828 747474 1182059 1761301 1201671 286808 490421
45093 490421 1899983 3450070 4311363 4279052 3509458 2504663 1788432 1210443 191295
45084 191295 -1108503 -1643566 -794777 914703 2580493 3531917 3113792 1076820 -1382208
45075 -1382208 -2156693 -525386 1932990 3235819 2902882 1538390 -311479 -2096436
45067 -2096436 -3056705 -2980712 -2457677 -1783023 -581336 819829 902180 -987350 -3085259
45058 -3085259 -3109925 -1121921 783829 1206085 651161 321799 831460 2010162 3081689
45049 3081689 3137812 2142579 1251410 1523823 2652465 3521449 3533157 2801746 1676439
45040 1676439 774455 779281 1395324 1243672 -298358 -1945320 -2225309 -1525795 -1177171
45031 -1177171 -1263967 -836236 218493 1056659 1348242 1443980 1309908 677022 43379 142938
45021 142938 590460 426258 -201703 -375960 -250621 -912389 -2353339 -3208059 -2758718
45012 -2758718 -1739681 -921270 -342575 -163732 -727248 -1408252 -933952 661678 1820615
45003 1820615 1658664 946538 451402 -87594 -649517 -254416 1363286 2768710 2633878
44994 2633878 1425990 301958 -530594 -1238683 -1264188 -181220 1069854 1150182 174481
44985 174481 -437963 284070 1997609 3598811 4060458 3155544 1856617 1516180 2249953
44976 2249953 2774682 2177460 952773 -145612 -1159337 -2101877 -2197596 -968583 767672
44967 767672 1963996 2608496 3005204 2768467 1754983 1123782 1946838 3262113 3041123
44958 3041123 919933 -1406703 -2476651 -2446088 -2056730 -1461592 -555767 372914 887257
44949 887257 904668 637751 243044 -316410 -1099589 -1830427 -1847483 -853736 307811 333663
44939 333663 -871839 -1938180 -1735889 -568608 652902 1494480 1808279 1487610 1015327
44930 1015327 1197782 1672195 888191 -1528827 -3696888 -3923588 -2905544 -2023322 -831295
44921 -831295 1677678 4275055 4438615 1879916 -1091904 -2809626 -3779148 -4712132 -5110556
44912 -5110556 -4534039 -3600541 -2885558 -2110256 -1088822 -280566 184294 819743 1542338
44903 1542338 1379804 167571 -646305 176901 1946640 3020599 2750116 1672382 485781
44894 485781 -364482 -677221 -809861 -1484171 -2664415 -3233694 -2465033 -1199263 -725970
44885 -725970 -954879 -638245 751480 2214464 2421518 1208269 -272164 -636360 520829
44876 520829 2343135 3611851 3884139 3599070 3221269 2729227 1996986 1213412 702184
44867 702184 599763 836779 1229695 1606650 2069072 2936819 4048343 4426799 3366602
44858 3366602 1731455 1244524 2223159 2836737 1209048 -2162719 -4699767 -4462798 -2275867
44849 -2275867 -904814 -2006537 -4124790 -4268238 -1488583 1968861 3446349 2781432
44841 2781432 1646052 1032497 727151 570376 629389 397631 -623447 -1628050 -1279733
44832 -1279733 244864 1492291 1988351 2578931 3426900 3590519 3028866 3037636 3889155
44823 3889155 3953826 2293377 380109 -143693 114094 -319790 -1267894 -1481852 -775170
44814 -775170 109741 1015764 2105370 2698810 2070992 1025594 1031199 1963991 2253407 1254459
44804 1254459 24747 -409139 -250380 -90507 49178 420591 1016821 1611695 1868765
44795 1868765 1466709 609803 137377 489725 945853 694252 246978 752227 2151203
44786 2151203 3126555 2806859 1500459 -154417 -1650169 -2276675 -1604100 -498651 -437360
44777 -437360 -1472456 -2079068 -1504316 -987615 -1770534 -2969054 -2683424 -684459 1271450
44768 1271450 1720355 1007172 344511 301531 756020 1688668 3180758 4738367 5420756
44759 5420756 4964796 4234034 4046264 3956741 2922221 996999 -504633 -679270 -28979
44750 -28979 564983 1040555 1696492 2195481 1909623 999919 349750 438323 903772 1291789
44740 1291789 1676945 2262432 2692517 2220769 697567 -935657 -1651502 -1774574 -2572270
44731 -2572270 -4068391 -4411638 -2488071 -117230 101296 -1485768 -2158935 -931488 434934
44722 434934 879151 1675832 3428498 4171352 2485768 283448 78524 1259606 1678425
44713 1678425 1428948 2054049 3013269 2206654 -253331 -1821888 -1207231 415772 2021334
44704 2021334 3790540 5151932 4602056 2378665 800992 893966 991525 -161966 -1234254
44695 -1234254 -707778 570388 934787 385678 -95125 -323777 -476605 -157801 589807
44686 589807 550970 -872619 -2294852 -2337004 -1873376 -2531438 -3864914 -3972284 -2462926
44677 -2462926 -953182 -678130 -1138111 -1240371 -621390 314454 876322 627089 -20503
44668 -20503 -86951 584961 857669 -90343 -1412282 -1753279 -1126215 -682821 -1160150 -2410926
44658 -2410926 -3854835 -4551693 -3592164 -1386812 241358 303106 75914 1074717 2612363
44649 2612363 2984113 2219592 1750522 1884704 1636621 834848 360253 271339 -292108 -1106301
44639 -1106301 -765309 927398 2350494 2498125 2222125 2260356 1873598 617115 -174996
44630 -174996 797529 2655684 3488488 2786528 1398564 -98983 -1547261 -2403106 -2313003
44621 -2313003 -2027303 -2277891 -2206362 -593008 1650007 2242908 1003010 402593 1837166
44612 1837166 3381494 2766889 908445 357219 1308265 1671725 826959 594113 1842622
44603 1842622 2679818 1524091 -28202 474592 2436387 3056564 1555852 102228 316542
44594 316542 1124175 943255 187882 267125 1213024 1681624 879659 -513603 -1269502 -958576
44584 -958576 -398813 -744586 -1903810 -2328012 -1123151 263767 -119766 -1597700 -1492782
44575 -1492782 993466 3643236 4528752 4258638 3943496 3193801 1703469 772071 1256905
44566 1256905 1703630 692521 -435516 391418 2438815 3280587 2575141 1997092 1967537
44557 1967537 1302176 -49828 -740717 -666803 -1166956 -2193481 -1984416 -285379 671872
44548 671872 -526140 -2444883 -3238890 -3066875 -2828901 -2412991 -1626656 -1241198 -1638764
44539 -1638764 -1744953 -622547 1067834 2318514 3186728 3802026 3315515 1220422 -1327999
44530 -1327999 -2748731 -2684944 -1540264 365106 2175621 2525471 1496026 1123968 2503166
44521 2503166 3859956 3256364 1737508 1564542 2435395 2057790 10214 -1564014 -1302425
44512 -1302425 -446868 -716778 -1993296 -2809032 -2102757 -120361 1646402 1451603 -914422
44503 -914422 -3527347 -4403392 -3740125 -3055428 -2782210 -2242452 -1500365 -1368977 -1660831
44494 -1660831 -1296898 -336612 -83065 -774743 -950605 220908 1577081 1744086 887092
44485 887092 -187986 -1347500 -2488337 -2741156 -1599886 -111987 279229 -343546 -662460
44476 -662460 -84377 569513 386011 -326042 -316772 1205765 3562554 5074219 4686085
44467 4686085 2959014 1197794 -23908 -918254 -1522304 -1661830 -1695071 -2180790 -2762274
44458 -2762274 -2527657 -1648310 -1387194 -2043773 -2175461 -631041 1716900 3206057 3514496
44449 3514496 3551103 3795800 3741871 2741330 727593 -1658031 -3246019 -3139828 -1817594
44440 -1817594 -879536 -1201062 -1984333 -2194497 -2114089 -2598644 -3466532 -3683766 -2765373 -1085951
44430 -1085951 796892 2210595 2245708 727879 -955904 -1204189 -273408 186120 -375570
44421 -375570 -752439 -102642 690437 551687 34606 561843 2405104 4362781 5210719
44412 5210719 4763012 3660618 2731982 2488255 2734049 2716509 2091777 1644586 2481084
44403 2481084 4405846 5664388 4710574 1982413 -511813 -1345040 -990974 -808773 -1101332
44394 -1101332 -770125 1025985 3444269 4691049 3992945 2352165 1356739 1697611 2918782
44385 2918782 4057830 4169958 2684513 -70724 -2701916 -3654396 -2548390 -425583
44377 -425583 1352025 2118567 1821214 586026 -1102783 -2205553 -1940644 -871689 -494721
44368 -494721 -1439683 -2613776 -2553147 -1227253 18153 99092 -732575 -1385737 -1082002
44359 -1082002 1363 951882 996562 330981 -72157 348159 1054822 1203180 700293
44350 700293 -5782 -741531 -1474022 -1709730 -1005243 -12075 -17533 -1308437 -2885110 -3890124
44340 -3890124 -4253535 -3744503 -1808133 906096 2178807 658543 -2152039 -3648749
44332 -3648749 -3264382 -2456382 -1994032 -1002497 1047872 2979756 3384023 2530999 1944392
44323 1944392 2521695 3713952 4317921 3648810 2091116 727210 285913 473103 635781
44314 635781 863732 1679640 2618518 2171121 -247569 -3045918 -4025669 -2801887 -878853
44305 -878853 354525 801856 976219 1181615 1648013 2619939 3791348 4263690 3661019
44296 3661019 2829907 2765699 3208276 3146149 2528660 2375496 2912025 2742312 755017 -1924264
44286 -1924264 -3108955 -2401767 -1560758 -1849088 -2321389 -1453537 498654 1794436 1394620
44277 1394620 -67078 -1266620 -1349997 -275598 1205698 1907243 1207356 -240914 -1257795
44268 -1257795 -1432095 -1102269 -351410 1057897 2797026 4008157 4403027 4451200 4333890
44259 4333890 3719505 2820235 2478112 2677325 2220354 724532 -287599 491027 1981297
44250 1981297 2188196 1055281 70116 -469375 -1652148 -3347685 -3660520 -1797361 439707
44241 439707 1227254 1170864 1662551 2132124 923770 -1744751 -3722018 -3788021 -2876016
44232 -2876016 -2236518 -1941876 -1661115 -1500876 -1333425 -402987 1517785 3350927 3910404
44223 3910404 3319219 2550971 2082968 1677453 1048025 93247 -1142057 -2166231 -2166803 -1074787
44213 -1074787 -16552 54954 -266800 256550 1557329 2276205 1708335 734549 562802
44204 562802 1290670 2029029 1961198 1092101 294396 566320 1847101 2798249 2321969 975749
44194 975749 124164 83993 201132 465871 1569179 3246814 4142343 3788182 3217028
44185 3217028 2976852 2209567 747656 386184 2315816 4566064 4175534 1318269 -873426
44176 -873426 -477397 1249601 2290929 2341834 2218418 2350166 2702399 3099872 2972917
44167 2972917 1765316 79694 -668694 -215366 167778 -184011 -268954 538637 884764
44158 884764 -621669 -2979448 -4065003 -3622837 -3152176 -3206108 -2781652 -1500746 -509236
44149 -509236 -611375 -1006157 -629697 413008 1457913 2261012 2651977 2228307 1214136
44140 1214136 702325 1157682 1549447 937582 28950 -43814 327655 9263 -724737 -623710
44130 -623710 119399 -157168 -1800113 -2894680 -1967454 -52709 1070777 1311596 1508390
44121 1508390 1435488 423876 -702188 -372218 1093146 1538580 104730 -1403305 -1059344
44112 -1059344 691152 2095581 2503286 2464223 2184454 1276243 -129741 -1135826 -1108579
44103 -1108579 -369410 165442 -301539 -1818161 -3352174 -3482442 -1928162 35549 1208056
44094 1208056 1881884 2852652 3731999 3522966 2512858 2106494 2691023 3074284 2406403
44085 2406403 1363021 873510 890676 1138168 1888188 2993804 3199485 1755964 48325
44076 48325 139955 1967268 3435815 3348167 2789364 3148960 4061500 4232817 3492057 2904990
44066 2904990 3086010 3350225 2703280 1066434 -748054 -1930556 -2294050 -2209717 -2161698
44057 -2161698 -2299201 -2294239 -1707099 -590198 402114 712597 614923 951780 2079616 3364348
44047 3364348 3886549 3397388 2372903 1379843 682652 273216 -48613 -489539 -898114
44038 -898114 -848196 -417152 -448210 -1406141 -2368964 -2112035 -1011307 -652378 -1355136 -1419678
44028 -1419678 458462 3134196 4408829 3744467 2507112 2009657 2414893 3274685 4049648
44019 4049648 4164861 3483602 2681001 2358721 2036776 987306 -265117 -611417 -390498
44010 -390498 -1077829 -2604404 -2790525 -426326 2622900 3768730 2979808 2120794 1931285
44001 1931285 1579596 793850 357194 319193 -326426 -1577501 -1818414 -258330 1574561
43992 1574561 2079238 2012198 3001834 4576661 4724107 3129253 1762453 1900373 2489261
43983 2489261 2328307 2197972 3390614 5192695 5467581 3399511 359866 -1810090 -2281995
43974 -2281995 -1172644 766814 2223384 2172385 1051057 315135 583071 1038051 910610
43965 910610 549407 475778 316391 -463950 -1394168 -1489992 -589761 596697 1526508 2139191
43955 2139191 2310456 1839876 1073402 825128 1392668 2082790 1992015 1048969 118524 139060
43945 139060 1157489 2208199 2308211 1573962 1023544 1250766 1863238 2421730 3139394
43936 3139394 4061885 4298996 3040295 938559 -511634 -766316 -450257 14101 837517
43927 837517 1844011 2209140 1666574 1079584 1301474 2136483 2828726 2932677 2342851
43918 2342851 1157493 -57469 -516980 -166115 226925 275178 488623 1107300 1343187
43909 1343187 627720 -131897 376516 1939744 3009438 2695941 1705309 1318726 2117026
43900 2117026 3623584 4607191 3955589 1930018 293429 415024 1559178 2049024 1831205
43891 1831205 2453573 4319835 5565162 4568512 2414386 1593126 2862881 4651958 5305753
43882 5305753 4651002 3219498 1205848 -1063084 -2445708 -1881155 118772 1786876
43874 1786876 2206873 2359896 3432635 4660713 4051284 1387496 -757388 68201 3045578
43865 3045578 5096919 4719562 3361424 2790197 2669961 1724124 154824 -582491 -22340
43856 -22340 701635 568811 -205650 -1075520 -2062175 -3070275 -3209203 -1851829 6461
43847 6461 524608 -745581 -2228086 -2250058 -970928 97972 78345 -422809 -390333 266835
43837 266835 756033 493964 -190709 -426934 352236 1943575 3502009 4019999 2977272
43828 2977272 893359 -856469 -1235182 -657336 -468847 -1144826 -1602814 -775850 749123
43819 749123 1520596 1234758 793391 460074 -573903 -2323270 -3184296 -2038467 -59122
43810 -59122 920446 994236 1573055 2791353 3404467 3150128 3235431 4106019 4618359 4153256
43800 4153256 3740658 3988920 3601488 1530047 -732978 -910115 832823 2318863 2519480
43791 2519480 2325702 2332261 1889138 745196 -99385 122620 886685 1383666 1439405 944406
43781 944406 -391937 -2076001 -2827444 -2351896 -2028193 -2925313 -4153808 -4235660 -3209569
43772 -3209569 -2194640 -1619617 -1186791 -1005947 -1332919 -1521834 -721226 466377 486393
43763 486393 -848702 -1948863 -1713095 -835241 -261934 279766 1228223 1827096 1214086
43754 1214086 203105 475688 2181835 3735000 4058183 3653191 3123059 2144600 788450
43745 788450 500174 2248893 4462102 4564016 2397810 382021 77412 453741 268205
43736 268205 240425 1361218 2535443 1994429 293237 -297937 797796 1814231 1633393
43727 1633393 1313480 1913951 2702640 2646949 2152691 2054859 2129300 1890181 1742875 2001537
43717 2001537 1843735 785747 251464 1881505 4887535 6892743 7012984 6313465 5525383
43708 5525383 4328323 2943276 2387757 2692686 2670982 2008228 1823851 2467826 2581424
43699 2581424 1398172 319129 842576 2289873 3098654 3258950 3783325 4543139 4428726
43690 4428726 3346245 2423079 2221659 2107357 1510957 641172 -260405 -1335279 -2464767
43681 -2464767 -3032046 -2694544 -1886555 -1370927 -1639640 -2637633 -3610380 -3491952 -2113424
43672 -2113424 -757233 -658438 -1154697 -407210 1963168 4116918 4321501 3062823 2128028
43663 2128028 2277377 2716787 2600356 2151865 2045806 2219558 1871695 672304 -547698
43654 -547698 -829195 -536404 -907979 -2056730 -2547325 -1625622 -732149 -1528653 -3231690
43645 -3231690 -3606254 -2287912 -1198571 -1420121 -1593314 -269713 1808135 3040729 3324123
43636 3324123 3586300 3841313 3325889 2162462 1319731 967857 292418 -874742 -1582856
43627 -1582856 -1394603 -1310565 -2264703 -3542987 -3689762 -2539201 -1317264 -820047 -527026
43618 -527026 156069 713479 408769 -168969 396533 2221437 3609686 3224625 1841735
43609 1841735 1054844 1000091 620554 -219415 -384175 689936 2210850 3433839 4498208
43600 4498208 5316019 4993829 3269135 1400964 610458 588514 561740 800303 1782645
43591 1782645 2787586 2850942 2451765 2647215 3080523 2608240 1540942 1330403 2124569
43582 2124569 2659062 2742346 3681231 5658864 6861267 6269355 5373858 5726539 6484627
43573 6484627 6072859 4916608 4615811 5330858 5886230 5853699 5709427 5375807 4456581
43564 4456581 3645424 3966587 4622865 3606718 854929 -1093470 -348524 2046665 4014975
43555 4014975 5113665 6004693 6446799 5507199 3367237 1462010 741151 764845 643997
43546 643997 129119 -392685 -441664 149415 1011143 1416211 1035087 461062 577783 1399248
43536 1399248 1950292 1432732 227652 -430781 342304 2277418 4242558 5269131 5323909
43527 5323909 5131054 5350987 6048998 6878138 7549081 8076248 8691659 9488644 10094177
43518 10094177 10024185 9717962 10777242 14301293 19050573 22341964 23171048 23480965 25659223
43509 25659223 29656657 33576060 36398860 38703149 40815515 41745317 40517716 37577888
43501 37577888 34131383 30665377 26846138 22591878 18546520 15396902 13100939 11010513
43493 11010513 8725214 6691927 5736647 5931217 6301826 6043801 5677320 6298837 7798379
43484 7798379 8717596 8176848 7147485 7172805 8279923 8882255 7689863 5221080 3328015
43475 3328015 3429970 5219150 7007765 7357616 6283568 4755390 3405613 2316796
43467 2316796 1789498 2262164 3271188 3567943 2799917 2097315 2328578 2850893 2950447
43458 2950447 3340106 4689957 5622921 4303876 1722438 1048066 3311871 5955344 6576689
43449 6576689 5991274 6082345 6483262 5572425 3645581 2682077 3238004 3720374 2948210
43440 2948210 1637020 927102 971565 1505166 2463123 3426968 3622180 3068597 2688368
43431 2688368 2801484 2731974 2462110 3175820 5119423 6375250 5346579 3416746 3245558
43422 3245558 4962719 6068971 5128906 3611295 3478068 4539555 5169457 4599442 3508368
43413 3508368 2904452 3156175 3740029 3511453 1743758 -699064 -1836691 -713509 1497090
43404 1497090 2985536 3209608 2692192 1710777 248071 -1135376 -1493671 -596402 924345
43395 924345 2473327 3807346 4576883 4463672 3855217 3485129 3192395 1963798 -361430
43386 -361430 -2309795 -2422475 -1105314 -32870 -34180 -375938 -61190 930857 1923129
43377 1923129 2538787 3035399 3779765 4656868 5118161 4814859 4033957 3311688 2741323
43368 2741323 2050696 1336600 1148475 1634226 2196216 2386065 2552324 3032917 3304210
43359 3304210 2801796 2172142 2609561 4043086 5115579 5114913 4787825 4869288 4983838 4716358
43349 4716358 4702175 5582089 6603512 6468880 5209068 4111012 4024956 4796593 6115888
43340 6115888 7667481 8515973 7810612 6423325 6442322 8358317 10068961 9661166 8045004
43331 8045004 7547744 8754922 10253482 10987562 11188236 11041900 10151216 8774640 8158841
43322 8158841 8865421 9843661 9986054 9701524 10046431 11080193 12133710 13097006 14217149
43313 14217149 14966213 14490360 13272326 13032843 14462914 16069846 16009695 14362546 12780222
43304 12780222 12347810 12705810 13128845 13498724 13864386 13706852 12346604 10052304 8223583
43295 8223583 8097022 9373727 10526317 10576559 10094437 10038134 10163418 9582733 8753742
43286 8753742 9486006 12301989 15053867 15479156 14325117 14244533 15927486 17403019 17613477
43277 17613477 18493169 22003717 26693534 29369780 29536791 29912025 32395501 35616890
43269 35616890 37281519 37258270 37096439 37639918 38492957 39073415 38747132 36386728 31403424
43260 31403424 25303098 20833555 19167665 18949542 18458168 17583205 17066489 16917660 16639799
43251 16639799 16320829 16344335 16400865 15949964 15493326 16125009 17632474 18283772 17090424
43242 17090424 15273986 14635893 15208668 15543222 14850975 13670220 12516074 11162712 9710555
43233 9710555 9308749 10885912 13564432 15187570 14509010 12451576 11121333 11747470 13536613
43224 13536613 14446569 13232441 10801144 9297198 9796388 11328828 12328665 12406338 12186300
43215 12186300 11973836 11438668 10443790 9414799 8852531 9000278 9855185 10919446 11195333
43206 11195333 10278928 9324906 9893892 11784937 13167310 13133607 12812318 13303078 13877051
43197 13877051 13443110 12711088 13142971 14167190 13381223 9995362 6523897 5971319 8154949
43188 8154949 10019626 9433663 7603807 7313272 9446117 12067024 12849924 11543337 9598794
43179 9598794 8127037 7169997 6619094 6651907 7147749 7721989 8530684 9953638 11293728
43170 11293728 11208704 9935359 9443588 10405870 10710607 8519492 5298163 3835934 4471191
43161 4471191 5565975 6694994 8546925 10180559 9629616 7571509 7207369 9461688
43153 9461688 11213138 9823483 6827253 5217889 5356433 5823835 6396746 7574591 8537309
43144 8537309 8256911 7738640 8575587 9921181 9521951 7464624 6302742 7353536 9215237
43135 9215237 10220403 10167803 9310655 7861785 7022204 8274515 10856192 12006179 10648150
43126 10648150 8810023 8343386 8407559 7723412 7225227 8327639 10128122 10791442 10734837
43117 10734837 11875820 14138685 15282360 14407899 13325583 13780151 15290350 16670533
43109 16670533 17947964 19456063 20360094 19679489 18014135 16693591 15604377 13434500
43101 13434500 10079027 7271975 6383653 6903849 7815919 9225011 11423617 13244083
43093 13244083 12979665 10761222 8526559 7501182 7152097 6981938 7741574 9912156 12307317
43084 12307317 13486237 13661819 13923520 14368619 14447717 14483489 15131901 15680503 14702691
43075 14702691 12439065 10825455 10934456 11989525 13163425 14626402 16356380 17709191
43067 17709191 18901323 21140365 24296765 26211506 25680724 24613095 25666652 29012768
43059 29012768 33050756 37110363 41581495 46366161 51289476 57436622 66081733 76809364
43051 76809364 88813525 103732226 125015871 154656590 192610327 238514628 289861378
43044 289861378 337291946 365997395 366070236 341084701 304426579 267957474 235903475
43037 235903475 207871456 183603401 163562975 147526669 134746786 124755000 116854057
43030 116854057 109518746 101443388 92880630 85060992 78462814 72406969 66215404 59907261
43022 59907261 53602868 47069553 40392949 34581023 30776032 28962251 28016551 26997679
43014 26997679 25748381 24125559 21481444 17567344 13483091 10906101 10427041 11242849
43006 11242849 12393905 13551521 14479254 14581804 13589492 12280895 11941191 13174957 15513866
42997 15513866 17999037 19926085 21376467 23471694 27821016 34977575 43240893 49487309
42989 49487309 51600172 50029687 46937904 44154408 42176410 40722949 39580879 38801330
42981 38801330 38536218 38936874 39964524 41183030 42113309 42997175 44731582 47626396 50696401
42972 50696401 52844941 54390359 56521537 59362246 61629337 62438685 62443367 62660319 62978768
42963 62978768 62470809 60559771 57279380 52977576 48404973 44503872 41403510 38209925
42955 38209925 34550008 31619712 30624916 30749161 30027169 28003235 26068230 25036088
42947 25036088 23843159 21255823 17781327 15078710 14082050 14341246 14827633 14918162 14795032
42938 14795032 15049279 15670854 15608392 13926565 11290230 9500599 9499140 10623859 11859360
42929 11859360 12792397 13105025 12306421 10633609 9332673 9301681 10074465 10708184 10981468
42920 10981468 11131096 11161777 11136319 11456386 12087607 12194256 11412177 10807946 11518552 12979028
42910 12979028 13690150 13369961 13017759 12988835 12500340 11389724 11003180 12505114 15142519
42901 15142519 17071538 17457082 16984721 16588069 16511502 16674147 17169016 17920553 18277474
42892 18277474 17622968 16359563 15607820 15668232 15489793 14293649 13088779 13488563 15294065
42883 15294065 16580085 16313496 15453933 14938394 14120544 12344545 10757164 10881032 12129662
42874 12129662 12570390 11905728 11839957 13239133 14640533 14287208 12314431 10038640 8095893
42865 8095893 6282136 4572880 3317486 2706487 2711705 3284244 4127534 4678653 4845891
42856 4845891 5319555 6510510 7589290 7360395 5841916 4169915 3087971 2421014 2034436
42847 2034436 2269082 3048245 3471592 2963296 2159552 1888765 1820084 1123002 168768 337891
42837 337891 1924809 3363642 3135162 1608565 300935 44312 723877 2136324 3912712
42828 3912712 4931782 4158494 2192359 843766 903446 1362688 1164564 633774 613880
42819 613880 1187550 1992878 2977220 4031513 4605321 4567144 4827679 6146622 7773860
42810 7773860 8230873 7134749 5408939 4031327 3432683 3745535 4620691 5020891 4228422
42801 4228422 2952291 2478522 2869707 3062741 2650001 2342107 2538784 2688564 2447313
42792 2447313 2348795 2802971 3411217 3831365 4358096 4978890 4835826 3583979 2500579
42783 2500579 3024305 4571480 5069036 3693508 1929546 1499206 2156633 2274510 1101666
42774 1101666 -454127 -1230557 -1160201 -903152 -801492 -787261 -857006 -841158 3761 2115159
42764 2115159 4296131 4477190 2332893 118871 128372 2098977 3919736 4129450 2839484
42755 2839484 1012001 -50259 774229 3081083 4654830 3912392 2152592 1850393 3164589
42746 3164589 3995908 3348003 2520847 2636890 3055327 2997997 2879387 2982560 2438914 759867
42736 759867 -924911 -1383408 -921176 -390182 259183 1154730 1365161 154749 -1401487
42727 -1401487 -1619844 -510963 560606 1066338 1642947 2455469 2771738 2342219 1971897
42718 1971897 2378133 3321431 4095788 4239112 3680181 2757473 2115323 2142293 2626741 3265546
42708 3265546 4058028 4751805 4605937 3517057 2723967 3279133 4238615 3632371 1149626
42699 1149626 -1313616 -1926382 -771671 768990 1608558 1598815 1217888 1010976 1099120
42690 1099120 1112465 681201 -188949 -1278537 -2234421 -2427629 -1536624 -506617 -802179
42681 -802179 -2150883 -2402976 -654548 973050 299139 -1463119 -1401148 766462 2529242
42672 2529242 2443346 1545294 742628 -497402 -2036055 -2170047 -299040 1473552 1068494
42663 1068494 -677079 -1425813 -445603 1279952 2989517 4441340 4965561 4001588 2357073
42654 2357073 1443571 1319517 769242 -669151 -1943380 -1921640 -640966 1030089 2150928
42645 2150928 2026164 637424 -954524 -1371616 -483420 332291 -70618 -1023288 -791350
42636 -791350 1154410 3185688 3225763 1222659 -638537 -401513 1520021 3216954 3851285
42627 3851285 4352614 5535059 6644974 6400140 4724279 2652699 939829 -404650
42619 -404650 -1348266 -1476765 -695739 258625 517898 138556 -35646 320548 405309 -464154
42609 -464154 -1422965 -917359 964055 2260828 1769773 634451 368397 584118 171937
42600 171937 -373290 167544 1191542 955618 -319367 -479211 1063587 2300760 1904196
42591 1904196 1182268 1559989 2301620 2316896 2255291 2896469 3155953 1892114 374034
42582 374034 558757 1804316 1759694 89039 -1076431 -382009 1197293 2291843 2769349
42573 2769349 3027577 3177096 3314004 3379156 2626600 534120 -1705872 -2063118 -277526
42564 -277526 1752351 2440171 2074969 1684766 1694558 2073919 2556155 2342359 802463 -1202520
42554 -1202520 -1956969 -1179549 -341747 -328568 -274535 660136 1859466 2473201 2720849 2974439
42544 2974439 2769825 1875005 1271145 1799332 2675349 2660907 2090335 2424709 4139431
42535 4139431 6188729 7363196 7294583 6421442 5806622 6595965 8680055 10164756 9179871
42526 9179871 6139492 3368937 2574835 3454662 4660573 5244865 5105635 4792397 5034407
42517 5034407 5903020 6429656 5638523 3936508 2828799 3185039 4370273 5157485 4929633
42508 4929633 3926553 2922067 2762124 3567048 4206030 3270141 922944 -897483 -678108
42499 -678108 823114 1650091 1164751 561033 957376 2027036 2881539 3359696 3660726
42490 3660726 3377384 2003520 177083 -769071 -675461 -852507 -2017796 -2979867 -2238936
42481 -2238936 -144125 1579294 1991255 1552216 824549 -300911 -1938941 -3633494 -4719024
42472 -4719024 -4781056 -3776221 -2198583 -983300 -674913 -855399 -866407 -632617 -139939
42463 -139939 1109555 2990564 3898026 2649670 725283 596133 2009322 2286040 614933
42454 614933 -571855 456854 1937176 1546085 112045 140876 1933610 3434242 3212212
42445 3212212 1606795 -555068 -2518897 -3282001 -2487875 -1414746 -1519822 -2304189 -2169079
42436 -2169079 -1016798 -279010 -588461 -1211688 -1739983 -2545832 -3436617 -3595476 -3110664
42427 -3110664 -2906823 -2873360 -1767553 559959 2476449 2699039 1662471 253558 -1264541
42418 -1264541 -2442832 -2386512 -1206434 -325577 -428846 -453481 464114 1483494 1660371
42409 1660371 1684874 2600424 3886629 4343840 4067984 4047949 4426545 4615990 4663944 5081350
42399 5081350 5609332 5455220 4557203 3499683 2485630 1558509 1473247 2936551 5084595
42390 5084595 6131888 5677944 5069797 5200778 5233960 4094930 2223809 1093203 1567969
42381 1567969 3302106 5282381 6447659 6129734 4467340 2430280 1213292 1463895
42373 1463895 2889876 4436138 5019991 4362322 3036836 1691717 638003 307368 1311332
42364 1311332 3399917 4997686 4712222 3008730 1527077 990587 736519 179652 -336633
42355 -336633 -360460 -146749 -279271 -940709 -1711565 -1799754 -694404 921087 1326197 -338814
42345 -338814 -2657587 -3435613 -2387056 -1136077 -655447 -213030 773840 1345914 391437
42336 391437 -1552402 -2867698 -2705806 -1595817 -650072 -630093 -1315583 -1466533 -21306
42327 -21306 2357399 3646677 2703633 368944 -1907893 -3429065 -3744359 -2192539 865892
42318 865892 3336283 3338146 1434888 -211625 -477401 56578 630277 1139285 1489233
42309 1489233 1321649 622623 -181991 -809200 -1141717 -836946 243376 1305129 1246371
42300 1246371 118596 -805006 -576973 391375 901028 99396 -1830476 -3613691 -3767405
42291 -3767405 -2118061 -140813 750662 721880 674747 745237 771029 1387951 2992245 4142584
42281 4142584 2966338 70977 -1931298 -1964951 -1517961 -1769241 -1947392 -1432540 -1302327
42272 -1302327 -2369001 -3460264 -3247135 -2320425 -1838615 -1455943 -355717 815346 948624
42263 948624 518877 728460 1333211 1260097 817335 1238609 2311923 2492592 1389260
42254 1389260 294911 90035 253433 105879 -470177 -1604308 -3234040 -4386967 -4261706
42245 -4261706 -3859080 -4671833 -5901395 -5277700 -2859951 -1460617 -2543233 -4234482 -4567910
42236 -4567910 -4178938 -4125110 -3458032 -1311919 481650 -329889 -2612451 -3106810 -1077310
42227 -1077310 874416 710351 -633454 -1270262 -968363 -892983 -1844862 -3404544 -4273722
42218 -4273722 -3380868 -1180825 479317 525158 91446 735364 1939229 1975100 791601
42209 791601 75038 377176 221980 -1286232 -2745863 -2413482 -605897 962393 1333996
42200 1333996 752006 -350760 -1685840 -2705232 -2790921 -1949881 -864838 -158170 220820
42191 220820 797272 1688913 2050136 963969 -932645 -1657097 -461945 785092 122751
42182 122751 -1412096 -1087360 1431498 3430991 2916568 993834 -273469 -546149 -662114
42173 -662114 -951021 -1370314 -2137264 -3008104 -2931915 -1539633 -10745 592216 788427
42164 788427 1349779 1687891 1001960 7244 -107378 354472 328323 -20227 201774 714536
42154 714536 599740 344138 1231764 2723164 2634446 418113 -1648169 -1307343 1176142
42145 1176142 4034843 6004669 6513480 5347349 3259194 1841641 1729470 1780905 941543
42136 941543 -32654 216501 1575819 2871982 3778440 4918270 6236496 6617723 5466054
42127 5466054 3756378 2968251 3361161 3739322 2908106 1159744 70769 692166 2292828
42118 2292828 3409659 3817692 4497474 5661939 6097294 5050965 3654439 3511282 4674512
42109 4674512 6064715 7214362 8365244 9293766 9453618 9229837 9731966 11140083 12402929
42100 12402929 12833001 12840478 12707310 11926007 10530348 9879629 10876520 12200057 11794261
42091 11794261 9801200 8493689 9169554 10558566 10813257 9753063 8255444 6564035
42083 6564035 4521993 2808275 2433039 3154656 3759009 3957681 4646656 6049088 7077145
42074 7077145 7127419 7059919 7460921 7315999 5741220 3855074 3231624 3342171 2502593
42065 2502593 892732 425966 1540554 2343994 1594684 574889 986639 2581652 4003707
42056 4003707 4622181 4370103 3045449 1110233 110597 895744 2279243 2767210 2653445
42047 2653445 2929705 3162758 2425171 1657635 2792429 5516172 7068366 5792850 3158465
42038 3158465 1592247 1761313 2705809 3365424 3128795 1860796 223235 -633898 -185247
42029 -185247 1153505 2786392 4117090 4148559 2362256 168070 -200312 1214198 1808280
42020 1808280 83294 -2152548 -2482700 -1131596 108243 755051 1419189 1729281 763287
42011 763287 -841946 -1325801 -317969 899172 1613078 2322781 3060121 3026885 2367967
42002 2367967 2455110 3621500 4216805 2888457 492825 -1260133 -1943731 -2202903 -2405319
41993 -2405319 -2544716 -2700327 -2663090 -1845974 -407075 379426 -188632 -1044906 -917829
41984 -917829 -224304 -100941 -328543 132389 959600 662260 -926521 -2052409 -1475079
41975 -1475079 -98163 611666 693787 1138207 1972353 2097123 976516 -395214 -570210
41966 -570210 670223 2081295 2380994 1558038 462329 -584964 -1983404 -3567172 -4177654
41957 -4177654 -3249755 -2002090 -1955465 -2758090 -2730134 -1392149 -159508 -363301 -1703198
41948 -1703198 -2960519 -3275218 -2398211 -604675 1213548 2081491 1873054 1141904 125923
41939 125923 -1132722 -1849932 -1145093 182341 185948 -1350467 -2317173 -1478619 -408502
41930 -408502 -763824 -1411097 -419233 1393225 1547787 -23453 -754320 547722 2070642
41921 2070642 2136419 1670427 2241806 3422674 3708478 2930414 2197886 2129756 2515468 3271171
41911 3271171 4419703 5290411 4912033 3342262 1787320 1222607 1472996 1791464 1868608
41902 1868608 2061992 2857377 4214382 5398628 5568011 4604405 3213078 2194668 1900683
41893 1900683 2347055 3275424 3903558 3276796 1377993 -558796 -1379249 -1300775 -1342705
41884 -1342705 -1851711 -2312013 -2371086 -2154277 -1509987 95718 2433962 3978593 3355598
41875 3355598 1128176 -634866 -673981 237909 649640 293472 -80706 -207043 -556076
41866 -556076 -1117021 -1108039 -353843 108482 -394908 -868109 -17371 1639365 2273098 1100253
41856 1100253 -942155 -2718320 -3818055 -3954899 -2854027 -1141316 -131861 -183513 -273599
41847 -273599 292705 833017 596791 84393 182331 743348 865982 13966 -1776921 -4131243
41837 -4131243 -6146333 -6740518 -5911673 -4908068 -4452673 -3713443 -1942627 -135919 264835
41828 264835 -374864 -412002 612429 1467712 1183859 299879 -38074 603816 1654971
41819 1654971 2066703 1337931 409695 849939 2488862 2925355 667462 -2232219 -2563652
41810 -2563652 -433067 877761 -414308 -2362615 -2473594 -1080417 -211338 -530999 -974982
41801 -974982 -682733 121665 939222 1611450 2056589 2041522 1415559 401939 -396032 -421899
41791 -421899 215884 824106 1125430 1658697 2590689 2855984 1613510 4448 -84704
41782 -84704 1163700 1623766 356204 -1122112 -1263343 -577279 -437183 -1135048 -2076879
41773 -2076879 -2799699 -2860252 -1721101 272515 1610239 1185948 -495000 -2225779 -3336264
41764 -3336264 -3521521 -2598681 -1206986 -644894 -1156107 -1421498 -539582 690273 1314810
41755 1314810 1640199 1973396 1459408 -292117 -1748666 -1413191 -181286 98264 -527949
41746 -527949 -655695 -56777 451640 991491 2174237 3105323 2304788 548330 306743
41737 306743 2068831 3603010 3404322 2521842 2092036 1330857 -606247 -2489517 -2357200
41728 -2357200 -48496 2725325 4098772 3236681 845004 -937965 -356014 1687320
41720 1687320 2493893 1252380 121637 700576 1409474 160339 -1945456 -1980343 432101
41711 432101 2486744 2079238 355060 -311276 453508 816029 -685564 -3095252 -3836052
41702 -3836052 -1597602 1857321 3393752 2020944 -146257 -676263 487410 1690696
41694 1690696 1809674 851401 -792147 -2473804 -3181202 -2426665 -1003699 -58758 193299
41685 193299 126712 -247438 -946156 -1383874 -1176564 -994907 -1453285 -1762638 -864034 610581
41675 610581 1074170 355185 -321803 -535881 -1023379 -1761096 -1655312 -632763 -190705
41666 -190705 -1062735 -1989222 -1770313 -995323 -579836 -49456 1250021 2420443 2178380
41657 2178380 968848 247200 203326 -114605 -780665 -923594 -655118 -1187364 -2584897
41648 -2584897 -3146511 -1929369 -472236 -767197 -2482812 -3601145 -3292235 -2660707 -2610246
41639 -2610246 -2394469 -1010479 848590 1337837 -102011 -1763053 -1664837 -104579 597596
41630 597596 -948071 -3269204 -3729621 -1752554 579124 1147013 44062 -1186522 -1635132
41621 -1635132 -1517194 -1153616 -539928 86801 129702 -644299 -1764686 -2599979 -2830948
41612 -2830948 -2350289 -1215078 160902 1225459 1819743 2063244 1727403 420621 -1419595
41603 -1419595 -2504284 -2134867 -1057044 -350254 -24015 632568 1725681 2510019 2315083
41594 2315083 1218220 -48002 -552108 103089 1167654 1383968 629580 186373 765262
41585 765262 1187443 100072 -1774628 -2523123 -1734662 -815034 -818025 -1494618 -2423118 -3395473
41575 -3395473 -3492858 -1586171 1611505 3581622 2909902 814418 -964157 -2282639 -3582837
41566 -3582837 -4277392 -3659240 -2405331 -1665547 -1354257 -706012 116422 370762 197356
41557 197356 321008 572227 38620 -1360091 -2534827 -2506481 -1323650 77132 385706
41548 385706 -1081501 -3154981 -3415713 -1058242 1678749 2155766 537890 -1077917 -1801027
41539 -1801027 -2307639 -2715660 -2319626 -1302250 -580749 109102 1818334 3819610 3724411
41530 3724411 911452 -2168894 -3059026 -1943138 -371471 854242 1398164 698886 -987352
41521 -987352 -2097137 -1642807 -547049 13026 414528 1472931 2611297 2591647 1349269
41512 1349269 -115820 -1019837 -993591 155266 1882734 3009147 3304370 3854940 4878344
41503 4878344 4698474 2401893 -20476 -223228 1047509 1413635 786947 1061249 2332404
41494 2332404 2466966 829836 -344697 686884 2672274 3413291 2548269 1108765 -173235
41485 -173235 -896074 -606014 391846 825523 88398 -844660 -1013254 -907970 -1272879 -1547339
41475 -1547339 -835113 335813 618817 -218261 -1222527 -1831964 -2310126 -2679582 -2338945
41466 -2338945 -982313 814276 2145800 2539098 2185541 1731368 1689992 1830862 1485006
41457 1485006 665907 263701 681725 1012142 314422 -919238 -1500762 -1229252 -770514
41448 -770514 -269331 622435 1469428 1256605 192494 -5196 1673220 3985598 4914362
41439 4914362 4015837 2518049 1602554 1424150 1523292 1370660 555085 -890890 -2278537
41430 -2278537 -2835671 -2485792 -1669728 -575826 824759 2044347 2213393 1251662 205979
41421 205979 -76164 -54135 -644056 -1677486 -2008591 -1046007 542593 1657169 1623045
41412 1623045 228043 -2209676 -4456113 -4831565 -2760581 442481 2737641 3017677
41404 3017677 1479924 -877135 -2574814 -2272685 -94806 2014881 2238082 1001818
41396 1001818 270922 966222 2147848 2627095 2125164 734337 -1341134 -3018995 -2730182
41387 -2730182 -500202 1481333 1458458 335378 63741 656007 461412 -963824 -2124879
41378 -2124879 -2003593 -1530419 -1846048 -2392335 -1905178 -553997 187761 -375437 -1291375
41369 -1291375 -1368083 -665709 -156252 -323815 -593318 -95892 1316843 2933456 3900982
41360 3900982 3887854 3045666 1620435 -71297 -1374894 -1500302 -310699 1279847 2014003
41351 2014003 1401743 4435 -1249535 -1804805 -1676127 -1305427 -1299577 -1965198 -2895799
41342 -2895799 -3237192 -2559232 -1292037 -154474 571556 955586 979218 701585 654530
41333 654530 1388443 2560292 3115165 2589867 1649785 1037487 601878 -154681 -1107420
41324 -1107420 -1724913 -1880503 -1781216 -1369099 -535292 194652 -54658 -1446915 -3189311
41315 -3189311 -4364765 -4554657 -3809174 -2676288 -2166242 -2866352 -3997019 -4163049 -3252518
41306 -3252518 -2755362 -3801245 -5613070 -6429687 -5425420 -3265024 -1283498 -583369 -1410173
41297 -1410173 -2816954 -3280188 -2174103 -413532 692902 853701 691828 682545 731471
41288 731471 554157 40044 -573861 -686953 69254 962569 557396 -1456163 -3445531
41279 -3445531 -3654579 -2441973 -1798844 -2757220 -4131309 -4008032 -1953732 457209 1107982
41270 1107982 -597960 -2991659 -3741642 -2385813 -792261 -817597 -2184508 -3245784 -3156920
41261 -3156920 -2415852 -1710623 -1192362 -708252 -27527 929009 1547837 819447 -1060408
41252 -1060408 -2215075 -1395287 49356 109156 -664613 -24335 2101033 3137538 1839964
41243 1839964 239160 357152 1204160 907602 29407 358542 1499637 1343316 -313305
41234 -313305 -1182319 -20827 1408399 944608 -1007730 -2431893 -2559644 -2334922 -2469637
41225 -2469637 -2408324 -1424309 135189 1137403 867617 -289098 -1220923 -1097739 -170452
41216 -170452 461653 87875 -710637 -812640 -230572 -346924 -1980562 -3835185 -3908077
41207 -3908077 -2276024 -1168891 -1863448 -2862192 -2221935 -593939 -297319 -1837311 -3166032
41198 -3166032 -2546556 -479634 1694405 3505811 4790317 4809917 3241242 1248852 387382
41189 387382 869727 1740155 2190052 1927089 958499 -83118 -142852 706761 729929 -1202760
41179 -1202760 -3604944 -4205817 -3143399 -2421682 -2540950 -1950038 -101826 1326354 1242551
41170 1242551 1107232 2585261 4764068 5453245 4256717 2637723 1610476 1096282 1172316
41161 1172316 2133873 3229393 2991303 1319418 -40822 296676 1676652 2539717 2361492
41152 2361492 1698268 936559 -139356 -1753333 -3713088 -5484504 -6382193 -5974481 -4663299
41143 -4663299 -3548672 -3280898 -3314235 -2763015 -1718501 -1073215 -1107389 -949205 276196
41134 276196 2168984 3307397 2755273 1181081 344884 1263330 2900534 3130286 1216498
41125 1216498 -1242533 -2335028 -2109795 -1864179 -1728745 -545580 1744937 3337406 3021596
41116 3021596 1987255 1944234 2555372 2248123 779879 -728873 -1831234 -2894876 -3326211
41107 -3326211 -1818594 1089567 2752950 1831045 280571 490161 1799266 1721819 -186325
41098 -186325 -1734238 -1257137 458863 1790520 2317511 2500687 2346933 1354574 -536426
41089 -536426 -2562590 -3724477 -3659167 -3039783 -2968701 -3676354 -4048254 -2924938 -652056
41080 -652056 1314855 2216188 2598234 3075535 3392245 3115373 2543582 2307191 2423558
41071 2423558 2294112 1511198 303576 -764399 -1312356 -1402408 -1412670 -1655828 -2120006
41062 -2120006 -2561598 -2652674 -1966298 -233518 1999599 3336757 2778598 877903 -912175
41053 -912175 -1877752 -2346472 -2510409 -1955689 -643417 566363 995101 1144014 1892972
41044 1892972 3002590 3124548 1377728 -1487798 -3688955 -4097246 -3221301 -2392235 -2093022
41035 -2093022 -1649004 -804210 -684102 -2120282 -3611049 -2661279 628888 3055908 2303122
41026 2303122 -2179 -577115 1264192 3368865 4109133 3935741 3509721 2374173 407996
41017 407996 -979332 -521477 889552 1247380 73310 -1248053 -1550749 -1000508 -112630
41008 -112630 934081 1608932 1080564 -188026 -192603 1924891 3940290 3069369 -117036
40999 -117036 -2377778 -2374148 -2186815 -3521620 -4834089 -4001392 -1980196 -1332853 -2126142
40990 -2126142 -2017707 -272801 950904 -20815 -1907713 -2512890 -1626604 -615650 -250348
40981 -250348 -255125 -345616 -526276 -620012 -331683 296187 876471 964858 348186 -482733
40971 -482733 -343051 1231022 2676799 1847757 -1014398 -3270209 -3379273 -2712244 -2880892
40962 -2880892 -3026359 -1486095 1113620 2532972 2113480 1332402 1345995 1783098 2073635
40953 2073635 2298319 2338463 1638166 410817 -98696 691242 1580031 975972 -1002226
40944 -1002226 -2484721 -1877779 391567 2288679 2353674 1267235 803764 1362759 1496135
40935 1496135 240991 -1194488 -1003908 776605 2523418 3160358 2885098 2186270 1362739
40926 1362739 840398 860103 905459 320469 -663099 -1273970 -1219644 -620790 429789 1342448
40916 1342448 982492 -566133 -1191430 556308 2881986 3027729 1412514 829788 1828051
40907 1828051 2016889 399635 -874663 -350444 182088 -1027268 -2365576 -1355683 1252260
40898 1252260 2523954 1450482 -377529 -1532915 -1948723 -1710584 -746009 249935 254018
40889 254018 -608514 -1307749 -1501470 -1600085 -1443816 -358318 1398363 2516805 2193587
40880 2193587 900781 -405918 -992494 -433200 1016203 2233953 2357237 1928770 1968740
40871 1968740 2200404 1447541 -271590 -1419814 -1037704 -28229 185471 -517060 -1032269
40862 -1032269 -492743 748958 1475670 941293 -107639 -196905 856797 1495074 617840
40853 617840 -694884 -766714 149395 389599 -545507 -1542604 -1817883 -1637612 -1034404 450994
40843 450994 2309578 2983552 2038322 1116210 1822208 3636384 4740171 4082570 1927399
40834 1927399 -751454 -2580205 -2325963 -220845 1669122 1380965 -749596 -2518361
40826 -2518361 -2381359 -937758 152782 204630 84601 784705 1793037 1478167 -755837
40817 -755837 -3433788 -4735233 -4594156 -4141263 -3641961 -2395236 -559668 467663 -57582
40808 -57582 -1134756 -1375176 -586586 391060 609863 -486041 -2555628 -4096943 -3697551
40799 -3697551 -1837733 -385999 -64067 268184 1388407 2294598 1831174 388251 -971252
40790 -971252 -1845450 -1980059 -744805 1636499 3504676 3744707 3254797 3094537 2464411
40781 2464411 343396 -1996224 -2392460 -1095413 -303871 -652129 -627674 307923 539057
40772 539057 -925305 -2653160 -2961189 -2125430 -1098232 416878 2934989 5319305 5771690
40763 5771690 4248086 2351298 1056441 -14650 -1093466 -1531065 -1007913 -309401 -194995
40754 -194995 -325226 -125602 -84774 -1088207 -2630204 -2940141 -1377447 307401 69777
40745 69777 -1680883 -2685833 -1994850 -1014254 -1012868 -1135031 -12462 1790020 2481163
40736 2481163 1629518 475472 -140383 -579082 -999954 -732433 385071 1355952 1482554
40727 1482554 1373109 1614247 1453688 -3399 -1964367 -2684217 -1826124 -829782 -840947
40718 -840947 -1469538 -2010328 -2756108 -4142747 -5255986 -4485457 -1773494 865014 1644472
40709 1644472 1071870 862695 1320694 1064443 -557076 -2137218 -2104195 -1022784 -869011
40700 -869011 -2365578 -4104830 -4339838 -2846354 -885633 107832 -278849 -1148166 -1268254
40691 -1268254 -614774 -488432 -1581220 -2641498 -2114247 -540336 157279 -424751 -715577
40682 -715577 111867 791653 208812 -592622 -29682 1424803 1806880 394602 -1405344
40673 -1405344 -1785382 -239387 2313592 4361376 4947372 4599278 4792268 5964330 6711719
40664 6711719 5770139 4039360 3376448 3898232 4042871 3149392 2226313 1835107 987042
40655 987042 -934834 -2643221 -2717414 -1902466 -1997230 -2926086 -2744092 -790581 880096
40646 880096 197069 -1991348 -3107925 -2413430 -1707783 -2292154 -2953595 -2079745 -541921
40637 -541921 -668887 -2678396 -4037024 -2853868 -285457 1408477 1855392 2202127 2704360
40628 2704360 2502992 1594506 1268576 2167684 3225372 3120374 1795433 -7208 -1766085
40619 -1766085 -3074549 -3390266 -2749824 -2127713 -2263751 -2657892 -2566219 -2428877 -3168575
40610 -3168575 -4364096 -4457156 -2955200 -1213943 -531350 -525641 -205712 204483 -317698
40601 -317698 -1693666 -2498417 -1847117 -593072 -145561 -714521 -1324873 -1205477 -541214
40592 -541214 16677 30905 -532061 -1307695 -1636865 -1080488 16274 824920 1062526 1363891
40582 1363891 2387512 3873244 4902730 4848625 3761669 2121414 664547 214994 1015580
40573 1015580 2183166 2432514 1525694 467360 58362 -61037 -453725 -701050 -131784
40564 -131784 648572 232956 -1380789 -2291695 -1122311 1005468 1938694 1274015 423559
40555 423559 257991 158641 -452658 -1109955 -1397286 -1760230 -2388744 -2425997 -1390660 -452383
40545 -452383 -966985 -2412302 -3209453 -3108641 -3180911 -3713166 -3872274 -3526370 -3557880 -3922535
40535 -3922535 -3233807 -1157612 430383 -62357 -1554283 -1766506 -176521 1818265 2930411
40526 2930411 2870289 1853326 575943 230496 1272573 2547894 2806677 2576013 3203224
40517 3203224 4557764 5287982 5074651 4885489 4993887 4515763 3189306 1925358 1144735
40508 1144735 211097 -899750 -1055378 45793 960557 727567 522378 1597943 2800722
40499 2800722 2024288 -476364 -2122330 -1336850 751499 2195440 2469546 2266028 2080917
40490 2080917 1865310 1667357 1835070 2453244 2983248 2828212 2211535 2021796 2520690
40481 2520690 2793022 2170509 1610769 2406718 3805597 3633817 1594944 56496 638249
40472 638249 1860570 1679997 694177 697401 1254951 373416 -1809104 -2732651 -1205761
40463 -1205761 906173 1610335 1346070 1514137 2224261 2857011 3429397 3936882 3519033
40454 3519033 1840382 316949 246036 469785 -1111158 -3989097 -5150979 -3131091 -112348
40445 -112348 904627 -383304 -1997421 -2503495 -2020878 -997417 467459 1943130 2534510
40436 2534510 1984147 1199168 1130946 1592940 1710929 1179589 451833 -146610 -817739 -1714340
40426 -1714340 -2509170 -2780040 -2470253 -1784253 -975356 -426351 -550367 -1307247 -2099157
40417 -2099157 -2388179 -2109357 -1317315 -17930 1207515 1091830 -884458 -3238991 -3693980
40408 -3693980 -1756014 718323 1743975 1280444 802356 1456500 3060484 4450770 4401956
40399 4401956 2558204 -119080 -1989287 -2079019 -733949 994875 2237190 2582963 2038278
40390 2038278 984154 -114795 -1061264 -1701395 -1553031 -395521 764498 316898 -1916634
40381 -1916634 -4117310 -4558505 -3541173 -2531766 -2052634 -1386406 19824 1836839 3401006
40372 3401006 4180461 3840339 2656109 1788662 2298952 3771219 4609703 3837510 2009625
40363 2009625 300932 -593633 -477769 647576 2385477 3843809 4225530 3470048 2193922
40354 2193922 1140293 668227 516015 62729 -935604 -1970794 -2454611 -2566797 -2917348
40345 -2917348 -3486400 -3567844 -2845386 -1871553 -1240618 -828419 -159017 869414 1875199
40336 1875199 2306066 1782360 558979 -285618 295767 2028540 3391401 3267957 2070732
40327 2070732 979067 604504 777819 1135011 1393180 1351819 1044669 687243 281362
40318 281362 -336918 -887107 -705108 208511 851889 492323 -301137 -516241 -2217 818259
40308 818259 1903094 3226859 3929218 3095909 1290783 89041 -6353 13809 -458586
40299 -458586 -651273 145489 1324281 2005987 2383135 2981175 3317172 2543808 1085965
40290 1085965 388532 1002713 1952577 2163892 1612381 813323 61997 -395771 -226748
40281 -226748 372244 564238 76066 -21326 1360271 3478344 4256590 2768855 358523
40272 358523 -1070264 -1127842 -780200 -783756 -1110833 -1599006 -2203622 -2514678 -1872508 -372339
40262 -372339 814365 624523 -700012 -2016892 -2623917 -2742921 -2837831 -2983115 -2984352 -2737066
40252 -2737066 -2286194 -1742255 -1304042 -1255616 -1754208 -2516235 -2747908 -1662477 592375
40243 592375 2621774 2944362 1668598 505057 763142 1861730 2365537 1939047 1348871
40234 1348871 826316 -339098 -2297922 -3816481 -3651539 -2103299 -517053 297220 473923
40225 473923 318367 -44129 -320834 -80266 703164 1548127 1982319 1861717 1278849 564194
40215 564194 252037 497553 590215 -263542 -1573787 -1790136 -308334 1459959 1703490
40206 1703490 401139 -906963 -1205872 -893389 -656709 -582254 -742945 -1621354 -3155604
40197 -3155604 -4100227 -3349974 -1509546 -110613 488717 1187067 2073329 1757603 -488158
40188 -488158 -3113125 -4023371 -3274679 -2739784 -3378465 -4178044 -3919257 -2731841 -1398410
40179 -1398410 -149301 1035622 1572966 702496 -1299807 -3022611 -3282034 -2378655 -1828095
40170 -1828095 -2744312 -4468066 -5090669 -3641982 -1404055 -414683 -925590 -1326014 -639393
40161 -639393 106373 -439310 -1947655 -2997349 -2925353 -2089591 -844188 591199 1502360
40152 1502360 1100366 -344425 -1691614 -2310016 -2410426 -2016614 -729205 1121319 2150207
40143 2150207 1516023 201851 -102197 923719 1972343 1803913 579680 -568454 -806137
40134 -806137 -142254 1042877 2522117 4035717 4943140 4732959 3939566 3759444 4347358
40125 4347358 4362649 3031333 1793993 2477826 4282030 4413382 1940598 -819181 -1539681
40116 -1539681 -849345 -800071 -1724534 -2298317 -1924823 -1258298 -647392 247517 1223374 1431268
40106 1431268 785432 179347 -20865 -424361 -1146682 -1251105 -391888 218433 -489419
40097 -489419 -1724866 -1952131 -984342 210590 1152322 1929781 2085590 1026946 -464640
40088 -464640 -759101 217405 660492 -314218 -1066377 115392 2097510 2133934 -425780
40079 -425780 -3293266 -4162085 -3080042 -1598538 -786409 -673195 -757874 -434806 465092
40070 465092 1120193 374405 -1648758 -3370515 -3698379 -3270170 -3073643 -2796806 -1652065
40061 -1652065 -89415 706769 685098 902781 1717159 2350285 2390171 2434598 2905338 3385294
40051 3385294 3556955 3687638 3667118 2697160 708648 -873363 -724658 663615 1710271
40042 1710271 1645815 906636 146622 -296623 -299786 -85492 -202486 -775967 -1126021 -712029
40032 -712029 -13691 185219 -85842 -343527 -651787 -1330068 -1973417 -1778673 -805397 -48369
40022 -48369 -154063 -663950 -576763 683985 2622928 3710519 2701060 425036 -618127
40013 -618127 679726 2384301 2200719 754974 311742 998980 832580 -546646 -924584
40004 -924584 879655 2961787 3307346 2711008 2888237 3356600 2422035 257420 -1248272
39995 -1248272 -1284622 -789194 -513883 -272905 -174053 -852825 -2105989 -2728899 -2179189 -1234590
39985 -1234590 -634654 -243063 25979 -322627 -1304400 -1925256 -1527263 -828001 -776507 -1100948
39975 -1100948 -969009 -565135 -870264 -1958919 -2526280 -1423661 906828 2852117 3216640
39966 3216640 2218304 1065969 677377 831628 659641 -86988 -589891 49723 1696408
39957 1696408 3326560 4015462 3479070 1991151 300944 -572502 -134940 941946 1531925
39948 1531925 1473297 1667589 2632048 3718656 4182402 4267788 4513867 4575746 3711664 2153034
39938 2153034 967944 622078 653724 762983 1084911 1211792 274435 -1431737 -2183634
39929 -2183634 -1104850 404757 627467 -83985 -225454 425887 955051 1287291 2120170
39920 2120170 3066283 2824960 1415865 401006 474744 626657 246648 158435 678072
39911 678072 536802 -973121 -2433398 -2378395 -1480744 -1024783 -598604 715859 2010475
39902 2010475 1715031 387120 -51068 473546 188030 -1253281 -1974208 -922705 510827
39893 510827 782539 127813 -809074 -2361341 -4449207 -5422428 -4052251 -1634391 -395844
39884 -395844 -517451 -412555 499757 1076686 536985 -322847 -472330 -49665 221821 244297
39874 244297 443032 784157 518255 -980411 -3278499 -4902567 -4485836 -2095909 667321
39865 667321 2128587 2079522 1706813 2065724 2921583 3219959 2460610 1232454 287986
39856 287986 -514616 -1824087 -3471674 -4322557 -3804056 -2856308 -2638692 -2779198 -1826724
39847 -1826724 731231 3749882 5667974 5737914 4198049 2128934 1043747 1586117 2574622
39838 2574622 2362184 1156568 727335 1664363 2519550 2279041 2018562 2925252 4114435
39829 4114435 4064929 3237756 3336299 4385612 4540769 2978637 1182957 686091 979964
39820 979964 688246 -210684 -614756 -289884 -282300 -1148856 -1884320 -1334377 -9359 552177
39810 552177 47534 -212552 403773 485402 -1329048 -3817551 -4447325 -2913814 -1543288
39801 -1543288 -1849693 -2553628 -1954446 -677280 -615280 -2116623 -3698463 -4067986 -3217238
39792 -3217238 -1858933 -819271 -716951 -1367979 -1788107 -1459905 -1082826 -1358381 -1780906
39783 -1780906 -1611250 -1293678 -1672457 -2404827 -2500571 -1975321 -1568693 -1203208 -225208 1060411
39773 1060411 1639033 1458250 1326121 1246130 545755 -288030 207971 2013987 3143071
39764 3143071 2342769 708631 -217558 -476785 -845276 -1299062 -1471423 -1606649 -1986704
39755 -1986704 -2292823 -2462572 -3205249 -4652118 -5488574 -4631272 -2923052 -1874065 -1445533
39746 -1445533 -491905 1141993 2504333 3290362 4208981 5479656 6247678 5819295 4489934
39737 4489934 2842078 1109193 -397340 -1041121 -610943 152005 295600 -276560 -814535
39728 -814535 -668488 60541 826696 1353745 1763840 1984795 1513385 245625 -830173
39719 -830173 -627163 415840 738271 -62675 -494499 642686 2401965 3060910 2540213
39710 2540213 2152294 2379464 2353171 1599377 966372 1300527 2137323 2426902 2079365 2085604
39700 2085604 3129661 4512063 4706432 2997482 383756 -1392626 -1623712 -1052449 -574329
39691 -574329 -213567 321210 753005 532046 -331313 -1234622 -1539614 -871617 678431
39682 678431 2284794 2877313 2391349 1964583 2351439 2811654 2293990 1028190 -14324
39673 -14324 -624983 -1126612 -1072551 351074 2551727 3539470 2279611 179819 -378655
39664 -378655 1398927 3957632 4979941 3679824 1621389 964402 1773704 1864390 -110909
39655 -110909 -2452628 -2543602 -449593 1285940 1190243 386414 335813 798016 744204 -62652
39645 -62652 -1223414 -2380419 -3007384 -2497838 -1182618 -334912 -458897 -549769 142245
39636 142245 682354 -51105 -1275831 -1165036 508390 1921873 1472344 -538634 -2679389
39627 -2679389 -3961045 -4226034 -3569988 -2008304 254871 2519810 3874824 3978516 3375858
39618 3375858 2721930 1929927 653120 -619190 -904854 -282138 -14674 -639853 -988843
39609 -988843 29506 1531676 1742534 549537 -305852 344391 1574597 1735911 634896
39600 634896 -335032 -35602 1079438 1752001 1655718 1630072 2067230 2008249 684010 -756720
39590 -756720 -461300 1344983 2351968 1252821 -711231 -1966753 -2804284 -4184470 -5661804
39581 -5661804 -6087654 -5577473 -5143949 -4837301 -3880345 -2463837 -1759987 -1974945 -1908694
39572 -1908694 -971704 -381302 -1538231 -3985107 -5770354 -5493066 -3485833 -1244312 -105293
39563 -105293 -359005 -1314390 -2060389 -2096767 -1359540 -57915 1326453 2270999 2726409
39554 2726409 3087707 3492392 3603137 3212724 2414175 1061339 -947882 -2572763 -2196941
39545 -2196941 -75022 1251471 260147 -1205027 -617972 1383520 2026534 494069 -1510445
39536 -1510445 -2982202 -4691094 -6718882 -7562589 -6635499 -5438523 -5071307 -4504757 -2637269
39527 -2637269 -366330 833168 976062 814800 371227 -292745 -123962 1358502 2511361
39518 2511361 1398017 -1411931 -3520517 -3743576 -2938206 -2157605 -1559085 -1053780 -625114
39509 -625114 98727 1481982 3054523 3968368 4163091 4180412 4055747 3403560 2432932
39500 2432932 1850981 1801699 1753374 1318678 437887 -946215 -2572682 -3601409 -3531610
39491 -3531610 -2938149 -2476329 -1907786 -1170479 -1369601 -3060600 -4485024 -3685253 -1788161
39482 -1788161 -1649842 -3389153 -4112938 -2536756 -911681 -1170714 -1946923 -1275169 107065
39473 107065 498967 473203 1747777 3967322 5227774 5167662 5023230 4927910 3718186
39464 3718186 1605820 603769 1569912 2848137 2823136 2146332 2244478 2955262 3059223
39455 3059223 2397000 2111761 2982049 4399936 4976503 3752167 1081278 -1359728 -1905103
39446 -1905103 -676086 427969 -29467 -1324998 -1755896 -1002581 -343455 -644310 -1186010
39437 -1186010 -885702 51530 377662 -552094 -1978416 -2659049 -2198243 -1234572 -505247
39428 -505247 -45310 584869 1447870 1895355 1301936 60593 -581697 -43673 552200
39419 552200 -365575 -2458904 -3414930 -1925798 244535 515216 -773323 -765898 1614882
39410 1614882 3894144 3617563 1829616 1135213 1557137 727119 -2141588 -4903008 -5587222
39401 -5587222 -4825758 -4201522 -3790972 -2678926 -868110 741250 1775448 2593984 3286907
39392 3286907 3434688 2832237 1756567 571024 -382657 -645185 -6368 1029708 1720473
39383 1720473 2111167 3104263 5244638 7659609 8561265 7040320 4299746 2629102 2835463
39374 2835463 3258884 2073670 -7753 -671960 527619 1430116 561325 -616860 -17246
39365 -17246 1918128 3046845 2587908 1558520 691630 -240692 -1180341 -1564028 -1421973
39356 -1421973 -1251830 -876789 25257 461995 -792353 -2552940 -2035183 964220 3083531
39347 3083531 1905108 -760148 -1892936 -1547309 -1691428 -2308891 -1662243 171431 1087919
39338 1087919 497484 321749 1667686 2927666 2488596 1413238 1787838 3654762 5184481
39329 5184481 5138153 3793474 1974870 427238 -168489 340159 1216836 1694804 1899540
39320 1899540 2214577 2258114 1530029 725027 1121109 2564723 3246645 1977321 -132473
39311 -132473 -892636 486563 2663790 3729622 3074101 1654443 678074 353772 116959
39302 116959 -252772 -410937 -356984 -678202 -1451667 -1774526 -1158841 -613840 -1268348 -2533835
39292 -2533835 -2980102 -2653747 -2930545 -4089660 -4784406 -4351639 -3907742 -4246049 -4195836
39283 -4195836 -2425340 218161 1664043 1257494 83885 -823619 -1205778 -849990 372012
39274 372012 1700838 1996033 1260862 661379 874796 1358309 1422646 1158482 1111348 1750475
39264 1750475 3245482 4988391 5513608 3918036 1240406 -702309 -1645975 -2593484 -3379657
39255 -3379657 -2590380 -391865 776782 -429864 -2095652 -1900605 -613600 -745567 -2788246
39246 -2788246 -4920581 -5845993 -5820306 -5120717 -3562436 -1709134 -797491 -1081157 -1609561
39237 -1609561 -1824093 -2025532 -2190151 -1844347 -1318528 -1533768 -2159306 -1593316 595100
39228 595100 2684893 3038133 2023083 914842 101010 -715866 -1551257 -2248078 -2751599
39219 -2751599 -2702539 -1680048 -250056 448154 600435 1666237 3746686 4774051 3447640
39210 3447640 1257950 171949 -17267 -329143 -280989 840509 1735290 675633 -1493998
39201 -1493998 -2477036 -2046219 -1843488 -2097569 -1425997 67410 501004 -383075 -358183
39192 -358183 1707499 3962117 4579304 4334941 4560851 4555007 2985803 429308 -1401984
39183 -1401984 -1978791 -1918222 -1540853 -933704 -612939 -737339 -457359 646226 1340942
39174 1340942 375746 -1434967 -2228326 -1577783 -578756 -72362 -201475 -1141440 -2728810
39165 -2728810 -3751471 -3094075 -1356648 -69863 319327 414394 401783 170880 420985
39156 420985 1861451 3504047 3553934 2013342 666282 409730 427394 244732 642753
39147 642753 1887316 2817548 2584898 1838442 1301688 539973 -860722 -2075638 -2073556
39138 -2073556 -978166 470390 1927370 3104598 3350288 2489158 1329486 540012 -205299
39129 -205299 -1243244 -2003367 -1940178 -1503253 -1253986 -897602 -202469 47701 -728845 -1527229
39119 -1527229 -1001119 465077 1370615 1354204 1281826 1316910 642390 -656088 -1084815 126257
39109 126257 1588207 1434101 -222575 -1438539 -857188 707270 1257178 -76463 -1951509
39100 -1951509 -2173311 27117 3461275 6561797 8580099 8945913 6735776 2043001
39092 2043001 -2797567 -4914006 -3905464 -2029090 -1306588 -1547105 -1454747 -546232 646245
39083 646245 1530322 1963992 2163913 2469058 2965936 3291477 3150599 2922117 3214317 3920860
39073 3920860 4357411 4235601 3765264 2905881 1448199 -118185 -807672 -411089 320110
39064 320110 879764 1382815 1614294 983022 -165418 -512518 288535 889237 284904
39055 284904 -682625 -877091 -647117 -733824 -600415 437147 1335488 624994 -863205
39046 -863205 -728834 1489296 3593665 3907062 3176303 2532600 1483818 -669659 -2815625
39037 -2815625 -3137453 -1602582 111542 885405 1122134 1542659 2100381 2276719 1763126
39028 1763126 712388 -271817 -505117 -5322 371702 136210 135959 1474961 3673778
39019 3673778 5010369 4874737 4664817 5757472 7617177 9035603 10638773 14510941
39011 14510941 20844037 26245167 26685638 21888359 15667233 11735662 10211141 8809225
39003 8809225 6433581 4250186 3515876 3850144 4166702 4220239 4329277 4160745 2828873
38994 2828873 240712 -2306718 -3163064 -1887237 188234 1020797 -158575 -1881280
38986 -1881280 -1953694 -54731 1836146 1893607 543851 -446365 -196007 808981 1814842
38977 1814842 2321727 1889233 533403 -795947 -1077175 -449094 248029 831491 1583507
38968 1583507 2018192 1277639 -226602 -1050394 -825981 -640254 -946348 -753699 392491
38959 392491 1286840 1011055 521714 928451 1471923 853976 -389297 -655745 144329
38950 144329 553415 -100136 -912406 -923488 -109316 1067021 1876268 1313984 -752958
38941 -752958 -2571808 -2129736 137827 1676893 972742 -992668 -2508321 -2820665 -1847019
38932 -1847019 119957 1899982 2159731 1293797 1128729 2131576 2508982 973808 -1172165
38923 -1172165 -1933990 -1283076 -605044 -599220 -1087079 -1979884 -3064732 -3584602 -3307283 -3280725
38913 -3280725 -4286157 -5327278 -5001628 -3613857 -2469733 -1786691 -928559 -126962 -172130
38904 -172130 -709482 -629024 -4662 109076 -255470 26127 968999 1184046 218962 -630176
38894 -630176 -509515 -300013 -869677 -1632994 -1903858 -2205236 -2925357 -2943842 -1203101 1189792
38884 1189792 2124606 1370497 697573 1137580 1646502 978971 -295478 -576639 483520
38875 483520 1457164 1075790 64126 421915 2919211 5926646 7110968 5901968 3824562
38866 3824562 2724903 3204012 4453176 4926853 3446094 466564 -1897849 -1961950 -442759
38857 -442759 563366 368496 237728 1133916 2345209 2810536 2542374 2058369 1448082
38848 1448082 719707 172474 -246467 -1078195 -2191906 -2439801 -1286936 77545 194869
38839 194869 -770320 -1496642 -1325599 -797040 -815063 -1915787 -3840492 -5319103 -5002332
38830 -5002332 -3188862 -1785722 -1911613 -2538566 -2306733 -1515811 -1168439 -1151305 -827269
38821 -827269 -526509 -806422 -931702 104975 1481114 1372908 -162187 -927724 510703
38812 510703 3136905 4980353 4997014 3236035 484579 -1804314 -2318546 -1120123 559055
38803 559055 1732470 2113243 1533595 140703 -1025693 -981654 -206623 215363 537234
38794 537234 1727981 3159789 3083788 1625246 998434 2091277 3131004 2756096 2140029
38785 2140029 2611612 3253690 2712986 1657900 1385399 1397767 528982 -665138 -913754
38776 -913754 -744746 -1613755 -3073765 -3236507 -1872427 -707101 -528382 -245257 823311
38767 823311 1859515 2311336 2737130 3152646 2485677 677582 -497681 -2156 678184
38758 678184 -155344 -1646370 -1714257 -246038 925821 771911 -44086 -913889 -2112981
38749 -2112981 -3510175 -3999896 -2989613 -1407667 -474207 -261690 -186534 -176006 -420989
38740 -420989 -467442 379263 1851121 2864415 2945768 2609078 2080174 668907 -1866392
38731 -1866392 -4095361 -4163359 -2080735 201240 1057623 677422 150695 30787 288792
38722 288792 896876 1719945 2303555 2461326 2709632 3425231 3893881 3048625 1099892
38713 1099892 -387288 -255334 975739 1834043 1464358 230428 -939936 -1527527 -1782024
38704 -1782024 -2194339 -2723072 -2844840 -2426318 -1998138 -1781919 -1040055 855325 3097809
38695 3097809 4142788 3615688 2571282 1828195 1096090 24266 -960614 -1456224 -1835057
38686 -1835057 -2440485 -2743337 -2161430 -1167622 -613051 -331536 470882 1545893 1540248 -35855
38676 -35855 -1770452 -1964074 -692075 447998 307203 -783172 -1781475 -2014555 -1391937
38667 -1391937 -192023 990019 1465679 1075949 459041 354091 736417 1001614 948658
38658 948658 1107126 1913244 2941834 3295846 2603839 1353798 310780 -164855 -229266
38649 -229266 -155804 96513 839294 2057536 2998720 2789952 1565895 479921 256479
38640 256479 202590 -755010 -2332491 -2949586 -1635899 680609 2047623 1373040 -678979
38631 -678979 -2407571 -2564184 -1291888 311324 1463723 2210140 2639547 2383578 1565215
38622 1565215 1532938 3376461 5918940 6676811 5127249 3529918 3746999 4697139 4272761
38613 4272761 2598198 1512675 1400664 727352 -1047127 -2215034 -1495089 -300510 -801391
38604 -801391 -2739366 -3915036 -3455698 -2840609 -3431150 -4482603 -4366972 -2794382 -928250
38595 -928250 171581 392132 109549 -353475 -738116 -779539 -327948 523764 1400510 1785288
38585 1785288 1477829 953200 938707 1626718 2727932 4163491 5848106 6733467 5384624
38576 5384624 2222551 -80289 286451 1719855 1331323 -1072876 -3007033 -2962424 -1934532
38567 -1934532 -1139325 -380113 604588 1123658 895656 766022 997957 492540 -1072529
38558 -1072529 -2027340 -1155245 282040 771359 1171112 2796405 4267092 3163385 149857
38549 149857 -1553936 -739702 612844 933774 903539 1039110 413390 -900675 -805497
38540 -805497 1509583 3407672 2212582 -750373 -1880299 -165719 1933534 2126463
38532 2126463 812204 -206502 -27124 814505 1309121 1091810 751805 925654 1234033
38523 1234033 842403 -15762 -315682 -193695 -935010 -2370055 -2246773 411350 3081693
38514 3081693 2839162 418699 -979856 -90117 1500882 2357648 2708870 2818190 2046487
38505 2046487 282304 -1188873 -1034080 700868 2763899 3619748 2418439 -28570
38497 -28570 -1548977 -936178 408673 280919 -1468136 -3283320 -4438358 -5330821 -5647864
38488 -5647864 -4439167 -2151386 -550426 -274997 -316010 -187906 -605299 -1581117 -1967626
38479 -1967626 -1565393 -1614299 -2367042 -2320156 -983248 -324066 -1956568 -4616229 -5972497
38470 -5972497 -5476316 -3997786 -2156432 -513730 48984 -288380 52985 1497759 2084856
38461 2084856 585216 -947828 -102194 1967510 2322947 819731 -168802 19549 -365247
38452 -365247 -1912995 -2892900 -2304508 -1404743 -1283712 -1220057 -468180 310498 435762 283868
38442 283868 33393 -990840 -2770923 -4006849 -4072319 -4030559 -4675451 -5048918 -4014190
38433 -4014190 -1925480 338243 2564911 4269217 4085950 1631535 -1206468 -2326017
38425 -2326017 -1742062 -585170 891631 2634022 3398731 2183506 259508 -344697 168780
38416 168780 29291 -911860 -1052325 -41317 593612 265500 359092 1516756 2073135
38407 2073135 614082 -1547445 -2033024 -462368 1490155 2212677 1152366 -1349049
38399 -1349049 -3862597 -4300900 -2042556 810968 1667717 579088 -232257 322944 1002657
38390 1002657 521119 -505111 -592689 612311 2057477 2427243 1196495 -879339 -2132791
38381 -2132791 -1577162 -328896 -522831 -2454677 -3880499 -2875011 -376905 1184217
38373 1184217 1042480 554566 891439 1715828 2248093 2331628 1978297 901429 -807065
38364 -807065 -2206151 -2389503 -1475626 -288345 529826 675848 -46437 -1496795 -2954802
38355 -2954802 -3594635 -3111034 -1691433 213622 1757825 1922284 575806 -1015142 -1453545
38346 -1453545 -761428 31731 516265 1094143 1639089 1245045 -237683 -1510774 -1449629
38337 -1449629 -608703 -209900 -301546 -95409 226081 -513457 -2421781 -3742480 -2964299
38328 -2964299 -944157 90598 -680624 -1901943 -2030989 -1092778 -76717 552199 978840
38319 978840 1168461 819786 171305 43065 806293 1872901 2493401 2568692 2360744 1935569
38309 1935569 1397542 1243366 1803625 2512171 2395662 1327289 304106 406998 1791647
38300 1791647 3586323 4412603 3296077 747327 -1207045 -935566 770013 1484522 224124
38291 224124 -1278283 -951220 943330 2497707 2803377 2618421 2650844 2561180 1973870
38282 1973870 1349947 1215354 1272024 986884 575862 653521 1140778 1257949 640057 -142434
38272 -142434 -398468 -234904 -318514 -901781 -1448287 -1316331 -616333 -164402 -541987 -1366147
38262 -1366147 -1675292 -998444 172835 1027320 1322052 1462400 1847992 2365828 2518462
38253 2518462 1945413 892743 236109 775089 2202869 3016464 2004439 -187491 -1597197
38244 -1597197 -1225889 -96310 361089 210709 464997 1192000 1396021 762800 309677
38235 309677 909209 2151468 3170669 3666300 3484184 2202583 135284 -1095611 -304426
38226 -304426 1422835 2013988 1245210 758359 1276380 1586916 858093 239269 944076
38217 944076 1991435 1449012 -623610 -1983490 -956412 1707772 3845764 3939815 2111639
38208 2111639 -194518 -1389014 -1146171 -654501 -1015897 -1714276 -1506743 -569997 -461131
38199 -461131 -1657090 -2474585 -1353856 720229 1332707 -200750 -2048807 -2345759 -1356399
38190 -1356399 -657522 -954726 -1513752 -1464887 -903112 -573355 -940395 -1814938 -2703319 -3369698
38180 -3369698 -4092553 -5275818 -6633652 -7014686 -5634519 -3529798 -2986669 -4948682 -7536447
$$ [...]
##END NTUPLES=NMR SPECTRUM
##END=
