##TITLE=31Pdec_LR-685B-CM2
 CDCl3, 24 sc
 18.12.2019
##JCAMPDX= 6.0         $$ Bruker NMR JCAMP-DX V2.0
##DATA TYPE= NMR SPECTRUM
##DATA CLASS= NTUPLES
##ORIGIN= UXNMR, Bruker Analytische Messtechnik GmbH
##OWNER= root
$$ XWIN-NMR		Version 3.5
$$ Wed Dec 18 14:05:55 2019 Russian Standard Time (UT+4h)  she@DPX200
##.OBSERVE FREQUENCY= 81.013821
##.OBSERVE NUCLEUS= ^31P
##.ACQUISITION MODE= SIMULTANEOUS
##.ACQUISITION SCHEME= undefined
##.AVERAGES= 24
##.DIGITISER RES= 17
##SPECTROMETER/DATA SYSTEM= spect
##.PULSE SEQUENCE= zgpg30
##.SOLVENT NAME= CDCl3
##.SHIFT REFERENCE= (INTERNAL, CDCl3, 0, 182.463)
##AUDIT TRAIL= $$ (NUMBER, WHEN, WHO, WHERE, WHAT)
$$ ##TITLE= Audit trail, XWIN-NMR		Version 3.5
$$ ##JCAMPDX= 5.01
$$ ##ORIGIN= Bruker BioSpin GmbH
$$ ##OWNER= she
$$ F:/spectra/data/she/nmr/P31/1/pdata/1/auditp.txt
$$ ##AUDIT TRAIL=  $$ (NUMBER, WHEN, WHO, WHERE, WHAT)
(   1,<2019-12-18 14:04:38.25 +0400>,<she>,<DPX200>,
      <created by zg, POWCHK disabled, PULCHK disabled
       configuration hash MD5:
       00 E9 B6 7A A2 85 ED C7 34 08 36 98 17 FE 4E 26
       data hash MD5: 32K
       CA 58 2B 5F 94 89 72 81 9D 90 A2 E9 C9 C1 12 F9>)
(   2,<2019-12-18 14:04:40.56 +0400>,<she>,<DPX200>,
      <Start of raw data processing
       efp BC_mod = 2 LB = 1 FT_mod = 6 PKNL = 1 PHC0 = -1308.307 PHC1 = 44.40093 SI = 64K 
       data hash MD5: 64K
       3A E8 3C 04 CA AB DE 93 A3 B9 F3 9E A6 DC CB A1>)
(   3,<2019-12-18 14:05:12.78 +0400>,<she>,<DPX200>,
      <pk PHC0 = -21.13087 PHC1 = 140.0002 
       data hash MD5: 64K
       0C E0 8B 5D 9B 4C B1 21 67 42 F1 69 92 59 99 6F>)
(   4,<2019-12-18 14:05:21.40 +0400>,<she>,<DPX200>,
      <abs ABSG = 5 
       data hash MD5: 64K
       89 10 63 53 4A 86 71 42 FE B6 9F B8 D6 18 B7 95>)
$$ ##END=
$$ 
$$ hash MD5
$$ 4B EC 6B FE 20 33 EE 98 4E 01 59 A5 56 CF CE BC
##$RELAX= 
##$RELAX= 
##$RELAX= 
##$RELAX= 
##$RELAX= 
##$RELAX= 
##$RELAX= 
##$RELAX= 
$$ Bruker specific parameters
$$ --------------------------
##$DU= <F:/spectra>
##$EXPNO= 1
##$NAME= <P31>
##$PROCNO= 1
##$TYPE= <nmr>
##$USER= <she>
##$AMP= (0..31)
100 100 100 100 100 100 100 100 100 100 100 100 100 100 100 100 100 100 
100 100 100 100 100 100 100 100 100 100 100 100 100 100 
##$AQSEQ= 0
##$AQ_mod= 1
##$AUNM= <au_zg>
##$AUTOPOS= <>
##$BF1= 81.014009
##$BF2= 200.13
##$BF3= 200.13
##$BF4= 200.13
##$BF5= 200.13
##$BF6= 200.13
##$BF7= 200.13
##$BF8= 200.13
##$BYTORDA= 1
##$CFDGTYP= 0
##$CFRGTYP= 5
##$CHEMSTR= <none>
##$CNST= (0..31)
1 1 145 1 1 1 1 1 1 1 1 1 1 1 1 1 1 1 1 1 1 1 1 1 1 1 1 1 1 1 1 1 
##$CPDPRG= <waltz16>
##$CPDPRG1= <>
##$CPDPRG2= <waltz16>
##$CPDPRG3= <>
##$CPDPRG4= <mlev>
##$CPDPRG5= <mlev>
##$CPDPRG6= <mlev>
##$CPDPRG7= <mlev>
##$CPDPRG8= <mlev>
##$CPDPRGB= <>
##$CPDPRGT= <>
##$D= (0..31)
0 1 0 0 0 0 0 0 0 0 0 0.03 2e-05 3e-06 0 0 0 0 0 0 0 0 0 0 0 0 0 0 0 0 
0 0 
##$DATE= 1576663477
##$DBL= (0..7)
120 120 120 11 120 120 24 19 
##$DBP= (0..7)
150 150 150 150 150 150 150 150 
##$DBP07= 0
##$DBPNAM0= <>
##$DBPNAM1= <>
$$ [...]
##$SUBNAM3= <"">
##$SUBNAM4= <"">
##$SUBNAM5= <"">
##$SUBNAM6= <"">
##$SUBNAM7= <"">
##$SUBNAM8= <"">
##$SUBNAM9= <"">
##$SW= 369.568048894756
##$SWIBOX= (0..15)
0 1 3 0 0 0 0 0 0 0 0 0 0 0 0 0 
##$SW_h= 29940.119760479
##$TD= 32768
##$TD0= 1
##$TE= 0
##$TE2= 300
##$TE3= 300
##$TEG= 300
##$TL= (0..7)
0 120 53 12 22 120 120 120 
##$TP= (0..7)
150 150 150 150 150 150 150 150 
##$TP07= 0
##$TPNAME0= <>
##$TPNAME1= <>
##$TPNAME2= <>
##$TPNAME3= <>
##$TPNAME4= <>
##$TPNAME5= <>
##$TPNAME6= <>
##$TPNAME7= <>
##$TPOAL= (0..7)
0.5 0.5 0.5 0.5 0.5 0.5 0.5 0.5 
##$TPOFFS= (0..7)
0 0 0 0 0 0 0 0 
##$TUNHIN= 0
##$TUNHOUT= 0
##$TUNXOUT= 0
##$USERA1= <user>
##$USERA2= <user>
##$USERA3= <user>
##$USERA4= <user>
##$USERA5= <user>
##$V9= 5
##$VALIST= <valist>
##$VCLIST= <CCCCCCCCCCCCCCC>
##$VD= 0
##$VDLIST= <DDDDDDDDDDDDDDD>
##$VPLIST= <PPPPPPPPPPPPPPP>
##$VTLIST= <TTTTTTTTTTTTTTT>
##$WBST= 1024
##$WBSW= 4
##$XGAIN= (0..3)
0 0 0 0 
##$XL= 0
##$YL= 0
##$YMAX_a= 13838
##$YMIN_a= -12439
##$ZGOPTNS= <>
##$ZL1= 120
##$ZL2= 120
##$ZL3= 120
##$ZL4= 120
##$ABSF1= 182.463
##$ABSF2= -187.1042
##$ABSG= 5
##$ABSL= 3
##$ALPHA= 0
##$AQORDER= 0
##$ASSFAC= 0
##$ASSFACI= 0
##$ASSFACX= 0
##$ASSWID= 0
##$AUNMP= <proc_1d>
##$AZFE= 0.1
##$AZFW= 0.5
##$BCFW= 0
##$BC_mod= 2
##$BYTORDP= 0
##$COROFFS= 0
##$CY= -3
##$DATMOD= 1
##$DC= 0
##$DFILT= <>
##$DTYPP= 0
##$F1P= 0
##$F2P= 0
##$FCOR= 1
##$FTSIZE= 65536
##$FT_mod= 6
##$GAMMA= 0
##$GB= 0
##$INTBC= 1
##$INTSCL= 5.30512e-09
##$ISEN= 30
##$LB= 1
##$LEV0= 0
##$LPBIN= 0
##$MAXI= 10000
##$MC2= 0
##$MEAN= 0
##$ME_mod= 0
##$MI= 50
##$NCOEF= 0
##$NC_proc= -5
##$NLEV= 6
##$NOISF1= 182.463
##$NOISF2= 159.3651
##$NSP= 0
##$NTH_PI= 0
##$NZP= 0
##$OFFSET= 182.463
##$PC= 4
##$PHC0= -1329.438
##$PHC1= 184.4011
##$PH_mod= 1
##$PKNL= yes
##$PPARMOD= 0
##$PSCAL= 0
##$PSIGN= 0
##$REVERSE= no
##$SF= 81.0140089999434
##$SI= 65536
##$SIGF1= 159.3651
##$SIGF2= -187.1042
##$SINO= 113.3802
##$SIOLD= 16384
##$SREGLST= <1H.CDCl3>
##$SSB= 0
##$STSI= 65536
##$STSR= 0
##$SW_p= 29940.119760479
##$SYMM= 0
##$S_DEV= 0
##$TDeff= 32768
##$TDoff= 0
##$TI= <>
##$TILT= no
##$TM1= 0
##$TM2= 0
##$TOPLEV= 0
##$USERP1= <user>
##$USERP2= <user>
##$USERP3= <user>
##$USERP4= <user>
##$USERP5= <user>
##$WDW= 1
##$XDIM= 65536
##$YMAX_p= 283445080
##$YMIN_p= -16268276
$$ End of Bruker specific parameters
$$ ---------------------------------
##NTUPLES= NMR SPECTRUM
##VAR_NAME=  FREQUENCY,     SPECTRUM/REAL,   SPECTRUM/IMAG
##SYMBOL=    X,             R,               I
##VAR_TYPE=  INDEPENDENT,   DEPENDENT,       DEPENDENT
##VAR_FORM=  AFFN,          ASDF,            ASDF
##VAR_DIM=   65536,         65536,           65536
##UNITS=     HZ,            ARBITRARY UNITS, ARBITRARY UNITS
##FACTOR=    0.456856943014862, 1,           1
##FIRST=     14782.0589164792, 0,            0
##LAST=      -15158.0608439998, 0,           0
##MIN=       -15158.0608439998, -16268276,   0
##MAX=       14782.0589164792, 283445080,    0
$$ Real data points
##PAGE= N=1
##DATA TABLE= (X++(R..R)), XYDATA
$$ [...]
45980C88855j6730m89245l52020L38422O58438J34405m92426m26535r1152l63350
45970g11338r84602q54753J45068P90648L42056k83885J05079J141503J418249
45961A108025N40129l78636l90118L9088n2749o34212q80853n50231k79263m32419
45951a911239m81764M1949O36453N53491M2479K5127O18820Q81327K63923m99016
45941A71550m72428J30071L80875M5390k24905J2712M38792N79809L39734k08583
45931A193017r53290j442938j082452l5873O04872J15854p85409q22626J27399
45922c081446R59737R23942M58000K34202J76053o0746k45820N7120N98705O77532
45912F97279J84306k75890l44534l16671m08094k83164K92136Q47772P84708K36406
$$ plain form
45980 388855 372125 -117120 -469140 -130718 527720 662125 169699 -256836 -347988 -711338
45970 -711338 -1695940 -2550693 -2405625 -1614977 -1272921 -1556806 -1451727 -310224 1108025
45961 1108025 1648154 1269518 879400 918488 865739 231527 -649326 -1199557 -1478820 -1911239
45951 -1911239 -2393003 -2351054 -1714601 -1161110 -1118631 -1093504 -474684 406643 670566 171550
45941 171550 -300878 -170807 210068 255458 30553 43265 482057 1061866 1401600 1193017
45931 1193017 239727 -1203211 -2285663 -2321536 -1716664 -1600810 -2386219 -3208845 -3081446
45922 -3081446 -2121709 -1197767 -739767 -505565 -329512 -390258 -636078 -578958 19747 697279
45912 697279 881585 605695 261161 -55510 -463604 -746768 -454632 393140 1177848 1414254
45902A414254j60053j58423o4460j04000j38106m5744M0298M406n7392l5170M0107
45891G35717J22685K09135K00773n5637m89439p77899p13552m26402j35561J36122
45881a194058M48349O86823O13126J46594n02775r54618q77131k12125O79393
45872a166422J179330R40735L02365k4811J81128L17178k18611j015573j007776
45863e12457K3769R28655O45901l32211p04187k20922J89545P7735O3730M48584
45853F08142M46888m13660j118106m92680R15168J471793O63398m62716r23697
45844F94530p55730l19936K43912O27302L87762k51643m37129R8382N73931L25021
45834A186402k43910l62347K219K78525J57685j50019l04585j57245J65109L51171
$$ plain form
45902 1414254 1254201 1095778 1031318 927318 789212 743468 783766 788172 730780 695610 735717
45891 735717 858402 1067537 1268310 1212673 723234 -54665 -768217 -1194619 -1330180 -1194058
45881 -1194058 -745709 -58886 554240 700834 198059 -756559 -1633690 -1845815 -1166422
45872 -1166422 12908 953643 1256008 1231197 1412325 1729503 1510892 495319 -512457
45863 -512457 -488688 439967 1085868 753657 49470 -171452 18093 95828 159558 608142
45853 608142 1055030 641370 -476736 -969416 -54248 1417545 2080943 1618227 694530
45844 694530 -61200 -381136 -137224 490078 877840 626197 189068 287450 861381 1186402
45834 1186402 942492 580145 582364 860889 1018574 868555 563970 406725 571834 923005
45824I23005K49707Q0549K2457k00303q00943j237087q16214J13190N03038J62693
45814i99908n8874K04706L00926r4603l15979J7423K59067L8204J05818Q64064
45804C20844J194375R0899j420800j520794k03257Q65655P86094K48788M3342
45795D05146J52912L97001P10407O67046j02720r29609p41606J94969M57588l55395
45785H55739r85435n35153J98157J62136l34830l99505m8620J02379J7237J12726
45775h55169L71053M61350M41412N52705N85447K08642k85530l30655l7275j9305
45765A092675l00341j93878N41304J132272P73845k82980j072918j090370o78080
45756g8471l40491j36831R7971K98124K74278R5547l3626k03299o24218r99070
$$ plain form
45824 923005 1172712 1253261 1275718 1075415 274472 -962615 -1778829 -1665639 -1162601 -999908
45814 -999908 -1058782 -854076 -553150 -647753 -963732 -946309 -687242 -649038 -543220 320844
45804 320844 1515219 1606118 185318 -1335476 -1538733 -673078 113016 361804 405146
45795 405146 558058 955059 1665466 2332512 2229792 1300183 558577 753546 1211134 855739
45785 855739 -129696 -664849 -466692 -304556 -639386 -1038891 -1087511 -985132 -967895 -855169
45775 -855169 -484116 -22766 418646 971351 1556798 1765440 1479910 1149255 1111980 1092675
45765 1092675 792334 598456 1139760 2272032 3045877 2762897 1689979 599609 -78471
45756 -78471 -418962 -555793 -457822 -159698 114580 210127 176501 -26798 -651016 -1650086
45746a650086o91377K30125P88319M23590j29346L585M30321K55987k13496J26392
45736d25986J144716J323642O4411j189962r31103L56229J082586P30719O7875
45727B223127l19359n50923o54564l05737M23463Q21129M00277m28510q59785
45718G49118o34649k30809j92820m80482o12274l86140j39040j09331N0806O30992
45708a354629J079388O48729l27075p56925m37844k83635o37554n94470L41010
45699b323005J119920P04446k13843l17691K35547K61903l24980m08756L29801
45690i36658Q12976L12205m77929o58846l86187k44830j78899J85408O53088O32874
45680b86798R632o57358p54704j90751N58104Q74484N91102J22522j44995l50038
$$ plain form
45746 -1650086 -2341463 -2111338 -1323019 -899429 -1028775 -1025190 -594869 -338882 -552378 -425986
45736 -425986 718730 2042372 2106783 916821 -14282 341947 1424533 2155252 2223127
45727 2223127 1903768 1352845 698281 392544 816007 1637136 2037413 1608903 749118
45718 749118 114469 -116340 -309160 -789642 -1401916 -1788056 -1927096 -2036427 -1985621 -1354629
45708 -1354629 -275241 373488 46413 -710512 -1148356 -1431991 -2069545 -2664015 -2323005
45699 -2323005 -1203085 -498639 -712482 -1030173 -794626 -532723 -857703 -1266459 -936658
45690 -936658 -123682 188523 -289406 -948252 -1334439 -1579269 -1758168 -1572760 -919672 -286798
45680 -286798 -277166 -934524 -1689228 -1879979 -1321875 -447391 143711 266233 121238 -228800
45670b28800o74476p05824J7996R94478J154813L43364m61296n80442l83607k94523
45660h18317m0009N20656P23159R1168o83778o82101j59010j5653k52475p7393
45650a393753N70195P85992J95471l86373k57827Q7415j45098o99667o28607K68320
45640a603932J114006J078519K90065m84644o77505l00939K14488L98877J21572
45631A50507l07762n13358n00784n36606o30073m78514j8558L46209L01872P4475
45621b112592R231K9827m3047M9892N83055J057882O65301l80851q56806k31522
45611a229630M89658K36405n53999p06295j29238J92334j52009m26095O366P28699
45601a543804R15838L68701l75690n87880P1734J101479J374973L82742q75087
$$ plain form
45670 -228800 -903276 -1609100 -1591104 -596626 558187 901551 440255 -140187 -523794 -818317
45660 -818317 -858326 -337670 385489 476657 -207121 -889222 -1048232 -1063885 -1316360 -1393753
45650 -1393753 -823558 -37566 157905 -228468 -486295 -398880 -543978 -1243645 -1872252 -1603932
45640 -1603932 -489926 588593 878658 394014 -283491 -584430 -369942 28935 150507
45631 150507 -157255 -670613 -1171397 -1708003 -2338076 -2816590 -2835148 -2488939 -2187067 -2112592
45621 -2112592 -2103361 -2073534 -2116581 -2066689 -1483634 -425752 239549 -141302 -998108 -1229630
45611 -1229630 -739972 -503567 -1057566 -1763861 -1893099 -1700765 -1852774 -2278869 -2272503 -1543804
45601 -1543804 -627966 -259265 -634955 -1222835 -1151101 -49622 1325351 1708093 833006
45592H33006j007573j38779L26758j01882l26938L85600J129984R09864K71801
45583B281841J92490K91872l77353j390637j436721n06500L0825l54890n99933
45574a869006R2560J009508J167195O62883J01805l51878o34361l83622L23433
45565A18517O07381p383p00489n24029J71870M10986J13779r1889j24683l76299
45555d02239o73434m88897o1497j27993n41272l66174M85339R37450M35464k05064
45545a008317j73584J60010J24362j25245j50424j22761l20130l75659Q2151N67406
45535a342191M25533l2117M762N58587R37169Q50588N83951K59162j95395m93581
45525A556468k97472L9620p6670m11593k52768K52547K20863m34069p69580l87039
$$ plain form
45592 833006 -174567 -313346 13412 -88470 -415408 -29808 1100176 2010040 2281841
45583 2281841 2474331 2766203 2388850 998213 -438508 -945008 -914183 -1269073 -1869006
45574 -1869006 -1776446 -766938 400257 1063140 1164945 813067 178706 -204916 118517
45565 118517 725898 718515 18026 -506003 -334133 76853 190632 98743 -25940 -402239
45555 -402239 -1075673 -1564570 -1626067 -1754060 -2295332 -2661506 -2176167 -1238717 -803253 -1008317
45545 -1008317 -1181901 -1021891 -897529 -1022774 -1173198 -1295959 -1616089 -1991748 -1909597 -1342191
45535 -1342191 -916658 -948775 -944013 -385426 551743 1402331 1986282 2245444 2050049 1556468
45525 1556468 1258996 1298616 1221946 810353 557585 810132 1030995 596926 -172654 -559693
45515e59693o4163l50609o47458l46239R9263L9065k41361j13646K94668M30744
45505a459429K52378O5918j22679l56692k58386M24254J142905J150468N07508
45496A346245j32259m21390m19559j93959N9292p1855n35037n50691K49636J001596
45486C32019P94969Q5912j21917O3476j54987o29652n20407L8214P8476l87519
45476d21416k99478M78629P43600j628o52273l71475J00573p1290l48377M2678
45466h00457O02403M38928j79475l90943k05237j95393k53733J32322P22126P87146
45456F57687L12714p2226j52618j83645j46627J07284K39469o7114k67810K84488
45446G11602R89270O61197n33575j141217n61308K08956K99950J14836J93914
$$ plain form
45515 -559693 -623856 -974465 -1621923 -1968162 -1868899 -1829834 -2071195 -2184841 -1890173 -1459429
45505 -1459429 -1207051 -1141133 -1263812 -1620504 -1878890 -1454636 -311731 838737 1346245
45496 1346245 1213986 792596 373037 179078 238370 166515 -368522 -919213 -669577 332019
45486 332019 1126988 1212900 1090983 1154459 999472 369820 -150587 -112373 -33897 -421416
45476 -421416 -720894 -242265 501335 499707 -152566 -524041 -423468 -494758 -843135 -800457
45466 -800457 -198054 240874 61399 -329544 -534781 -730174 -983907 -851585 -129459 657687
45456 657687 970401 898175 745557 561912 415285 522569 762038 694924 427114 711602
45446 711602 1700872 2362069 1828494 687277 125969 334925 634875 749711 943625
45437I43625J89731k11198m10944O6633N05897N5540p61164p61133M2329N05498
45427A64814J86529q0389L20150P75662M91400k21644m59524j20276K2191m03440
45417F75473p58568l81471L41919M65810j51385o35953l87108O5854m7203m78935
45407a291567l28890N04347J051226O21753k59827o33637l01921J92121M11138
45398c5257L66564K19325O7659m2018j62854l85611n48927k84621L73779P60596
45388C28635L79471l43681o22868l93788k02078j62291J64257P51964Q29495M3388
45378G72504p89410p17905K1500M17354J33822j97578o3341K77015L48559Q0812
45368B83332l31780o86682o71992j4760R51217J332443P24646j46695l23134J32663
$$ plain form
45437 943625 1133356 922158 511214 577847 1083744 1139284 378120 -383013 -340684 164814
45427 164814 351343 270954 591104 1366766 1858166 1636522 1176998 1056722 1078913 675473
45417 675473 -83095 -464566 -122647 343163 191778 -444175 -831283 -765429 -812632 -1291567
45407 -1291567 -1620457 -1116110 -64884 556869 297042 -336595 -638516 -446395 -35257
45398 -35257 331307 550632 618291 576273 413419 27808 -521119 -805740 -431961 328635
45388 328635 708106 364425 -258443 -652231 -854309 -1016600 -852343 -100379 729116 772504
45378 772504 -16906 -734811 -713311 -295957 -162135 -359713 -423054 -146039 202520 283332
45368 283332 -48448 -735130 -1407122 -1421882 -470665 861778 1586424 1439729 1116595 1249258
45358A249258L43270q7889o15282o18345j67196K46591L03616k7942o12234j137575
45348a123728j239957q50475k57847K68680O82924R10010P39444K02490k23152
45339h91611j02969L98553P21276N83641K11842o6428k20227m23227o80132p09328
45329a178610l17493J68943J40549m60142q53177l48973O64929J176677Q61137
45320a46160L18186J8287k42418o24800p34625k77528L49779O27421O13675N94715
45310D96532M85746J33975j70342q4513J79762K01641K1971p6247j34858k62976
45300G90691j59678L78451P72520L41758n05371o97116r5065L10716m0759n02512
45290E93635l72367M3066Q0458k19004l34968j26848J23676K62252L39873K90470
$$ plain form
45358 1249258 1592528 1504639 889357 271012 103816 350407 654023 626081 13847 -1123728
45348 -1123728 -2363685 -3214160 -3472007 -3203327 -2520403 -1610393 -870949 -668459 -891611
45339 -891611 -994580 -596027 125249 708890 920732 854304 634077 210850 -469282 -1178610
45329 -1178610 -1496103 -1327160 -1186611 -1646753 -2499930 -2848903 -2183974 -1007297 -146160
45320 -146160 172026 190313 -52105 -676905 -1411530 -1689058 -1339279 -711858 -98183 496532
45310 496532 982278 1116253 945911 861398 1041160 1242801 1264772 1188525 1053667 790691
45300 790691 631013 1009464 1781984 2123742 1618371 921255 826190 1136906 1096147 593635
45290 593635 221268 264334 344792 125788 -209180 -336028 -212352 49900 389773 680243
45280F80243l8783n59680r13725p94263k31161L87036O18163M38743K86087M02709
45270B75369L96421j02274o24255m20833K88789N26457R8307q2382M22031P08786
45260A486416l0170j073671j153287l11932K88813J49224n6754K26765O15197
45251A40601N58614K12000R5735L20247N41978M62720R2164l57764o54057o80511
45241G31727m87966j99909Q3939K40868J29227j99447m20579k84365L8522J73356
45231a94627L7755j04501n8265N4314P75k38894m05163k05123L15870O79741M49794
45220C31676j73107n11386k80247N0973Q508j50750R0947N49807M68027l40355
45210D4093j031288p28558L49405J141369R94517K86467k32951l29945k55436
$$ plain form
45280 680243 641460 81780 -831945 -1626208 -1857369 -1470333 -852170 -413427 -127340 275369
45270 275369 671790 569516 -54739 -475572 -186783 339674 437981 355599 777630 1486416
45260 1486416 1456246 382575 -770712 -1082644 -793831 -644607 -701361 -474596 140601
45251 140601 699215 911215 1006950 1327197 1869175 2331895 2424059 2066295 1412238 731727
45241 731727 243761 43852 127791 368659 497886 298439 -122140 -406505 -367983 -194627
45231 -194627 -156872 -261373 -319638 -265324 -264549 -503443 -908606 -1113729 -797859 -118118 331676
45220 331676 158569 -352817 -633064 -582091 -573583 -724333 -633386 -83579 384448 44093
45210 44093 -987195 -1715753 -1366348 -224979 769538 1056005 823054 493109 237673
45201B37673j31876J16550K85102j7514n73631n20037L88282J093332O04736m26850
45191A055767n75253J73548M20331l37890q52639j98413O46415L73617n23280
45182A82203n69475L24855P97212K02481n32282m79685O75P4193k61042l23748
45172e84613J65391O70770M78350m44844j267152j092967k6610Q50946P76283
45163d74446J71900j40730r6161j27145j82837J30085O17540O30628J58276p0743
45153F16367K50844N20307J88704m18907n95714j35685N31105P83676L19513m73425
45143A586785p57258k70883J29423m01865j289068j177230P2793J087820Q82416
45134a37067L3341m17037k74484Q8924M59896O33578K89489l77955n87914j09629
$$ plain form
45201 237673 105797 222347 507449 489935 -83696 -603733 -215451 877881 1482617 1055767
45191 1055767 480514 654062 1074393 736503 -116136 -314549 331866 705483 182203
45182 182203 -387272 -62417 734795 937276 404994 -74691 -74016 177 -260865 -584613
45172 -584613 -419222 251548 729898 285054 -982098 -2075065 -2101675 -1250729 -474446
45163 -474446 -302546 -443276 -539437 -666582 -849419 -719334 -101794 528834 687110 616367
45153 616367 867211 1387518 1576222 1157315 561601 425916 957021 1740697 2060210 1586785
45143 1586785 829527 558644 688067 286202 -1002866 -2180096 -2107303 -1019483 -137067
45134 -137067 -103726 -520763 -795247 -706323 -246427 387151 676640 298685 -289229 -398858
45124c98858K42615j25336o00352m35131p4063l82597j062958r82405Q9136J091638
45114b638311J082300K62977m80089m86688K44211J072568J238078P14146K78453
45105A287645L61258L31262m35046j318450j238130l20773L00949K36931K36195
45096e58159P06416R71037M43756l56750n51632o4918M67215N24924O5454n63094
45086A084249p78914k27134O54387R17363K11306p44488j028895n24792J39489
45077b97429L21586j34599q00081r20073j15932J038969J478026P82879m27279
45068I26067j226998j132344k41079Q13265J121551L78999n21308n05021J41459
45059b45409J93477n36847q71160k15623M95252M39844J69404L03571K52599n01090
$$ plain form
45124 -398858 -156243 -281579 -881931 -1317062 -1391125 -1773722 -2836680 -3819085 -3729949 -2638311
45114 -2638311 -1556011 -1293034 -1773123 -2259811 -2015600 -943032 295046 1009192 1287645
45105 1287645 1648903 1980165 1545119 226669 -1011461 -1332234 -1031285 -794354 -558159
45096 -558159 148257 1119294 1563050 1206300 654668 589750 1056965 1581889 1647343 1084249
45086 1084249 305335 78201 732588 1649951 1861257 1116769 87874 -436918 -297429
45077 -297429 24157 -110442 -910523 -1830596 -1946528 -907559 570467 1353346 926067
45068 926067 -300931 -1433275 -1674354 -861089 260462 639461 118153 -386868 -245409
45059 -245409 -51932 -588779 -1459939 -1675562 -1180310 -740466 -571062 -267491 -14892 -515982
45049e15982r90318k18971Q40531N27419p67829j106709n6277Q02515O09902M18149
45039d57570J012925J429413O77048n65622j131267j015277p28902j58670O97061
45030b40861R13996k9875r72475o01625M39918N81596j10048k01226N30178P28235
45020A037813j37459q63105n81186q1655k12837m00076J39007Q39980P10773J2848
45010D64103k48460M149J2362l24142k73762L79563Q77465O19514n5452n06289
45000I49051n60085l53393L2855M19791M41584N457m28793l83791k068J85461
44990C06069K9445n8320K44490O53444O52747K31559r8298n3474K2618k64101
44980A666179p12044q37217n94571k98741O503M78965Q23584M56468m85639j024042
$$ plain form
45049 -515982 -1506300 -1725271 -884740 -357321 -1125150 -2231859 -2288136 -1485621 -875719 -457570
45039 -457570 555355 1984768 2661816 2096194 964927 -50350 -779252 -937922 -240861
45030 -240861 673135 643260 -329215 -930840 -490922 90674 -19374 -220600 309578 1037813
45020 1037813 900354 37249 -543937 -625592 -838429 -1238505 -1099498 -259518 451255 464103
45010 464103 215643 219792 232154 -91988 -365750 13813 891278 1510792 1455340 949051
45000 949051 388966 35573 68428 488219 929803 935260 506467 122676 120608 306069
44990 306069 335514 277194 521684 1175128 1827875 2059434 1961136 1907662 1930280 1666179
44980 1666179 954135 116918 -477653 -776394 -769891 -290926 532658 989126 503487 -520555
44970e20555n97405J82529M72612K93924J37039L5429k48283m94699k60754L27324
44960f72839O73684N16743J14262k22485k97597K3204M99282M49842l51649j024049
44950b91602o09675M67923Q83759K58274m45662m42270n6180J16774P5396M7785
44940D522J8314L2295L15541P10900O39756J1184m79345l82491j68495l64845
44930C37336o56442m73796L3615K93447K21227J88917L26276M21768L47938J26307
44920A166593k44131o23977o34697j39085L96074M25384L1286k52812j45646J67675
44910A46664L43603J67183k40202l58113K07811R89872R96916N3526q45130r18085
44900E44045o15870o55285p72890l15113M75398P71998M57340J37245N0941q8793
$$ plain form
44970 -520555 -1117960 -935431 -462819 -168895 -31856 3573 -244710 -739409 -1000163 -672839
44960 -672839 845 517588 631850 409365 111768 134972 634254 1084096 732447 -291602
44950 -291602 -901277 -433354 450405 708679 263017 -179253 -235433 -118659 -43263 4522
44940 4522 22836 55131 370672 1081572 1721328 1732512 1253167 870676 702181 337336
44930 337336 -319106 -792902 -759287 -465840 -244613 -55696 270580 692348 1040286 1166593
44920 1166593 922462 298485 -336212 -475297 -79223 346161 377447 124635 -21011 146664
44910 146664 490267 657450 417248 59135 266946 1256818 2253734 2307260 1462130 544045
44900 544045 -71825 -727110 -1500000 -1815113 -1339715 -567717 -110377 26868 77809 -10984
44890a0984k67436j20108K68952L75684J06553j25013k12563m17932n78966j77879
44880a159692O12198Q60400J97112n92095o68957j28979M80786R09638J023457
44871A533868N65086l35730r37457p27926q9131L29621M61902N68327N76143K61320
44861B206023k05324m43995m03911k76753r9860J23998J54656j63373m97695m18967
44851b5201m6218J52322O0618o0024j25143k67662l57910o0349N21571P96297
44841E88301N07883J33516J25400J76471k48055q92761q79926K9023R31145Q72793
44831A343790K3594o94525q53100p89623p53072n09383J3681L58399K26113J9375
44821a614751J88889M43628K06884m03010o78545l16722K36046M15262R2895m41963
$$ plain form
44890 -10984 -278420 -398528 -129576 246108 352661 227648 15085 -402847 -981813 -1159692
44880 -1159692 -547494 312906 510018 -82077 -751034 -880013 -399227 510411 1533868
44871 1533868 2098954 1763224 825767 97841 8710 338331 800233 1368560 1944703 2206023
44861 2206023 2000699 1556704 1152793 876040 776180 900178 1054834 891461 393766 -25201
44851 -25201 -71419 80903 141521 81497 -43646 -311308 -669218 -729567 -207996 588301
44841 588301 1096184 1229700 1355100 1531571 1283516 390755 -489171 -460148 470997 1343790
44831 1343790 1367384 672859 -180241 -969864 -1722936 -2232319 -2218638 -1860239 -1634126 -1614751
44821 -1614751 -1425862 -982234 -775350 -1178360 -1856905 -2173627 -1937581 -1522319 -1429424 -1871387
44811a871387o95023k97758N08988R39184N96410J1172k30359l98916r10584j199173
44801c547446m07313J013804J631444J025530K56066J20702J68600j26699m01653
44792b66965k57682o3850j74598k15645J20038L74128J66562m1658J88572M05310
44782B34212J03383k84521j43889K22876J89701j08583k34216l60769o96751o42103
44772a720660K67649J124698P27564m66699r01270k30270M09968M08505M11124
44763C0609P95849Q90242K37952n63307q71888q40743p22953l06162L86988P05102
44753b58311K91849k91552l83211l9629L45164N85323N54588J90741j04590J50638
44743A041010N67955K87847m92265o16161N3456K04805o97667j295008n15365
$$ plain form
44811 -1871387 -2566410 -2864168 -2355180 -1415996 -819586 -808414 -1038773 -1437689 -2348273 -3547446
44801 -3547446 -3954759 -2940955 -1309511 -283981 -27915 92787 261387 134688 -266965
44792 -266965 -524647 -588497 -763095 -978740 -858702 -484574 -318012 -359670 -171098 234212
44782 234212 337595 53074 -90815 132061 321762 213179 -21037 -381806 -1078557 -1720660
44772 -1720660 -1453011 -328313 399251 -67448 -968718 -1198988 -789020 -380515 30609
44763 30609 826458 1716700 1954652 1391345 519457 -321286 -1044239 -1350401 -963413 -258311
44753 -258311 33538 -258014 -641225 -680854 -335690 249633 804221 994962 890372 1041010
44743 1041010 1608965 1896812 1404547 788386 841842 1046647 348980 -946028 -1461393
44734a461393N77246N41544r9433n518M99794J10536q98996r37426K07083R89140
44724d77423O40397J72720L75775N76354J25595m06003l99206k69455m68476n22136
44714f51858j0374M69327K84255j35112j32192J9939k10765m84712j80780M25305
44704f06967N92342K93118L0306r2022j94192J1577O83182J121208O54449j40949
44694B352052k51478J22675K2003m69165l87665K11778J87934o01508q34693M8999
44684D00932P62162K44659n92678m19809L63932M65766j17011k88881J76575L60157
44674A355804j48635o27613m73909m4851Q6494o2047j70061j57792j42528j97347
44664e82485k99071k88524M9568O11301R03549O92355L89283L41097J85290m12506
$$ plain form
44734 -1461393 -884147 -342603 -442036 -447554 52240 162776 -736220 -1673646 -1466563 -477423
44724 -477423 162974 335694 711469 1287823 1413418 1007415 608209 338754 -129722 -651858
44714 -651858 -662232 -192905 91350 -43762 -175954 -156015 -366780 -851492 -1032272 -606967
44704 -606967 -14625 278493 308799 216777 22585 34162 717344 1838552 2493001 2352052
44694 2352052 2100574 2223249 2245252 1776087 1388422 1600200 1788134 1186626 351933 400932
44684 400932 1163094 1407753 815075 395266 759198 1224964 1107953 819072 995647 1355804
44674 1355804 1207169 579556 105647 60796 147290 85243 -84818 -242610 -385138 -582485
44664 -582485 -881556 -1170080 -1120512 -509211 394338 1086693 1475976 1817073 2002363 1589857
44654A589857q42485l40652N68411N56212n51689j432868j152744l38872J42r8926
44644b043614J7952M37496O69144M74579J07939j18525j27561k9801M5161J68172
44634c99058N76190J150587J191645K97679p44714p82157L9699L97813k83802
44625A443882j068222j000993l35101K56746O96718J025379Q01534j43958j004245
44616F71740r15645j27846M60718M89986K16808j12335l26493k25669L0602m5963
44606A15903l79139k07168N75818R00753J77555n27956r9427P58488O38704l05531
44596A648000p71071m64582k02634j72356J72909N73803J05642r65822j199271
44587a275382k45241N30353K43839k42690P553N19317N23125L14536M43011N47991
$$ plain form
44654 1589857 747372 406720 975131 1531343 979654 -453214 -1605958 -1944830 -1944688 -2043614
44644 -2043614 -2025662 -1588166 -919022 -444443 -336504 -455029 -582590 -612391 -567230 -399058
44634 -399058 177132 1327719 2519364 2817043 2072329 1290172 1329871 1727684 1443882
44625 1443882 375660 -625333 -960434 -703688 -6970 1018409 1819943 1675985 671740
44616 671740 -243905 -371751 88967 578953 795761 683426 356933 131264 161866 115903
44606 115903 -263236 -470404 105414 1006167 1183722 655766 556339 1314827 1953531 1648000
44596 1648000 876929 412347 209713 37357 210266 784069 889711 -76111 -1275382
44587 -1275382 -1520623 -990270 -746431 -989121 -981568 -462251 60874 375410 818421 1366412
44577A366412Q0821n93818q17604o99579o43123m48038J80715P86377P78043M48152
44567D38358M41908N92592K60829m00457n16166J59571P95917N74663l46262j142156
44557H58797j209992o18017O5986K92839R295l39039k82760K52012R18008J193484
44547A140613Q13308J73490K3865M22325M58048l78526j120017o27533M88799
44538A394372O35885k69139p12204j32489K53862k63317o35621q5146L46601l38496
44528A94308j173236q19349J24902K45252j93831J29427J064713J150503J28645
44519H51334o48694m49231m8277r3724j70820N1301J22987j93780l77187r8614
44509a054705K29391K46204J05779j08788n14945p82494l58733M45984O58244
$$ plain form
44577 1366412 1447233 853415 35811 -663768 -1306891 -1754929 -1574214 -787837 -9794 438358
44567 438358 880266 1472858 1733687 1333230 817064 976635 1772552 2347215 2000953 858797
44557 858797 -351195 -969212 -903226 -610387 -601092 -940131 -1222891 -970879 -52871 1140613
44547 1140613 1953921 2127411 2151276 2573601 3031649 2653123 1533106 905573 1394372
44538 1394372 2030257 1761118 1048914 916425 1170287 906970 271349 186203 532804 194308
44528 194308 -978928 -1798277 -1673375 -1428123 -1621954 -1492527 -427814 722689 851334
44519 851334 202640 -246591 -294868 -388592 -559412 -508111 -385124 -578904 -956091 -1054705
44509 -1054705 -825314 -579110 -473331 -582119 -1097064 -1879558 -2238291 -1792307 -1134063
44500a134063J72469n1491L64438O01847J61177k56981o7351J83752l8013j84066
44490b48282K90532P15850K64351m95718l90982M34079O77028j38035j001395
44481A07428r24246j79938L19514K56837P7151K05506M76621M11286n8815m05961
44471B85383k69499j16487n69927j226053r99029K06708J134299R32663L22351
44462b99591K98337N86154M08912L2820K23342O06395R6677j069931j307741j07251
44452e31877R64490N21652n89961o73013K52065O95996J27440l85900q6276L51802
44442F46418J61642k40491j64298Q9085j00056m05426j30589L97301K99698k03592
44432C49692k8745Q24877J052062J55332o88656n57277j66451l71104o07879r6483
$$ plain form
44500 -1134063 -961594 -1013085 -648647 -46800 114377 -142604 -209955 -26203 -64216 -248282
44490 -248282 42250 758100 1022451 526733 135751 569830 1246858 1108823 107428
44481 107428 -816818 -996756 -677242 -420405 -343254 -137748 338873 750159 691344 285383
44471 285383 15884 -100603 -670530 -1896583 -2895612 -2688904 -1554605 -621942 -299591
44462 -299591 -1254 584900 993812 1026632 1249974 1856369 1953046 883115 -424626 -531877
44452 -531877 432613 954265 364304 -308709 -56644 639352 766792 380892 294616 646418
44442 646418 808060 567569 403271 492356 392300 -13126 -143715 253586 553284 349692
44432 349692 320947 1145824 2197886 2353218 1664562 1107285 940834 569730 -38149 -134632
44422a34632N37006L24126k61190j91681J81146j46841p44439l66382O15767N39337
44412C52217o87904j203382j60161R49729P53399m9178k22687J01786K26633K50984
44402C11436M46500L97368j24224m51023j96636o5605m92113o52911K4747N88129
44392b14332J23028n62873l17225L52732K92865k20051j80694J77676M866k70197
44382h14205K95128J027957M98189p70089q07875N26252J208200L92397l33791
44373A222163J49624O80880J56900m09961J61729R11725L16135j003733j188423
44364I97039j02313N67411j1843p78340o08125K05498P17467N67092j176o41562
44354I11148j008554q24407k04967L30324L88316J10794k5950K57847P11185P51633
$$ plain form
44422 -134632 402374 726500 465310 273629 454775 307934 -436505 -802887 -187120 352217
44412 352217 -335687 -1539069 -1699230 -749501 3898 -45280 -267967 -166181 60452 311436
44402 311436 757936 1155304 1031080 580057 383421 317816 -174297 -827208 -802461 -214332
44392 -214332 -91304 -654177 -971402 -618670 -325805 -545856 -726550 -548874 -544008 -814205
44382 -814205 -519077 508880 1007069 236980 -570895 -44643 1163557 1555954 1222163
44373 1222163 1371787 2052667 2209567 1799606 1961335 2873060 3189195 2185462 997039
44364 997039 894726 1462137 1450294 671954 63829 269327 986794 1553886 1552710 911148
44354 911148 -97406 -921813 -1126780 -796456 -408140 -297346 -323296 -65449 645736 1397369
44344A397369J24675o84089r55792n96283r2804L07863P47630J025910N60994
44335A835473n34073j153016o25937K25111K73485k17657j11546O78182R49863
44326A319885N3837j057454j121742k20415M83171K98852l01939m82280m8992
44317a077077M80689N77563K55298n1205k7559J90823K16360j36273o29407q30368
44307a031156n60402p7809K65622M74296P59478R38000M48988p20226j579544
44298a082753j212363o2306N75119K85095m1702L28502R12972Q72760K85439q7814
44288G72949M6606K35499N3433l38086m72702j65921K49732K47505k62068p01263
44278c34316m80275J94170N62645L37959l0564j73648k55548l93522k68603K85789
$$ plain form
44344 1397369 1522044 837955 -117837 -714120 -806924 -499061 248569 1274479 1835473
44335 1835473 1301400 148384 -477553 -252442 21043 -196614 -308160 370022 1319885
44326 1319885 1373722 316268 -805474 -1025889 -542718 -243866 -545805 -1028085 -1077077
44317 -1077077 -596388 -18825 236473 185268 157709 348532 564892 428619 -200788 -1031156
44307 -1031156 -1591558 -1669367 -1403745 -929449 -169971 768029 1217017 496791 -1082753
44298 -1082753 -2295116 -2357422 -1782303 -1497208 -1538910 -1210408 -297436 575324 860763 772949
44288 772949 819555 1055054 1108487 770401 297699 131778 381510 629015 366947 -334316
44278 -334316 -814591 -620421 -57776 280183 249619 75971 -179577 -573099 -841702 -555913
44268e55913Q22741Q32219L38867l63528j061377j379492q52178K51149Q20750
44259a146762K75110n64776o85501l14236k17883k00061M39927J286348J102893
44250b4941j51103r76507m38291N65205P66169K67766J3479K55839M67386L61950
44240A106952J55272j8193k44210m23843k92315J02230L40829J47300k68756m33048
44230A72218q7263M89690O43250N1152p22949p72528n4484M60107J34737l92413
44220g8483j63776O51121J014353N09072k33011n85790o17871n52270k83769J97021
44210a43403M96459L80453J78241J92337J62959j80025m80081k98818O9852O2529
44200D40503j58048j6467L38863K04554l46823l90727L15874Q14551M68686m8441
$$ plain form
44268 -555913 266828 1099047 1437914 1074386 13009 -1366483 -2218661 -1967512 -1146762
44259 -1146762 -871652 -1436428 -2121929 -2436165 -2654048 -2854109 -2414182 -1127834 -24941
44250 -24941 -176044 -1152551 -1590842 -1025637 -259468 8298 21777 277616 745002 1106952
44240 1106952 1262224 1244031 999821 575978 283663 385893 726722 874022 605266 172218
44230 172218 84955 574645 1217895 1269047 546098 -226430 -280914 179193 313930 -78483
44220 -78483 -242259 408862 1423215 1932287 1699276 1113486 495615 -56655 -340424 -143403
44210 -143403 353056 733509 911750 1104087 1267046 1087021 606940 308122 377974 440503
44200 440503 282455 265988 604851 809405 462582 71855 387729 1202280 1670966 1622525
44190A622525j3567J13520l06202p63154n02521k4837k49762p10541k29902Q52093
44180b12348R47473j57765q20479j89684M75654J7575p57567o37286j3142R8325
44170a249244q5129K20982P18109O38052L16812N14317P23347n6086j192771j010720
44160d62331M69494J294345M74814o52266o42328L8140J33383m92118j052831
44151h91698j050991m54385N47501J277028Q94801l19343q85025o5537J003033
44142E5384R66408J17524m05777m18348m48696l96602J62992P49675M95128k72556
44132F05132l69001K99111N31192j61684p07295j93468P14700Q62579K52994k51392
44122A582868k82802j73598j64833k02640l52350p06213r13968m59323M61135
$$ plain form
44190 1622525 1608958 1722478 1416276 653122 150601 125764 -123998 -834539 -1064441 -212348
44180 -212348 735125 577360 -243119 -432803 42851 60426 -697141 -1334427 -1347569 -1249244
44170 -1249244 -1334373 -1113391 -395282 242770 559582 1073899 1797246 1741160 548389 -462331
44160 -462331 7163 1301508 1776322 1124056 481728 519868 653251 161133 -891698
44151 -891698 -1942689 -2397074 -1849573 -572545 322256 2913 -882112 -947649 55384
44142 55384 1021792 1139316 733539 315191 -133505 -530107 -367115 382560 877688 605132
44132 605132 236131 535242 1066434 904750 197455 3987 718687 1581266 1834260 1582868
44122 1582868 1300066 1126468 961635 758995 406645 -299568 -1213536 -1672859 -1211724
44113a211724Q92167K80891o68436p52617K08026J088765Q84073l2226n51227
44104A37692m27336m19503p90804o93742L53994J294217Q95075k71347n44491
44095d66245L12724P91534P4945p12268m36934J95334p7873r00651q68752K01357
44085a886829J066942J044682P89068Q54567P90735K20487k71118j00142K64229
44076B772621O0849n03020o13298j31131L00449K49648j33980o21250j058904
44067C21984j077520l97715M74004N77866k19366r04043o25745K10441O14109
44058a025985L47235K5319J00345L41585L75173K62693K93559M40848L41130j49523
44048A352379o07536m87272J24053N12273K38239k91691m50567k66115j98719
$$ plain form
44113 -1211724 -319557 -38666 -707102 -1459719 -1251693 -162928 721145 688919 137692
44104 137692 -289644 -709147 -1499951 -2193693 -1839699 -545482 349593 78246 -466245
44095 -466245 -153521 638013 712958 690 -436244 -240910 -318783 -1219434 -2088186 -1886829
44085 -1886829 -819887 224795 1013863 1868430 2659165 2879652 2608534 2508392 2772621
44076 2772621 2833470 2330450 1717152 1586021 1886470 2136118 2002138 1380888 321984
44067 321984 -755536 -1153251 -679247 -101381 -320747 -1224790 -1850535 -1640094 -1025985
44058 -1025985 -678750 -653431 -553086 -211501 163672 426365 719924 1160772 1501902 1352379
44048 1352379 744843 257571 381624 893897 1132136 840445 389878 123763 -74956
44039g4956k89171j70168J43219J78521j81452m71528l83448q6173L18322Q82953
44029a33881J181368N69845n19598o69550M33179J172078L42324q23618n24074
44020A028073O20051M83944j013041j600631k65893J080787N97137p20082q06695
44011e96350K76137P51082J1501p26514n32290L9823J29346k13658m14492k05659
44001a481074K80120P11831O50512p7941r50306j135976m59428M03996P61497
43992a296769N42655O8547l66076n45755l64445O006K47288L09221M20272N91425
43982c87631M43184k43639j027174j158599m34925M94852P85978L04176k73021
43973a496799l03039R2173L58076L44519L70454N27793M85691J24031j78852j53921
$$ plain form
44039 -74956 -364127 -534295 -391076 -212555 -394007 -865535 -1248983 -1335156 -1016834 -133881
44029 -133881 1047487 1617332 1097734 428184 861363 2033441 2375765 1552147 1028073
44020 1028073 1648124 2132068 1119027 -481604 -747497 333290 930427 210345 -596350
44011 -596350 -320213 430869 442370 -284144 -816434 -776611 -647265 -860923 -1275415 -1481074
44001 -1481074 -1200954 -489123 161389 83448 -866858 -2002834 -2462262 -2058266 -1296769
43992 -1296769 -754114 -685567 -1051643 -1597398 -1961843 -1955837 -1708549 -1399328 -979056 -387631
43982 -387631 55553 -188086 -1215260 -2373859 -2808784 -2313932 -1527954 -1223778 -1496799
43973 -1496799 -1799838 -1707665 -1349589 -1005070 -634616 -106823 378868 502899 324047 170126
43963A70126n6174j53114k47284q4676J56272J80776M6336l4704k1893J09262
43953F4927M24525O69224M15876j10740p2900O90567J303572J398247J899461
43944F682759L176102L534253J289631k273631m003559k886255j048423n04769
43936C966108q37266q04337m32053k97676j08790N87054J165292P46253l09808
43927C674777r14635q33638o55778n23279l0175P09103R36694L48833m56587q26302
43917A429013p73585o63399o03640l86918J22517O66469P29993J58605m67466
43908B11589m63344J9182K47071Q8766J52887N93852P30325K49869k03419k39847
43898A386931m74310j215749j462920m19107Q53541P78880k91736o07566K54094
$$ plain form
43963 170126 113952 -39162 -286446 -371122 -214850 -34074 12262 -22442 -44335 64927
43953 64927 489452 1158676 1574552 1463812 1390912 2081479 3385051 4783298 6682759
43944 6682759 9858861 13393114 14682745 12409114 8405555 5519300 4470877 3966108
43936 3966108 3128842 2324505 1892452 1594776 1485986 2073040 3238332 3984585 3674777
43927 3674777 2760142 1926504 1270726 747447 717272 1426375 2363069 2711902 2255315 1429013
43917 1429013 655428 -7971 -611611 -998529 -876012 -209543 520450 679055 211589
43908 211589 -251755 -232573 14498 103264 256151 850003 1580328 1830197 1626778 1386931
43898 1386931 912621 -303128 -1766048 -2185155 -1331614 -552734 -844470 -1452036 -1197942
43889a197942Q91193M40837k07461p9053M13947M35244P5027j04530p5599q8930
43879E02733j5394L00044M77348J00577n21647p09471l40359Q3512J90475J45207
43869B13025K96054O69288Q90949O13077K3247k70032l4302K12911j3772l81331
43859B219114l21117n9343k50290p72541q44568l29489P2230M9273N9814K48218
43849G1301Q6259m69238n54227K24271R65632P87663R0198l05372m37327o74103
43839b14943o72661j7484O33264K82695p55326j107257k43875Q66946J153331
43830g5310O61893J48793N1563J50211k9425n82210r47552n18110M09013Q41235
43820A10101M68318P2132J55740J27528m22815o90842k7435O17442J00462q18215
$$ plain form
43889 -1197942 -306749 134088 -73373 -152426 261521 696765 771792 667262 591663 502733
43879 502733 487339 787383 1264731 1365308 843661 134190 -206169 -122657 67818 213025
43869 213025 509079 1178367 2069316 2682393 2705640 2435608 2401306 2614217 2600445 2219114
43859 2219114 1897997 1838654 1588364 815823 -28745 -358234 -286004 -236731 -176917 71301
43849 71301 157560 -311678 -865905 -641634 323998 1111661 1201859 896487 459160 -214943
43839 -214943 -887604 -905088 -271824 10871 -744455 -1851712 -2095587 -1228641 -75310
43830 -75310 586583 735376 786939 937150 907725 325515 -622037 -1140147 -731134 110101
43820 110101 578419 650551 806291 933819 511004 -179838 -207273 410169 510631 -307584
43810c07584n53130N98279Q28139j87702p92841j93330L17657k35534q40216l98033
43800a764295L76181L73292L6120L17275P70917L73345m97230o11793M228J65199
43790d56761m13921o83075l2265P72014P40022j58683j172816j443111n38698
43781c387294R63182J629124P50630m82250m12711P29502J194741L70919m36439
43772I19404k08535L12355R1095n32183o33703k17795J08266K71588N20018O03851
43762A234361J79473l57804m08135k12447l77182o14124q1354J030837J414747
43753A808372M63180q09474j173579p22262l65720l95688l41373M3225M28167
43744a065152N26645M34979K44165j45190n88138n56068J44560Q15386N83985
$$ plain form
43810 -307584 -860714 -262435 565704 378002 -414839 -608169 -290512 -526046 -1366262 -1764295
43800 -1764295 -1388114 -1014822 -978702 -661427 109490 482835 -14395 -626188 -621960 -456761
43790 -456761 -870682 -1553757 -1586022 -814008 -73986 -232669 -1405485 -2848596 -3387294
43781 -3387294 -2424112 -794988 -44358 -526608 -939319 -209817 984924 1355843 919404
43772 919404 710869 1023224 1114319 582136 -51567 -269362 -161096 110492 630510 1234361
43762 1234361 1413834 1056030 647895 435448 58266 -555858 -637212 393625 1808372
43753 1808372 2271552 1462078 288499 -433763 -799483 -1195171 -1536544 -1493319 -1065152
43744 -1065152 -538507 -103528 140637 -4553 -592691 -1148759 -1004199 -188813 395172
43735C95172l73432r11124m08813L64674L44951k89538m06533L62136J050281
43726A27774P90549N1069j71741J46143J96694k52457n23780k31393N0064k28424
43716d5502n93892k25658P08708J128537M47337o85618j217447q46346j23976
43707a453857K95310K40050o60o7002R3782K02269O9203l8690K75032Q36145R20296
43696A371878J89619p37027j011497o22277k92926m12917n51307j38543P30363
43687a474634J370031J209877L32813n56127p00467k0083P38042P78705J56913
43678A835070l40342j67575M16247P50602M51735k93810q36916n73578K94258
43669A535691O95433o2214j166528j219988k26674L81633o9707m91758J29946
$$ plain form
43735 395172 21740 -889384 -1298197 -933523 -588572 -878110 -1284643 -922507 127774
43726 127774 918323 969392 797651 943794 1140488 888031 364251 132858 182922 -45502
43716 -45502 -639394 -865052 -156344 972193 1419530 733912 -483535 -1329881 -1453857
43707 -1453857 -1158547 -918497 -919157 -986159 -892377 -690108 -620905 -659595 -384563 451582 1371878
43696 1371878 1561497 824470 -187027 -809304 -1102230 -1515147 -2066454 -2204997 -1474634
43687 -1474634 -104603 1105274 1438087 881960 181493 161410 899452 1678157 1835070
43678 1835070 1494728 1327153 1743400 2494002 2945737 2651927 1815011 1241433 1535691
43669 1535691 2231124 2168910 1002382 -217606 -444280 -62647 -132354 -624112 -494166
43660d94166J025250Q54911j73228o97040k73641K31046J74920j28503k46371
43651B73178j66091Q0641M31122M33483j96500p37480k69032P18133Q01921j49431
43641A219944o87400j23135L92002q1726o32677j31187P04222M06421q26537j405699
43631a165772p10913K71331O05947M33801K36476J66937L06857O84179Q56305
43622A685148K98815o31100r33307l68158J86022P0736k45768o2866M02763L92615
43612G94900k12703o96525m57681K34245N67915J57924m60107m29134L75106J163445
43602A037385J194084N71213r9793m50047m48125j99418l5628l61667r63139r70164
43592g25299p1498Q01314P29781J56351L3458J91378k04841r33794r13618p9442
$$ plain form
43660 -494166 531084 1385995 1212767 515727 242086 473132 648052 519549 273178
43651 273178 107087 187728 618850 1052333 855833 118353 -150679 567454 1369375 1219944
43641 1219944 532544 409409 801411 719685 87008 -44179 660043 1066464 239927 -1165772
43631 -1165772 -1876685 -1605354 -999407 -565606 -329130 -162193 144664 828843 1685148
43622 1685148 1983963 1352863 419556 51398 237420 308156 62388 -478 402285 794900
43612 794900 582197 -114328 -572009 -337764 230151 388075 -72032 -501166 -126060 1037385
43602 1037385 2231469 2802682 2702889 2252842 1804717 1605299 1569671 1208004 244865 -725299
43592 -725299 -796797 4517 734298 890649 924107 1115485 910644 -23150 -936768 -1016210
43582a016210M26215J54900l4471L10820L99239k18889o23606p0632O27968M37812
43572C93146j53009k6956O39764P30057N2787m77694l82503j46974j84020k88304
43562A56294k43970j46722j3773K32618L76322J73839m8700J99075O27275M58863
43552A771121k89248o92380k79448L17546L85995O4143j41906j35334q3657j4362
43542I02470K7745j30900l79925k78214J87335L25909k37783p58756l13294P62335
43532A06922J215712O13317j08135l8092N10264O55458K40760j54994j92182o9485
43522B779545Q1258M15503Q37657Q61986L61333l6686K30356Q16227R91213P33518
43512H071910O48097R35965J164670J100250J041963J129362R91665M21667j69986
$$ plain form
43582 -1016210 -589995 -435095 -469566 -158746 240493 21604 -602002 -672634 -44666 393146
43572 393146 240137 213181 852945 1583002 1635789 1158095 775592 628618 444598 156294
43562 156294 -87676 -234398 -248171 -15553 360769 534608 485908 684983 1312258 1771121
43552 1771121 1481873 789493 510045 827591 1213586 1277729 1135823 1000489 916832 902470
43542 902470 930215 799315 419390 141176 328511 654420 416637 -342119 -655413 106922
43532 106922 1322634 1935951 1827816 1789724 2299988 2955446 3196206 3041212 2849030 2779545
43522 2779545 2860803 3276306 4113963 4975949 5337282 5300596 5530952 6347179 7338392 8071910
43512 8071910 8720007 9655972 10820642 11920892 12962855 14092217 15083882 15505549 15335563
43503A5335563l55960k69462k27218k61854l89317p91528j280732j176136l27642
43494A0255714K97531j64979j117796j282785n47363L659j78203m45159k49780
43485F570839o7229m84697j131042j193171n64447J33615M28406L67075J36571
43476D195920k06248n72721p40164n80628k86764k23322m96486p50060n58231
43467b18704j2985L47481K81706J61942L28854N32513M11516J60157J69551K81848
43457B443879O3211l33523l11347J67708M68334L35004L70425J134250K261205
43448F599146K807184K158496M57923j478862k571229k299396j324938q45304
43440C503020j172323j455981r89751j53595L09760L64288M75140P34609P88376
$$ plain form
43503 15335563 14979603 14710141 14482923 14221069 13831752 13040224 11759492 10583356 10255714
43494 10255714 10553245 10388266 9270470 7987685 7440322 7443981 7265778 6820619 6570839
43485 6570839 6503610 6018913 4887871 3694700 3130253 3263868 3692274 4059349 4195920
43476 4195920 3989672 3416951 2676787 2096159 1809395 1586073 1089587 339527 -218704
43467 -218704 -231689 115792 397498 559440 888294 1420807 1832323 1992480 2162031 2443879
43457 2443879 2507090 2173567 1862220 2029928 2498262 2833266 3203691 4337941 6599146
43448 6599146 9406330 11564826 12022749 10543887 7972658 5673262 4348324 3503020
43440 3503020 2330697 874716 -115035 -268630 41130 405418 880558 1615167 2403543
43431B403543M56569m7212m45104o28683o49312o75072q05885q07134l13695N20549
43421i91436R37551M53770m51759q66830m78893K02014M95637J96903l02732m08171
43411a213946J7545L98920J56893m10087m90122O815L36466K27137L72630J109028
43401E11279J531286Q06421l53879o29362m2722K26525k21763n34112j93682J29085
43391A229076k27234q37999r25893m65975N7838M44874P00695O10591O6982m38682
43381B14273l05575K87003N44629J25351m36856m77496N206M66048M77579J14470
43371A014632k04336j56091J50504K78879k8132n14447p23568n56711k83518n0957
43361a073745K58878N91346N66815R3390k09920K58327J064448J100012Q8854
$$ plain form
43431 2403543 2860112 2812900 2367796 1739113 1089801 414729 -391156 -1198290 -1511985 -991436
43421 -991436 -53885 399885 -51874 -918704 -1397597 -1195583 -699946 -503043 -805775 -1213946
43411 -1213946 -1196401 -797481 -640588 -1050675 -1540797 -1533982 -1197516 -970379 -597749 511279
43401 511279 2042565 2848986 2495107 1865745 1823023 2049548 1827785 1293673 1099991 1229076
43391 1229076 1001842 163843 -762050 -1228025 -1170187 -725313 -24618 585973 652955 214273
43381 214273 -91302 195701 740330 865681 428825 -48671 -43465 422583 900162 1014632
43371 1014632 810296 654205 804709 1083588 1055456 541009 -182559 -739270 -1022788 -1073745
43361 -1073745 -814867 -223521 343294 436684 226764 485091 1549539 2649551 2738405
43352B738405r06038q68479j95817o8900p46704j221197o28258N95902J250680
43343e0406P58901k44075o48558j11349N21632K48382o69386q84637J42877J155248
43333B18629P54494n45511j064119m36707O6974k00817k62523N98184J388966
43324E17570R53570j14018m30305K9207J78739j90613j94622L81337N61459j76646
43314A515678r28493o97095J38516M50714l0415m72857j52186O52231J059134
43305A535227O16964k14771o13640l29511J30203K70141J92876J89488J67030
43296A944007n4183j99211J00693N79482O02746J08070l31311l87124l17042l69132
43286A676995m48334m92378n87593n52977l2964P33633Q73712O3446p52242m33990
$$ plain form
43352 2738405 1832367 963888 768071 699171 -47533 -1268730 -1896988 -1301086 -50406
43343 -50406 708495 464420 -184138 -295487 226145 474527 -194859 -1079496 -936619 218629
43333 218629 973123 427612 -636507 -1073214 -1006240 -1207057 -1469580 -871396 517570
43324 517570 1471140 1357122 926817 956024 1134763 944150 749528 1130865 1692324 1515678
43314 1515678 587185 -109910 28606 479320 448905 -23952 -176138 476093 1535227
43305 1535227 2152191 1937420 1323780 994269 1124472 1394613 1587489 1776977 1944007
43296 1944007 1889824 1690613 1791306 2370788 2973534 3081604 2750293 2363169 2046127 1676995
43286 1676995 1228661 736283 148690 -404287 -437251 296382 1170094 1233540 481298 47308
43276D7308P98460J499788P28809p96841j487221o24331R13830J673255J156432
43267C909489J37272m35812m50203l97889n25096n91281l10468K92055Q87970
43258B516037J036265N56905j31163l68067j48818j89724p63054j071058m01335
43249A035988O53862R97999O44172N00373P63546O98291P7399l44173j43671N2471
43239D936257k73744n68406j38517O22763P69049J73275m06041m66389k88531
43230D359716k83363l48248j34484K76988L11236l30150j024031q07394K80908
43221B301178J010584N42174l59247m20520K66039M71581k12873p76360l79027
43212B443529M48420O97776K75531p0549J58211O42740O68041n784o76477m03835
$$ plain form
43276 47308 845768 2345556 3074365 2277524 790303 165972 1079802 2753057 3909489
43267 3909489 4046761 3610949 3160746 2762857 2237761 1646480 1336012 1628067 2516037
43258 2516037 3552302 4109207 3978044 3609977 3461159 3271435 2508381 1437323 1035988
43249 1035988 1689850 2687849 3332021 3832394 4595940 5294231 5371630 5027457 4883786 4936257
43239 4936257 4662513 4094107 3955590 4578353 5347402 5520677 5114636 4648247 4359716
43230 4359716 4076353 3728105 3593621 3870609 4181845 3851695 2827664 2020270 2301178
43221 2301178 3311762 3853936 3494689 3074169 3340208 3811789 3598916 2822556 2443529
43212 2443529 2891949 3589725 3865256 3794707 3952918 4595658 5263699 5257915 4581438 4177603
43202D177603O18276J024864J76875p12710l78785L75829o7887j290325j237848
43193B685892M89192J871701J536800N70766L50275M40328m7817n87359k80271
43184G029507L90064L94328j01331k29981M8483K09645L21061P07908J018215
43175I787899P60376K66792J12065J30596m3536j09868K61994O06118M22310P4854
43165A2269600O0038J75734K24061N27359R20689N30024m58976l87102J233916
43156A5095343K420446J721715O73516J186295K381870K578818K605815M114896
43148C2778714O256813P476121R085801J3199178J8720962K4033689L1708106
43141A43259384M3501466N0821014L9198629O664587k8945265m6999718m4374035
$$ plain form
43202 4177603 4795879 5820743 5997618 5284908 4906123 5281952 5214065 3923740 2685892
43193 2685892 3175084 5046785 6583585 7154351 7504626 7944954 7897137 7309778 7029507
43184 7029507 7419571 7813899 7712568 7482587 7531070 7740715 8061776 8769684 9787899
43175 9787899 10548275 10815067 10927132 11057728 11014192 10904324 11166318 11772436 12194746 12269600
43165 12269600 12329638 12505372 12729433 13256792 14177481 14707505 14248529 13861427 15095343
43156 15095343 17515789 19237504 19911020 21097315 23479185 26058003 28663818 32778714
43148 32778714 39035527 46511648 55597449 68796627 87517589 111551278 143259384
43141 143259384 186760850 237581864 276780493 283445080 254499815 207500097 163126062
43134A63126062l3618940k5347535j9918080j4542980r967642p795409o834731
43127D5100745n307680l631298k782175k223221j239538m67068n63866p84256
43119B8101643o5290J554732L289143M261989L493732O37372k872474m823903
43111C3576944m781860m267325m175045l716917k397749j213833j000059j126369
43103A0897787q21042m66019o00483q38983p58728p51884j019158q02565K95337
43094E134262J201925P84708l72329p99681k23447L16651J03790n12600q74823
43085D758456p41618l13680k4934j52217l62674n2758O23968P29543n8432q01037
43075C604617o71243j89004k32828n01105p0302Q80833J101845P8175j166441
$$ plain form
43134 163126062 129507122 104159587 84241507 69698527 59730885 51935476 45100745
43127 45100745 39793065 36161767 33379592 31156371 29916833 29449765 28885899 28101643
43119 28101643 28036353 29591085 32880228 37142217 40635949 41273321 38400847 33576944
43111 33576944 28795084 24527759 20352714 16635797 14238048 13024215 12024156 10897787
43103 10897787 10076745 9610726 9010243 8171260 7412532 6660648 5641490 4838925 5134262
43094 5134262 6336187 7120895 6748566 5948885 5725438 6042089 6145879 5633279 4758456
43085 4758456 4016838 3703158 3678224 3526007 3163333 3110575 3734543 4464086 4405654 3604617
43075 3604617 2933374 2744370 2511542 2010437 1940135 2820968 3922813 4000988 2834547
43066B834547j370808m99097M07752M54306k80282r34822p53255J61706J002313
43057A022360J144369O75189L7603m65534o70646m83960q9272J00875n3474k63671
43047I53839l04418k59012j39418J96947N40998L98928q8687l4462Q25782J378219
43037C468716N78161q80270j331005l29199Q88319J111117M40376k88128o03107
43028C054980n82269m45062l34610k87730k20704n3955J28803J89325J60102J95543
43018A804423L39819M64518L85554L0679l61993l08530L15658Q57700O50644J19222
43008D297694K63252R33667P79517n79699j595417r99738J61170J24169q16108
42999B568507q98731J57494P58371J09478n99360k81749M00232L89635n5136o6618
$$ plain form
43066 2834547 1463739 964642 1372394 1826700 1546418 611596 -141659 20047 1022360
43057 1022360 2166729 2841918 2879521 2413987 1743341 1259381 1170109 1270984 1217510 953839
43047 953839 649421 390409 250991 447938 988936 1387864 1299177 1264715 2090497 3468716
43037 3468716 4046877 3166607 1835602 1506403 2394722 3505839 3946215 3658087 3054980
43028 3054980 2472711 2027649 1693039 1405309 1184605 1130650 1259453 1448778 1608880 1804423
43018 1804423 2144242 2608760 2994314 3024993 2663000 2354470 2670128 3527828 4178472 4297694
43008 4297694 4560946 5494613 6274130 5694431 4099014 3099276 3260446 3384615 2568507
42999 2568507 1669776 1827270 2585641 2695119 2095759 1814010 2214242 2603877 2548741 2482123
42989B482123L53072O04063N54585L91449k9432p91010j333891j099754l90446
42980G40759J19655L09752L70389J55954l97913o88223k19833M02717K64005l67671
42970F89591m39570J37745L53498j88475o21476k53193M13245O38393N25818M94583
42960A750159M28313R8834j36221J38109N41188L52088l83850r07602q12739m31211
42950F37068j80887j13422j69813l61769n52127m56364j8365M98481Q50087R42089
42940A074978O43092q0818p51104o22750L40029J153582R22137k0965n79998l46371
42930A731812R912j48933n34837m93939k8818K69838J63502Q4715L92848P39943
42920B186043M92261m04138j281880j456276q88680j49248J60882m1730k78662
$$ plain form
42989 2482123 2835195 3439258 3993843 4385292 4355860 3564850 2230959 1131205 740759
42980 740759 860414 1170166 1540555 1696509 1298596 610373 390540 793257 1057262 689591
42970 689591 250021 387766 741264 552789 -68687 -321880 91365 729758 1255576 1750159
42960 1750159 2178472 2277306 2141085 2279194 2820382 3172470 2788620 1881018 1068279 637068
42950 637068 456181 342759 172946 -188823 -740950 -1197314 -1215679 -717198 132889 1074978
42940 1074978 1718070 1637252 886148 263398 603427 1757009 2679146 2658181 2078183 1731812
42930 1731812 1741724 1592791 1057954 564015 535197 805035 968537 1053252 1446100 2186043
42920 2186043 2678304 2274166 992286 -463990 -1352670 -1501918 -1341036 -1382766 -1661428
42911a661428n9473M95164P48892L82038j15423o6809M68372Q08548O02159J73403
42901A775443j17745l06023m19036k16133K87677N30281J55687l29606k60824
42892A099721J34261J12094l47286n15045j33505K12003J36055K182O4370p7698
42882F87152n82310p23105K9975R06389Q09604l289l17744J46916M44577J00237
42872A498402j41548K66812O22720J35036o75204p03207P7043O32318L59214k81934
42862A789652n89931l88699N7574L30650O2468o31505r92394m58926M22965O06226
42852B08080J3596l92418p8122M26208O04549O88222Q17836M56110n56988j195184
42842I91889n51662O14811Q14001k5634n85294k39648J87942l0612m42457l50433
$$ plain form
42911 -1661428 -1720901 -1225737 -476845 -94807 -210230 -277039 191333 999881 1602040 1775443
42901 1775443 1657698 1351675 932639 716506 1004183 1534464 1690151 1360545 1099721
42892 1099721 1233982 1346076 998790 483745 350240 562243 698298 700480 764850 687152
42882 687152 104842 -618263 -588288 318101 1127705 1124416 806672 953588 1398165 1498402
42872 1498402 1356854 1623666 2246386 2381422 1706218 1003011 1080054 1712372 2071586 1789652
42862 1789652 1199721 811022 868596 1199246 1261714 630209 -362185 -821111 -398146 208080
42852 208080 221676 -170742 -248864 177344 781893 1470115 2287951 2744061 2187073 991889
42842 991889 440227 1055038 1869039 1843405 1258111 1018463 1206405 1175793 733336 382903
42832C82903J57253O52686R80178R02627L9870j200077j543559n34522N47427
42823C84786M39316k30012n7548P82141Q52422j23104q14305m71347J578k56527
42813E07400o46996k89164M08111M25383k27722n83052j51929N44771P94106M28406
42803A209314k07157n92869m10368J29666M73241M08791K80332L52327L91613
42794B034890J36860k83983o96751j105510j239811n57628P52677J458141P49132
42785A248017n13653q95253k98634K01253J30699R1842M71522P78448N72876J99007
42775A986124J60762L48609K89632j71623o90268p43557j59097M98808L76006
42766A895396m74150q40615J2120R91901N37408r87510j615981n57185P69673
$$ plain form
42832 382903 540156 1192842 2173020 3075647 3115517 1915440 371881 -162641 384786
42823 384786 824102 594090 536542 1318683 2171105 2048001 1233696 762349 763927 507400
42813 507400 -139596 -428760 -20649 404734 177012 -406040 -557969 -13198 780908 1209314
42803 1209314 1002157 409288 -1080 128586 601827 1010618 1290950 1643277 2034890
42794 2034890 2171750 1887767 1191016 85506 -1154305 -1711933 -959256 498885 1248017
42785 1248017 734364 -160889 -459523 -258270 -127571 -35729 435793 1214241 1787117 1986124
42775 1986124 2146886 2495495 2785127 2613504 1923236 1179679 1020582 1519390 1895396
42766 1895396 1421246 580631 592751 1584652 2122060 1134550 -481431 -1038616 -268943
42757b68943R16790K81104K0290K21749K00099j26333k47400n9646P5902O9154
42747A082766J45197K86874K40824j8643k95839n05422o19734m80492j7812N31488
42737C49207Q82867R34178N97932j40534q06276p07445J8206L24840k56354p90947
42727D05674l36335N33820N97956j19391n02489j94017m5637n54289r75470m94967
42717a685145N27649J102653Q90731L52115p7834l77396n72810n03519j46242
42708d89798J36523R00l23095k68638K06876M65301J67761j19912J46699M76173
42698C98790J24275m82492k66017O60476R82550K10307o29875p27987n31057m68606
42688g29636j06022N82136N94324k96522n92712O19659J790149J123514n03606
$$ plain form
42757 -268943 647847 928951 949241 1170990 1371089 1244756 997356 937710 1013612 1082766
42747 1082766 1227963 1514837 1755661 1737018 1441179 935757 316023 -164469 -182281 349207
42737 349207 1232074 2166252 2764184 2623650 1817374 1109929 1128135 1452975 1196621 405674
42727 405674 69339 603159 1201115 1081724 579235 385218 339581 -214708 -1190178 -1685145
42717 -1685145 -1157496 -54843 835888 1188003 1110169 732773 159963 -343556 -489798
42708 -489798 -353275 -352375 -675470 -944108 -737232 -271931 -104170 -224082 -77383 398790
42698 398790 523065 40573 -225444 435032 1417582 1627889 998014 270027 -261030 -729636
42688 -729636 -835658 -253522 340802 44280 -548432 71227 1861376 2984890 2481284
42679B481284r32921j21512J79003m26377o38530j29610m7731o28494o82463O2357
42669h84994L89224j1009J30899J069765J107087m89938j794567j081603M58256
42660a106880P16619j35104m55792N490J54619k39571l53390N174K04014J10067
42650a094754J83198L92098K70830j05698k85454l22520m79155m20445K13705
42641a648195Q34313O57445O7743K8125M51313M23750j69267n21537l10743k8527
42631b15580L8166M4626r6568n38695p77789k43147N55776O80768L67655O06983
42621D22195J246184J079300m0079p86677m53032O8762m5147l23965j60919Q2509
42611A089131m0754j76614m931K4063l73362n62865o0208M75088K26694n08990
$$ plain form
42679 2481284 1548363 1426851 1605854 1179477 540947 411337 363606 -264888 -947351 -884994
42669 -884994 -495770 -506779 -375880 693885 1800972 1311034 -483533 -1565136 -1106880
42660 -1106880 -390261 -525365 -981157 -975667 -821048 -1060619 -1414009 -1408835 -1204821 -1094754
42650 -1094754 -911556 -519458 -248628 -354326 -639780 -962300 -1441455 -1861900 -1648195
42641 -1648195 -813882 -156437 -88694 -60569 390744 814494 645227 123690 -187053 -215580
42631 -215580 -177414 -132788 -229356 -768051 -1545840 -1788987 -1233211 -552443 -184788 422195
42621 422195 1668379 2747679 2707600 1920923 1467891 1536653 1491506 1167541 1006622 1089131
42611 1089131 1048377 871763 866832 890895 517533 -45332 -105540 369548 596242 87252
42601H7252r24327r07685p59470l50383M40913R68457N58402l07037n42485q158
42591a744521M28287K87306K7573J25739M05406N21499N19520N96469O56925M11141
42581B235344j81736p37602p99997m00817r8134k33041l82982j8446N17332M31978
42571C31899j70899l25463K22535N33077M4427m25660j9040P55326R26257N90455
42561B462914M05819J86754o64310j663094j592070l66269P10443P65137L11971
42552E57295Q1484k6155k90132l72454J11041P73977Q70748K44478n71541r73243
42542D05498p30806p9586M22570M03609J60094K67515O42130N51749k15611q36052
42532I91110n69472J46992L66748K4215j06177K85298N77093K34835l55850m78572
$$ plain form
42601 87252 -837075 -1744760 -2504230 -2854613 -2413700 -1445243 -886841 -1193878 -1736363 -1744521
42591 -1744521 -1316234 -1028928 -1001355 -875616 -470210 51289 570809 1167278 1824203 2235344
42581 2235344 2053608 1316006 516009 115192 17058 -215983 -598965 -617411 -100079 331899
42571 331899 161000 -164463 58072 591149 635576 209916 190876 946202 1872459 2462914
42561 2462914 2868733 3055487 2391177 728083 -863987 -1230256 -519813 245324 557295
42552 557295 638779 612624 322492 -49962 61079 835056 1705804 1950282 1378741 405498
42542 405498 -325308 -404894 17676 421285 581379 848894 1491024 2042773 1827162 991110
42532 991110 421638 568630 935378 959593 853416 1138714 1715807 1950642 1594792 1116220
42522A116220j06964J47255m4437l22018k32437J09668J99511j46975n20219m24248
42512b24644R4508M91816M00330R1385R7219M36492N18871k282n70583l73879
42502I59233M19601O83016j49147j144058j005960K01056J152814R68154J11702
42493B196411m65872m22198m2186K70899K29346j77551n10042k77512L06160M70126
42483A577581J2633l22089L7029N99960N81345L8568l85679m51437l76030k16222
42473A095659Q3808K25385j37797p00140p84098l21483N7495l6577k89899k60404
42463a068051P8569M91207P62221P15089K95355k62112n93290n47088k03511K77784
42453e3827N97525M20448q3326j78583M06459P92137P1441j162395j405377l40239
$$ plain form
42522 1116220 1009256 1156511 1112074 790056 557619 667287 866798 719823 199604 -224644
42512 -224644 -130136 361680 762010 853395 950614 1387106 1905977 1903695 1333112 959233
42502 959233 1378834 2061850 1912703 768645 -237315 -36259 1116555 2084709 2196411
42493 2196411 1730539 1308341 1266155 1537054 1766400 1588849 1078807 801295 1107455 1577581
42483 1577581 1590214 1268125 1305154 1905114 2486459 2525027 2139348 1687911 1311881 1095659
42473 1095659 1179467 1404852 1267055 566915 -217183 -538666 -481171 -517748 -807647 -1068051
42463 -1068051 -989482 -498275 263946 979035 1274390 1012278 418988 -128100 -331611 -53827
42453 -53827 543698 964146 880820 702237 1108696 1900833 1972274 809879 -595498 -935737
42443i35737O93665N74422k16647n39037j22816M33806O07089K90710l73852r54034
42433e42431q47951J4522Q19851P08649j65792q25693o35219P8395N58220M67478
42423c69971R3218j47367j92375k03759j03724L53001R55844J019157L45259l15006
42413A434277l11440p6887k99994o32066k87882L99741L39627m45123p21110p9230
42403f80087L68212j20562o87249l59864M12248O86778M89557L05632O472n79847
42393a58710q05631j41284O42229M90791k28753l42132J95235L50094j73008n28343
42383f99512j92151L72404O49870O31959L49354j70788m45612m5289M52011J32548
42373A034794o27619n20872N39373J086775M08639k75298K12770J134684J093974
$$ plain form
42443 -935737 -242072 332350 115703 -423334 -546150 -112344 494745 785455 411603 -542431
42433 -542431 -1390382 -1375860 -556009 152640 -13152 -838845 -1474064 -1395669 -837449 -369971
42423 -369971 -276753 -424120 -616495 -820254 -923978 -570977 384867 1404024 1749283 1434277
42413 1434277 1122837 1045950 745956 113890 -173992 225749 565376 120253 -600857 -680087
42403 -680087 -311875 -432437 -1119686 -1479550 -1067302 -380524 109033 414665 421137 -158710
42393 -158710 -964341 -1105625 -463396 27395 -201358 -543490 -348255 1839 -171169 -699512
42383 -699512 -891663 -519259 130611 762570 1111924 941136 495524 450235 902246 1034794
42373 1034794 407175 -113697 425676 1512451 1921090 1645792 1858562 2993246 4087220
42364D087220K38935j03415M88179J039363O69575l73951j230653j325586p03571
42355B786096P5174L53447j9433n68150q21569q10972p74091p24453n64973k93600
42345a362524J13773O48476R51063N76472k08183n11406j6828N66533O34466N11275
42335A903117N98148M97420k11896r80845j011988m98942j87278q4387L51946
42326C75295R70710R72857K17404m87052n49081k62185j53956l41748o50254p83981
42316f91991l77276N21535J103837O61941k78267n12425J63411P38787N51942
42307A881494R5702j2909N7770q9714l70801n07707m37445j47915K84824L79410
42297A132709k18178p99453k92605Q60179Q95228o09837j758808j062865K88737
$$ plain form
42364 4087220 4326155 4222740 4710919 5750282 6419857 6045906 4815253 3489667 2786096
42355 2786096 2861270 3214717 3195284 2627134 1805565 994593 220502 -503951 -1068924 -1362524
42345 -1362524 -1248751 -600275 350788 927260 719077 207671 190843 757376 1391842 1903117
42335 1903117 2501265 2998685 2786789 1805944 793956 295014 107736 23349 375295
42326 375295 1346005 2318862 2536266 2049214 1500133 1237948 1083992 742244 91990 -691991
42316 -691991 -1069267 -547732 556105 1218046 939779 427354 590765 1329552 1881494
42307 1881494 1977196 1964287 2022057 1932343 1561542 1053835 616390 468475 753299 1132709
42297 1132709 914531 115078 -177527 682652 1577880 968043 -790765 -1853630 -1564893
42288a564893L78409m29726l61145O60588R90989J69832l60073K15331Q42242
42279E41554N94406J22186J46608Q7174n97048j035400l45282O22087M92801l82641
42269B46445n14793K88691P18145J51942m97214m03875L6208J65416O2254K9943
42259B83162k2907j50487q6399J16477p1170o53546p63644J0364P36533M49325
42249a52292l06206l01163M42113P48198K04916k50389R2279O37898N26397o3244
42239A578507l43476j45484m39k18544n13847n42918l55007j85731q3646Q1344
42229g29241L25102M27326K15127p6294J9186N16157P69216K90928m70184o74071
42219F13252k51153J21756J60169K82784N96182M50663m61302j298162j115406
$$ plain form
42288 -1564893 -1186484 -1616210 -1977355 -1316767 -325778 -155946 -516019 -300688 541554
42279 541554 1135960 1258146 1404754 1491928 894880 -140520 -485802 136285 629086 246445
42269 246445 -268348 20343 738488 890430 393216 -10659 25549 190965 253219 283162
42259 283162 260255 109768 23369 139846 68676 -584870 -1348514 -1338150 -601617 -152292
42249 -152292 -458498 -759661 -317548 430650 635566 385177 477456 1115354 1641751 1578507
42239 1578507 1235031 1089547 1089108 870564 356717 -186201 -541208 -726939 -810585 -729241
42229 -729241 -404139 23187 238314 162020 181206 697363 1466579 1757507 1287323 613252
42219 613252 362099 483855 644024 926808 1522990 1973653 1512351 214189 -901217
42210i01217k25598L08155K21299J99699N73564P67942K90041m24166n60189L1462
42200B80992O81307O75397L2451m86835k20293N32347P81121J23937o91635q27606
42190H81183m74251l39856m81997m30001j60781n7326n2466K51946O67099N95759
42180C99309J60973J13434M66817L52443m32331q79412l25700M96731O44610K48813
42170A245687j13249m00246o32284l45576M99453Q98548J99529o23783l33241
42161C94838N62338N53952n13995j304123j056399l89620J2952K17711L67538
42152a154808L47019L06943M86345M40719m21770j470177j322623N7311J070320
42143a660721P32213o7865j53688L06271N10638L31016R4129j01828j43382K48652
$$ plain form
42210 -901217 -1126815 -818660 -597361 -397662 175902 943844 1233885 809719 249530 280992
42200 280992 962299 1637696 1670147 1183312 963019 1495366 2276487 2400424 1708789 881183
42190 881183 406932 67076 -414921 -844922 -1005703 -1063029 -1115495 -863549 -196450 399309
42180 399309 560282 673716 1140533 1492976 1060645 181233 -144467 352264 996874 1245687
42170 1245687 1132438 732192 99908 -245668 253785 1152333 1351862 728079 394838
42161 394838 957176 1511128 997133 -306990 -1363389 -1753009 -1740057 -1522346 -1154808
42152 -1154808 -807789 -500846 -14501 426218 4448 -1465729 -2788352 -2731041 -1660721
42143 -1660721 -928508 -996373 -1150061 -843790 -333152 -2136 91993 -9835 -153217 95435
42133I5435Q39420Q83653L20729k594J94614J17035n08243p14827r4973J89248
42123A319497n29537q64881L86394J782696J184862p65921j539293n94634J82142
42114E61325j28816k92236L67461N91611l82988j156663l81774R90943J235300
42105A404163L96693k15631j67162l6041m2616O6409J47783j14481l76475p7738
42095I84904M91743N20400p8717n96077n81295k30051J51067L83041K54432k44065
42085A055382o58473n93119k85585j40059j7796L71789P14711M94425q3684l54091
42075E03500k12045r0410n8271K11670O19681O51564K92966J04408K26192J10591
42065B359846m93102j024347r37447m33321j3443J56560J00233k16206n90378
$$ plain form
42133 95435 934855 1818508 2139237 2136643 2331257 2448292 1940049 1225222 1130249 1319497
42123 1319497 789960 -74921 311473 2094169 3279031 2513110 973817 379183 561325
42114 561325 432509 140273 507734 1099345 716357 -440306 -822080 168863 1404163
42105 1404163 1800856 1585225 1418063 1382022 1339406 1405815 1553598 1439117 1062642 984904
42095 984904 1476647 1997047 1918330 1322253 740958 510907 661974 1045015 1299447 1055382
42085 1055382 396909 -196210 -481795 -621854 -639650 -267861 446850 941275 857591 503500
42075 503500 291455 201045 142774 354444 974125 1625689 1918655 2023063 2249255 2359846
42065 2359846 1866744 842397 -95050 -528371 -541814 -385254 -285021 -501227 -1091605
42056a091605n35394K1106M09591R6261m54521l81516L06502P09055L14882k88649
42046h94288k75529K55228M54125m5363n98238m84498N1614K16222q8483j54061
42036a563271L00271N85849J83466l07660j12866L78895K12876m81810n86526
42027a390776K08793Q49582N33605j49191l19674j74743l79127p03013l17571
42018a842115P35616J339295P35071n00727j175165p59551K53297R72211R00229
42009F58161K77364k47051l26401k10369k19724j97281J44224N29585L70432k60241
41999E18699n55033j48722K59785j4127m80780k20756M98160M36120o21088j222929
41989a550671l10044J021076R52136l63626r39215J75666J548689J441615J00311
$$ plain form
42056 -1091605 -1626999 -1605893 -1196302 -1100041 -1554562 -1936078 -1629576 -920521 -605639 -894288
42046 -894288 -1169817 -914589 -460464 -505827 -1104065 -1588563 -1536949 -1320727 -1409210 -1563271
42036 -1563271 -1263000 -677151 -493685 -801345 -914211 -535316 -322440 -804250 -1390776
42027 -1390776 -1181983 -332401 201204 52013 -267661 -442404 -821531 -1524544 -1842115
42018 -1842115 -1106499 232796 967867 467140 -708025 -1467576 -1214279 -242068 658161
42009 658161 935525 688474 362073 151704 -68020 -265301 -121077 408508 778940 518699
41999 518699 -36334 -185056 74729 60602 -420178 -640934 -142774 293346 -327742 -1550671
41989 -1550671 -1860715 -839639 112497 -251129 -1190344 -1014678 534011 1975626 2075937
41980B075937r06669q43347k81499J06028J88305r130m08419n98682k05199M36468
41970d46207O30109L21390Q4160J34072R6047j84675l65820l22362m15752p70926
41960a239964r15249m78336K34669O58976N83051K05548l7705K74469R68000J100497
41950A353956J18728r85250p55447M98555R35584l1024p83539j57224N96966m3140
41940G48165j130972o73681R70348J412259q0362j437765r36168M25145P82395
41931G9364J54890r7031L68178O15981K25977o4249L06946P86906N66846k38256
41921B705552p86758o33372k13912j81672n42185o89825k86911K05000J55023
41912b69060k65935k48578M44782R90917O11423k45538m50104K05436O60104R0342
$$ plain form
41980 2075937 1169268 325921 44422 150450 338755 329625 -78794 -677476 -882675 -446207
41970 -446207 183902 505292 589452 723524 819571 634896 269076 -53286 -469038 -1239964
41960 -1239964 -2155213 -2633549 -2398880 -1739904 -1156853 -951305 -989010 -714541 253459 1353956
41950 1353956 1472684 487434 -268013 230542 1166126 1135102 351563 194339 791305 748165
41940 748165 -382807 -1056488 -86140 1326119 1245757 -192008 -1128176 -703031 79364
41931 79364 234254 137223 505401 1121382 1347359 1283110 1590056 2376962 2943808 2705552
41921 2705552 1918794 1285422 1071510 889838 347653 -342172 -629083 -424083 -269060
41912 -269060 -534995 -783573 -338791 652126 1263549 1018011 567907 773343 1433447 1523789
41902A523789q43400q57916J28939Q20923L31227n95149o75477J13589O25928
41893E72453K47493l70876m35683o8446J56885J04882r805j39312k89466k35369
41883d67244J25771M22219L11660O4822J28165L72423L44015L0435k31554m03340
41873F97372o33922o66090j11448P07338R55816M40512j35703k40604j61787l21435
41863E30049n49226m29799K9275M32126M66123J46773k14530k42118Q4968L28240
41853E81881J82770n6863n7449j28746o36079j039060n15027N51211Q63245J64702
41843h9415l29009J24326O52115L00015m09493m47320O6108K97002J60659J90375
41833E15363L63929K01993k01424l23780k58300n75934j170070j247800n81517
$$ plain form
41902 1523789 680389 -177527 -48588 772335 1103562 508413 -167064 -53475 572453
41893 572453 819946 449070 13387 -55059 101826 206708 196903 57591 -231875 -467244
41883 -467244 -341473 80746 392406 457228 585393 957816 1301831 1332266 1100712 697372
41873 697372 63450 -602640 -714088 -6750 949066 1389578 1253875 1013271 851484 530049
41863 530049 -19177 -448976 -419701 12425 478548 625321 410791 168673 253641 581881
41853 581881 764651 707788 650339 521593 -114486 -1153546 -1668573 -1117362 -254117 -89415
41843 -89415 -418424 -294098 358017 658032 248539 -198781 -132673 164329 324988 515363
41833 515363 879292 1081285 879861 556081 297781 -278153 -1448223 -2696023 -3277540
41824c277540J51063M56873N96701Q02801P39894J75670m14481l90895K24205
41815i35709P67736N96926l15103j194018j022671K63971J331687Q66706o47617
41806b88092j399187n70095P19323J077241N21434n5429k80055l60541l02318
41797i37719N5196M55371M47771J25664J4209K41237L76832J44065j98184k94103
41787D30339j37398M1533O2558j06357l21039l16425o914L01165K55707k9027
41777A74142j36072j0645l5412l13638l45650K13323Q16757O18166k64484o95316
41767B1171L721J013936R86353j76564j161245r53904o8181L28119M787k71239
41757b73046n1458J94063m7591m94779n16241l8359M34778N33872L70682K25612
$$ plain form
41824 -3277540 -3126477 -2669604 -2072903 -1270102 -530208 -354538 -769019 -1159914 -935709
41815 -935709 -167973 428953 113850 -1080168 -2102839 -1838868 -507181 359525 -288092
41806 -288092 -1687279 -2257374 -1538051 -460810 60624 5195 -274860 -635401 -937719
41797 -937719 -882523 -427152 20619 146283 160492 401729 778561 922626 724442 430339
41787 430339 292941 334474 397032 290675 -30364 -346789 -353703 -52538 203169 174142
41777 174142 38070 27425 -7987 -321625 -667275 -453952 362805 980971 716487 21171
41767 21171 24892 1038828 2025181 1848617 687372 -266532 -334713 -6594 -1807 -273046
41757 -273046 -324504 -130441 -178032 -672811 -1189052 -1227411 -792633 -258761 111921 337533
41747C37533J99298K07718J35613l7045j84578j73073j04152k47874n96639p14488
41737a177687l05183K51356L17168j18303m13561j99103J35573J02345j55869
41728a563264j82909L8435J57498J54363L93309Q76111R79922K75683p37304j127821
41718g35977o12753K16292O65847N98110L26108J78361K59892M31750M38129J72642
41708A938401j78813l68222l72104k93999j44401K0060o8392n03410p95646l93657
41698a160183M04816O78369J40187m60717m38864m0519J57152J14473J00186J05649
41688c99451M4097R5673K80858J33565n35352r68687l70480P92287J267222O80578
41678A020310j15162l30741o4661K04076J75695k81361r44209j005435J06948
$$ plain form
41747 337533 536831 744549 880162 843117 658539 485466 381314 133440 -463199 -1177687
41737 -1177687 -1482870 -1231514 -914346 -1032649 -1446210 -1645313 -1509740 -1407395 -1563264
41728 -1563264 -1746173 -1707738 -1550240 -1395877 -1002568 -126457 853465 1129148 391844 -735977
41718 -735977 -1348730 -1132438 -466591 131519 457627 635988 895880 1327630 1765759 1938401
41708 1938401 1759588 1391366 1019262 725263 580862 600922 532530 29120 -766526 -1160183
41698 -1160183 -755367 -76998 63189 -397528 -836392 -876911 -719759 -605286 -505100 -399451
41688 -399451 -355354 -259681 21177 154742 -380610 -1349297 -1719777 -927490 339732 1020310
41678 1020310 905148 574407 509746 713822 889517 608156 -336053 -1341488 -1234540
41669a234540J567881J781043M63814q47112q19183P6126N94323M65009K54822
41660B302183J34609k20704p73540j013573o75226l3078M42777M01573j51171
41651D13850o23354k70467P39802J217252M51276p08382r75980l52621J33533
41642B4909M5901j03251J8431R2637p8852k07914j48758j58909k82799j34961
41632i33566M00595Q16455O63927J70744j05464P5523N04763P37494L77946m79885
41622B228532j081945p52229J51081N52077M4058o17829o29425j65550O9673j35359
41612c36916l65587k11974L00469P68614P27687R7547o27504q89081p28411n55850
41602a821006l66826J66311P97263P45881n5674n99039k25817L49091J85956l57781
$$ plain form
41669 -1234540 333341 2114384 2578198 1731086 911903 988029 1582352 2047361 2302183
41660 2302183 2436792 2216088 1442548 428975 -246251 -279329 163448 565021 413850
41651 413850 -209504 -479971 259831 1477083 1928359 1219977 243997 -108624 24909
41642 24909 70810 -32441 -14010 78627 -225 -208139 -356897 -515806 -798605 -933566
41632 -933566 -532971 283484 947411 1118155 1012691 1088214 1592977 2330471 2708417 2228532
41622 2228532 1146587 394358 545439 1097516 1141574 523745 -105680 -271230 -201557 -336916
41612 -336916 -702503 -914477 -614008 154606 882293 979840 352336 -536745 -1265156 -1821006
41602 -1821006 -2187832 -2021521 -1224258 -478377 -534051 -1133090 -1358907 -1009816 -823860 -1181641
41592a181641k25195N97501J004221M13321m47059o11069l8890N57659N64838
41583F33686o0670p90586q89884j39885P70028R50415L84380j52120j83604K5112
41573E46872J36023J74075J42058j21348m35502l05370J91873K52788m22255r60369
41563h01155n82331J17192R9233m05728k95200M96958Q18002K11527k90740J42708
41553d89534Q08577O77355J7293k45222j03576j96126l94299k5868O16789M26665
41543A092054o26466j146772m12028M70440L66800r3137K49554R52682O35875
41534A489002o28959j245081n15253L93978L99219M7545K64821O36986J28250
41525I70508j043881j468774m33270J160391J918072J371151J37295q17264r02254
$$ plain form
41592 -1181641 -1406836 -809335 194886 608207 161148 -449921 -488811 68848 633686
41583 633686 573016 -217570 -1107454 -1247339 -477311 473104 857484 705364 521760 546872
41573 546872 682895 856970 999028 877680 442178 136808 328681 581469 159214 -801155
41563 -801155 -1383486 -1266294 -1167061 -1572789 -1867989 -1371031 -553029 -341502 -632242 -489534
41553 -489534 319043 996398 1013691 768469 664893 468767 74468 48600 665389 1092054
41543 1092054 465588 -681184 -1093212 -622772 -255972 -349109 -99555 853127 1489002
41534 1489002 860043 -385038 -900291 -506313 -107094 -59549 205272 842258 970508
41525 970508 -73373 -1542147 -1975417 -815026 1103046 2474197 2611492 1794228 891974
41516H91974k84446K69867J65817l64145o20409l83854r3513o0390k5850K60958
41506b43991M93281K64233k11068l35426n36K74121J34250j33574j23812P5517
41496A92995J23035Q25o4972j02477l38276o71255o97521l53581m7436K6996J86865
41485a744802N68221O71169R6773o80852q78784m38962J20657N90627J055507
41476f40446J220858O78031j70051m09258m019Q6686m96948q24685j69121P29007
41466E4P20494j06896p51742p84512n76802l56368K8616M92152O55133M31859
41456b48012J01887j23744j32788K23334P35330P02853o1807n41923J62958J182854
41446B000942Q50470p32092j562615n24618J077994J441056N26205m52981q10297
$$ plain form
41516 891974 607528 877395 1043212 679067 58658 -325196 -418709 -479099 -504949 -243991
41506 -243991 249290 513523 302455 -32971 -33507 240614 374864 241290 117478 192995
41496 192995 316030 316855 251883 149406 -188870 -860125 -1557646 -1911227 -1958663 -1931667 -1744802
41485 -1744802 -1176581 -505412 -408639 -1089491 -1968275 -2407237 -2286580 -1695953 -640446
41476 -640446 580412 1258443 1088392 679134 675115 761801 264853 -559832 -728953 54
41466 54 720548 613652 -138090 -922602 -1499404 -1855772 -1827156 -1335004 -679871 -248012
41456 -248012 -146125 -269869 -402657 -179323 556007 1258860 1197053 655130 818088 2000942
41446 2000942 2851412 2119320 556705 32087 1110081 2551137 3077342 2624361 1814064
41437A814064o43257r3504N52149N66330l30782j165816q38344K34225O64073
41428G59138J01088m49950l34956r1916k77061n15413l00872O2768J9535k72123
41418a299762k30560J94304M91973L84938J12577o0482j66942k80817k86681q0435
41408a221887K01372L43855L50070L78556M03384J92459k32958l84565Q1274O89997
41398H01557O31298n2212m27629q4465J75846l48136r82421o77092K16170M12218
41388c34866k12274l98962L46675Q15972M3239j027637r16571K28033J077293
41379c79098J133804R52219O97453m2509r74701j079840k59494K68336j85613
41370A30557o90767k58435N23885N00949j48131k80076L17729O95335L68799k4947
$$ plain form
41437 1814064 1170807 1077303 1629452 2195782 1865000 699184 -139160 95065 759138
41428 759138 860226 410276 75320 -16596 -293657 -809070 -1109942 -1047174 -1027639 -1299762
41418 -1299762 -1530322 -1336018 -844045 -459107 -346530 -407012 -573954 -854771 -1141452 -1221887
41408 -1221887 -1020515 -676660 -326590 51966 455350 647809 414851 30286 111560 801557
41398 801557 1432855 1380643 953014 868549 1044395 696259 -286162 -963254 -747084 -334866
41388 -334866 -547140 -946102 -599427 216545 259784 -767853 -1684424 -1456391 -379098
41379 -379098 754706 1706925 2404378 2361869 1387168 307328 47834 316170 130557
41370 130557 -560210 -818645 -294760 206189 58058 -222018 95711 791046 1159845 1134898
41360A134898O0277K70248J87058R0721L11842N17682K80628j65779l71723m32694
41350A883158o44109p70002m11573J28834J58809k95194m85072j19360K31118
41341c23391J13479j66874k40914l19796o17971o96823o6319Q83306J237115P21938
41331E23750n0142m31014l07652J20047N83074P24266L47198k06450l65662j04438
41321H32977M1541j83518m26496m12064l77950m98442m36750L3930M33358K30646
41311g62768k26356j65172L70118N14183q3851o48654l46618N56319J057832O62380
41301I27413j54670o20233m73427q0110P5418q0978k12712p9647J28798J23577
41291d46571k0639m8896j7320j52699k94585m6880M40326M70833j63671p50271
$$ plain form
41360 1134898 1195175 1465423 1652481 1743202 2055044 2572726 2853354 2687575 2315852 1883158
41350 1883158 1239049 469047 57474 186308 345117 49923 -435149 -554509 -323391
41341 -323391 -209912 -376786 -617700 -937496 -1555467 -2252290 -2318609 -1435303 -198188 523750
41331 523750 473608 42594 -265058 -145011 438063 1162329 1509527 1303077 937415 832977
41321 832977 874518 691000 264504 -147560 -525510 -1023952 -1460702 -1426772 -993414 -762768
41311 -762768 -989124 -1154296 -784178 -269995 -353846 -1002500 -1349118 -792799 265033 927413
41301 927413 772743 152510 -320917 -401027 -325609 -406587 -619299 -698946 -570148 -446571
41291 -446571 -467210 -516106 -533426 -686125 -980710 -1027590 -587264 -116431 -280102 -1030373
41281a030373o43872j51033N4775q3755j71262p9902J14272N13197J004593Q79474
41271D06114k64080j497368j485882l78263L49689P7413j54206N11519J277443
41262a157621R43345k28930r47445p02788j49659Q5722P3987R8229K33509M64051
41252a287600O98003O79616L10760n7150o4939J30579K24580L40843O41997O92568
41242B309257J4584q97505j008982k02408N47431N51957J30806j92874l51243
41233I01023l28328K9727M23419J70528o40732r03909m3052R62389R10328Q4564
41223A565957l33427r1869R677l31049l95763K81153J021958Q83864r7023j010608
41213A502870j158259o78921k06003j50548l51725l68207n1028K88384K98138
$$ plain form
41281 -1030373 -1674245 -1825278 -1770503 -1854258 -2025520 -2105422 -1991150 -1477953 -473360 406114
41271 406114 142034 -1355334 -2841216 -3219479 -2869790 -2792377 -2946583 -2435064 -1157621
41262 -1157621 -214276 -443206 -1390651 -2093439 -2243098 -2157376 -2083389 -1985160 -1751651 -1287600
41252 -1287600 -589597 90019 400779 343629 278690 409269 633849 974692 1616689 2309257
41242 2309257 2323841 1426336 417354 214946 762377 1314334 1445140 1252266 901023
41233 901023 572695 602422 1025841 1196369 555637 -348272 -391324 571065 1481393 1565957
41223 1565957 1232530 1140661 1150338 819289 423526 704679 1726637 2610501 2513478 1502870
41213 1502870 344611 -334310 -540313 -690861 -1042586 -1410793 -1461821 -1173437 -875299
41204h75299q648l43985m44188k11046J95674L55178J9765m01103k86038J78964
41194a820726J45631m49199n02459N20816J398445Q04434n37442p87109K36423
41185i91186Q22290N7590q48602n52129M64788Q58618L73805k05062l95865l19121
41175g34874p5378K82247M20310J27550j87215o7709J95282M2520l49646l37171
41165f84084P5007K19685j14795l35988J4871O06691Q14317M08689l62187r46850
41155c04644p31091L44898J341500J120823j91593j147564p24984L89033P38365
41146H34743n5347r58998r18223n2802O79277O98723L81042L81517O37956M39209
41136B067097m35601j143687p93027L05845J026575Q88593M08841M8118l21758
$$ plain form
41204 -875299 -883947 -1227932 -1672120 -1883166 -1687492 -1332314 -1312549 -1713652 -1999690 -1820726
41194 -1820726 -1675095 -2124294 -2626753 -2105937 -707492 96942 -440500 -1227609 -991186
41185 -991186 -168896 -111306 -959908 -1512037 -1047249 -188631 185174 -19888 -415753 -734874
41175 -734874 -810252 -528005 -107695 19855 -167360 -235069 -39787 2733 -346913 -684084
41165 -684084 -609077 -389392 -504187 -840175 -825304 -218613 595704 1004393 642206 -304644
41155 -304644 -1035735 -690837 650663 1771486 1579893 432329 -292655 96378 834743
41146 834743 779396 -179602 -1097825 -1150627 -471350 227373 608415 989932 1627888 2067097
41136 2067097 1631496 487809 -305218 627 1027202 1915795 2324636 2372754 2050996
41127B050996p04547o39168n3782L05361o8162n79047m39233R5970K23227q4653
41117A06962j72662R7692J86910j17036m01875m02804k73945k4389M84395Q73966
41107C57214N12117l15689m84628K90684Q55801L41620m76962m57013J12750J57894
41097H93788l19801l81164R5156K09868k95491n19135L9689N83936L34679k32110
41087D09415k66448J02964J94427p699j8976J07804j02386n16228m36051K15702
41077c17476O14074K42031l11280k17257M09434P28605L52438j90054j92499L48930
41067A466946P68429N60593r576k88692j57041k04917p85383j287188q85905J54432
41057f68302O30709j572q33891p16669K23547Q55044N63378j42142n16475m47385
$$ plain form
41127 2050996 1346449 707281 653499 958860 890698 311651 -127582 -31612 191615 106962
41117 106962 -65700 31992 218902 101866 -300009 -702813 -976758 -1001147 -516752 357214
41107 357214 869331 553642 69014 359698 1215499 1557119 1080157 623144 735894 893788
41097 893788 573987 192823 287979 497847 202356 -316779 -277090 306846 641525 409415
41087 409415 142967 245931 440358 432659 413683 521487 419101 -97127 -533178 -317476
41077 -317476 296598 538629 227349 10092 419526 1148131 1500569 1310515 1118016 1466946
41067 1466946 2235375 2795968 2786392 2497700 2340659 2135742 1350359 63171 -822734 -668302
41057 -668302 -37593 -39165 -873056 -1589725 -1366178 -511134 52244 -89898 -606373 -1053758
41047a053758k35718k6977J55825J56496p0851j56057K34180P18312N89856j9150
41037B92158r0579P57925J419219P54703n90042r19116Q9205R13972M27131o04241
41027B450335r13052n75679m73724o96559o61957l62210k75042k73861J63408
41018a618341P44271N98077j85801m92800P6783O14094M73204K38041M86803P04445
41008A638776K66135m14848o28355m84181l84688j17332N37666R56409N14348
40999A883930k59608m81964l68158o75123j126449p91167J82658O90510N33374
40990d11997O44023J211878J126003j15386j314366j250942l72426J22307J9027
40981c41879o7800P0912J50487J28947J72043J57957p9895k69811o8160L39518
$$ plain form
41047 -1053758 -1289476 -1316453 -1160628 -1004132 -1074983 -1231040 -996860 -278548 311308 292158
41037 292158 201579 959504 2378723 3133426 2543384 1624268 1713473 2627445 3054576 2450335
41027 2450335 1537283 961604 487880 -208679 -870636 -1232846 -1507888 -1781749 -1618341
41018 -1618341 -874070 -275993 -461794 -954594 -877811 -263717 209487 447528 934331 1638776
41008 1638776 1904911 1490063 861708 377527 -7161 -124493 413173 1369582 1883930
40999 1883930 1624322 1142358 774200 99077 -1027372 -1818539 -1635881 -945371 -411997
40990 -411997 232026 1443904 2569907 2454521 1140155 -110787 -483213 -360906 -341879
40981 -341879 -409679 -338767 -188280 -59333 112710 270667 190772 -79039 -147199 192319
40971A92319N14134L52710j8851n26724q84989n99861K01426N49114o2173p66879
40961a049774n89453Q211n8541o27857n79237K08391O19952J63680k88991j8351
40951b211970M90733N73089M34989N23548O76687N58616K65312n6068n17029r35860
40941a97953p65986j23816Q978o72096j005034r2247J083245J049969J53702n1866
40931f13104O67936R79332K74021m23510k44073K55756K43615j31889l39504l65168
40921C03412l39124j13302J80788K6472m33198k56171O58938R43038j65258j226491
40911d20896n47745J137459J677626O75520k55038k57051k33266p61152r73894
40902D1563l24724K27302j03543m56709J78415J085478Q75912k94410r70993m68874
$$ plain form
40971 192319 706453 1059163 1040312 513588 -371401 -971262 -769836 -220722 -282895 -1049774
40961 -1049774 -1639227 -1631016 -1689557 -2317414 -2896651 -2688260 -2068308 -1904628 -2193619 -2211970
40951 -2211970 -1721237 -1148148 -713159 -189611 487076 1045692 1311004 1254936 737907 -197953
40941 -197953 -963939 -1087755 -1078777 -1750873 -2755907 -2848154 -1764909 -714940 -561238 -613104
40931 -613104 54832 1034164 1308185 884675 640602 896358 1139973 1008084 668580 303412
40921 303412 -35712 -149014 31774 58246 -374952 -631123 27815 970853 805595 -420896
40911 -420896 -968641 168818 1846444 2521964 2266926 2009875 1776609 1015457 41563
40902 41563 -283161 -55859 -159402 -616111 -437696 647782 1523694 1229284 258291 -210583
40892b10583N35710J216147J291793P23412k41355q50883o14579j22168k10391
40883A517103n96611l91982K83897M55629o621j84096K18724L43064k65051q04471
40873E69585n37818R3571L40626K11641Q295l09070n85565j99909Q26042J279234
40863A696632L24909j048269j259794l26400L45581P2850l99922l08546J09705
40854g93254K69316J01869p2232k3681K61979N86105N90266J23961m67691p08072
40844a31434n07501o1974M50311P14968K82749p06611j250544o60923L75293P30211
40834g65455M29064L08575M33857J29687n04020n26464J55967M23550k31966q21294
40824i68499n21280j3462j84863n21802j8867J000350J257497L88142o92784j139703
$$ plain form
40892 -210583 325127 1541274 2833067 3556479 3315124 2464241 1849662 1727494 1517103
40883 1517103 920492 528510 812407 1268036 1261415 1077319 1296043 1639107 1374056 569585
40873 569585 31767 125338 465964 677605 685900 376830 -208735 -408644 417398 1696632
40863 1696632 2021541 973272 -286522 -612922 -267341 -194491 -594413 -902959 -793254
40854 -793254 -523938 -422069 -494301 -517982 -256003 330102 920368 1044329 576638 -131434
40844 -131434 -638935 -700909 -250598 464370 747119 40508 -1210036 -1870959 -1495666 -765455
40834 -765455 -336391 -27816 406041 535728 31708 -494756 -338789 84761 -147205 -968499
40824 -968499 -1489779 -1503241 -1688104 -2209906 -2228773 -1228423 29074 417216 -275568 -1415271
40814a415271r14782k83303M99433R92368Q72950M75314L40149L07733j68317
40805G06274q82239r75423k82499L40514L00285K0330L7473J65752R0133P7173
40795d02227M27322P58237N44884r116l39571m61382p89224j181218r67794k6359
40785b446448Q55911R45680M13208k7596L8520M66915Q21000O88449j441p76116
40775I78082r75092m87027J04220K61358P5023j07104k59330m96530o03059k71642
40765a781101K80194M52000P7736l30238k74779J47057M99988N36827L18589O9984
40755c743M3047K84104M57848J92073l32355n02729j15487L06976K42310j89564
40745C82480n45322n89487k35086N29142J243894J070890j01416j114662q70409
$$ plain form
40814 -1415271 -2330053 -2613356 -2113923 -1121555 -248605 226709 566858 874591 706274
40805 706274 -175965 -1151388 -1433887 -1093373 -793088 -772758 -735285 -569533 -479400 -402227
40795 -402227 25095 783332 1328216 1319100 979529 518147 -271077 -1452295 -2420089 -2446448
40785 -2446448 -1590537 -644857 -231649 -259245 -220725 246190 1067190 1755639 1754198 978082
40775 978082 2990 -484037 -379817 -118459 -43436 -150540 -409870 -906400 -1509459 -1781101
40765 -1781101 -1500907 -1048907 -971171 -1301409 -1576188 -1429131 -929143 -392316 -73727 -3743
40755 -3743 39304 323408 781256 973329 640974 138245 22758 329734 572044 382480
40745 382480 -162842 -752329 -987415 -458273 785621 1856511 1755095 640433 -229976
40736b29976J53670O01613K01762l7564L99951P44149L15488l25018k99688K21413
40726A745800L69244j13687o38459o70971k98931M0330J4329l50074o16774l05374
40716h24567M81647J033672Q58688K48127k30111m41889n39735m75866j67069
40707e7103Q7699r2352n21248n92613j17900L80568L34286j79483n53558l48762
40697a660466K19884N34285L38651J01410L68604Q98320R09157K06166n17249
40688A398762o94658o03999p03308q07374m74016J66562N43625M04810k160l15424
40678a087180k72408K04062P84394Q94370M39801J9111P5450K86562K00759n2992
40668A491929k00633l90761o97137o49510k2640M87999K56613j82327m1433L12346
$$ plain form
40736 -229976 -76306 525307 727069 689505 1089456 1833605 2149093 1824075 1524387 1745800
40726 1745800 2115044 2001357 1362898 691927 392996 433326 447655 97581 -519193 -824567
40716 -824567 -342920 690752 1549440 1797567 1567456 1125567 585832 109966 -57103
40707 -57103 30596 -61756 -583004 -1175617 -1293517 -912949 -578663 -758146 -1311704 -1660466
40697 -1660466 -1440582 -906297 -567646 -466236 -97632 800688 1709845 1916011 1398762
40688 1398762 704104 100105 -603203 -1410577 -1884593 -1718031 -1174406 -769596 -771756 -1087180
40678 -1087180 -1359588 -1155526 -371132 523238 963039 982150 1057600 1344162 1544921 1491929
40668 1491929 1291296 900535 203398 -446112 -468752 19247 275860 93533 52100 364446
40658C64446R0505k97308J34727R93179Q68809l02925r78518m43136J79112n7175
40648E51716n05551l66848o7650j73378k13569K69420O25294K49983j75121J31394
40638C25690N42285Q4365p59113p95407j00748K63933J18660K18997O69304P88587
40628A356553M99914M08591M62089l2496r13984j134565n05957n9725k55715k73866
40618d49161K96008N08322k60494r65384m41656O59008Q37584K3002n24527k77480
40608e94778j2288k68348n09128k14034J91893J02111k51545k15986K22127M54509
40598a095467K24071j728K37898P07145P95682L21944k93169n91562n20789k89959
40588e05934q6026m6995k30795m29518k83534J91940M68582J87722k80193l20574
$$ plain form
40658 364446 454951 157643 292370 1285549 2154358 1851433 872915 429779 608891 551716
40648 551716 46165 -320683 -388333 -561711 -775280 -505860 119434 369417 194296 325690
40638 325690 867975 952340 193227 -602180 -702928 -438995 -320335 -101338 567966 1356553
40628 1356553 1856467 2265058 2727147 2694651 1780667 646102 140145 80420 -175295 -449161
40618 -449161 -153153 355169 94675 -870709 -1312365 -653357 184227 207229 -317298 -594778
40608 -594778 -607066 -875414 -1384542 -1598576 -1406683 -1304572 -1556117 -1772103 -1549976 -1095467
40598 -1095467 -871396 -873124 -635226 71919 867601 1189545 896376 304814 -215975 -505934
40588 -505934 -591960 -638955 -869750 -1299268 -1582802 -1390862 -922280 -734558 -1014751 -1335325
40578a335325J10517N57976P31049O31968K35601l95495q12222o09270j00601
40569i85802M6867j87469k16895J23109L55775K68849K04106K32398m8627n10295
40559g17984k65850Q70867J583566O96384r72698j523298m80620P10246P21878
40550F22491j38295p37141o12133j54620J80952K92029K45120J03856m2136q0935
40540c20812K8223K00641K85852K20594J14522Q6498L9746j94778m76099m18896
40530d34509M8048N22663O99825P22712P18906M32219k61107q58797q06801l02217
40520D80942M6997J36945K98085M77138K57529k78430m85662j65047P2016k02273
40510F38240m99180j82747M77019O23156r287p69209r35399m84593P4292L54299
$$ plain form
40578 -1335325 -1224808 -666832 64217 696185 931786 536291 -275931 -885201 -985802
40569 -985802 -938935 -1126404 -1343299 -1220190 -864415 -595566 -391460 -159062 -207689 -717984
40559 -717984 -983834 -112967 1470599 2166983 1194285 -329013 -809633 -99387 622491
40550 622491 484196 -252945 -865078 -1019698 -838746 -546717 -301597 -197741 -239877 -320812
40540 -320812 -292589 -91948 193904 414498 529020 615518 655264 460486 -15613 -434509
40530 -434509 -386461 136202 836027 1558739 2277645 2709864 2448757 1589960 783159 480942
40520 480942 527939 664884 962969 1440107 1697636 1419206 933544 768497 840513 638240
40510 638240 139060 -43687 433332 1056488 1047201 277992 -657407 -1142000 -1067708 -713409
40500g13409L92034L73004K60536j02004n24734m47255L18138J062627Q94418
40491A513355p6245q02154o36812n8195J62338l3223k03990j87355j51237j33707
40481f07225k8386J09280J61022K33392M62085O54371N19293J32943k24536n28286
40471H83953q09764o82946K14014J288167J330118J08272j092417j032149l6316
40462A70932O47591N01381k2278n33494j020833j219331o71707L42064Q15178
40453i90497L65726j78631n3190L21715J92178k09607j57100J70535q4166q92129
40443a515166j145887l05283P73993J140369R91003R38675P82931l6919j143218
40434D80498j391081l95505Q71680J245238O38998p7766j56664L02238N82276
$$ plain form
40500 -713409 -321375 51629 312165 210161 -314573 -761828 -443690 618937 1513355
40491 1513355 1437110 634956 -1856 -60051 102287 69064 -134926 -322281 -473518 -607225
40481 -607225 -635611 -526331 -365309 -131917 330168 984539 1503832 1636775 1412239 883953
40471 883953 74189 -608757 -394743 893424 2223542 2331814 1239397 207248 170932
40462 170932 818523 1319904 1297626 764132 -256701 -1476032 -2147739 -1805675 -990497
40453 -990497 -624771 -803402 -856592 -534877 -342699 -552306 -709406 -538871 -623037 -1515166
40443 -1515166 -2661053 -2966336 -2192343 -1051974 -60971 877704 1660635 1623716 480498
40434 480498 -910583 -1306088 -434408 810830 1449828 1372062 1215398 1517636 2099912
40425B099912K15321m14911n08764P8940O02412N07282K74330O79836J623069
40416E157427K381025K717058K853204K495192R98757j258858k755759k650319
40408I937727j872500j704016k038827j934716j260849o83778l58039J50629O71578
40399I07209M06851n89798j064988l15146O69203O30689j45291m61070j07779
40390g0120P3033j77629j58093L31464M10846l81872j052728n19583O98662J187097
40380C41077N96965j49238l88199l58824l12261o5862L04262K98781q5471j42577
40370C8653L67259O69634K00485m10771l40227J18396J25094l28358n59294l80480
40360d99609k10253k06444j78073j95865m07196l96643L12645J208470J273494
$$ plain form
40425 2099912 2315233 1900322 1391558 1470498 2072910 2580192 2854522 3534358 5157427
40416 5157427 7538452 10255510 13108714 15603906 16602663 15343805 12588046 9937727
40408 9937727 8065227 6361211 4322384 2387668 1126819 443041 85002 235631 907209
40399 907209 1314060 724262 -340726 -655872 13331 644020 498729 37659 -70120
40390 -70120 2913 -174716 -332809 -1345 409501 27629 -1025099 -1544682 -846020 341077
40380 341077 938042 788804 400605 41781 -270480 -336342 -32080 266701 181230 38653
40370 38653 405912 1075546 1276031 865260 525033 643429 768523 440165 -119129 -499609
40360 -499609 -709862 -916306 -1094379 -1290244 -1697440 -2094083 -1781438 -572968 700526
40351G00526N34055L1793J28021M4285n63933q47056k59363L12909j07172r53163
40341i79098r21497R2227R26394P88991M3417n57876o63496l45293P5104K06355
40331a334772P495q1235K15363N00311L08967q7125q4330K70772L77265N6692
40321A49403k36500j93006j9086O5276J54792L31575M54471M42719M16225M10768
40311A976637K66546m6232k46342p4968L11347M38145L7544n57917o88474j72222
40301A244064L62878K88945j01290q3376K31368J4979p68765j047975l09213M83022
40291C14637L90154p2426n325K84333J1591m88674l25893K66669L14438j47158
40281E42346k56621p3584m60316j197673j009373K11220R60674M71265k02097
$$ plain form
40351 700526 1234581 1266374 1394395 1438680 874747 27691 -231672 81237 -25935 -979098
40341 -979098 -1900595 -1808368 -881974 -92983 -49566 -607442 -1270938 -1616231 -1541127 -1334772
40331 -1334772 -1327277 -1408512 -1193149 -692838 -383871 -470996 -555326 -284554 92711 149403
40321 149403 -87097 -280103 -299189 -233913 -79121 252454 706925 1149644 1565869 1976637
40311 1976637 2243183 2196951 1950609 1875641 2186988 2625133 2662677 2104760 1416286 1244064
40301 1244064 1606942 1895887 1794597 1711221 1942589 1957568 1188803 140828 -168385 314637
40291 314637 704791 632365 627040 911373 922964 434290 108397 375066 689504 542346
40281 542346 285725 212141 -248175 -1445848 -2455221 -2244001 -1283327 -812062 -1014159
40272a014159j79311j30272o24942p44490K68002J315476R99471j44746n93217
40263h48188k26618r5093l56148k10772L48086M44029J8285L0652O91918R47326
$$ plain form
40272 -1014159 -1193470 -1323742 -1948684 -2693174 -2425172 -1109696 -110225 -254971 -848188
40263 -848188 -1074806 -1169899 -1526047 -1736819 -1388733 -944704 -926419 -895767 -203849 743477
$$ [...]
##END NTUPLES=NMR SPECTRUM
##END=
