##TITLE=31Pdec_LR-685B-C1MC2
 DMSo-d6, 124 sc
 26.3.2020
##JCAMPDX= 6.0         $$ Bruker NMR JCAMP-DX V2.0
##DATA TYPE= NMR SPECTRUM
##DATA CLASS= NTUPLES
##ORIGIN= UXNMR, Bruker Analytische Messtechnik GmbH
##OWNER= root
$$ XWIN-NMR		Version 3.5
$$ Thu Mar 26 14:03:46 2020 Russian Standard Time (UT+4h)  she@DPX200
##.OBSERVE FREQUENCY= 81.013821
##.OBSERVE NUCLEUS= ^31P
##.ACQUISITION MODE= SIMULTANEOUS
##.ACQUISITION SCHEME= undefined
##.AVERAGES= 124
##.DIGITISER RES= 17
##SPECTROMETER/DATA SYSTEM= spect
##.PULSE SEQUENCE= zgpg30
##.SOLVENT NAME= DMSO
##.SHIFT REFERENCE= (INTERNAL, DMSO, 0, 182.463)
##AUDIT TRAIL= $$ (NUMBER, WHEN, WHO, WHERE, WHAT)
$$ ##TITLE= Audit trail, XWIN-NMR		Version 3.5
$$ ##JCAMPDX= 5.01
$$ ##ORIGIN= Bruker BioSpin GmbH
$$ ##OWNER= she
$$ F:/spectra/data/she/nmr/P31/1/pdata/1/auditp.txt
$$ ##AUDIT TRAIL=  $$ (NUMBER, WHEN, WHO, WHERE, WHAT)
(   1,<2020-03-26 14:02:29.67 +0400>,<she>,<DPX200>,
      <continue with go, POWCHK disabled, PULCHK disabled
       configuration hash MD5:
       00 E9 B6 7A A2 85 ED C7 34 08 36 98 17 FE 4E 26
       data hash MD5: 32K
       14 92 AE CB 79 40 A7 06 44 46 F2 F2 1D C5 CA 58>)
(   2,<2020-03-26 14:02:32.20 +0400>,<she>,<DPX200>,
      <Start of raw data processing
       efp BC_mod = 2 LB = 1 FT_mod = 6 PKNL = 1 PHC0 = -1383.411 PHC1 = 190.6017 SI = 64K 
       data hash MD5: 64K
       90 4B 39 B9 D8 A9 CA CF A6 39 AA 0A 4B 5E F0 E9>)
(   3,<2020-03-26 14:03:10.76 +0400>,<she>,<DPX200>,
      <pk PHC0 = -511.2595 PHC1 = 431.0002 
       data hash MD5: 64K
       10 89 24 3D 58 7F 56 7C 1F 8E A9 2A FB 2B FB 64>)
(   4,<2020-03-26 14:03:14.07 +0400>,<she>,<DPX200>,
      <abs ABSG = 5 
       data hash MD5: 64K
       16 62 E2 B5 E3 A7 72 7C CA 65 8A 52 A8 B1 AD 07>)
$$ ##END=
$$ 
$$ hash MD5
$$ 6C 4A 7F B9 F4 13 6D 5B 96 E2 D1 D7 E9 85 18 85
##$RELAX= 
##$RELAX= 
##$RELAX= 
##$RELAX= 
##$RELAX= 
##$RELAX= 
##$RELAX= 
##$RELAX= 
$$ Bruker specific parameters
$$ --------------------------
##$DU= <F:/spectra>
##$EXPNO= 1
##$NAME= <P31>
##$PROCNO= 1
##$TYPE= <nmr>
##$USER= <she>
##$AMP= (0..31)
100 100 100 100 100 100 100 100 100 100 100 100 100 100 100 100 100 100 
100 100 100 100 100 100 100 100 100 100 100 100 100 100 
##$AQSEQ= 0
##$AQ_mod= 1
##$AUNM= <au_zg>
##$AUTOPOS= <>
##$BF1= 81.014009
##$BF2= 200.13
##$BF3= 200.13
##$BF4= 200.13
##$BF5= 200.13
##$BF6= 200.13
##$BF7= 200.13
##$BF8= 200.13
##$BYTORDA= 1
##$CFDGTYP= 0
##$CFRGTYP= 5
##$CHEMSTR= <none>
##$CNST= (0..31)
1 1 145 1 1 1 1 1 1 1 1 1 1 1 1 1 1 1 1 1 1 1 1 1 1 1 1 1 1 1 1 1 
##$CPDPRG= <waltz16>
##$CPDPRG1= <>
##$CPDPRG2= <waltz16>
##$CPDPRG3= <>
##$CPDPRG4= <mlev>
##$CPDPRG5= <mlev>
##$CPDPRG6= <mlev>
##$CPDPRG7= <mlev>
##$CPDPRG8= <mlev>
##$CPDPRGB= <>
##$CPDPRGT= <>
##$D= (0..31)
0 1 0 0 0 0 0 0 0 0 0 0.03 2e-05 3e-06 0 0 0 0 0 0 0 0 0 0 0 0 0 0 0 0 
0 0 
##$DATE= 1585216768
##$DBL= (0..7)
120 120 120 11 120 120 24 19 
##$DBP= (0..7)
150 150 150 150 150 150 150 150 
##$DBP07= 0
##$DBPNAM0= <>
##$DBPNAM1= <>
$$ [...]
##$SUBNAM3= <"">
##$SUBNAM4= <"">
##$SUBNAM5= <"">
##$SUBNAM6= <"">
##$SUBNAM7= <"">
##$SUBNAM8= <"">
##$SUBNAM9= <"">
##$SW= 369.568048894756
##$SWIBOX= (0..15)
0 1 3 0 0 0 0 0 0 0 0 0 0 0 0 0 
##$SW_h= 29940.119760479
##$TD= 32768
##$TD0= 1
##$TE= 0
##$TE2= 300
##$TE3= 300
##$TEG= 300
##$TL= (0..7)
0 120 53 12 22 120 120 120 
##$TP= (0..7)
150 150 150 150 150 150 150 150 
##$TP07= 0
##$TPNAME0= <>
##$TPNAME1= <>
##$TPNAME2= <>
##$TPNAME3= <>
##$TPNAME4= <>
##$TPNAME5= <>
##$TPNAME6= <>
##$TPNAME7= <>
##$TPOAL= (0..7)
0.5 0.5 0.5 0.5 0.5 0.5 0.5 0.5 
##$TPOFFS= (0..7)
0 0 0 0 0 0 0 0 
##$TUNHIN= 0
##$TUNHOUT= 0
##$TUNXOUT= 0
##$USERA1= <user>
##$USERA2= <user>
##$USERA3= <user>
##$USERA4= <user>
##$USERA5= <user>
##$V9= 5
##$VALIST= <valist>
##$VCLIST= <CCCCCCCCCCCCCCC>
##$VD= 0
##$VDLIST= <DDDDDDDDDDDDDDD>
##$VPLIST= <PPPPPPPPPPPPPPP>
##$VTLIST= <TTTTTTTTTTTTTTT>
##$WBST= 1024
##$WBSW= 4
##$XGAIN= (0..3)
0 0 0 0 
##$XL= 0
##$YL= 0
##$YMAX_a= 13382
##$YMIN_a= -25419
##$ZGOPTNS= <>
##$ZL1= 120
##$ZL2= 120
##$ZL3= 120
##$ZL4= 120
##$ABSF1= 182.463
##$ABSF2= -187.1042
##$ABSG= 5
##$ABSL= 3
##$ALPHA= 0
##$AQORDER= 0
##$ASSFAC= 0
##$ASSFACI= 0
##$ASSFACX= 0
##$ASSWID= 0
##$AUNMP= <proc_1d>
##$AZFE= 0.1
##$AZFW= 0.5
##$BCFW= 0
##$BC_mod= 2
##$BYTORDP= 0
##$COROFFS= 0
##$CY= -3
##$DATMOD= 1
##$DC= 0
##$DFILT= <>
##$DTYPP= 0
##$F1P= 0
##$F2P= 0
##$FCOR= 1
##$FTSIZE= 65536
##$FT_mod= 6
##$GAMMA= 0
##$GB= 0
##$INTBC= 1
##$INTSCL= 5.30512e-09
##$ISEN= 30
##$LB= 1
##$LEV0= 0
##$LPBIN= 0
##$MAXI= 10000
##$MC2= 0
##$MEAN= 0
##$ME_mod= 0
##$MI= 50
##$NCOEF= 0
##$NC_proc= -8
##$NLEV= 6
##$NOISF1= 182.463
##$NOISF2= 159.3651
##$NSP= 0
##$NTH_PI= 0
##$NZP= 0
##$OFFSET= 182.463
##$PC= 4
##$PHC0= -1894.671
##$PHC1= 621.6019
##$PH_mod= 1
##$PKNL= yes
##$PPARMOD= 0
##$PSCAL= 0
##$PSIGN= 0
##$REVERSE= no
##$SF= 81.0140089999434
##$SI= 65536
##$SIGF1= 159.3651
##$SIGF2= -187.1042
##$SINO= 113.3802
##$SIOLD= 16384
##$SREGLST= <1H.CDCl3>
##$SSB= 0
##$STSI= 65536
##$STSR= 0
##$SW_p= 29940.119760479
##$SYMM= 0
##$S_DEV= 0
##$TDeff= 32768
##$TDoff= 0
##$TI= <>
##$TILT= no
##$TM1= 0
##$TM2= 0
##$TOPLEV= 0
##$USERP1= <user>
##$USERP2= <user>
##$USERP3= <user>
##$USERP4= <user>
##$USERP5= <user>
##$WDW= 1
##$XDIM= 65536
##$YMAX_p= 292536915
##$YMIN_p= -146052322
$$ End of Bruker specific parameters
$$ ---------------------------------
##NTUPLES= NMR SPECTRUM
##VAR_NAME=  FREQUENCY,     SPECTRUM/REAL,   SPECTRUM/IMAG
##SYMBOL=    X,             R,               I
##VAR_TYPE=  INDEPENDENT,   DEPENDENT,       DEPENDENT
##VAR_FORM=  AFFN,          ASDF,            ASDF
##VAR_DIM=   65536,         65536,           65536
##UNITS=     HZ,            ARBITRARY UNITS, ARBITRARY UNITS
##FACTOR=    0.456856943014862, 1,           1
##FIRST=     14782.0589164792, 0,            0
##LAST=      -15158.0608439998, 0,           0
##MIN=       -15158.0608439998, -146052322,  0
##MAX=       14782.0589164792, 292536915,    0
$$ Real data points
##PAGE= N=1
##DATA TABLE= (X++(R..R)), XYDATA
$$ [...]
##PAGE= N=2
##DATA TABLE= (X++(I..I)), XYDATA
4805f948457r950951K550354J4799149J0254537k669694p189583m452729n661243
4797i268617r571091o213054L329733P622952K956396l053060n120636n456283
4789b4773660m685841R42860R804048J1783897J393099j1558885j2069685P32402
4781b8431765J1681882Q814641k019511o586660j049305O163102P896139M409548
4773H78071k273893r391759r505798J550934J2257228O843983q165938q578853
4765a6386025R410079J9047151M768672j0360980j448561J5996281J1359777r367743
4757B3018651j3611196L356000J2147919j539810j7856441j9819445j5736007
4750c0040329j3709905n065389J1988589J9918895J0014904j110394K24486L313434
$$ plain form
4805 -6948457 -16899408 -14349054 450095 10704632 8034938 845355 -3607374 -9268617
4797 -9268617 -18839708 -25052762 -21723029 -14100077 -11143681 -14196741 -19317377 -24773660
4789 -24773660 -29459501 -28516641 -18712593 -6928696 -5535597 -17094482 -29164167 -28431765
4781 -28431765 -16749883 -7935242 -9954753 -16541413 -17590718 -11427616 -3531477 878071
4773 878071 -1395822 -10787581 -20293379 -18742445 -6485217 358766 -7807172 -16386025
4765 -16386025 -6975946 12071205 16839877 6478897 5030336 21026617 32386394 23018651
4757 23018651 9407455 12763455 24911374 23371564 5515123 -14304322 -30040329
4750 -30040329 -43750234 -48815623 -36827034 -16908139 -6893235 -8003629 -7779143 -4465709
4742d465709k434669m886626P480764K0075680J4001043k673694r229878m540454
4734A3326457j508397r50136M500841R030753Q57989j3878852j7061314o235027
4726a1917686L462833L363839p90403l572985n618965n480828j082867J813459
4718a9823603l069791q731477l153592J0331679J6074956R133070P58536P9130
4710A598908L587352M724096K630209p87222l906471m697763l289244l170058
4702c310193m346289j005493P141941R897480K804206j899054N737174J3611144
4694B8630916M948497j2166226j4282353J129657J1242721K180319j2542893j4269894
4686e129256l557118N821571N570498j661637p737929n606338L850596J0961376
$$ plain form
4742 -4465709 -6900378 -11787004 -4306240 15769440 29770483 27096789 17866911 13326457
4734 13326457 11818060 10867924 15368765 24399518 25257507 11378655 -5682659 -11917686
4726 -11917686 -8454853 -5091014 -5881417 -9454402 -15073367 -20554195 -21637062 -19823603
4718 -19823603 -22893394 -31624871 -34778463 -24446784 -8371828 761242 1519778 1598908
4710 1598908 5186260 9910356 12540565 11753343 7846872 3149109 -140135 -3310193
4702 -3310193 -7656482 -8661975 -1520034 8377446 11181652 9282598 15019772 28630916
4694 28630916 33579413 21413187 7130834 8260491 19503212 21683531 9140638 -5129256
4686 -5129256 -8686374 -2864803 2705695 1044058 -6693871 -12300209 -8449613 2511763
4678B511763R039890L829347L118718K692503n049052j3868411j1240270l66558
4670i332070L347022k032268j816664R039989J5231160M709767j2338050j8187132
4662a1378246j0011172J768017Q712257R053392L666911m392642r473193p517969
4654a9572645P56403J1298805J8069350J4998201K708980q509856r311644k737253
4646G700341J990528L170223M794640N280587M5014p091136p720412k922705j161579
4637D085501l265276k569648O78787p76898o055474n025202N000325J3900958
4629E973073J3029738M423848n501168j1362687q427051K270028R923113O613837
4621A6942731Q18206M818014J2956376R386384n423479j4945903j2484093p402979
$$ plain form
4678 2511763 11551653 15381000 18499718 21192221 16143169 2274758 -8965512 -9332070
4670 -9332070 -5985048 -8017316 -9833980 -793991 14437169 19146936 6808886 -11378246
4662 -11378246 -21389418 -19621401 -10909144 -1855752 1811159 -2581483 -12054676 -19572645
4654 -19572645 -18816242 -7517437 10551913 25550114 28259094 19749238 10437594 7700341
4646 7700341 9690869 12861092 17655732 22936319 22981333 15890197 8169785 5247080 4085501
4637 4085501 820225 -1749423 -1070636 -1847534 -7903008 -12928210 -7927885 5973073
4629 5973073 19002811 23426659 17925491 6562804 -1864247 405781 10328894 16942731
4621 16942731 17760937 22578951 35535327 44921711 39498232 24552329 12068236 4665257
4613D665257n382714k447140L00146l598531r931677p971826j299908k422501
4605b8088894p135711m89775J1183117N508561j4150504j7167343L700728J6937508
4597b9702313M618162o755845P519337K7385286K3084551M954106J942974J1691053
4589D4737311J0146358l417498q662387l061985l400462j2677601j7203115j4167308
4581g706687j2975309j1482620M49035J5175133J3849118o65067n514270N174448
4573c696219J2340215N212870l902624m480176k776374l941608j719762M873019
4565A909341N070365l829256q636287j730480O614729O347345J773331j246901
4557F272187n951437j2721816j2097325r75798P941403M564356k743727j440220
$$ plain form
4613 4665257 -717457 -3164597 -2864451 -6462982 -16394659 -24366485 -25666393 -28088894
4605 -28088894 -35224605 -35714380 -24531263 -19022702 -33173206 -50340549 -46639821 -29702313
4597 -29702313 -25084151 -31839996 -24320659 3064627 26149178 31103284 33046258 44737311
4589 44737311 54883669 51466171 42803784 39741799 36341337 23663736 6460621 -7706687
4581 -7706687 -20681996 -32164616 -31715581 -16540448 -2691330 -3356397 -8870667 -3696219
4573 -3696219 8643996 13856866 9954242 5474066 2697692 -1243916 -2963678 1909341
4565 1909341 6979706 3150450 -5485837 -7216317 -601588 5745757 7519088 6272187
4557 6272187 320750 -12401066 -24498391 -25474189 -17532786 -12968430 -15712157 -17152377
4549a7152377N771923Q008075M104185J237433J529997R64660j847919m260084
4541a644107m492210k460712J230801L732090J826684k336321l298817j613997
4533i056589k938794n717235o36020J2285851J7478995M517897j3252296j3167588
4525a0485779O866955K4585879K0583152L02529j5223570j4732506o084447j191977
4517D620236L47296O011980J3066271Q662464r132260k2130593j3863505O889267
4509e528844J6597030P013131p941549j3809197j0866970n745574K38163Q578947
4501a1464863J6583070J8586411J1845736m52702j0660326j2712153q576398n111032
4493a962257l285664J697094O832188P05192j5324619k0143942k057357J8344248
$$ plain form
4549 -17152377 -11380454 -3372379 731806 1969239 3499236 4463896 2615977 -1644107
4541 -1644107 -6136317 -8597029 -7366228 -3634138 -1807454 -4143775 -7442592 -9056589
4533 -9056589 -11995383 -17712618 -18348638 -6062787 11416208 15934105 2681809 -10485779
4525 -10485779 -3618824 20967055 41550207 41852736 26629166 11896660 5812213 4620236
4517 4620236 4967532 10979512 24045783 32708247 23575987 1445394 -12418111 -5528844
4509 -5528844 11068186 18081317 10139768 -3669429 -14536399 -20281973 -20043810 -11464863
4501 -11464863 5118207 23704618 35550354 35097652 24437326 11725173 3148775 -1962257
4493 -1962257 -5247921 -3550827 3281361 3986553 -11338066 -31482008 -33539365 -15195117
4485a5195117J4910729m660604j1036047J000239P682237k189008j0714433l994353
4477b4196357N711840M578550N21050M584007P966086k352738j7995801j9006701
4469d0190064j882850J8533217K9483997K8456934J6324763l145118j9199914
4462B8380965k1817401j3418144m725319p79797J410784L675225L345550q05678
4454d733815n025086m280952K112255Q183925N821839n029090j2831282p236723
4446b3018929O533812J4080327J0852415N012127K588762J423434j11945p15066
4438A6644937k863362q917700j1008090o50783J1629621O269280j2671589j7883119
4430a9450805j6577J5608818P686904q404571o745502Q655278J3696238K569386
$$ plain form
4485 -15195117 -284388 -4944992 -15981039 -14980800 -7298563 -9487571 -20202004 -24196357
4477 -24196357 -18484517 -13905967 -13384917 -8800910 -834824 -3187562 -21183363 -40190064
4469 -40190064 -42072914 -23539697 5944300 34401234 50725997 47580879 28380965
4462 28380965 6563564 -6854580 -11579899 -12359696 -10948912 -7273687 -3928137 -4733815
4454 -4733815 -9758901 -14039853 -11927598 -3743673 2078166 -2950924 -15782206 -23018929
4446 -23018929 -16485117 -2404790 8447625 13459752 16048514 17471948 17360003 16644937
4438 16644937 13781575 4863875 -6144215 -6794998 4834623 11103903 -1567686 -19450805
4430 -19450805 -19467382 -3858564 3828340 -4576231 -11321733 -2666455 11029783 13599169
4422A3599169q431150r497488o922143n818833k895937K275743M259056J997255
4414a1434328O86686K844886O318125R529258J0798026N999696n048263j4208125
4406E485961j4504503q558517j282204P294331J4587052J2174138R4340p529968
4398G760630l079326J498828l656450o801382M038251J4800730N517776j3985132
4390F093925j7159088l610543J924852p113464r060502O332628J8833614J1466028
4382G707450k361250k522155O937622R007721J176808o423484j0023457j2430452
4374h931197j1098505j459955J1239710J6051466J0838067L486519K22232J99229
4366B0547566K20460j374679m530615o952464n343339k1817M273614M529930L049068
$$ plain form
4422 13599169 5168019 -4329469 -11251612 -17070445 -19966382 -17690639 -13431583 -11434328
4414 -11434328 -10747642 -7902756 -1584631 7944627 18742653 24742349 19694086 5485961
4406 5485961 -9018542 -17577059 -18859263 -11564932 3022120 15196258 15290598 7760630
4398 7760630 4681304 6180132 2523682 -4277700 -239449 14561281 20079057 6093925
4390 6093925 -11065163 -14675706 -12750854 -19864318 -28924820 -22592192 -3758578 7707450
4382 7707450 5346200 2824045 9761667 18769388 19946196 13522712 3499255 -8931197
4374 -8931197 -20029702 -21489657 -10249947 5801519 16639586 20126105 20348337 20547566
4366 20547566 20768026 19393347 14862732 7910268 2566929 2545112 6818726 11348656 14397724
4357A4397724K617180K083136j97622k038014k94633L632765M193650k114581
4349B2279605j1444859j4415018n809035P279984J1687970M344694m059302m806760
4341E057279k090093j870861M70192J0188278J8542855J2510964m521704j5888993
4333B2397917j3847552n540225J506588N703114M091154n596940j3845867n952136
4325a1083947J5767230K9992728K2242572J431065j4004220j5717417p237580
4318B1390431K683268M168368n652830j4866833q275694J0020183J8266096N768481
4310C3501470j3521132k2010274j8896196j1645752j605549J0063497J3898048
4303a0215888L801137r789042j1230113j67928R483681P869595j721644r231045
$$ plain form
4357 14397724 17014904 19098040 18900418 16862404 16567771 20200536 24394186 22279605
4349 22279605 10834746 -3580272 -9389307 -2109323 9578647 13923341 9864039 5057279
4341 5057279 2967186 1096325 1566517 11754795 30297650 42808614 38286910 22397917
4333 22397917 8550365 3010140 4516728 10219842 14310996 8714056 -5131811 -11083947
4325 -11083947 4683283 34676011 56918583 58349648 44345428 28628011 21390431
4318 21390431 24073699 28242067 22589237 7722404 -553290 9466893 27732989 33501470
4310 33501470 19980338 -2029936 -20926132 -32571884 -34177433 -24113936 -10215888
4303 -10215888 -6414751 -16203793 -27433906 -27601834 -18118153 -10248558 -11970202 -21201247
4295b1201247p027571L995449J3209597R986755k190713q709968m362247n42528
4287a6842473n713551j0561760l516615Q832711J1128792L350450M12143Q859121
4279d051182J7593940J4347329J128077j0718308j3982884j0332455n930464n320382
4271a7266329p329057n813995L207914J4484034J6641132M940076j0776010j5171021
4263a7083256n499139M739305M715938K142210R170244J7494375O996393j8116751
4255D559319k6098756l823718J7753296P393607j7498051j7564845O724257J8516711
4247a0038180M990891p236763j529755N500873K509294M978172J8587858J8737900
4239C6500290o474726k5916243j0495510J8561123K2201390K612737q382763l690047
$$ plain form
4295 -21201247 -28228818 -24233369 -11023772 -1037017 -3227730 -11937698 -16299945 -16842473
4287 -16842473 -22556024 -33117784 -36634399 -27801688 -16672896 -13322446 -12910303 -4051182
4279 -4051182 13542758 27890087 29018164 18299856 4316972 -6015483 -11945947 -17266329
4271 -17266329 -24595386 -30409381 -27201467 -12717433 3923699 8863775 -1912235 -17083256
4263 -17083256 -22582395 -17843090 -13127152 -10984942 -1814698 15679677 22676070 4559319
4255 4559319 -21539437 -25363155 -7609859 -216252 -17714303 -35279148 -28554891 -10038180
4247 -10038180 -5047289 -12284052 -13813807 -8312934 -5803640 -825468 17762390 36500290
4239 36500290 30025564 4109321 -6386189 12174934 34376324 36989061 28606298 24916251
4231B4916251l031924r808312o716881O805575J0113091j729573q915137p93705
4223A0839385R488050J0619000P693953M783108k958439j3074754j4121142o461580
4215F807581l439985o850765l751082P094832J0038730J226349k805729M504639
4207A2824570O302671o632202j5967351n814743Q432388L879825j2796636j6155000
4199b5926478n96776J4610735J4886479N208881l937259r026156r681957m680126
4191a9142657M192164J0832423R946291J301643r903149j5681354j1928469l708651
4183c4091759O55298P44397K732986P685991J0585959J1108699J3724706J5535688
4175B8681965P529636q094025j5989151r447037p06730j802031q100429r879369
$$ plain form
4231 24916251 21884327 12076015 5359134 12164709 22277800 20548227 11633090 10839385
4223 10839385 20327435 30946435 38640388 43423496 40465057 27390303 13269161 6807581
4215 6807581 3367596 -3483169 -7234251 -139419 9899311 11125660 8319931 12824570
4207 12824570 19127241 12495039 -3472312 -9287055 -854667 3025158 -9771478 -25926478
4199 -25926478 -26523254 -11912519 2973960 8182841 4245582 -4780574 -14462531 -19142657
4191 -19142657 -14950493 -4118070 5828221 7129864 -2773285 -18454639 -30383108 -34091759
4183 -34091759 -33436461 -32692064 -29959078 -22273087 -11687128 -578429 13146277 28681965
4175 28681965 36211601 28117576 12128425 2681388 1974658 172627 -7927802 -17807171
4167a7807171p758748o240730l285319K726413O091591M583290O283854J4101629
4159a305191J5156715M7829j7475081j6896282j92084J1956450Q856439j021681
4151h72886o659141n316236J696273J0411609J2481141M524968k618810L167871
4143A6814789J5172744J5089181r5841j3598673j3162463n164733k38206J386202
4135A6203000L322745L232352j630379o560527n369117K65071L868185L237879
4127A6569209Q32381k509718q419507j5124047j5204427l298299J3828040J9869066
4119F542698P100574j0781773j2760992K453780J4689385J0640321J12125l697040
4111A4299078m799349j1134747j4392640l539040J0355885O873323r488450j3425185
$$ plain form
4167 -17807171 -25565919 -31806649 -35091968 -32365555 -26273964 -21690674 -15406820 -1305191
4159 -1305191 13851524 13899353 -3575728 -20472010 -20664094 -8707644 148795 -872886
4151 -872886 -7532027 -12848263 -11151990 -740381 11740760 16265728 13646918 16814789
4143 16814789 31987533 47076714 46980873 33382200 20219737 15055004 14816798 16203000
4135 16203000 19525745 22758097 21127718 14567191 9198074 9463145 13331330 16569209
4127 16569209 17401590 14891872 6472365 -8651682 -23856109 -27154408 -13326368 6542698
4119 6542698 13643272 2861499 -9899493 -7445713 7243672 17883993 17996118 14299078
4111 14299078 9499729 -1635018 -16027658 -19566698 -9210813 -2337490 -11825940 -25251125
4103b5251125R75472J0753384K414098o653860O10439J1998423Q539138k835535
4095E50434l293471M505213L521614m971385l954349N867459L974383j3348759
4087g148861k1664042n963748J3703999J2061661l665945p500112N029131J3996423
4079a151494Q504247j9319p49412L86852m428420r426676n957799J510177K163189
4070i168655l875881o235401m53083N990430M969773j362196l594637L572768
4062a0156882J4604818J7932364Q354330o269301j3648170j1145255n997457k620515
4054h946068J482411N539817K455163p758292j1983437j608844J1915921J1548502
4046B645173n78800o519029J473842J1936521J2188385L331193n483962q020035
$$ plain form
4103 -25251125 -24275653 -13522269 -11108171 -17762031 -17151592 -5153169 3385969 550434
4095 550434 -2743037 1762176 5283790 312405 -3641944 2225515 6199898 -7148861
4087 -7148861 -28812903 -34776651 -21072652 -9010991 -12676936 -20177048 -15147917 -1151494
4079 -1151494 7352753 7333434 6584022 6970874 2542454 -6884222 -12842021 -11331844 -9168655
4070 -9168655 -13044536 -19279937 -19733020 -13742590 -8772817 -10135013 -13729650 -10156882
4062 -10156882 4447936 22380300 30734630 24465329 10817159 -328096 -6325553 -8946068
4054 -8946068 -7463657 -1923840 531323 -7226969 -19210406 -20819250 -8903329 2645173
4046 2645173 2066373 -4452656 -2978814 8957707 21146092 24477285 18993323 10973288
4038A0973288l274022N055550R078451L659068n942948r793971o061539r03519
4030B790358K300990M509089M165293l99111l812202p90947K295502k939165q997710
4021h77903k331831J0725127J0196052l553473p712956M239083R660776l788601
4013A6556274j4008336j450466J4537671N127751k0242188k7975264j1588768
4006c9043326M214057O307033O876963J2290064R702955n914520j7136853r405383
3998c2109010P781989J6884065J4508934P280251j102032q484674j0710286q047814
3990a3998577o215972n578356R027Q985559J0113911J512010k658930N535888
3982b295440J2627301M538112q677703o326811J0534154J9111408Q328499n039287
$$ plain form
4038 10973288 7699266 12754816 21833267 25492335 19549387 9755416 3693877 2790358
4030 2790358 5091348 9600437 13765730 13366619 9554417 8763470 11058972 8119807 -877903
4021 -877903 -3209734 7515393 17711445 14157972 6445016 10684099 20344875 16556274
4013 16556274 2547938 1097472 15635143 20762894 520706 -27454558 -39043326
4006 -39043326 -34829269 -28522236 -21645273 -9355209 347746 -5566774 -22703627 -32109010
3998 -32109010 -24327021 -7442956 7065978 14346229 13244197 4759523 -5950763 -13998577
3990 -13998577 -20214549 -25792905 -25783878 -16798319 -6684408 -5172398 -7831328 -2295440
3982 -2295440 10331861 14869973 6192270 -134541 10399613 29511021 37839520 32800233
3974C2800233j743170J0805610Q698442j2803566k9498966k0822671J15441M363002
3966h085645j0179360j5029487M924621K6077591K0655137j402750r179194J343871
3958I124784N010979q829876k0254032j3360173k93494K381713o14493K356120
3950b4478472P260164M832906Q41697O310775J5372438J1832236n441285j9998373
3942c467914k0058509j0087302M6793O200669Q882029R551700R409345O814689
3934G291500k222284j5558920k0976215r042483J2285474K4563834J9945637P873176
3926B4159719Q75875J328646L807104L820360O51205m570161r842686j2357684
3918G872378j0096260m300945M36434N84614j061592K520650J2519077J9515626
$$ plain form
3974 32800233 31057063 41862673 50561115 37757549 8258583 -12564088 -12448647 -8085645
3966 -8085645 -18265005 -33294492 -28369871 -2292280 18362857 16960107 7780913 9124784
3958 9124784 14135763 5305887 -14948145 -28308318 -28601812 -26220099 -26834592 -24478472
3950 -24478472 -17218308 -12385402 -11543705 -5232930 10139508 21971744 16530459 -3467914
3942 -3467914 -23526423 -33613725 -33566932 -27366263 -18484234 -8932534 476811 7291500
3934 7291500 5069216 -10489704 -31465919 -40508402 -28222928 -3659094 16286543 24159719
3926 24159719 25035594 26364240 30171344 33991704 34642909 30072748 20230062 7872378
3918 7872378 -2223882 -6524827 -6088393 -5503779 -6565371 -4044721 8474356 27989982
3910B7989982J3461451l806074k0913738k9046374k6041161j2774107N416607
3903d5713414J6624166J2869317K231969l53434N772141O925186l114710j4056118
3895a8814897j4396534l763057J2243141K6752549K9096866J2486396j1492637
3888C2111827k0802313j0437575K609629N883497N143101N474309m96661j4262091
3880E223723k0826065j0944118K824471O797561O107905Q703997P531738k825268
3872B593944r234581j145419P486468R21567r114822l720899P408551J703597
3864c101594j4039108j1220443J3304500L0582983K2943258M416853o999567j0220853
3856B5666029q236940j62921O498055p75759j6502696j9708018n850553O433424
$$ plain form
3910 27989982 41451433 37645359 16731621 -12314753 -38355914 -51130021 -45713414
3903 -45713414 -29089248 -16219931 -13987962 -14341396 -8569255 -1644069 -4758779 -18814897
3895 -18814897 -33211431 -36974488 -24731347 2021202 31118068 43604464 32111827
3888 32111827 11309514 871939 3481568 9365065 14508166 19982475 19485814 5223723
3880 5223723 -15602342 -26546460 -23721989 -16924428 -10816523 -2112526 5419212 2593944
3872 2593944 -6640637 -7786056 -299588 621979 -8492843 -12213742 -4805191 -3101594
3864 -3101594 -17140702 -28361145 -15056645 15526338 38469596 42886449 35886882 25666029
3856 25666029 17429089 17266168 23764223 22988464 6485768 -13222250 -19072803 -12639379
3848a2639379O669673O071901J1633078J2394566L100043l050787J028876K339604
3840B7547575o565575j0981484o02764R193778K894989p842438m696708O302897
3832A5250270P850160J418486k58923N65290o609170j5569534j1144596K011719
3824f486298L546249r593381j7332337p112699R566632J6956563J4740187J0502778
3816A4787694N591244k370628j0179848j0388681p28579J0802320J1657967j551810
3808A7619679j5539593j3468371K832288J3322708O283386o853989r537200r54329
3800f295421R550424J6418841J5899586L207908j5560254k1596778q366512M296729
3792b445477j957061j5173619j2792372J984879Q684434N615521Q659277J7616165
$$ plain form
3848 -12639379 -5969706 102195 11735273 24129839 27229882 24179095 25207971 27547575
3840 27547575 20982000 10000516 9397752 18591530 21486519 13644081 8947373 15250270
3832 15250270 23100430 24518916 24259993 24825283 18216113 2646579 -8498017 -6486298
3824 -6486298 -2940049 -12533430 -29865767 -36978466 -27411834 -10455271 4284916 14787694
3816 14787694 20378938 18008310 7828462 -2560219 -3288798 7513522 19171489 17619679
3808 17619679 2080086 -11388285 -8555997 4766711 11050097 4196108 -5341092 -6295421
3800 -6295421 3255003 19673844 35573430 38781338 23221084 1624306 -6742206 -2445477
3792 -2445477 -4402538 -19576157 -32368529 -30383650 -21699216 -16083695 -7424418 10191747
3784A0191747J4352142k624409j1228405j722335P003571o82735j2145762r043709
3776e899895L354280O854458j890134j0343323r314150o10327R305615J4203135
3768E659659J1071634L938912j52399j107616m034245p104100k883384O243097
3760A1631558P774216j574971j0077904r430236m596818k04550O411711J1846801
3752A1779807N048087j0604437j3238052M717097J8493301N403104j8641523k1009696
3744a8052312N4758J6009530J1599620J637999K160117P832836N677135m943575
3736B1976108j4220628j3817954k653713J1061967J3137215j506013j7729896
3729c752914j5659098K987011J6582353J2227554o88919p618085n783945O2243
$$ plain form
3784 10191747 24543889 21919480 10691075 8968740 15972311 15289576 3143814 -5899895
3776 -5899895 -2545615 4308843 2418709 -7924614 -17238764 -17849091 -8543476 5659659
3768 5659659 16731293 20670205 20517806 19410190 15375945 8271845 5388461 11631558
3760 11631558 19405774 17830803 7752899 -1677337 -6274155 -6478705 -66994 11779807
3752 11779807 16827894 6223457 -7014595 -2297498 16195803 21598907 2957384 -18052312
3744 -18052312 -17997554 -1988024 9611596 11249595 13409712 21242548 26919683 21976108
3736 21976108 7755480 -6062474 -8716187 2345780 15482995 13976982 -3752914
3729 -3752914 -19412012 -16425001 157352 12384906 11695987 4077902 -1706043 -1643800
3721a643800N823610O413748k418761j4327311j4888407n09920J4625158J7011316
3713A0085633R896696L819152M16290n060269j1955189j4693807j1437627n016453
3705b3945574J586837N363972L311983k206733k797854N367791J4331252J3507866
3697A4519540K963347p187373q015727L12941Q294936M115021j2695738k4789912
3689b2482965j4648598R938089K2134273J2096284p65989n29773R01509j0546185
3681c903355k0899046j0017591R901595R821813p995966j2071763O447276J9973476
3673h743561J2137201L750821J2811857K0878086O055999j6099846j6597323L4694
3665A4227928O766590M41196J465656J1926810J0406238p960705j9800121j1433294
$$ plain form
3721 -1643800 4179810 10593558 8174797 -6152514 -21040921 -21550841 -6925683 10085633
3713 10085633 19982329 23801481 24217771 19157502 7202313 -7491494 -18929121 -23945574
3705 -23945574 -22358737 -16994765 -13682782 -15889515 -18687369 -13319578 1011674 14519540
3697 14519540 17482887 10295514 2279787 2592728 10887664 15002685 2306947 -22482965
3689 -22482965 -37131563 -27193474 -5059201 7037083 6271094 5741321 6642830 -3903355
3681 -3903355 -24802401 -34819992 -24918397 -15096584 -23092550 -35164313 -28717037 -8743561
3673 -8743561 3393640 7144461 19956318 40834404 46890403 30790557 14193234 14227928
3665 14227928 20994518 21435714 22901370 34828180 45234418 37273713 17473592 6040298
3657F040298M82133q94940p050905m133432L144818M819684M802287Q678268P779851
3648B3668062n368814j7878890j2550204N269466J5230369J0120022k51351p380083
3640A0858577r660030m905272N648712R969282p81848j4066336j0173539P002377
3632f108077J3417298R42224j0599357m273020R388436R951129l777681j4797321
3624e856369j1026721K843312J3109739J0377708k024313r964760k987444J1879328
3616F350480J6880992N284997j1071236j7777473j3184701n024863j52997j526024
3608b0220825p689523j1132319m244790R296460J6271599J0645766R11432l074083
3600i236283k079602j289700p43156J130890J545995j559363l815987o74161M954679
$$ plain form
3657 6040298 6522431 5627491 -1423414 -5556846 -2412028 2407656 7209943 15888211 23668062
3648 23668062 18299248 420358 -12129846 -6860380 8369989 18490011 18238660 10858577
3640 10858577 1198547 -3706725 1941987 11911269 11129421 -2936915 -13110454 -6108077
3632 -6108077 7309221 8251445 -2347912 -6620932 2767504 12718633 8940952 -5856369
3624 -5856369 -16883090 -14039778 -930039 9447669 7423356 -2541404 -5528848 6350480
3616 6350480 23231472 28516469 17445233 -332240 -13516941 -18541804 -18694801 -20220825
3608 -20220825 -27910348 -39042667 -43287457 -33990997 -17719398 -7073632 -6162200 -9236283
3600 -9236283 -11315885 -12605585 -13348741 -12217851 -10671856 -12231219 -16047206 -16721367 -11766688
3591a1766688P072642M424254q06136p092326j1410997q414530K423439J3110146
3583a2460196J5595213J0088563J716851n448515p723586k543132N394546O242552
3575A0862296j337858o519229k228872M119553L296721j472828k290132j06926
3567D322725L58253J477358O279480P916307o56357j1239119r146417M953893
3559D266123J5705205J4436667O887683K64331m330511o054482l409914m86780
3551B7278322k900465o969730m430196K213717K253901m517054o313765N20961
3543G135691M896892l21852p308960p813564n266623m400139j766395L998705
3535a0846245M962880j905686n047013L973942J3505428Q289260n113626p441067
$$ plain form
3591 -11766688 -4694046 -269792 -1075928 -8168254 -19579251 -27993781 -25570342 -12460196
3583 -12460196 3135017 13223580 14940431 9491916 1768330 -774802 4619744 10862296
3575 10862296 9524438 3005209 776337 4895890 8192611 6719783 4429651 4322725
3567 4322725 4680978 6158336 12437816 20354123 19697766 8458647 -687770 4266123
3559 4266123 19971328 34407995 41295678 41560009 37229498 31175016 27765102 27278322
3551 27278322 24377857 17408127 12977931 15191648 17445549 12928495 6614730 7135691
3543 7135691 12032583 11710731 4401771 -3411793 -8678416 -13078555 -14844950 -10846245
3535 -10846245 -5883365 -7789051 -12836064 -8862122 4643306 12932566 7818940 377873
3527C77873K911130P997602m34449q516775l036681Q884824J2399814O178448
3519B6761786L31977N4639J881388K705411L021137K140717j923290p186075q686910
3510A9100780o254336n767138r806124j1396825k026655J5067467K4651233J5631925
3502C9200327m503121j6290938j1205160k876531q936759k4611683k6010193l448090
3494e8682148K1291425K2594064O317939n12096Q633204J1528580m418774j9881610
3486a3129416j4691762l00429J509618l279439O865481K6985577K8968438P823753
3478D0751821q725693n447366k055611j4721939k5326036j2782189R265202J4350088
3470d691723M985117K631184Q695811O845113l303151n985486L09773J947071
$$ plain form
3527 377873 3289003 11286605 10852156 2335381 -701300 8183524 20583338 26761786
3519 26761786 27093763 27148402 29029790 31735201 34756338 36897055 34973765 27787690 19100780
3510 19100780 12846444 7079306 -2726818 -14123643 -16150298 -1082831 23568402 39200327
3502 39200327 34697206 18406268 7201108 4324577 -4612182 -29223865 -55234058 -58682148
3494 -58682148 -37390723 -14796659 -8478720 -8990816 -357612 11170968 6752194 -13129416
3486 -13129416 -27821178 -28121607 -26611989 -29891428 -23025947 3959630 32928068 40751821
3478 40751821 32026128 26578762 24523151 9801212 -15524824 -28307013 -19041811 -4691723
3470 -4691723 293394 2924578 11620389 18465502 15162351 9176865 9486638 11433709
3462A1433709j213025M132218J4553448J0021072j0648063k3836631j8268499
3455a3825771r343572o984532O13656J7316113K3391108R003552m032974K584659
3447A8722239J1282632j151577k1667109k0869581o36759J0918220M282392l174510
3439b294053q70916K501460J365805J894003M843327K696993k655653r87437M584253
3430A1077782l17283j3013696j1819543Q629984K3603686J3767160n805593r914592
3422A6207905o85760L97705j1241360j7109304n122776J2595628J6425451L066080
3414A4533569j2789601j5193718j879078J4723261J9811844J1040063N24857R5375
3406C0866572O245253M337620j1146193k5566437j9488360N153106K2467456J2662611
$$ plain form
3462 11433709 10220684 14352902 28906350 38927422 28279359 4442728 -13825771
3455 -13825771 -23169343 -30153875 -29540219 -12224106 11167002 20170554 16137580 18722239
3447 18722239 30004871 28853294 7186185 -13683396 -14320155 -3401935 880457 -2294053
3439 -2294053 -3164969 -663509 702296 2596299 7439626 10136619 7480966 6493529 11077782
3430 11077782 10760499 -2253197 -14072740 -5442756 18160930 31928090 26122497 16207905
3422 16207905 15522145 15919850 4678490 -12430814 -17553590 -4957962 11467489 14533569
3414 14533569 1743968 -13449750 -15328828 -605567 19206277 30246340 30771197 30866572
3406 30866572 37111825 41449445 30303252 4736815 -14751545 -9598439 12869017 25531628
3398B5531628j1425803j9721850m934074Q929351K905158r840858o890829P648356
3390g798921J0653126l342714j5029013j0388107K013912Q595672Q552539O797757
3382E4251L468110n67956J013065J0004794J7516669J5752701Q291209J607547
3374E7140390n376169j4954824k1245754j7099401o228028M83891j168951n170010
3366a3618856m112952L122010J0906335J1485752L271446m160802L90097J2551618
3358A9834648J3346410o113328k8579786k9075939n267582K0399187K7401257
3351A1944867J6789797L646927j507158n1216Q54652k925665r091618j2450667
3343G209919j1313500r195471r189734q553383j916330J0117688J8654544J5344510
$$ plain form
3398 25531628 14105825 -5616025 -10550099 -1620748 1284410 -8556448 -15447277 -7798921
3390 -7798921 2854205 -488509 -15517522 -25905629 -23891717 -15296045 -6743506 54251
3382 54251 3522361 2954405 3967470 13972264 31488933 47241634 55532843 57140390
3374 57140390 51764221 36809397 15563643 -1535758 -7763786 -7279895 -8448846 -13618856
3366 -13618856 -17731808 -14609798 -3703463 7782289 11053735 6892933 7283030 19834648
3358 19834648 33181058 27067730 -1512056 -30587995 -35855577 -15456390 11944867
3351 11944867 28734664 32381591 30874433 30823217 31677869 28752204 19660586 7209919
3343 7209919 -4103581 -13299052 -22488786 -31042169 -32958499 -22840811 -4186267 11158243
3335A1158243K903861o542225n637950p92815j698471m781240K442936J8712105
3327A5764444K4070920O679627j6762580k1562620q142747K727215L117183N078325
3319A0969767J3155361J2674297m537087k1435345j7865538P01901J1895401O366519
3311A1925276n129916r759084m755898N770059J4608125J3089247q91046j6015628
3303H841135j6810585j236436J6164909J9341731N803573j2270756j9348882j0871654
3295a0386965K039857N157255j517928n145968O67853P534744O819819J745099
3287F913766j926977o777093j5188632j8698741q597075P971233J5085318Q958192
3279a2260009J006565J422461R009546J6063005J5085144K658121j5132376k3620645
$$ plain form
3335 11158243 14062104 7519879 1881929 1089114 -609357 -5390597 -2947661 15764444
3327 15764444 39835364 46514991 29752411 8189791 47044 2774259 5891442 10969767
3319 10969767 24125128 36799425 32262338 10826993 -7038545 -6336644 5558757 11925276
3311 11925276 6795360 -2963724 -7719622 -1949563 12658562 25747809 24856763 8841135
3303 8841135 -7969450 -9205886 6959023 26300754 32104327 19833571 484689 -10386965
3295 -10386965 -8347108 -3189853 -4707781 -9853749 -9185896 -1651152 5168667 6913766
3287 6913766 4986789 -1790304 -16978936 -35677677 -44274752 -36303519 -21218201 -12260009
3279 -12260009 -11253444 -9830983 -821437 15241568 30326712 32984833 17852457 -5768188
3271e768188j4611117J843175R357063N712655J356992P54708j572626o452304
3263i379642n601338L659869J0557746M865193q435113j5469658j0499108r04094
3255c1206145L238216M27010k082150J868856R003476J0558448M157883k924193
3247f958599l848109n6547L688576N952963O447546L780042J22464J164363O269601
3238A6562300O804401K55267l909923m55191J165677n994853j0801117j538601
3230B087960J1244546Q792742o038977j4154832j0866242q267242q754038j370993
3222b7327076J2292060J3960366j195511j3125209o951817N858798R489883Q019229
3214A020723J1708476J5206287P901536n506283j2709488j3384355j4438812j3582714
$$ plain form
3271 -5768188 -20379305 -18536130 -9179067 -3466412 -2109420 -1354712 -2927338 -9379642
3263 -9379642 -14980980 -11321111 -763365 4101828 -4333285 -19802943 -30302051 -31206145
3255 -31206145 -27967929 -27540919 -29623069 -27754213 -18750737 -8192289 -4034406 -6958599
3247 -6958599 -10806708 -10863255 -7174679 -1221716 5225830 9005872 9128336 10292699 16562300
3238 16562300 23366701 23621968 19712045 19256854 20422531 14427678 3626561 2087960
3230 2087960 13332506 22125248 16086271 1931439 -8934803 -17202045 -25956083 -27327076
3222 -27327076 -15035016 -1074650 -2270161 -15395370 -22347187 -16488389 -6998506 1020723
3214 1020723 12729199 27935486 35837022 30330739 17621251 4236896 -10201916 -23784630
3206b3784630m958472M919569M771425j642680j212652M901217K321108r978031
3198b4663146j3303214K839211K1993598K1849962M491186p404323o26126J4272225
3190A9449373J9530380J1274273q60164r076170j4453140j9310669k0424272j4297731
3182b8168120m662173J270858K291722L407041P374073J1376124J1961541Q360470
3174A3211536J355540n944909p224987N07019R690502Q920319k055456j1326261
3166G133303j0629446m970309l481550o874443p851590n11823J2524209K0211896
3158E550247J2368423o718326j8083981r315761Q033963J2810192K680336n248867
3150B076226r57536O930444Q271227M665561P94305l698242q008278q127514n786486
$$ plain form
3206 -23784630 -28743102 -23823533 -19052108 -20694788 -21907440 -17006223 -14685115 -24663146
3198 -24663146 -37966360 -35127149 -13133551 8716411 13207597 5803274 5177148 19449373
3190 19449373 38979753 50254026 49393862 40317692 25864552 6553883 -13870389 -28168120
3182 -28168120 -32830293 -31559435 -29267713 -25860672 -18486599 -7110475 4851066 13211536
3174 13211536 14567076 8622167 1397180 1904199 11594701 20515020 18459564 7133303
3166 7133303 -3496143 -8466452 -11948002 -18822445 -26674035 -27185858 -14661649 5550247
3158 5550247 17918670 11200344 -6883637 -16199398 -8165435 4644757 7325093 2076226
3150 2076226 1118690 8049134 16320361 20985922 21780227 18081985 10073707 1946193 -3840293
3141c840293p267296r877886l797142R006431J4231852Q629227N565722J0357394
3133B3008009J0444360K91069n430530K175574P832718k368776j5728189j3607537
3125F616698j100043N271187M605255M230331j10510j2331278j7718637l245638
3117a3782635J5234971J4140089L08206k200040N425076J522507j3535771j6159919
3109i047516j873669P242746K713379J993723J1598235J2465369m096476j7558889
3101C436902j2042608p26353J213075J108138O994011P377059m809839j1535717
3093h985332K128496J9009206J4887129m100475j4849828j3169390r911677m872534
3085a9864405O886587J3245612j05392j9139999j6002103Q185083K4091506J8274555
$$ plain form
3141 -3840293 -11107589 -20985475 -24782617 -15776186 -1544334 7084893 12650615 23008009
3133 23008009 33452369 33743438 28312908 30488482 38321200 35952424 20224235 6616698
3125 6616698 5516655 10787842 15393097 19623428 19512918 7181640 -10536997 -13782635
3117 -13782635 1452336 15592425 15900631 13700591 19125667 20648174 7112403 -9047516
3109 -9047516 -10921185 -3678439 -965060 1028663 12626898 25092267 20995791 3436902
3101 3436902 -8605706 -9332059 -8118984 -7010846 -16835 7360224 2550385 -8985332
3093 -8985332 -6856836 12152370 27039499 22939024 8089196 -5080194 -14991871 -19864405
3085 -19864405 -12977818 267794 162402 -18977597 -34979700 -26794617 -2703111 15571444
3077A5571444P652712N926567M287295m852373j0652698m623588J741013l775382
3069A1274990j2472616q907670L964233J0021699M234843k878797k849026P28281
3061C115937Q66911k443915l740809l92119L549410K549624k093291k725941L328617
3052B014424P513089J208956j0275742j3326703m487926N584505P316975K879273
3044a573149l28338P17833M298826P116789N658230m63171n853708n546147k958919
3035A068246m197428n923128K29755J0593873J0414690l103789j2186733k610549
3027e715063J4378638J7131526L628246q113035p171938k247745m037611q051224
3019a98206l560855P319723J0119973k024010j6617803j5309261L275771K0576257
$$ plain form
3077 15571444 23224156 29150723 33438018 28585645 17932947 13309359 15050372 11274990
3069 11274990 -1197626 -10105296 -6141063 3880636 8115479 5236682 2387656 3115937
3061 3115937 3982848 1538933 -2201876 -2593995 955415 3505039 1411748 -1314193 2014424
3052 2014424 9527513 10736469 460727 -12865976 -17353902 -11769397 -4452422 -1573149
3044 -1573149 -1901487 -1183654 3115172 10231961 15890191 15427020 9573312 4027165 1068246
3035 1068246 -3129182 -9052310 -8822555 1771318 12186008 9082219 -3104514 -5715063
3027 -5715063 8663575 25795101 29423347 21310312 14138374 11890629 7853018 -198206
3019 -198206 -3759061 3560662 13680635 11656625 -4961178 -20270439 -16994668 3581589
3011C581589K0026685O066249m618717o117562p098919j2169300j2828274l251208
3003a6409457O641867N082868k605673k609989M535592N327554l290659q640588
2995a1968485m094443M24351k303451k736662P452172J6544392R300973o211466
2987F407381q429796M163196J0222638j466788j6273433j7976415j0681540n752492
2979c9787249k303097N250959J1794807R242696K139362P63365M086508L654344
2971e158305j99586m46343J969019N74366j907277K920317J1591299J1161659
2963B0505149O49182n951158j329714N744901O727588L842295k41594p315151
2955B2631498j2484185n491400Q729777R609451o923752j5209777L360860K7440067
$$ plain form
3011 3581589 23608274 29674523 25055806 18938244 11839325 -329975 -13158249 -16409457
3003 -16409457 -9767590 -4684722 -7290395 -9900384 -5364792 -37238 -3327897 -11968485
2995 -11968485 -16062928 -15638577 -17942028 -20678690 -13226518 3317874 12618847 6407381
2987 6407381 -2022415 2140781 12363419 10896631 -5376802 -23353217 -34034757 -39787249
2979 -39787249 -42090346 -36839387 -25044580 -15801884 -13662522 -12899157 -8812649 -5158305
2971 -5158305 -5357891 -5804234 -3835215 -3260849 -5168126 -2247809 9343490 20505149
2963 20505149 21154331 15203173 13873459 19618360 26345948 30188243 29946649 22631498
2955 22631498 10147313 4655913 13385690 22995141 16071389 861612 4222472 31662539
2947C1662539K3582934m249077k0582602r910820O020612N936694k960540n974215
2939B3525525p021808j5393877k1629822r178079J5061255K3756541O491480j3629946
2931A981269j0899388P961055J4984935J541378j1039753m741675R618402J2004803
2923B1411026L555531j100317k312123j2293852k5741658k0370081O116477K4337860
2915f397137J2519726j2561756k0793996q125571P959004J7366899J9969012J1290494
2907B1226675r493121k4462676j5300152O468590J2371452q93433q046087L481981
2899a4646771J5337157R628216n057865j1185132o873170j84991N546788Q423998
2891I88230L676475n920446q021480M93439O047808K64152n485131l15242O500043
$$ plain form
2947 31662539 55245473 50996396 30413794 20502974 26523586 32460280 29499740 23525525
2939 23525525 16503717 1109840 -20519982 -29698061 -14636806 9119735 15611215 1981269
2931 1981269 -8918119 -957064 14027871 15569249 4529496 -212179 9406223 21411026
2923 21411026 24966557 23866240 21554117 9260265 -16481393 -36851474 -30734997 -6397137
2915 -6397137 6122589 -6439167 -27233163 -35358734 -27399730 -10032831 9936181 21226675
2907 21226675 11733554 -12729122 -28029274 -21560684 -9189232 -10082665 -18128752 -14646771
2899 -14646771 690386 10318602 5260737 -5924395 -12797565 -12982556 -7435768 988230
2891 988230 4664705 -1255741 -9277221 -8783782 -2735974 -2471822 -7956953 -8272195 -1772152
2882a772152K362868n625978l481528M720949N425732O20501J901078N606327
2874I757797j289088j2564539o953331J5193790K6016516J0823675r376943j0563267
2866B1044610K89250K856922k489510j910269K556841k480736j2940213j0267835
2858c340940N248393J0630074l000391j4512291o444285P537792O824626k843952
2850I9026k663806O104808P715958K297521L127929O928799l356985k2829796
2842b576546k2273736O729721L1547527K1789627q233062k1867496r679296O024555
2834A461294O649463m523402j5183827j6818531o836240Q407986J5877664J1559945
2826E94352O950405R623809Q898641m785375j9011577j6697840k991355N821629
$$ plain form
2882 -1772152 590716 -5035262 -8516790 -3795841 1629891 2250392 4151470 9757797
2874 9757797 8468709 -4095830 -11049161 4144629 30161145 40984820 31607877 21044610
2866 21044610 21333860 24190782 21701272 19791003 22347844 19867108 6926895 -3340940
2858 -3340940 1907453 12537527 9537136 -4975155 -11419440 -3881648 2942978 99026
2850 99026 -2564780 3540028 11255986 13553507 16681436 23610235 20253250 -2576546
2842 -2576546 -24850282 -18120561 13426966 35216593 26983531 5116035 -4563261 1461294
2834 1461294 8110757 3587355 -11596472 -28415003 -35251243 -26843257 -10965593 594352
2826 594352 7544757 17168566 26067207 21281832 2270255 -14427585 -17418940 -11597311
2818a1597311Q993940J3443711J1150252o504222k1224771q825130J7044081J9816111
2810B2296661j479524j0172564N031032J0195397j3276673l2232223j4984365
2803c4622259J5611396J8510301l362371j6309078j1951708r566522j3131692
2796e4821933o074708J2767085K3141408J7283662J0630975J2530590J1315659
2789B6772738k771895j9639108k3975583j4316829n50072P793032P220279K327994
2781a7139444K495937R521341J2505940L754099p333281q495854m876923r010318
2773a8578503j6957690j3497709J667532J2110582R283756J599207k017517j629593
2765b8019935J441185O520062P579254M92524n043452K126053J2323872O030070
$$ plain form
2818 -11597311 -2603371 10840340 21990592 15486370 -5738401 -14563531 2480550 22296661
2810 22296661 20817137 10644573 15675605 25871002 12594329 -19637894 -34622259
2803 -34622259 -19010863 -500562 -3862933 -20172011 -32123719 -41690241 -54821933
2796 -54821933 -60896641 -48129556 -24988148 -7704486 2926489 15457079 26772738
2789 26772738 24000843 4361735 -19613848 -33930677 -34480749 -26687717 -19467438 -17139444
2781 -17139444 -14643507 -5122166 7383774 11137873 3804592 -4691262 -9568185 -18578503
2773 -18578503 -35536193 -49033902 -47366370 -35255788 -25972032 -24372825 -26390342 -28019935
2765 -28019935 -26578750 -20058688 -12479434 -11986910 -17030362 -14904309 -2580437 3449633
2757C449633j2319940j5691783M300655K1574897J2987425r091349j7515412p940494
2749b0246368K085837J529038l832880m989777L5234Q028339J3696604J2334469
2741H640496N046285j139472j801430K72912J152211M38702k173017p519431j1562798
2732h645542p918057O93828K712266n665510j3208573r173240K076076Q989387
2724c0139365Q305575M991051K281733k94048k106467j191574K459857O935213
2716h758025R969502R203528M510076Q60829L664905R810860R137405k769624
2708C5629456j8191957k5701229k0642973o523735Q821948J7612048J7751412
2701H754970J4732640J3993905J3310264P993938j03614o379670j1825165j7513391
$$ plain form
2757 3449633 -8870307 -24562090 -20261435 1313462 14300887 5209538 -12305874 -20246368
2749 -20246368 -18160531 -16631493 -20464373 -25454150 -25418916 -17390577 -3693973 8640496
2741 8640496 13686781 12547309 10745879 11018791 12171002 12609704 10436687 2917256 -8645542
2732 -8645542 -16563599 -15869771 -13157505 -18823015 -32031588 -41204828 -39128752 -30139365
2724 -30139365 -21833790 -16842739 -14561006 -14855054 -16961521 -18153095 -15693238 -8758025
2716 -8758025 1211477 10415005 14925081 15785910 19450815 29261675 38399080 35629456
2708 35629456 17437499 -8263730 -28906703 -35430438 -26608490 -8996442 8754970
2701 8754970 23487610 37481515 50791779 58785717 58682103 52302433 40477268 22963877
2693B2963877j5519623P53040J9589279K0640273L043537j2035748j0682069k574507
2685B6178059k128188p868482r457290m372752J362321K081253l529408j1188144
2677h922631j1824134j640921Q614424N070068r015812j7218180j3411084n817167
2669e4165437J683627J2798722K1576645J4589966l373236r057931L864626J2333305
2661B50287K98402j5177771j2089219K369086O936998l55026n791241m679947
2653b8238431j738985K998346R515683Q942848k373014j0388274l371707P016808
2645a7636726M468751m265331l101752L247488r86398j0996052p868456P084004
2637c0054472J2763437L353840l615838K628041J2038965J4265114J1635726P220954
$$ plain form
2693 22963877 7444254 8197294 27786573 48426846 51470383 39434635 28752566 26178059
2685 26178059 24049871 16181389 6724099 2351347 3713668 5794921 2265513 -8922631
2677 -8922631 -20746765 -22387686 -13773262 -8703194 -17719006 -34937186 -48348270 -54165437
2669 -54165437 -52481810 -39683088 -18106443 -3516477 -6889713 -15947644 -12083018 250287
2661 250287 548689 -14629082 -26718301 -24349215 -17412217 -17767243 -23558484 -28238431
2653 -28238431 -29977416 -26979070 -17463387 -8520539 -10893553 -21281827 -24653534 -17636726
2645 -17636726 -13167975 -17433306 -20535058 -17287570 -18273968 -29270020 -37138476 -30054472
2637 -30054472 -17291035 -13937195 -17553033 -14924992 -2886027 11379087 23014813 30235767
2629C0235767j63612n551595j956676K956077m650164j7869814j4867160M110148
2621g757029J2287895j909119j5555349q205090O523857N967555n201818o797479
2613b0646577K574534O894214Q06986n389809n428481k909351J317165J0476370
2605a2304949J9314778J5676087p47581j3113852p523228R091302J7852751J0536363
2597C8781671l214457j0176567q712519o603956p946864q701953n156404K17002
2589a1514047L983794O145817N503327j787028j3061739j6564064o594503N868529
2581b8019914P773749K498834J964313O584825P482889M523619O208911J2637328
2573B1654554J3762414N521634n563289j4225782k0018305j9710015j0325293
$$ plain form
2629 30235767 30072155 24520560 22563884 25519961 20869797 2999983 -11867177 -7757029
2621 -7757029 4530866 2621747 -12933602 -21138692 -14614835 -8647280 -13849098 -20646577
2613 -20646577 -18072043 -11177829 -10370843 -15760652 -21189133 -24098484 -22781319 -12304949
2605 -12304949 7009829 22685916 21938335 8824483 1301255 10392557 28245308 38781671
2597 38781671 35567214 25390647 16678128 10074172 2127308 -6574645 -11731049 -11514047
2589 -11514047 -7530253 -1384436 4118891 2331863 -10729876 -27293940 -33888443 -28019914
2581 -28019914 -20246165 -17747331 -15783018 -9198193 -1715304 2808315 9017226 21654554
2573 21654554 35416968 40938602 35375313 21149531 1131226 -18578789 -28904082
2566b8904082L66274J415830k840797K045928J5576816J9915472O827101r829930
2558D572612j5125481j1628070r201189r055559o661667j480815L231129M596068
2550d0752972J682568j587729K508283J3532007J7624992N932477q841614r443029
2542a9345017M55880O210062Q073899J3758498J4989391J022474j2322873k367351
2534A0474963J6475747R349573j8525753k4407864J706431J9186450M829537j1560475
2526G528609l259347J0708967Q941717O784419J7950133K3440491J5814990K3095662
2518A11005641M2928153J1831721r2416327j71135782j18362983J7870502Q8389057
2511a09890018M5680061j0945965j613221L1322790K4010477l373952m159872
$$ plain form
2566 -28904082 -28537808 -27121978 -29962775 -27916847 -12340031 7575441 14402542 4572612
2558 4572612 -10552869 -22180939 -31382128 -40437687 -47099354 -48580169 -45349040 -40752972
2550 -40752972 -39070404 -40658133 -38149850 -24617843 -6992851 -1060374 -9901988 -19345017
2542 -19345017 -18889137 -12679075 -4605176 9153322 24142713 25165187 12842314 10474963
2534 10474963 26950710 36300283 17774530 -6633334 -4926903 14259547 19089084 7528609
2526 7528609 4269262 14978229 23919946 30704365 48654498 72094989 87909979 111005641
2518 111005641 153933794 165765515 73349188 -97786594 -216149577 -198279075 -109890018
2511 -109890018 -64209957 -75155922 -76769143 -45446353 -21435876 -24809828 -28969700
2504b8969700O026362r557360l0164022j3220650K4431622K9930449k17737k0532973
2496d2274009j2011266l51347j760385k086989N687955P125849j974889n391391
2488e3036472K880906P795767J827709j711420O836249J7228451J6343408M888741
2480C053339q434840j5347079q905730R216624K2425404J5778931k078269j0029196
2472E679184n398143m207408j1024387j1135230K146639J3552502R105186l005882
2464d287539o006585K410680J0787899J0102797J595934o597739o571189J092764
2456B527022N710839o67703j0561523j0306516k12233O304351L531709m3268J484624
2447b232698J864243m336558j0720281q772244o99665M456580K392519l500415
$$ plain form
2504 -28969700 -22943338 -32500698 -62664720 -75885370 -51453748 -21523299 -21741036 -42274009
2496 -42274009 -54285275 -54636622 -56397007 -58483996 -52796041 -45670192 -47645081 -53036472
2488 -53036472 -50155566 -42359799 -40532090 -42243510 -35407261 -18178810 -1835402 3053339
2480 3053339 -5381501 -20728580 -29634310 -20417686 2007718 17786649 15708380 5679184
2472 5679184 281041 -3926367 -14950754 -26085984 -23939345 -10386843 -1281657 -4287539
2464 -4287539 -10294124 -7883444 2904455 13007252 14603186 8005447 1434258 2527022
2456 2527022 8237861 7570158 -2991365 -13297881 -13510114 -7205763 -3674054 -3717322 -2232698
2447 -2232698 -368455 -4705013 -15425294 -24197538 -24897203 -20440623 -18048104 -21548519
2439b1548519o547890j943177P711413J1797755L443787q425378q200039M123485
2431a9588563J0974057J776223j1368618j0105141O065247K0898175K2045841
2424B0697221J2348613K243376k221423k526286k446210k689791k270899l696326
2416A9438275j0841029j8972662j4865606N022866K3205018K0295005J909473
2409B5191340q042380n28623Q202705L043414r259352j4149461j0627438p326474
2401a3496269o675367m754688j190684R61166J276530J92500m016505r286466
2393c6989783o983751N882336J7202982J3201401k108582j1607206p291384K644448
2385b6049539Q046895P420254L520672j252633k389469M511024J5048404J7444120
$$ plain form
2439 -21548519 -28096409 -30039586 -22328173 -10530418 -7086631 -15512009 -23712048 -19588563
2431 -19588563 -8614506 -6838283 -18206901 -28312042 -22246795 -1348620 20697221
2424 20697221 33045834 35289210 33067787 30541501 28095291 25405500 23134601 19438275
2416 19438275 8597246 -10375416 -25241022 -20218156 2986862 23281867 25191340
2409 25191340 17148960 16620337 24823042 27866456 18607104 4457643 -6169795 -13496269
2401 -13496269 -20171636 -24926324 -26117008 -25155842 -23879312 -23686812 -27703317 -36989783
2393 -36989783 -43973534 -38091198 -20888216 -7686815 -9795397 -21402603 -28693987 -26049539
2385 -26049539 -18002644 -10582390 -7061718 -8314351 -10703820 -6192796 8855608 26299728
2377B6299728P299668n868522j1650028j1367975j1368187j0506261m032826L868196
2369a7326207L243492n288836q954746j955139M703169P78608n359232M28962
2361b9729929J3208046J4190774J013268o170980L966842J4525938O135727j2441885
2353D697801j8321620r306453k565391l297791O19377J1275911J3343704K010912
2345a543550n189800K391386Q427067l509938k0424371j9035709k047085Q411133
2337c2520867N914809L676478O622417M873430k841910l407209O379974J1231583
2329g1295K644573o543207m797287j344789p647897j4379871n931467J1751479
2321b6319761J7973245P724832l375638l902381O75200J999741j0325l983590
$$ plain form
2377 26299728 33599396 27730874 16080846 4712871 -6655316 -17161577 -21194403 -17326207
2369 -17326207 -14082715 -19371551 -28326297 -30281436 -25578267 -24799659 -30158891 -29729929
2361 -29729929 -16521883 -2331109 -1317841 -7488821 -3521979 11003959 17139686 4697801
2353 4697801 -13623819 -22930272 -25495663 -28793454 -28174077 -16898166 -3554462 -1543550
2345 -1543550 -6733350 -4341964 4085103 575165 -19849206 -38884915 -40932000 -32520867
2337 -32520867 -26606058 -22929580 -16307163 -11433733 -14275643 -17682852 -11302878 -71295
2329 -71295 2573278 -3969929 -8767216 -10112005 -17759902 -32139773 -38071240 -26319761
2321 -26319761 -8346516 -621684 -3997322 -7899703 -7224503 -5224762 -5235087 -9218677
2313i218677j0899001j5302680o135037J5037369K8058946J7847735l950587j3381464
2305B056604n061894M905759M926630J925870N728906J2250567J0640860l97632
2297C6975670j2114336j7364085j5425434q593418j501576j254916r811656j7220965
2289d6310716j1341242N044219J5968786J3334433O464014O081735Q951315O809267
2281E001811J972404K150899M824918O11505q724051r805186J424134J1126229
2273H582663O926445m480384q621629m658984l650611q601472r003519K066403
2265b1441088J5188719J5438364J648718j1248338q727867P977359K3604211K4077367
2257D6517445R083762r683000k0889295k2209626j7135887p709674M808985J3663832
$$ plain form
2313 -9218677 -20117678 -35420358 -41555395 -26518026 1540920 19388655 15438068 2056604
2305 2056604 -3005290 1900469 6827099 8752969 14481875 26732442 37373302 36975670
2297 36975670 24861334 7497249 -7928185 -16521603 -18023179 -19278095 -29089751 -46310716
2289 -46310716 -57651958 -52607739 -36638953 -23304520 -16840506 -10758771 -1807456 5001811
2281 5001811 6974215 9125114 13950032 14561537 5837486 -3967700 -2543566 8582663
2273 8582663 15509108 11028724 2407095 -2251889 -5902500 -14503972 -23507491 -21441088
2265 -21441088 -6252369 9185995 10834713 -413625 -9141492 -1164133 22440078 46517445
2257 46517445 55601207 45918207 25028912 2819286 -14316601 -22026275 -17217290 -3553458
2249c553458Q945604q739744k1964006j3011672J2635966K8596733J8551871l099238
2241A8362056j0811559k084089K250214q648834j9351892j2976684K795430Q738916
2233b1726442L235886R68872O819003R617957L276380l076301j783565Q39170
2225a829040l026894q664277o383253M256485J5237624J9070772J1908459m719185
2217B5850691k0058275k0670837o920503N957416R086612J0727626J7430851J8085617
2209C9489198J353509k1326393k7888450j5275439j292P114515R390304R326664
2201B182616L633570m688319n783597J230824N460474J221638m507997n018754
2193f269545k179602J319596N946628Q600718M351217k271148r56775O472272
$$ plain form
2249 -3553458 5392146 -3347598 -25311604 -38323276 -25687310 2909423 21461294 18362056
2241 18362056 7550497 5466408 7716622 -932212 -20284104 -33260788 -30465358 -21726442
2233 -21726442 -18490556 -17521684 -10702681 -1084724 2191656 -884645 -2668210 -1829040
2225 -1829040 -4855934 -13520211 -19903464 -15646979 -409355 18661417 30569876 25850691
2217 25850691 5792416 -14878421 -21798924 -15841508 -6754896 3972730 21403581 39489198
2209 39489198 40842707 19516314 -8372136 -23647575 -23648867 -16534352 -7144048 2182616
2201 2182616 5816186 1127867 -4655730 -3424906 2035568 3257206 -1250791 -6269545
2193 -6269545 -8449147 -7129551 -1182923 7417795 11769012 9497864 8541089 15013361
2185A5013361O474839l896029j0956479o511488J49285k59523l811220o103202
2177i900456j1074139j6759725j0203802J0068185K3915333J7569942M899748
2170H515086L101747M746077l894154j3141125o191341O864247K434379j5239303
2162a2804387j8425279j156510J1857942O503018j110749L670788J0321369N498805
2154D354997l572887m208124J185102M960210R194126J6102423J7361963P602627
2146E2980437l410399n503505l429167m905561o055710k688410k919076j2005343
2138A2063266j6758722m471594J2206108J0928124n633042j3340085l410912O651667
2130a765190K327214p857813r290220k619867J860854J018897O93817N915131
$$ plain form
2185 15013361 21488200 17592171 6635692 124204 273489 13966 -3797254 -9900456
2177 -9900456 -20974595 -37734320 -47938122 -37869937 -13954604 3615338 8515086
2170 8515086 11616833 16362910 12468756 -672369 -6863710 537 2434916 -12804387
2162 -12804387 -31229666 -32386176 -20528234 -14025216 -15135965 -11465177 -1143808 4354997
2154 4354997 782110 -3426014 -2240912 2719298 11913424 28015847 45377810 52980437
2146 52980437 49570038 44066533 40637366 35731805 29676095 26987685 24068609 12063266
2138 12063266 -4695456 -9167050 3039058 13967182 8334140 -5005945 -8416857 -1765190
2130 -1765190 562024 -7295789 -16586009 -19205876 -17345022 -16326125 -15632308 -9717177
2122i717177J4942441J9756473J1528576q628506k4728870k0587573r70800J1498336
2114f907100L939498j1812838j6971684r109142M47863N140707Q036530J0993072
2106a6243094J0334646N353110K022591L238468K073147p657763j8041008j4654191
2098c3574094J645758J1858159M098186q470983o472538O390969R447909j676351
2090a6752985p720205K889412J4686595R791250l545757m928291N013490N898894
2082E332403r792850k4239158j8933340J607465J7448875J6523702M536048m369258
2074a1886113l202137J163031j830566r768689q470835N893160J6593463Q934326
2066b574360o426099q459436K242291N888490l705443j0208473k999782O537540
$$ plain form
2122 -9717177 5225264 24981737 36510313 27881807 3152937 -17434636 -18405436 -6907100
2114 -6907100 -2967602 -14780440 -31752124 -40861266 -40413403 -35272696 -27236166 -16243094
2106 -16243094 -5908448 -555338 1467253 4705721 6778868 -878895 -18919903 -33574094
2098 -33574094 -31928336 -20070177 -15971991 -24442974 -30915512 -24524543 -15076634 -16752985
2090 -16752985 -24473190 -21583778 -6897183 2894067 -651690 -5579981 -566491 5332403
2082 5332403 -4460447 -28699605 -47632945 -46025480 -28576605 -12052903 -7516855 -11886113
2074 -11886113 -15088250 -13925219 -15755785 -25524474 -33995309 -28102149 -11508686 -2574360
2066 -2574360 -9000459 -17459895 -15217604 -9329114 -13034557 -23243030 -26242812 -19705272
2058a9705272O775757N583655J3679851K2071512J4141023o946876k0553199j6423417
2050a376966n049171J028340K754290O547190J1125941J0286555L785183k214977
2042B6886385m378555n549565p691067p185514j486516L535921K19316p649811
2034c299406p090014N466364J6406374J2034050l654675j6083607j8755505j5528386
2026c0504805r630866j453954N948176R823528J3230693J7357539J3596795k970250
2018A5396856j7360383j0475610J0364149J7550161K602342j2326549r329087
2011c578121Q48726J230408m717608n252843k792535n237206p075941J108166
2003b5466954J2632402J3265126M080510j904135j247953r89519j995826Q77489
$$ plain form
2058 -19705272 -12929515 -7345860 6333991 28405503 42546526 35599650 15046451 -1376966
2050 -1376966 -6426137 -5397797 -2643507 3903683 15029624 25316179 29101362 26886385
2042 26886385 22507830 16958265 9267198 2081684 595168 4131089 4350405 -3299406
2034 -3299406 -10389420 -4923056 11483318 23517368 19862693 3779086 -14976419 -30504805
2026 -30504805 -40135671 -41589625 -35641449 -25817921 -12587228 4770311 18367106 15396856
2018 15396856 -1963527 -12439137 -2074988 15475173 18077515 5750966 -3578121
2011 -3578121 -2729395 -1498987 -6216595 -11469438 -14261973 -19499179 -26575120 -25466954
2003 -25466954 -12834552 430574 4511084 2606949 1358996 369477 -1626349 -748860
1995g48860M437340O78727o570676o359708j547440n724671j7170569j6493868
1987d9499725L076093K2254281K2987940J2612492P527651O714464j525336j5044359
1979I103501j8864203r376249j075191m858769j1797764o620031R264307J8034438
1971a6189961Q704423q084452j3688711n277819K518638k45224n269746l89717
1963c7922569J0880576J4319629N581078m777070o172379J141199J0199090J3988783
1955G238337P798176o525542j7742690j5026115k004244O891821M939764p82814
1947a5213307k605556j010988K202619P866694J1789177M873577j1670088k1737518
1939b5505390j4362885L82529N869249J567606p89416K353969L847226J190103
$$ plain form
1995 -748860 3688480 4367207 -2203469 -8563177 -10110617 -15835288 -33005857 -49499725
1987 -49499725 -46423632 -24169351 -1181411 11431081 18958732 25673196 24147860 9103501
1979 9103501 -9760702 -19136951 -20212142 -25070911 -36868675 -43488706 -34224399 -16189961
1971 -16189961 -7485538 -15569990 -29258701 -34536520 -32017882 -32263106 -37532852 -37922569
1963 -37922569 -27041993 -12722364 -7141286 -11918356 -18090735 -16949536 -6750446 7238337
1955 7238337 15036513 8510971 -9231719 -24257834 -26262078 -19370257 -14430493 -15213307
1947 -15213307 -17818863 -18829851 -16627232 -8760538 3028639 7902216 -3767872 -25505390
1939 -25505390 -39868275 -39485746 -33616497 -32048891 -32838307 -30484338 -26637112 -25447009
1931b5447009J50465K249267J807128j510570L49926Q841280J2240302K741003
1923A421792q851075o863823O096215J2624139O093943p04845L400414J0456453
1915B3673213O493410n577827r005614K459997J5580557J5938453N114957n700115
1907D8977031j0737769j0984283p253041j148843R79320n397446j3962307j3730861
1899a3258199l836661N685301P541507L671166j555745n613503m568812M545218
1891g389728J5405649J6046579N057804m686085l528044K296912J724559n315267
1883A9612379j0570076r386579k510436P821802J5980315J3830176K416271m157428
1875C3036424K531849R474412k62486j9089847k2546192n837568P652192J568260
$$ plain form
1931 -25447009 -25296544 -23047277 -21240149 -22750719 -22400793 -13559513 -1319211 1421792
1923 1421792 -7429283 -14293106 -8196891 4427248 10521191 9816346 13216760 23673213
1915 23673213 30166623 24588796 15583182 18043179 33623736 49562189 54677146 48977031
1907 48977031 38239262 27254979 20001938 18853095 19832415 14434969 472662 -13258199
1899 -13258199 -17094860 -11409559 -3868052 -196886 -1752631 -7366134 -11934946 -7389728
1891 -7389728 8015921 24062500 29120304 24434219 20906175 23203087 24927646 19612379
1883 19612379 9042303 -344276 -2854712 4967090 20947405 34777581 37193852 33036424
1875 33036424 35568273 45042685 44780199 25690352 3144160 -2693408 4958784 6527044
1867F527044r143082l583830J0667708R383953q803302j7937396l107101J6596813
1859F00807J4445707p659518k3595852j7794918j161249Q233637P965750Q425145
1851a0540491J3927985J5541498L892160j5774384k6252891j7431214P68551R530353
1843b6338433M292429j028172M218528J1238958O577242m748550n882297M424236
1835g246059Q610275j510512j0936094n652652M918484M417730l534475l426652
1827a4359955M485453N177199m581924j0982998o495277N42519L856065P954005
1819a4404913J2284687O163534r550057j4381515K361208J9894820J3452886q179967
1811G640683j5373695j313628J1559337Q184466n23129j583579n06399o326645
$$ plain form
1867 6527044 -2616038 -6199868 4467840 13851793 5048491 -12888905 -15996006 600807
1859 600807 15046514 7386996 -16208856 -34003774 -35165023 -26931386 -18965636 -10540491
1851 -10540491 3387494 18928992 22821152 7046768 -19206123 -36637337 -35868786 -26338433
1843 -26338433 -22046004 -23074176 -18855648 -7616690 -1039448 -5787998 -11670295 -7246059
1835 -7246059 1364216 -146296 -11082390 -16735042 -11816558 -7398828 -10933303 -14359955
1827 -14359955 -9874502 -4697303 -9279227 -20262225 -26757502 -26214983 -22358918 -14404913
1819 -14404913 -2120226 4043308 -5506749 -19888264 -17527056 2367764 15820650 7640683
1811 7640683 -7733012 -9046640 2512697 10697163 10174034 8590455 8084056 1757411
1803A757411j2807124r170239R92797N704193L252187K350630P008585J1697232
1795A0785672J0266148K295657p716337j2394789o780833L190700L850066p431735
1787c935451j4573140m621575J0741835J1099389p32146k811795R886388J6484706
1779B1538211M589225q828880n676674L357073j781625j4835478j2602645O053497
1771h187296J7285439R492752j780801k693054j483814q331053j4773453r111682
1763a9582962K273366N751073K048141J050713L540792L828314L467447O680499
1755I057383Q403379K837004k301416K405379P916721q64486j6095052j4613980
1747c255068M021862J2997505m46495j4107880n666602J2633680J3891315l282059
$$ plain form
1803 1757411 -11049713 -20219952 -19227155 -13522962 -10270775 -7920145 -911560 10785672
1795 10785672 21051820 23347477 15631140 3236351 -3544482 -353782 3496284 -3935451
1787 -3935451 -18508591 -23130166 -12388331 -1288942 -2021088 -4832883 5053505 21538211
1779 21538211 26127436 17298556 11621882 14978955 13197330 -1638148 -14240793 -8187296
1771 -8187296 9098143 18590895 16810094 14117040 12633226 4302173 -10471280 -19582962
1763 -19582962 -17309596 -11558523 -9510382 -8459669 -4918877 -1090563 2376884 9057383
1755 9057383 17460762 20297766 17996350 20401729 28318450 27453964 11358912 -3255068
1747 -3255068 766794 13764299 13317804 -790076 -6456678 6177002 20068317 16786258
1739A6786258j5933064j0409189M845245J6484147J8725475R967403o698214j8169325
1731A5598736j0930475J0290372K4725216K0038317M535770q381138j6423962
1724C9452836k2212820k1613739j0483653K143428J782788r518120j2282255K960917
1716b9770618J9048125J4818899l845659j2234425l001014N848292K345455j960950
1708h751895L591138Q223339R29352o545494o42843O201152l458333j6309117
1700a6762701p091527J4873814J6383832m275209j4562581m556783p98183j1598562
1692b8387900r160566J0092866L91697n7467937j01763303o7651068J2825119
1685b41121092N1969604K9610107Q002132K7221913N3573230M6347066J6752321
$$ plain form
1739 16786258 853194 -9555995 -4710750 11773397 30498872 40466275 33768061 15598736
1731 15598736 4668261 14958633 39683849 59722166 64257936 55876798 39452836
1724 39452836 17240016 -4373723 -14857376 -12713948 -10931160 -20449280 -32731535 -29770618
1716 -29770618 -10722493 4096406 250747 -11983678 -14984692 -9136400 -6790945 -8751895
1708 -8751895 -5160757 3062582 3991934 -2553560 -3196403 3004749 -453584 -16762701
1700 -16762701 -23854228 -8980414 7403418 3128209 -11434372 -15991155 -16789338 -28387900
1692 -28387900 -37548466 -27455600 -27063903 -84531840 -186295143 -253946211 -241121092
1685 -241121092 -189151488 -159541381 -151539249 -124317336 -70744106 -24397040 -7644719
1678g644719m871943j3554080j3848196R75460K4957052K8327637K39127k5715577
1670a1135239j7852039P447963J5648001O050806J025825L206019q18678p113518
1662c540860K3360J5500164J7821320L251450j1007938j4977300j3181270p812111
1654a3923185J396547M745548n420356j4585797l976345J5418565J5944233j206430
1646a607220o457706Q404620J6014181O44439j4041050m496082J3621655J1872896
1638B3955733n659398j1944087j18357J0343720N910275o155763j4661486j6694041
1630a5023404j1778989l25222R847624R216411J098238j263750O463836J5112019
1622A3346763J6957865J3080740M822577q067190j7505245j0522330R992163K1690596
$$ plain form
1678 -7644719 -12516662 -26070742 -39918938 -38943478 -13986426 14341211 14580338 -11135239
1670 -11135239 -28987278 -21539315 -5891314 159492 1185317 4391336 3572658 -3540860
1662 -3540860 -3517500 11982664 29803984 33055434 22047496 7070196 -6111074 -13923185
1654 -13923185 -12526638 -7781090 -13201446 -27787243 -31763588 -16345023 -400790 -1607220
1646 -1607220 -8064926 339694 16353875 16998314 2957264 -1538818 12082837 23955733
1638 23955733 18296335 6352248 6233891 16577611 22487886 16332123 1670637 -15023404
1630 -15023404 -26802393 -27127615 -17279991 -8063580 -6965342 -8229092 -1765256 13346763
1622 13346763 30304628 43385368 48207945 40140755 22635510 12113180 22105343 43795939
1614D3795939J0253494j0745427j9084076j2817151n775070k642931L292338J0831310
1606A7108426Q870731l279300j0553604l677207P519002R744612L335399m304643
1598B4763416j0956387j5570892j2253173J09228J0041711P219095k171674n276894
1590d095570j620821K58468l91161K376911O541096L602453n754266j1216158
1582a0299048q562055l447652M52554M393955N784157M8124p989820q261434j859251
1573b9740470R58956k70835M272015J4089117J5430608L971168p351546r416906
1565h057893p736566n136153N920179K2744572K5100300M601556j6436443j4307296
1557F692256K564624R151628L98681q768277j0220957p724519k153709P133346
$$ plain form
1614 43795939 54049433 43304006 24219930 11402779 5627709 2984778 6277116 17108426
1606 17108426 25979157 22699857 12146253 8469046 15988048 25732660 29068059 24763416
1598 24763416 13807029 -1763863 -14017036 -13907808 -3866097 3352998 1181324 -4095570
1590 -4095570 -5716391 -5457923 -5849084 -3472173 3068923 6671376 917110 -10299048
1582 -10299048 -18861103 -22308755 -21856201 -17462246 -11678089 -11629965 -19619785 -27881219 -29740470
1573 -29740470 -28781514 -29052349 -24780334 -10691217 4739391 8710559 1359013 -8057893
1565 -8057893 -15794459 -20930612 -15010433 7734139 32834439 37435995 20999552 6692256
1557 6692256 9256880 18408508 18807189 10038912 -182045 -7906564 -10060273 -2926927
1549b926927J0876035L06926j4282243j4753853j978568P656158R191216J1430675
1541E519419J4332237P612037n951852r294821P81774N900986m586317j6182160
1533a868697j2423991J295332R835584J0295005Q446239M714811j992394m955792
1525A3346097J510756R367555O541937l968520p878997j777150J622070o130281
1517A2633467j4729762r168584P889412J8197024J2127026O35580j844570K369914
1509B8109507J093543o316670q655613l332604j251865p007592r972090l341273
1501a0674657K745420j576240q863869p889802k189863m07205L88592N242364
1493b3225260O357262l328115j1537182l121098J2897318J5953617P101837M127285
$$ plain form
1549 -2926927 7949108 8256034 -6026209 -20780062 -22758630 -15102472 -5911256 5519419
1541 5519419 19851656 27463693 21511841 12217020 12998794 18899780 14313463 -1868697
1533 -1868697 -14292688 -12997356 -3161772 7133233 15579472 20294283 18301889 13346097
1525 13346097 14856853 24224408 30766345 26797825 18918828 17141678 18763748 12633467
1517 12633467 -2096295 -11264879 -3375467 14821557 26948583 27584163 25739593 28109507
1509 28109507 29203050 22886380 14230767 10898163 9646298 2638706 -7333384 -10674657
1501 -10674657 -7929237 -9505477 -18369346 -26259148 -28449011 -28856216 -28467624 -23225260
1493 -23225260 -16867998 -20196113 -31733295 -34854393 -21957075 -6003458 1098379 5225664
1485E225664Q131989L511791r280603j1293607k7630L139491r981768j7976940
1477b8551613m423897J5418978J8992426P666024k933777p173594p986779m987341
1469a3979573J611385O710804J0358496J8495015K5068860J1881439k0757638
1462C9388788m2253631k8740232K988736J7788071O936811q464021j0139809J62071
1454b2333216J1311585J4652043P491018m107729q997602m384274O67407K16875
1446e483893n90430J385019l01067p588951j0370988l226081M320147M696058
1438a7160186M341388P773413O583274k201965m463610Q052925J9870358J4467214
1430C7262811j168096j2433719k0096237k7287227k2052360K308887K5086693
$$ plain form
1485 5225664 13357653 16869444 7588841 -3704766 -3732396 -592905 -10574673 -28551613
1477 -28551613 -32975510 -17556532 1435894 9101918 6168141 -1005453 -8992232 -13979573
1469 -13979573 -12368188 -5657384 4701112 23196127 48264987 60146426 39388788
1462 39388788 -2864843 -31605075 -28616339 -10828268 -3891457 -12355478 -22495287 -22333216
1454 -22333216 -11021631 3630412 11121430 7013701 -1983901 -6368175 -5700768 -5483893
1446 -5483893 -6074323 -4689304 -4990371 -12579322 -22950310 -26176391 -21856244 -17160186
1438 -17160186 -12818798 -5045385 1537889 -664076 -5127686 2925239 22795597 37262811
1430 37262811 36094715 23660996 3564759 -23722468 -45774828 -43465941 -18379248
1423a8379248K2988583M547295n960372n684317o726801o015084O701760K0838073
1415A2309889J7947728N509429M754759J1235524K943472j6302628j9746462m683692
1407A3968019J833780j0430483j9656148j1906946q72885L442640J1391035K4828444
1399A2597456K4280632K766301j6213189j3452591j790788p56679o712974o830682
1391f112514j866843K802419R577456J6108427J0254360o873641j3712079n22321
1383I655264J2640302Q095610j570438J365620Q233575K038012j1130128j4813430
1375A4514387j1519319j2952712j3246880O28971K0100027K3534941R341855l528463
1367B6872807n562301m853143o383930m425681K262024N406231J207254l713131
$$ plain form
1423 -18379248 4609335 9156630 3196258 -2488059 -9214860 -15229944 -8528184 12309889
1415 12309889 30257617 35767046 40521805 51757329 54700801 38398173 18651711 13968019
1407 13968019 15801799 5371316 -14284832 -26191778 -27064663 -23622023 -12230988 12597456
1399 12597456 36878088 39644389 23431200 9978609 8187821 7431142 718168 -6112514
1391 -6112514 -7979357 -5176938 4400518 20508945 30763305 23889664 10177585 9655264
1383 9655264 22295566 30391176 28820738 30186358 38419933 40457945 29327817 14514387
1375 14514387 2995068 -9957644 -23204524 -22575553 -2475526 21059415 30401270 26872807
1367 26872807 21310506 16457363 10073433 5647752 7909776 13316007 14523261 10810130
1359A0810130l226955J157336N303400P025508N495695J119721n021634j2807035
1351I856166j9515178j6557036n21167J4392866J1402901j598850j352336J1981130
1343H088496J2902140m865075j4218358r95839R446739l136477j5191508O85237
1335g284645K4540768J9030757q933644k1182899j1157896p616927j9312396k1528971
1327e3445853k520757J7184947K1039095J7260412J3965658N668089n331808m505805
1319I313978O981055Q717015l284495o236554J0311846K2962726R968975j5087513
1311D3647033k4570077j4104639q38882K357292l496678r567169n795397Q800965
1303c567552J9491417J3032609K00648R10656Q840411o33179k4623318k9401440
$$ plain form
1359 10810130 7583175 8740511 14043911 21069419 26565114 27684835 22663201 9856166
1351 9856166 -9659012 -26216048 -26737215 -12344349 -941448 -2540298 -3892634 8088496
1343 8088496 20990636 16125561 1907203 911364 10358103 7221626 -7969882 -7284645
1335 -7284645 17256123 36286880 27353236 6170337 -4987559 -12604486 -31916882 -53445853
1327 -53445853 -55966610 -38781663 -17742568 -482156 13483502 19151591 13819783 9313978
1319 9313978 16295033 25012048 21727553 15490999 25802845 48765571 58734546 43647033
1311 43647033 19076956 4972317 4133435 6490727 2994049 -6573120 -12368517 -3567552
1303 -3567552 15923865 28956474 29157122 30067778 38908189 38275010 13651692 -15749748
1295a5749748m027916J7910605R299506j0411046j1325204n34002k624490j4747441
1287c2209736j4503887Q98867J3899219J6213928J3248412O908735k676805o649742
1279d871009l57741L084916o076959j1786937L872228K6031919K5861835N886676
1271D1644928n411002m92083p48639j5323041k4650982j4354775J898619N854664
1263a1582311n47543n913141p011941m440043L737749J3259913J2153870j739640
1255b083087j3242332r261725M130726J2332081J1007236O487242M775945P004054
1247B1150140J0430242R659692J771209q276784j3269378j3937285j5297272j4765592
1239b2535028n732451P211162J0410054J261841p121493n790451j662471l150832
$$ plain form
1295 -15749748 -19777664 -1867059 7432447 -2978599 -14303803 -14837805 -17462295 -32209736
1287 -32209736 -46713623 -45814756 -31915537 -15701609 -2453197 4455538 1778733 -4871009
1279 -4871009 -5228750 -2143834 -8220793 -20007730 -16135502 9896417 35758252 41644928
1271 41644928 36233926 35741843 34993204 19670163 -4980819 -19335594 -17436975 -11582311
1263 -11582311 -12129854 -18042995 -25054936 -29494979 -25757230 -12497317 -343447 -2083087
1255 -2083087 -15325419 -24587144 -20456418 -8124337 2882899 9370141 14146086 21150140
1247 21150140 31580382 41240074 43011283 34734499 21465121 7527836 -7769436 -22535028
1239 -22535028 -28267479 -21056317 -10646263 -9384422 -16505915 -22296366 -23958837 -27109669
1231b7109669n856765j112212R330332J5217304J0079696k561694j1482225o313465
1223a9808698R695458J7683194M417661j6335804j7942129L045938K1667271J9370254
1215B1793145O123693m62476n14101l276973p262191m995794J325305L858068
1207A6588676K626429J887458j139382j0406131j8468475j3941164L22628R556636
1199a2973325P532423K863481L415387N149305M82288r591997j6412581j3561102
1191c3096121l406197N477334P699335P280491J0745972J4669877Q499428p289475
1183A0580644j6313071p254831R265555J5011727P852625p22829n257581q808538
1175D353701r582176j747742R829311J1512961J064237q321956q675800p460728
$$ plain form
1231 -27109669 -32966434 -34078646 -24748314 -9531010 548686 -2013008 -13495233 -19808698
1223 -19808698 -10113240 7569954 11987615 -4348189 -22290318 -19244380 2422891 21793145
1215 21793145 27916838 27454362 26940261 23663288 16401097 11405303 12730608 16588676
1207 16588676 19215105 21102563 19963181 9557050 -8911425 -22852589 -22529961 -12973325
1199 -12973325 -5440902 -2577421 837966 5987271 6469559 -3122438 -19535019 -33096121
1191 -33096121 -36502318 -31024984 -23325649 -16045158 -5299186 9370691 17870119 10580644
1183 10580644 -5732427 -12987258 -3721703 11290024 19142649 18419820 13162239 4353701
1175 4353701 -5228475 -6976217 2853094 14366055 15430292 7108336 -1567464 -9028192
1167i028192j0197219p827740O615734K0588308J7103343R11911p015007k025
1159A1149113N477625m134410j7866280j4375527Q590079K8914166K4595179k139664
1151D0210281k7400905l0317662j3002341M716869Q548308L371436K163720P432486
1143d277808J0868940Q386378N065119L463008k115913j3322108j8936649q759403
1135a9628436Q924879J5599409O672964m219235n812895k186097j347393k182770
1127d179574o5280K994397K420204k92935j009791o50694j939631k466288J183656
1118d005936N551145M292224k417579r351105j3804691j4462686p280349P712216
1110c3766761J8996759J4470274j462567j2669757j2068834n962398J064612J0885635
$$ plain form
1167 -9028192 -19225411 -27053151 -20437417 150891 17254234 18166145 11151138 11149113
1159 11149113 16626738 12492328 -5373952 -19749479 -11159400 17754766 42349945 40210281
1151 40210281 12809376 -17508286 -30510627 -25793758 -17245450 -13874014 -11710294 -4277808
1143 -4277808 6591132 14977510 20042629 23505637 21389724 8067616 -10869033 -19628436
1135 -19628436 -10703557 4895852 11568816 7349581 1536686 -649411 -1996804 -4179574
1127 -4179574 -4244854 -1250457 1169747 876812 -132979 -783673 -2723304 -5189592 -4005936
1118 -4005936 1545209 5837433 3419854 -5931251 -19735942 -34198628 -41478977 -33766761
1110 -33766761 -14770002 -299728 -1762295 -14432052 -26500886 -32463284 -31398672 -20513037
1102b0513037J9710033J6964532K271846r772171q777756p77071N008354Q497415
1094A2612145R946734L129013j1087991j7291179o019618Q888403R131945r87372
1086H322080l855544K499813M923791P25730Q02422O137436K927846j2584924
1078I898650k3476619j6070748O44553J0131839R980627P022195K185773n986867
1070e670597j0569392l685948Q726230J2459396M274087n224992p626928n518417
1062a2836561m297361m465067m612699m569651k663681L748852J1943952J3961522
1054c790694O933136j712229l666386p4436K380994J806038J165813M60681l463287
1045C9630r027874r581969l842813N2591m165410j0920116j0491674k816163L995217
$$ plain form
1102 -20513037 -803004 16161528 18433374 8661203 -116553 -893624 4114730 12612145
1094 12612145 22558879 25687892 14599901 -2691278 -8710896 177507 9309452 8322080
1086 8322080 4466536 6966349 11890140 12615870 13418292 19555728 22483574 9898650
1078 9898650 -13577969 -29648717 -29004164 -18872325 -8891698 -1869503 316270 -5670597
1070 -5670597 -16239989 -19925937 -11199707 1259689 5533776 308784 -7318144 -12836561
1062 -12836561 -17133922 -21598989 -26211688 -30781339 -33445020 -29696168 -17752216 -3790694
1054 -3790694 3142442 1430213 -2236173 -2310609 70385 1876423 3042236 3502917 39630
1045 39630 -8988244 -18570213 -22413026 -22360435 -26525845 -37445961 -47937635 -50753798 -46758581
1036d6758581O457353Q021008Q997848M592932l806287n241146O177964K0173870
1028a385039K1576225Q396864q075591j7185538j6102740p408691K181289L725283
1020a4277938m382775j0758068m286996Q498020J0412314j423524j0005632k227125
1012b8451724J3006885J8008536R145346k595576q092440p344086l040019L483634
1004e879444R231622R836863N178531K08160j667682k429354m545939n231591
996D701166L97136J0105198J2453372j162699k2356810l0243717j5093582P622934
988c3577002J5087456N819692r31801N402682J2287515N631799p406022r695997
980g381678p3773O740723L154530k652580j923781L404064P773786R716019Q331026
$$ plain form
1036 -46758581 -40301228 -32280220 -23282372 -18689440 -22495727 -27736873 -21558909 -1385039
1028 -1385039 20191186 28588050 20512459 3326921 -12775819 -20184510 -18003221 -14277938
1020 -14277938 -18660713 -29418781 -33705777 -25207757 -14795443 -16218967 -26224599 -28451724
1012 -28451724 -15444839 2563697 11709043 9113467 1021027 -6323059 -9363078 -5879444
1004 -5879444 3352178 13189041 18367572 18575732 16908050 14478696 9932757 4701166
996 4701166 5098302 15203500 27656872 26494173 4137363 -26106354 -41199936 -33577002
988 -33577002 -18489546 -12669854 -13601655 -8198973 4088542 9720341 2314319 -7381678
980 -7381678 -7455451 -714728 2439802 -212778 -2136559 1267505 9041291 18757310 27088336
971B7088336J521903p290905r405944l667496p36028p162191j3022777n534516
963a8209618J0387650J7217848R019498j304131j240564N019778M901203m710884
955B1080780j4592358j5543428q649929l190490n899123j2197957r870616N203901
947d3659220J9403444J5033236n651206j9591615j1202810P317235J3119887L762327
939b1468722j896657P109135J7931173J3465758k229786q910288K347891J6928636
931B3277140J5293517k362771j6543012j2574342K472198J0803230O485888j209288
923B5642560m918376p706257j0971828o961163O319776J3506100J169559j7193814
915a113443j4937711Q579754K2982584Q223440j7189872k2136129l699073J3741486
$$ plain form
971 27088336 28610239 21319334 11913390 8245894 7509866 347675 -12675102 -18209618
963 -18209618 -7821968 9395880 18415378 17111247 15870683 20890461 25791664 21080780
955 21080780 6488422 -9055006 -17704935 -20895425 -26794548 -38992505 -48863121 -43659220
947 -43659220 -24255776 -9222540 -14873746 -34465361 -45668171 -38350936 -25231049 -21468722
939 -21468722 -23365379 -16256244 1674929 15140687 12910901 4000613 6348504 23277140
931 23277140 38570657 36207886 19664874 7090532 9562730 20365960 26851848 25642560
923 25642560 20724184 13017927 2046099 -4915064 1404712 14910812 16080371 -1113443
915 -1113443 -16051154 -7471400 15511184 23734624 6544752 -15591377 -19290450 -5548964
907e548964J2602519n59127r384242o156287M947190J3979453J3331607M724946
899B7937095l044712o115766r783968j6476198j8107761q493366M988197J2310368
891a6786111J5077884J7750874J3683584l263372j9636954j5318491N822213J8479687
883A5809314J1027411j712017m920184k554772j785459J408273Q548639P470009
875C3291214r302888k7222041k7336046j2897653k371314j737481j00318R172196
867c8504331J8164613J7379541P876852k787684r219722r946959n812928M43274
859b2407344N031743M928441m15316p340184r255057m000134J440241K43413j743772
850c3517969O900935K2808121K7439291J2043563r177274j8169292j4304746q216006
$$ plain form
907 -5548964 7053555 6494428 -2889814 -9046101 -4098911 9880542 23212149 27937095
899 27937095 24892383 18776617 8992649 -7483549 -25591310 -34084676 -29096479 -16786111
891 -16786111 -1708227 16042647 29726231 26462859 6825905 -8492586 -2670373 15809314
883 15809314 26836725 25124708 20204524 17649752 15864293 17272566 25821205 33291214
875 33291214 23988326 -3233715 -30569761 -43467414 -45838728 -47576209 -47676527 -38504331
867 -38504331 -20339718 -2960177 4916675 2128991 -7090731 -17037690 -22850618 -22407344
859 -22407344 -17375601 -12447160 -12862476 -20202660 -29457717 -33457851 -32017610 -31774197 -33517969
850 -33517969 -26617034 -3808913 23630378 35673941 26496667 8327375 -5977371 -14193377
842a4193377n023805l831514m848921o343210j995988Q973636J6555054J3625623
834B917498O042147L91467o745417j6174681j6176841p49589J4534377J3450615
826b510424M912380O484611J2078946K384733j7794270k2219648n060649Q685466
818a3038855K436055q241902l763553R103368J1062367l03068j0424717q340919
810b1511224L528866J3695717J0175959o871656j9105540r251449J2271805J7719924
802F52402K775796n694811P256674J8486051L302809k2078494k1758621O837974
794a0220220K9444951K2861963J310323j0005905p426287m831935r697446j4789245
786c353801j0434081J894638J0032139N235851n828214q367579P06281Q513612
$$ plain form
842 -14193377 -19217182 -23048696 -27897617 -34240827 -36236815 -27263179 -10708125 2917498
834 2917498 8959645 9351112 2605695 -13568986 -29745827 -30495416 -15961039 -2510424
826 -2510424 2401956 8886567 20965513 23350246 5555976 -16663672 -21724321 -13038855
818 -13038855 -10602800 -18844702 -22608255 -13504887 -2442520 -2745588 -13170305 -21511224
810 -21511224 -17982358 -4286641 5889318 -982338 -20087878 -29339327 -17067522 652402
802 652402 3428198 -2266613 4990061 23476112 26778921 4700427 -17058194 -10220220
794 -10220220 19224731 42086694 43397017 33391112 25964825 21132890 11435444 -3353801
786 -3353801 -13787882 -11893244 -1861105 3374746 -2453468 -10821047 -10114766 -1601154
778a601154N455248j147694k72015N064658M176422l513805r114963r198380q355821
769a8507504q062659l926423M672030J0837087Q990637K524103J73799O129081
761B830151J4025282J2204501j656790j3880852j0509611K622573P680894J913528
753A5229676j76823N092584K011946j4384287k2122115n215771J6177670J3512245
745A0125125n832425j0726228M663247J4744111N179839q077443q718010k893582
737a535366j526520j393845L119457N943507L77933p419436p242841J307627J1307697
728B938213J6469462J1783977l531970j8997040j9977848p072139K890908K35129
720a5261308n570021l423567K843656L862751l28617l683141l946077k027836
$$ plain form
778 -1601154 3854094 2706400 2434385 7499043 11675465 8161660 -953303 -10151683 -18507504
769 -18507504 -26570163 -30496586 -25824556 -14987469 -5996832 -3472729 -3298930 2830151
761 2830151 16855433 29059934 27403144 13522292 3012681 5635254 13316148 15229676
753 15229676 15052853 20145437 22157383 7773096 -14349019 -19564790 -3387120 10125125
745 10125125 4292700 -6433528 -1770281 12973830 18153669 10076226 1358216 -1535366
737 -1535366 -3061886 -4455731 -1336274 4607233 4985166 -2434270 -9677111 -8369484 2938213
728 2938213 19407675 31191652 27659682 8662642 -11315206 -18387345 -15496437 -15261308
720 -15261308 -20831329 -24254896 -21411240 -17548489 -17877106 -21560247 -25506324 -27534160
712b7534160O45899P2191n402123o213599Q172310K7165847K6017040K433415
704B5356820j4565224n519893J0300709N670272j2513350j6704844k613417P722286
696b866641K576308n628204m750452R77330M311042O642385J0033608J1127978
688B2423354Q336345M673307P43372n067597q722878m276400L763232L879135
680B5751870n397735j3876157j5911854j5060978j1728227j777272R355187Q143844
672b0501322m738877j0201206J325865J3212433P121827r079628j4238262n055508
664d2154678M000256O298569Q965596J3874554J2163455K481498k449999L545888
656F725139P212650l629333j7258663j2497563Q376470J9634000Q032332q308400
$$ plain form
712 -27534160 -26888261 -26816070 -32218193 -38431792 -30259482 -3093635 22923405 25356820
704 25356820 10791596 5271703 15572412 21242684 8729334 -7975510 -10588927 -2866641
696 -2866641 -290333 -5918537 -10668989 -9691659 -5380617 1261768 11295376 22423354
688 22423354 30759699 35433006 36176378 31108781 22385903 18109503 21872735 25751870
680 25751870 20354135 6477978 -9433876 -24494854 -36223081 -38000353 -28645166 -20501322
672 -20501322 -25240199 -35441405 -34115540 -20903107 -13781280 -22860908 -37099170 -42154678
664 -42154678 -38154422 -31855853 -22890257 -9015703 3147752 5629250 3179251 6725139
656 6725139 13937789 10308456 -6950207 -19447770 -11071300 8562700 16595032 8286632
648H286632o583476Q642281J5113258O580283j900078j359244j894769j1567813
640A5317074j9441603j2513430K206742P863782K914286k4095K919260K226802
632A468818n296760q438889K59553J0707549Q820371l796927j2704135r168290
624a8148710J469212Q238494O107614o30135m075255j916368P6185k721036n074629
615a6674628N72334R483803Q396431l417536q815619L500283J9684880J7234787
607B9964735m318355k2390562k0429181n549063N900706Q988287R043928P796540
599I007035J519621q394092j2789694o406379L627767O314645J189084j598556
591g530569M301575J2564389J2721300L899178m295719l507834M264715R320791
$$ plain form
648 8286632 1703156 10345437 25458695 32038978 30138900 28779656 26884887 15317074
640 15317074 -4124529 -16637959 -14431217 -6567435 -3653149 -3677244 -757984 1468818
632 1468818 -3827942 -12266831 -12007278 -1299729 7520642 3723715 -8980420 -18148710
624 -18148710 -16679498 -8441004 -2333390 -2963525 -7038780 -8955148 -8878963 -11599999 -16674628
615 -16674628 -16102294 -6618491 1777940 -1639596 -10455215 -6954932 12729948 29964735
607 29964735 25646380 3255818 -17173363 -22722426 -16821720 -7833433 1210495 9007035
599 9007035 10526656 2132564 -10657130 -17063509 -13435742 -7121097 -5932013 -7530569
591 -7530569 -3228994 9335395 22056695 25955873 21660154 18152320 22417035 31737826
583C1737826L921094j0246136k2683926k3382405j3127376k564894P34532N41077
575c5070208L659043Q146681P350234L068628M503994J2487187J4828144L056833
567B2030536j3736139j9596093j1826909k124772M86848q29327M36413L656789
559b1502654M329691L216281N615008J1960887J4923993Q553065l077679r933918
551A4084674p114001J430464Q661278R602767K125468j0794553j8704109j1270185
543a1978197P609529J9792995J2802850n307727j7015246j5937633q814371k092992
535b0940792L010743M608060P52013l631974r16250O518749P814747L71910n196056
526g608850r35505P416920J0720611Q435281L552276n301421j7202139k1715794
$$ plain form
583 31737826 35658920 25412784 2728858 -20653547 -33780923 -36345817 -35611285 -35070208
575 -35070208 -31411165 -23264484 -15914250 -12845622 -8341628 4145559 18973703 22030536
567 22030536 8294397 -11301696 -23128605 -25253377 -24766529 -25595856 -25159443 -21502654
559 -21502654 -17172963 -13956682 -8341674 3619213 18543206 27096271 24018592 14084674
551 14084674 6970673 8401137 17062415 26665182 28790650 17996097 -708012 -11978197
543 -11978197 -4368668 15424327 28227177 22919450 5904204 -10033429 -18847800 -20940792
535 -20940792 -17930049 -13321989 -12569976 -16201950 -17118200 -10599451 -2784704 -2412794 -7608850
526 -7608850 -8544355 -1127435 9593176 18028457 21580733 16279312 -922827 -22638621
518b2638621j0464829P346749J3204467L514089n467638l24333J1384492J2450863
510I005239n39568j3906817j5528483p971812l81886M804899J0097064J3133529
502a287835Q910230P46740k200079j62642l043361j0980983r691285M671624J1819450
493a218141l903186k3823958j8142917Q033229K0176463O261848p039025J259440
485a8396247J5094832J1229225l952931r676396m523326q78147Q13045P047055
477c242890J0157273j311426j6088263j0867687J2339559K5025371J2848188n705133
469B3154992r280737j703976J298451l134676p077428p431518o533163m147840
461a4855895N28946L617925J570079k292438k457136J160414M950437O816443
$$ plain form
518 -22638621 -33103450 -25756701 -12552234 -9038145 -14505783 -14830116 -3445624 9005239
510 9005239 8465671 -5441146 -20969629 -28941441 -29323327 -24518428 -14421364 -1287835
502 -1287835 7622395 8369135 6169056 6006414 2963053 -8017930 -17709215 -13037591 -1218141
493 -1218141 -5121327 -28945285 -47088202 -39054973 -18878510 -12616662 -19655687 -18396247
485 -18396247 -3301415 7927810 3974879 -5701517 -10224843 -11102990 -10289945 -3242890
477 -3242890 6914383 5602957 -10485306 -21352993 -9013434 16011937 28860125 23154992
469 23154992 13874255 12170279 13468730 10334054 3256626 -4174892 -10708055 -14855895
461 -14855895 -14326949 -10709024 -9138945 -11431383 -13888519 -12728105 -7777668 -961225
453i61225N644672M04112n832940n728718L305659J3360626J4197089N112638
445B9501913n149070q838957o363647l432741l236763k976306O84054M297457
437D485940J049839p269022r309872k70892Q872611O651629j543637k821221K215982
428B061357K218285l919280m899190K973925R096944N927390o50137l500746m176182
419E132366m583491o06512Q308183J3094254O718323n425433j3163655j2932747
411c458712o845324K139795R559471J1097305Q236764N063548j030630j4506923
403A0255294k7092337k3331383m661033Q701550O724206K885745Q805704J4121251
395c591003O539297m412820k470492Q419370J1560263L530638n256422q848843
$$ plain form
453 -961225 4683447 5087559 -745381 -6474099 -3168440 10192186 24389275 29501913
445 29501913 24352843 15513886 9150239 5717498 2480735 -495571 188483 4485940
437 4485940 5535779 -1733243 -11043115 -11314007 -2441396 4210233 2666596 -154625 2061357
428 2061357 4279642 360362 -4538828 -1564903 7532041 13459431 12809294 9308548 5132366
419 5132366 548875 -57637 8250546 21344800 28063123 22637690 9474035 -3458712
411 -3458712 -10304036 -8164241 1395230 12492535 20729299 25792847 24762217 10255294
403 10255294 -16837043 -40168426 -44829459 -36127909 -29403703 -26517958 -17712254 -3591003
395 -3591003 2948294 -1464526 -3935018 4484352 16044615 19575253 14318831 5469988
387E469988p634829M65365J3041911J5407980n08478j6664287j0471800R348490
379H454340J3124650n315570k0680475j5560054k016115L551388L467353N481527
371i492956O340764J953064j374201J660568N092082L185795M45685J270926J975901
362A1057628J449491O057872J4885504J5261815L994861l133129L005545O572192
354E9151779p324471k3720325j8874412L22306N899422o237401j0583991M773492
346C406399J7921720Q591515r731960j1973281M74985N836960k281911q007980
338D236447j798114M915925P16239o387656k691251Q244017J0955256K093660
330B0284523n940062n813226m714041p985177p895456R60628P424545l9592j1422323
$$ plain form
387 5469988 -2164841 -1699476 11342435 26750415 26241937 9577650 -894150 8454340
379 8454340 21578990 16263420 -4417055 -19977109 -21993224 -18441836 -14974483 -9492956
371 -9492956 -3152192 -1199128 -2573329 -912761 4179321 7365116 7810801 9081727 11057628
362 11057628 12507119 18564991 33450495 48712310 52707171 49574042 52579587 59151779
354 59151779 51827308 28106983 9232571 9554877 15454299 9216898 -1367093 3406399
346 3406399 21328119 29919634 20187674 8214393 8689378 14526338 12244427 4236447
338 4236447 2438333 7354258 8070497 1682841 -1008410 7235607 18190863 20284523
330 20284523 14344461 8531235 3817194 -4167983 -12063439 -11102811 -3678266 -3717858 -15140181
321a5140181p742094Q412974J5238398N517950l253162J154642O555941o11218
313A0133250j1130855q822019K512717O632253Q54298m069594m506264n706955
305a4103169n931934K237926J4150241J4592971Q52764j1173548r129481Q50810
297g653420P011252P528112O278220L531535j191553m507005m328754l996017
289B672370o304293q769294q207528m301637L155475J3096860J8053807J0181103
281A9576863m983024j2072657p168506k860724o371169p449029J881573J0273977
273i172696M765552o296843o138896L000176N411824k4867O19707R045405R837392
264A1046754j900607r531412j753148Q110051L911747p000766o652407M175421
$$ plain form
321 -15140181 -22882275 -14469301 769097 6287047 3033885 4188527 10744468 10133250
313 10133250 -997605 -9819624 -7306907 -674654 179644 -3889950 -8396214 -14103169
305 -14103169 -20035103 -17797177 -3646936 10946035 11798799 625251 -8504230 -7653420
297 -7653420 -642168 6885944 13164164 16695699 15504146 10997141 6668387 2672370
289 2672370 -3631923 -12401217 -20608745 -24910382 -21754907 -8658047 9395760 19576863
281 19576863 14593839 2521182 -4647324 -7508048 -13879217 -21328246 -19446673 -9172696
273 -9172696 -4407144 -10703987 -16842883 -13842707 -8430883 -8455750 -7836043 1209362 11046754
264 11046754 9146147 -385265 -2138413 5971638 9883385 2882619 -3769788 405633
256D05633Q452148P73722n702216j601399N127300L468345m452561q764848o214654
247h508530j856418p4810k9957P34260K020116J378727j840973l842438k86994
238a2307017O183057O685050j696589r031601m986181N145816O873382j419369
230d553452m870668N098185J6030109J1809731l201330r837847j241882Q284029
222A7516875M047272r441754j5822407q183736M138837Q757255M289334p41989
214D559687J89278M414021M880345p59933q032021j1124694p898299m18239O351030
205g838825P197507K102396j415699L343437J1415099J0662989r82479j1056063
197A3428362r892480l835216l472749o515330l444185M940737Q672805N452803
$$ plain form
256 405633 8857781 9631503 3929287 2327888 7455188 10923533 6470972 -2293876 -8508530
247 -8508530 -10364948 -10439758 -10469715 -9735455 -7715339 -6336612 -8177585 -12020023 -12307017
238 -12307017 -6123960 561090 -1135499 -10167100 -15153281 -10007465 -3134083 -4553452
230 -4553452 -9424120 -4325935 11704174 23513905 20312575 10474728 9232846 17516875
222 17516875 21564147 12122393 -3700014 -11883750 -7744913 1012342 5301676 4559687
214 4559687 4748965 9162986 14043331 13283398 5251377 -5873317 -13771616 -14189855 -7838825
205 -7838825 -641318 1461078 45379 3388816 14803915 25466904 24484425 13428362
197 13428362 3535882 -299334 -3772083 -10287413 -13731598 -8790861 -118056 5334747
189E334747K916926L380354J02239p554824q885825Q65600R562090M654316p763035
180B612588j1638660l478805N089150M798471j621928o937392p491944k892515
172b1561035M660061R069228N051770l598438o210998J427158J0681295J0491362
164A0010403P41578q607094r731025m320077R61788K638770K084562J274684N55795
155d390616Q76444M154454Q869711R012848J948080n649371n928775j841300k860213
146D191262r268239j0770465l125548M470657L923516J49567Q73270L675944K954907
137b925129J895637N746126R224061L953143n386806o599020l2723J778227m665019
128B988497q176008k148154N017267M956583J694356J025530l25441n001538n346849
$$ plain form
189 5334747 8251673 11632027 11734266 4179442 -4706383 -3840783 5721307 10375623 2612588
180 2612588 -9026072 -12504877 -7415727 -2617256 -4239184 -11176576 -18668520 -21561035
172 -21561035 -16900974 -7831746 -2779976 -6378414 -12589412 -11162254 -480959 10010403
164 10010403 10751981 2144887 -7586138 -11906215 -10944427 -8305657 -6221095 -4946411 -4390616
155 -4390616 -3514172 640282 9509993 18522841 20470921 14821550 8892775 7051475 4191262
146 4191262 -5076977 -15847442 -18972990 -14502333 -10578817 -10429250 -9555980 -5880036 -2925129
137 -2925129 -1029492 4716634 13940695 17893838 12507032 5908012 5875289 7653516 2988497
128 2988497 -5187511 -7335665 -2318398 2638185 4332541 5358071 5032630 31092 -5315757
119e315757M133654J3052270Q227685m554275p102882M232375J3294194Q200302
111C4167566l189203p844641o026469o080187q687674p280930j005164L069902
103b876800J198985j922625j629803O7628J90550J353626O798343J2509822J1276001
94B6965727L590258k299856k041770n16661l262180q278586r971866o869927j747067
85d431928K266261K607371j508592n753803l768545K733101L516469n037243j1869829
76b1246738o669959L740216N699003j13585j512752M093241O796032K812402N64278
67e837862M642025P930963N009675M80203j815616n044905q417969l709543Q640023
58A876994J3773600M105671o141596j934070Q608068P881552k643277o673737
$$ plain form
119 -5315757 -1182103 11870167 20097852 15543577 8440695 12673070 25967264 34167566
111 34167566 30978363 23133722 17107253 11027066 2339392 -4941538 -5946702 -2876800
103 -2876800 -1677815 -3600440 -5230243 -5162615 -4972065 -3618439 3179904 15689726 26965727
94 26965727 30555985 28256129 26214359 25697698 22435518 14156932 4185066 -2684861 -4431928
85 -4431928 -2165667 441704 -1066888 -6820691 -10589236 -7856135 -4339666 -9376909 -21246738
76 -21246738 -27916697 -24176481 -18477478 -18591063 -20103815 -16010574 -9214542 -6402140 -5837862
67 -5837862 -1195837 6735126 11744801 12225004 10409388 5364483 -3053486 -6763029 1876994
58 1876994 15650594 19756265 13614669 11680599 20288667 28170219 25526942 18853205
50A8853205q23588J882584m384257r841998p093165j488502O76254N32318q92211
41b579360n470712q916168k231711J2042375J7963273P938483n589766q683167
33D473247m597589l498480m251237j64717M736048J110105p087445n591240O904058
24g967250J3392483K781271j2437433j2837492Q96224R812158L760630n962162
16h561571n138107K806323M264789k704726o894110l638404j869805o394335o563350
7c4693296O475618K1346632K0068662M577204o562204n910572m037301
0A264743
$$ plain form
50 18853205 18029617 19912201 15527944 5685946 -1407219 -2895721 -2219467 -1687149 -2579360
41 -2579360 -8050072 -16966240 -19197951 -7155576 10807697 18746180 13156414 4473247
33 4473247 -124342 -3622822 -7874059 -8038776 -3302728 -2192623 -9280068 -14871308 -7967250
24 -7967250 5425233 8206504 -4230929 -17068421 -16172197 -6360039 -2599409 -8561571
16 -8561571 -13699678 -10893355 -6628566 -9333292 -16227402 -19865806 -21735611 -28129946 -34693296
7 -34693296 -28217678 -6871046 13197616 17774820 11212616 5302044 1264743
0 1264743
##END NTUPLES=NMR SPECTRUM
##END=
