##TITLE=31Pdec_LR-685B-C1M
 CDCl3, 24 sc
 29.7.2019
##JCAMPDX= 6.0         $$ Bruker NMR JCAMP-DX V2.0
##DATA TYPE= NMR SPECTRUM
##DATA CLASS= NTUPLES
##ORIGIN= UXNMR, Bruker Analytische Messtechnik GmbH
##OWNER= root
$$ XWIN-NMR		Version 3.5
$$ Mon Jul 29 16:34:32 2019 Russian Standard Time (UT+4h)  she@DPX200
##.OBSERVE FREQUENCY= 81.013821
##.OBSERVE NUCLEUS= ^31P
##.ACQUISITION MODE= SIMULTANEOUS
##.ACQUISITION SCHEME= undefined
##.AVERAGES= 24
##.DIGITISER RES= 17
##SPECTROMETER/DATA SYSTEM= spect
##.PULSE SEQUENCE= zgpg30
##.SOLVENT NAME= CDCl3
##.SHIFT REFERENCE= (INTERNAL, CDCl3, 0, 182.463)
##AUDIT TRAIL= $$ (NUMBER, WHEN, WHO, WHERE, WHAT)
$$ ##TITLE= Audit trail, XWIN-NMR		Version 3.5
$$ ##JCAMPDX= 5.01
$$ ##ORIGIN= Bruker BioSpin GmbH
$$ ##OWNER= she
$$ F:/spectra/data/she/nmr/P31/1/pdata/1/auditp.txt
$$ ##AUDIT TRAIL=  $$ (NUMBER, WHEN, WHO, WHERE, WHAT)
(   1,<2019-07-29 16:33:23.87 +0400>,<she>,<DPX200>,
      <created by zg, POWCHK disabled, PULCHK disabled
       configuration hash MD5:
       00 E9 B6 7A A2 85 ED C7 34 08 36 98 17 FE 4E 26
       data hash MD5: 32K
       7E F5 5D B5 B9 61 B1 B7 1E 55 DA 8F E8 A9 04 AB>)
(   2,<2019-07-29 16:33:26.34 +0400>,<she>,<DPX200>,
      <Start of raw data processing
       efp BC_mod = 2 LB = 1 FT_mod = 6 PKNL = 1 PHC0 = -570.3405 PHC1 = 111.4 SI = 64K 
       data hash MD5: 64K
       B1 91 07 BB F5 66 58 C9 49 E4 1E 68 9E 6B D5 F6>)
(   3,<2019-07-29 16:33:48.00 +0400>,<she>,<DPX200>,
      <pk PHC0 = 180.1524 PHC1 = 0 
       data hash MD5: 64K
       02 48 F4 BC C1 29 C4 88 BA 6B A9 25 6C E1 8A FA>)
(   4,<2019-07-29 16:34:04.17 +0400>,<she>,<DPX200>,
      <pk PHC0 = -0.5998924 PHC1 = 0 
       data hash MD5: 64K
       F7 F3 54 3B 30 25 0D 46 C3 D9 DB C1 B6 51 20 BB>)
$$ ##END=
$$ 
$$ hash MD5
$$ A7 7C 24 5B CB 08 63 84 2C A3 C2 0C 35 58 9F 3D
##$RELAX= 
##$RELAX= 
##$RELAX= 
##$RELAX= 
##$RELAX= 
##$RELAX= 
##$RELAX= 
##$RELAX= 
$$ Bruker specific parameters
$$ --------------------------
##$DU= <F:/spectra>
##$EXPNO= 1
##$NAME= <P31>
##$PROCNO= 1
##$TYPE= <nmr>
##$USER= <she>
##$AMP= (0..31)
100 100 100 100 100 100 100 100 100 100 100 100 100 100 100 100 100 100 
100 100 100 100 100 100 100 100 100 100 100 100 100 100 
##$AQSEQ= 0
##$AQ_mod= 1
##$AUNM= <au_zg>
##$AUTOPOS= <>
##$BF1= 81.014009
##$BF2= 200.13
##$BF3= 200.13
##$BF4= 200.13
##$BF5= 200.13
##$BF6= 200.13
##$BF7= 200.13
##$BF8= 200.13
##$BYTORDA= 1
##$CFDGTYP= 0
##$CFRGTYP= 5
##$CHEMSTR= <none>
##$CNST= (0..31)
1 1 145 1 1 1 1 1 1 1 1 1 1 1 1 1 1 1 1 1 1 1 1 1 1 1 1 1 1 1 1 1 
##$CPDPRG= <waltz16>
##$CPDPRG1= <>
##$CPDPRG2= <waltz16>
##$CPDPRG3= <>
##$CPDPRG4= <mlev>
##$CPDPRG5= <mlev>
##$CPDPRG6= <mlev>
##$CPDPRG7= <mlev>
##$CPDPRG8= <mlev>
##$CPDPRGB= <>
##$CPDPRGT= <>
##$D= (0..31)
0 1 0 0 0 0 0 0 0 0 0 0.03 2e-05 3e-06 0 0 0 0 0 0 0 0 0 0 0 0 0 0 0 0 
0 0 
##$DATE= 1564403603
##$DBL= (0..7)
120 120 120 11 120 120 24 19 
##$DBP= (0..7)
150 150 150 150 150 150 150 150 
##$DBP07= 0
##$DBPNAM0= <>
##$DBPNAM1= <>
$$ [...]
##$SUBNAM2= <"">
##$SUBNAM3= <"">
##$SUBNAM4= <"">
##$SUBNAM5= <"">
##$SUBNAM6= <"">
##$SUBNAM7= <"">
##$SUBNAM8= <"">
##$SUBNAM9= <"">
##$SW= 369.568048894756
##$SWIBOX= (0..15)
0 1 3 0 0 0 0 0 0 0 0 0 0 0 0 0 
##$SW_h= 29940.119760479
##$TD= 32768
##$TD0= 1
##$TE= 0
##$TE2= 300
##$TE3= 300
##$TEG= 300
##$TL= (0..7)
0 120 53 12 22 120 120 120 
##$TP= (0..7)
150 150 150 150 150 150 150 150 
##$TP07= 0
##$TPNAME0= <>
##$TPNAME1= <>
##$TPNAME2= <>
##$TPNAME3= <>
##$TPNAME4= <>
##$TPNAME5= <>
##$TPNAME6= <>
##$TPNAME7= <>
##$TPOAL= (0..7)
0.5 0.5 0.5 0.5 0.5 0.5 0.5 0.5 
##$TPOFFS= (0..7)
0 0 0 0 0 0 0 0 
##$TUNHIN= 0
##$TUNHOUT= 0
##$TUNXOUT= 0
##$USERA1= <user>
##$USERA2= <user>
##$USERA3= <user>
##$USERA4= <user>
##$USERA5= <user>
##$V9= 5
##$VALIST= <valist>
##$VCLIST= <CCCCCCCCCCCCCCC>
##$VD= 0
##$VDLIST= <DDDDDDDDDDDDDDD>
##$VPLIST= <PPPPPPPPPPPPPPP>
##$VTLIST= <TTTTTTTTTTTTTTT>
##$WBST= 1024
##$WBSW= 4
##$XGAIN= (0..3)
0 0 0 0 
##$XL= 0
##$YL= 0
##$YMAX_a= 12091
##$YMIN_a= -12847
##$ZGOPTNS= <>
##$ZL1= 120
##$ZL2= 120
##$ZL3= 120
##$ZL4= 120
##$ABSF1= 0
##$ABSF2= 0
##$ABSG= 0
##$ABSL= 0
##$ALPHA= 0
##$AQORDER= 0
##$ASSFAC= 0
##$ASSFACI= 0
##$ASSFACX= 0
##$ASSWID= 0
##$AUNMP= <proc_1d>
##$AZFE= 0.1
##$AZFW= 0.5
##$BCFW= 0
##$BC_mod= 2
##$BYTORDP= 0
##$COROFFS= 0
##$CY= -3
##$DATMOD= 1
##$DC= 0
##$DFILT= <>
##$DTYPP= 0
##$F1P= 0
##$F2P= 0
##$FCOR= 1
##$FTSIZE= 65536
##$FT_mod= 6
##$GAMMA= 0
##$GB= 0
##$INTBC= 1
##$INTSCL= 5.30512e-09
##$ISEN= 30
##$LB= 1
##$LEV0= 0
##$LPBIN= 0
##$MAXI= 10000
##$MC2= 0
##$MEAN= 0
##$ME_mod= 0
##$MI= 50
##$NCOEF= 0
##$NC_proc= -6
##$NLEV= 6
##$NOISF1= 182.463
##$NOISF2= 159.3651
##$NSP= 0
##$NTH_PI= 0
##$NZP= 0
##$OFFSET= 182.463
##$PC= 4
##$PHC0= -390.788
##$PHC1= 111.4
##$PH_mod= 1
##$PKNL= yes
##$PPARMOD= 0
##$PSCAL= 0
##$PSIGN= 0
##$REVERSE= no
##$SF= 81.0140089999434
##$SI= 65536
##$SIGF1= 159.3651
##$SIGF2= -187.1042
##$SINO= 113.3802
##$SIOLD= 16384
##$SREGLST= <1H.CDCl3>
##$SSB= 0
##$STSI= 65536
##$STSR= 0
##$SW_p= 29940.119760479
##$SYMM= 0
##$S_DEV= 0
##$TDeff= 32768
##$TDoff= 0
##$TI= <>
##$TILT= no
##$TM1= 0
##$TM2= 0
##$TOPLEV= 0
##$USERP1= <user>
##$USERP2= <user>
##$USERP3= <user>
##$USERP4= <user>
##$USERP5= <user>
##$WDW= 1
##$XDIM= 65536
##$YMAX_p= 292612480
##$YMIN_p= -18814687
$$ End of Bruker specific parameters
$$ ---------------------------------
##NTUPLES= NMR SPECTRUM
##VAR_NAME=  FREQUENCY,     SPECTRUM/REAL,   SPECTRUM/IMAG
##SYMBOL=    X,             R,               I
##VAR_TYPE=  INDEPENDENT,   DEPENDENT,       DEPENDENT
##VAR_FORM=  AFFN,          ASDF,            ASDF
##VAR_DIM=   65536,         65536,           65536
##UNITS=     HZ,            ARBITRARY UNITS, ARBITRARY UNITS
##FACTOR=    0.456856943014862, 1,           1
##FIRST=     14782.0589164792, 0,            0
##LAST=      -15158.0608439998, 0,           0
##MIN=       -15158.0608439998, -18814687,   0
##MAX=       14782.0589164792, 292612480,    0
$$ Real data points
##PAGE= N=1
##DATA TABLE= (X++(R..R)), XYDATA
$$ [...]
45738F42660k95926m7464l63454N9357Q84225O84621k27981j96286P43970Q44884
45728B728606j43928l55724R35844J855013Q26327j077668j985367j752997j291150
45719b61044q08210j81318P5601l21206m85610L43195J333859J223642K93177
45710A212086j52672K08483N14057K21283l15526n93814m19394J26289N03820
45701A304612J0428j062849j328758k27616Q47263M94472n34420n67357L69485
45692f94740Q54833M48352m6245l50091q42665j077657j53082J340169J717377
45683A196251P98735J14018J79155k05776j280807j361295K08927J393571M88624
45674A531403j099467j141968o4944J95169l87498k60302N96452N89677m69809
$$ plain form
45738 642660 346734 299270 -64184 -4827 879398 1564019 1336038 1139752 1883722 2728606
45728 2728606 2584678 2228954 3164798 5019811 5846138 4768470 2783103 1030106 -261044
45719 -261044 -1069254 -1250572 -1174971 -1496177 -1981787 -1638592 -304733 918909 1212086
45710 1212086 1059414 1267897 1781954 2003237 1687711 1093897 674503 800792 1304612
45701 1304612 1315040 252191 -1076567 -1304183 -456920 37552 -496868 -1064225 -694740
45692 -694740 160093 608445 562200 212109 -630556 -1708213 -1861295 -521126 1196251
45683 1196251 1994986 2109004 2288159 2082383 801576 -559719 -350792 1042779 1531403
45674 1531403 431936 -710032 -774976 -579807 -967305 -1227607 -631155 -41478 -511287
45665e11287q13978K96472J248380O46508n99568r04712l54574j57790o36621
45656a787170r56170m34243P31206J780003J916643Q82314n64683j137641m12351
45647A7908O16938P25151j28094q80575o03731N42147J391737Q72478o40900j349891
45637E63168j09989J774950J912599k5572j817395j707832n11858P1140j08600
45628D0611j63796q7410n19786j040045l67636J536702K876085K064128l61114
45619C977739k295441k163052l13448J363146J251666l00506j380420q76572J76414
45610e60474K75863k84546o1657J050335J553180O90772m76766q90041r86449
45601C10217j465836j708002p03692J068053K034144J656578R97978R78844J073693
$$ plain form
45665 -511287 -1325265 -1028793 219587 866095 266527 -638185 -992759 -1150549 -1787170
45656 -1787170 -2743340 -3177583 -2446377 -666374 1250269 2132583 1567900 430259 17908
45647 17908 634846 1359997 1231903 351328 -252403 289744 1681481 2553959 1913059 563168
45637 563168 453179 2228129 4140728 4115156 2297761 589929 78071 149211 40611
45628 40611 -123185 -210595 -730381 -1770426 -2138062 -601360 2274725 4338853 3977739
45619 3977739 1682298 -480754 -794202 568944 1820610 1520104 139684 -736888 -560474
45610 -560474 -284611 -569157 -630814 419521 1972701 2663473 2186707 1296666 310217
45601 310217 -1155619 -2863621 -3567313 -2499260 -465116 1191462 2189440 3168284 4241977
45592D241977L00097j124697j917785j445755n80563m49159q13954m87251O96059
45583a581031J326606L67458j208254j663490q07354P9424K93478L71282P37136
45574b084745J045820J107353J169775R44229k58276j874266k079067l60434J295923
45565a093688J028167l19045p18636j7374L45306N035L9132P91100J241508Q45087
45555B146592L47771K76640O9525o23140j038465n58477J15435j6836p38846j045182
45545a064983o71833l17381m28025m88547K09029J395294J830997P39072r52234
45536B51389j423657k20095J083220J019475J69101l8209L26972N1772q84135
45527C35833j113054k09117M88821p02q03533o51155L30301J189332J535971J465499
$$ plain form
45592 4241977 4542074 3417377 1499592 53837 -526726 -975885 -1789839 -2277090 -1581031
45583 -1581031 -254425 113033 -1095221 -2758711 -3566065 -3486641 -3193163 -2821881 -2084745
45574 -2084745 -1038925 68428 1238203 2182432 1924156 49890 -2029177 -2389611 -1093688
45565 -1093688 -65521 -384566 -1103202 -1120576 -775270 -770235 -731103 59997 1301505 2146592
45555 2146592 2494363 2771003 2840528 2217388 1178923 620446 735881 719045 -19801 -1064983
45545 -1064983 -1736816 -2054197 -2482222 -2970769 -2761740 -1366446 464551 1203623 251389
45536 251389 -1172268 -1392363 -309143 710332 879433 841224 1168196 1219968 335833
45527 335833 -777221 -986338 -497517 -498219 -1301752 -1952907 -1622606 -433274 1102697 2568196
45517B568196R51940K33372N8101O16096Q66723j17940j656630k245263j466619
45508a92024k58255M33092M68144J78081r9697k13585l20291o24487q19501l14889
45498a763412P02270J150171M73556n24749q30690m81771p4061K19161M02563
45489g26962K01760k99381k90553N60535J222947O55180n73061j128616q62830
45480a240981p10769r86151r65495p9506J361609K475947K283841N01269j455667
45471A184097j299419J142769K919261J607359j072802j556066L13882J128627
45463D367708q10688k947195k337852K70012J922433J429446N7437p95264r16551
45454B39486o36994k07308J33386K19239J41103Q2538J44154L88372O68135M85984
$$ plain form
45517 2568196 3520136 3753508 3811609 4427705 5294428 5176488 3519858 1274595 -192024
45508 -192024 -450279 -17187 450957 629038 529341 315756 -4535 -629022 -1448523 -1763412
45498 -1763412 -1061142 89029 562585 37836 -792854 -1274625 -1348686 -1129525 -726962
45489 -726962 -525202 -824583 -1115136 -554601 668346 1323526 750465 -378151 -1240981
45480 -1240981 -1951750 -2937901 -3903396 -3982902 -2621293 -145346 2138495 2639764 1184097
45471 1184097 -115322 1027447 3946708 5554067 4481265 2925199 3239081 4367708
45463 4367708 3557020 609825 -1728027 -1458015 464418 1893864 1951301 1156037 239486
45454 239486 -397508 -604816 -471430 -252191 -111088 -28550 115604 503976 1172111 1658095
45444A658095l60437j118588q92290L468M86588L66844L33087L85826j49590q92726
45434a79723n02635R39758J485933K03006j219789r99144J46912M35606k31773
45425G8151o39121m19135j36714J30795O61737R93737M97511k57192j49814O54315
45415A414270Q50957o5655j171572j431821p15438M27027J185134Q90837k30025
45406A153714j016869q03781l65776o01866r89712n27605M10965O19558J24060
45397a997312J82266J202815K015377J470319k12813j855178k351971j401493
45389b947990J08345P57245L08956J23036R95046J606706N68575r87163q87528
45380c54772O09707J192622K34434l64309M69511J235430M94514q34655j173344
$$ plain form
45444 1658095 1297658 179070 -713220 -709752 -223164 143680 476767 862593 713003 -179723
45434 -179723 -682358 257400 1743333 1946339 726550 -272594 -125682 309924 78151
45425 78151 -560970 -980105 -1116819 -986024 -324287 669450 1166961 909769 759955 1414270
45415 1414270 2265227 2199572 1028000 -403821 -1119259 -692232 492902 1383739 1153714
45406 1153714 136845 -666936 -1032712 -1634578 -2624290 -3151895 -2740930 -2121372 -1997312
45397 -1997312 -1815046 -612231 1403146 2873465 2660652 805474 -1546497 -2947990
45389 -2947990 -2839645 -2082400 -1773444 -1650408 -655362 951344 1519919 532756 -354772
45380 -354772 254935 1447557 1681991 1317682 1787193 3022623 3517137 2682482 1509138
45371A509138o41862k74392j62268J22510J87613n95882j674236j770994o34740
45362c935113N64424O18411l82558j119464m50139J122538J833941R87775N3505
45353g06680L42106O46776p94669k737348k164368Q40580K616171J277031n63259
45344a243660j27850J363134J308903R8428j33891N55578M10189o07659r85703
45335F37469o82684r70085j501718n84437J418902J939661J93057j374930p67810
45326a692575P59134J007314J5410p45353r12389j146479j353712p43327N74963
45317d237014J434905J191948N18445L26119M90442J41499q84203j441803m59580
45308b919242J316693J934053Q45126k41245J35446J032870P41543m35643q01370
$$ plain form
45371 1509138 867276 592884 430616 553126 740739 144857 -1529379 -3300373 -3935113
45362 -3935113 -3370689 -2752278 -3134836 -4254300 -4704439 -3581901 -1747960 -760185 -706680
45353 -706680 -364574 282202 -512467 -3249815 -5414183 -4573603 -1957432 -680401 -1243660
45344 -1243660 -1371510 -8376 1300527 1398955 1265064 1820642 2230831 1623172 637469
45335 637469 -45215 -1015300 -2517018 -3101455 -1682553 257108 450165 -924765 -1692575
45326 -1692575 -933441 73873 89283 -656070 -1568459 -2714938 -4068650 -4811977 -4237014
45317 -4237014 -2802109 -1610161 -1091716 -765597 -275155 -133656 -1017859 -2459662 -2919242
45308 -2919242 -1602549 331504 1176630 935385 1070831 2103701 2845244 2409601 1608231
45299A608231r7784K38855m19142j029100p98843k72989l6508J70450N04836N13164
45289C81170J10140j12406O802o3535l51667j63102N60841R25743N41263N3625
45279A888874j49218m54767q86029q54697m61592n62016j102662r90965r3346
45270c666418M06957K15988N00736J465860J552069K16850p29246j05526N35064
45261C92334k86817j194658l85992R88388O91055o99583p73018O35285J370932
45252G37926O38761j16987m5682M7566k49820k61742K2788k67098q80739l78173
45242g53200J315859K293279J359596l96815j446404j586012j159395j22963J239992
45233G43937J987614J687595Q79950j7506j066364j846671j622400q09323o87692
$$ plain form
45299 1608231 1510447 1749302 1330160 301060 -497783 -770772 -807280 -636830 -131994 381170
45289 381170 491310 378904 385706 322171 -29496 -192598 368243 1293986 1835249 1888874
45279 1888874 1739656 1284889 398860 -455837 -917429 -1479445 -2582107 -3573072 -3666418
45270 -3666418 -3259461 -3043473 -2542737 -1076877 475192 692042 -37204 -142730 392334
45261 392334 105517 -1089141 -1475133 -486745 204310 -495273 -1268291 -633006 737926
45252 737926 1376687 1259700 1214018 1261584 1011764 750022 772810 505712 -375027 -753200
45242 -753200 562659 2855938 4215534 3818719 2372315 786303 -373092 -496055 743937
45233 743937 2731551 4419146 5299096 5281590 4215226 2368555 746155 -63168 -750860
45224g50860j207338p92425J008304K408236J856735J21373j096816j291436r08684
45215f52911k13903N56109Q63481N31356l1808o29212j265182j265132N2866J654335
45205d00001J638269J72942o08114j84903m72250j991828k202143L60460K976008
45196g11560K463475q5557j255539l92709L91522K01046R6078L35298p3695j047864
45186g9505j255476m36377L09965N97634J027478J421224Q70056m13621j218689
45177H22689j233293r87362k92484J136422J980630P67992j252032j441833R6672
45168d02599P21130k74203p07470L15330P64593m59706j356200l50590R66974
45159g82741P84627R6708M21360Q92370K27356n33749o5024L44246j018003k722832
$$ plain form
45224 -750860 -1958198 -2750623 -1742319 665917 2522652 2644025 1547209 255773 -652911
45215 -652911 -866814 -310705 552776 1084132 1052324 423112 -842070 -2107202 -2054336 -400001
45205 -400001 1238268 1411210 803096 618193 145943 -1845885 -4048028 -3687568 -711560
45196 -711560 1751915 1666358 410819 18110 409632 610678 706756 1042054 968359 -79505
45186 -79505 -1334981 -1771358 -1461393 -863759 163719 1584943 2454999 2041378 822689
45177 822689 -410604 -1397966 -1690450 -554028 1426602 2194594 942562 -499271 -402599
45168 -402599 318531 44328 -663142 -347812 416781 -42925 -1399125 -1749715 -782741
45159 -782741 1886 98594 519954 1412324 1639680 1105931 1040907 1385153 367150 -2355682
45149b355682k135937J23454J062516J05279m05514N57100J305597P57943Q3303
45140i01941J34454k1748q21678q79151N95863K052794J843334O05834j08608
45131B499153j91822l95250n88190k74714J8687m71225j157413q64085K33799
45122a191060R41520J018349J226008J478605O92190j090415k048669r87509Q19255
45113H58274J337176M65624k65869j46469M6051k60528n42592l63848j90491l86775
45103E50553m58419q2405P4405m63322q47095j53044R21343R83184J00824m29153
45093A96871j73561J17425J03278J15566r0170r91576j629316m22039J906438
45084h67084K541634O30119j232450r09998K19449j9027j028139j021203l58147
$$ plain form
45149 -2355682 -4491619 -4368165 -3305649 -3200370 -3605884 -3048784 -1743187 -985244 -901941
45140 -901941 -767487 -789235 -1610913 -2490064 -1894201 158593 2001927 2607761 2499153
45131 2499153 2307331 1912081 1323891 1049177 1067864 596639 -560774 -1424859 -1191060
45122 -1191060 -249540 768809 1994817 3473422 4165612 3075197 1026528 39019 858274
45113 858274 2195450 2661074 2395205 2248736 2294787 2034259 1491667 1127819 937328 550553
45103 550553 92134 9729 84134 -379188 -1226283 -1379327 -457984 525200 626024 196871
45093 196871 23310 140735 244013 359579 269409 -722167 -2351483 -2773522 -867084
45084 -867084 1674550 2304669 1072219 162221 381670 362643 -665496 -1686699 -2044846
45075b044846m46100o40161O11907K318270J947031k96119j445820l61617P73212
45066D15757K83430o32615n74698k91096p27460r46243J40725J614990J904762
45057A187552J047570R5650n81378j024291q48067k6821N15792K91496J07613
45048G65116M57320M66113k62886m10382P02082J199498n55134k639233j927733
45039b205239J002492K478998J151526m17093j91921M45381k92388j368247q68249
45030b64740O30045J020301M978p97782o67958n73424j008824r46889L15665J633967
45020f54661J427328o5808j017609l64980R32867J241871K64867q13033r42423
45011H419l27854K05674L76556N05529P38305P94358M44624k14422r56842j508591
$$ plain form
45075 -2044846 -2490946 -3131107 -2519200 -200930 1746101 1449982 4162 -357455 415757
45066 415757 699187 66572 -508126 -799222 -1526682 -2472925 -2332200 -717210 1187552
45057 1187552 2235122 2330772 1749394 725103 -122964 -149785 366007 657503 765116
45048 765116 1222436 1688549 1425663 1015281 1717363 2916861 2361727 -277506 -2205239
45039 -2205239 -1202747 1276251 2427777 2010684 1818763 2264144 1971756 603509 -264740
45030 -264740 365305 1385606 1390584 592802 -75156 -648580 -1657404 -2604293 -2288628 -654661
45020 -654661 772667 706859 -310750 -675730 257137 1499008 1763875 950842 8419
45011 8419 -319435 -113761 262795 768324 1506629 2300987 2745611 2531189 1574347 65756
45001F5756j497777q04408L2833K73915p1630k67278M7167L62803K01683o6341
44991a723277J91370Q64206J260740J074254O13471J31713m94087j256625j639922
44982i78157j089779K64069J566811J925576J138801j37402r23717p71832j62798
44973H31572N7639l32968p09738m56893K22408O22616M64086J04795j09675k28548
44963D65294l19302j91133K09425M98835L27750j14768m34804n98207p23802n78286
44953a458998J32180J065687J433285R22666k7354q22213j068618m76785Q23898
44944E23748J813139J305854m79425j811133j408847M6450Q79938M13451n75466
44935G07709j018725n97315K15716P14197O13006K92749K17695J96760k59330
$$ plain form
45001 65756 -1432021 -2236429 -2203596 -1929681 -2001311 -2268589 -2221422 -1858619 -1656936 -1723277
44991 -1723277 -1531907 -667701 593039 1667293 2280764 2412477 1918390 661765 -978157
44982 -978157 -2067936 -1803867 -237056 1688520 2827321 2689919 1766202 994370 831572
44973 831572 889211 556243 -153495 -610388 -387980 234636 698722 803517 693842 465294
44963 465294 145992 -45141 164284 663119 990869 876101 441297 -156910 -880712 -1458998
44953 -1458998 -1326818 -261131 1172154 2094820 2067466 1245253 176635 -300150 523748
44944 523748 2336887 3642741 3163316 1352183 -56664 -10214 869724 1283175 707709
44935 707709 -311016 -908331 -692615 21582 634588 927337 1145032 1341792 1082462
44926A082462r11536r54707l24669J79891L80539J056151K156179K128973K41956
44917E035239j737683j850664q96794j023161k045671j661155O53889K490105
44909a035895J964458J38248j054436j311568j102018j81713J294959J742588
44901D54623K99033j146466l85882J431506J176781j393609k965072j494219R20892
44892c102413J385700K27049l26213J06735R5789n40239l12175J081105J744048
44883C59386L56725j710108k255620j072208L63743J192120J732911K130874J866696
44874B964519P79381m44753j073506r48856k67957N22121O28827l81866j652325
44865A25585j751376n90950L57959J72016k57906K41911J299205J669671J048219
$$ plain form
44926 1082462 170926 -783781 -1108450 -928559 -548020 508131 2664310 4793283 5035239
44917 5035239 3297556 1446892 550098 -473063 -2518734 -4179889 -3526000 -1035895
44909 -1035895 928563 1066811 12375 -1299193 -2401211 -2582924 -1287965 454623
44901 454623 753656 -392810 -778692 652814 1829595 435986 -2529086 -4023305 -3102413
44892 -3102413 -1716713 -1489664 -1815877 -1709142 -1613353 -2153592 -2465767 -1384662 359386
44883 359386 716111 -993997 -3249617 -4321825 -3958082 -2765962 -1033051 1097823 2964519
44874 2964519 3743900 3299147 2225641 1276785 1008828 1530949 2159776 1777910 125585
44865 125585 -1625791 -2216741 -1858782 -1686766 -1944672 -1702761 -403556 1266115 2314334
44856B314334J67768m45530p98455q23937m20806P4153K81717M33107Q45967J084511
44846B712829N82620j86674k44213L34049M93364j77116r66355j225504r87471
44837C35529l72922N14744J025522M80046n71696q08877p8288L91011q269m32618
44827D74182k12133J30517J07381R7411K40150l7362n75571j79596J179585J599401
44817B823965J36215j260071o19633P69807L35510j659884k656186j827968p73365
44808d731610l30322M27459J636175J838909O16700m01301k72249k61177j266128
44799b743544j785795k54671K137594K892786J513602k97141j016578m28306R61752
44790I79699K222592K200895O88512r70075j412602r06222n93064p77578r25114
$$ plain form
44856 2314334 2482102 2036572 1238117 414180 -6626 67527 349244 782351 1628318 2712829
44846 2712829 3295449 3108775 2864562 3198611 3691975 3514859 2548504 1323000 335529
44837 335529 -37393 477351 1502873 1982919 1411223 602346 524058 915069 906800 474182
44827 474182 262049 392566 499947 597358 837508 800146 224575 44979 1224564 2823965
44817 2823965 2960180 1700109 1080476 1850283 2185793 525909 -2130277 -3958245 -4731610
44808 -4731610 -5061932 -4634473 -2998298 -1159389 -542689 -943990 -1216239 -1477416 -2743544
44799 -2743544 -4529339 -4784010 -2646416 246370 1759972 1462831 446253 17947 979699
44790 979699 3202291 5403186 6091698 5121623 3709021 2802799 2209735 1432157 507043
44781E07043o68140J06223J350345K160287J157014j272946k511949j119129P04729
44772D13477K14772j565536j387487J087763K811827K000287J90797q61209j404312
44763A500379j873705j597919o00336k42895p13453k75062J481478K193188N08753
44754C80428j165200k52419J791362J876061K25931m43984L27020M07238p80074
44745B366363j251671p3077J064518P42608k48258q24449j211818j599311j219351
44736b254446O6668R59194N94159k12992m69917l17671r8022L51110P57383M31569
44726a92965r0797O32863K140230J868190q48141k954432j876713N83630J084530
44717C46395k86510q87573j85946j64095j350088j725592j68366J701697K050684
$$ plain form
44781 507043 -161097 -54874 1295471 3455758 4612772 3339826 827877 -291252 413477
44772 413477 628249 -937287 -2324774 -1237011 1574816 3575103 3765900 2904691 1500379
44763 1500379 -373326 -1971245 -2571581 -2814476 -3527929 -3802991 -2321513 -128325 380428
44754 380428 -784772 -1037191 754171 2630232 2856163 2412179 2739199 3146437 2366363
44745 2366363 1114692 1041615 2106133 2848741 2600483 1776034 564216 -1035095 -2254446
44736 -2254446 -2187778 -1228584 -634425 -847417 -1317334 -1635005 -1733027 -1381917 -624534 -192965
44726 -192965 -283762 349101 2489331 4357521 3509380 554948 -1321765 -738135 346395
44717 346395 59885 -827688 -1013634 -1177729 -2527817 -4253409 -4421775 -2720078 -669394
44708f69394J139941K21579j41396J35571R62022J433694M22310j459806k023927
44699B0594m85108J218175J089701l37855j234172j004261k54360O70482J572852
44690A256048J605781K25530j425062j599476l26557O41897L40431k46429R0321
44681E62484R97026J216869M00969n32770p10480l62498l40603q33320r91126
44672e93449n9332J389829J887525P85556r71853j996663j859501j014920R1786
44663b341022J171631J677174J108352j29052q24194k82698Q12632J211165N33874
44654B937862m63077r27503p61057l72588m8371J44634J74792J51310L33600N99880
44644A769482K68371q69750j694216j002307M79611P02625p40867j755102o96674
$$ plain form
44708 -669394 470547 692126 550730 686301 1648323 3082017 3504327 2044521 20594
44699 20594 -464514 753661 1843362 1505507 271335 -732926 -987286 -316804 1256048
44690 1256048 2861829 3087359 1662297 62821 -263736 378161 718592 472163 562484
44681 562484 1559510 2776379 3177348 2644578 1934098 1571600 1230997 397677 -593449
44672 -593449 -652781 737048 2624573 3410129 2438276 441613 -1417888 -2432808 -2341022
44663 -2341022 -1169391 507783 1616135 1487083 662889 380191 1192823 2403988 2937862
44654 2937862 2474785 1547282 786225 413637 365266 509900 684692 836002 1169602 1769482
44644 1769482 2037853 1168103 -526113 -1528420 -1048809 -346184 -1087051 -2842153 -3538827
44635c538827J212159J734077P30076k07231l88547m33005n21072k07096J59583
44626a459883k20303p37892J40775K174955L146817K019270L41019l97784q13221
44617D193753j713267k046615o87028J083290J053157o35681j712994j012917
44609a478302L51285J045618J070716R56139P94398N75146M58033K61883m90540
44600C544376j624332k155658j528123m07008K29403L24621N34777J048155J226358
44591A192569N49600n26269j096722j038729j059347j310145p95221J033799K768833
44582b81632K475279M56653r30870n05284K57107l13362j590315j821223p21717
44573b975364M94135J049822J211276J228744Q72542O2677q39454j406486j379385
$$ plain form
44635 -3538827 -2326668 -592591 137485 -69746 -458293 -891298 -1412370 -1619466 -1459883
44626 -1459883 -1680186 -2418078 -2277303 -102348 3044469 5063739 5404758 5006974 4193753
44617 4193753 2480486 433871 -253157 830133 1883290 1247609 -465385 -1478302
44609 -1478302 -1127017 -81399 989317 1945456 2739854 3315000 3773033 4034916 3544376
44600 3544376 1920044 -235614 -1763737 -2170745 -1941342 -1616721 -1081944 -33789 1192569
44591 1192569 1742169 1215900 119178 -919551 -1978898 -3289043 -4084264 -3050465 -281632
44582 -281632 2193647 2650300 1719430 1214146 1471253 1157891 -432424 -2253647 -2975364
44573 -2975364 -2481229 -1431407 -220131 1008613 1881155 1943832 1104378 -302108 -1681493
44564a681493p75966j26914j25736o47256p57274j37639L55713J54061m3551L66586
44554c419469O43553M8322n32824J46089J478273J726945O01306n04943o66154
44545d78902k50822L13009R76461J173787J38906j485486j876937n09856R07732
44536a092108P77069k17196k95875P91772J502055P05736q10856j439145q47697
44527i26245k81912o29093r68267O2109J894216K461991J157032k45848k84723
44518B239260K00633p4311n50641o6974Q14451O94141j94857l80006L96619R55641
44508D033956O66214j8002p61380j486803j608734p09816L62707O15269N48343
44499A641754R92691J157243J648j279274q14312M96037J83940j375599j277179
$$ plain form
44564 -1681493 -2457459 -2584373 -2710109 -3357365 -4114639 -4252278 -3896565 -3742504 -3786055 -3419469
44554 -3419469 -2775916 -2727594 -3260418 -3114329 -1636056 90889 692195 187252 -478902
44545 -478902 -729724 -416715 559746 1733533 1872439 386953 -1489984 -1999840 -1092108
44536 -1092108 -315039 -532235 -828110 -36338 1465717 2171453 1360597 -78548 -926245
44527 -926245 -1208157 -1837250 -2805517 -2743408 -849192 1612799 2769831 2523983 2239260
44518 2239260 2439893 2365582 1814941 1747967 2562418 3256559 3061702 2681696 3078315 4033956
44508 4033956 4700170 4682168 3920788 2433985 825251 115435 478142 1093411 1641754
44499 1641754 2634445 3791688 3793336 2514062 1699750 2195787 2379727 1004128 -273051
44490b73051Q35477J763960k6095j833706j242455P9036m27731j906348j806668
44481d837581K2066J707434K411024K488028J740672n4609j664789j617421l70011
44472a75187M57155L57383p6079n86662j109252j035835j54458N20896K49329
44463a552710j40215J52780L09740m34161r35273j888J172624P78058m55606m23652
44453a530303P79324J160103L37678N896P93743J231287L24557j025522j756634
44444C20129j922078j699482q46545K95943P93074N96309O05263Q78742L38232
44435f40413j176731k055574j006421J050898K053361J158458n42256j325568
44427b484246n89151N53623O21742k16142l01618R23802J799020R73388l25162
$$ plain form
44490 -273051 562426 2326386 2300291 466585 -775870 -696834 -1124565 -3030913 -4837581
44481 -4837581 -4815515 -3108081 -697057 1790971 3531643 3477034 1812245 194824 -175187
44472 -175187 281968 639351 563272 -23390 -1132642 -2168477 -2322935 -1802039 -1552710
44463 -1552710 -1692925 -1540145 -1230405 -1664566 -2599839 -2601727 -1429103 -651045 -1106651 -1530303
44453 -1530303 -750979 409124 746802 752698 1546441 2777728 3102285 2076763 320129
44444 320129 -1601949 -3301431 -4147976 -3852033 -3058959 -2462650 -1857387 -978645 -640413
44435 -640413 -1817144 -3872718 -4879139 -3828241 -1774880 -616422 -1158678 -2484246
44427 -2484246 -3073397 -2519774 -1898032 -2114174 -2415792 -1491990 307030 1280418 955256
44418I55256k12684Q42658J020842K60147l7373J44094m68126j593576j408628
44409d97390K01143J027960k7240j315792j271553o45502n91520n20630M88707
44400c151817J680173J771093J061551P43120P88673R1070j520751k674009k079801
44391c290698j30674J416210J316455K93950J78209J394264K208802J239416l72517
44382D253417p20400r9078k03620r68657o77193P67660J269365j23335j639001
44373A859158j540284m49418K04389K88039L12665K12307l7728J12958O86122
44364A648208P86876J59038k35480L5002J04055l54824k76291O90068J028567
44355C585219k18024j512766j033608N31134J199955O31217L3661l4055m1000
$$ plain form
44418 955256 742572 1585230 2606072 2866219 2828846 2972940 2504814 911238 -497390
44409 -497390 -296247 731713 704473 -611319 -1882872 -2528374 -3119894 -3640524 -3151817
44400 -3151817 -1471644 299449 1361000 2104120 2892793 2983863 1463112 -1210897 -3290698
44391 -3290698 -3421372 -2005162 -688707 -394757 -216548 1177716 3386518 4625934 4253417
44382 4253417 3533017 3433939 3230319 2261662 1584469 2352129 3621494 3498159 1859158
44373 1859158 318874 -130544 73845 361884 674549 886856 849128 962086 1648208
44364 1648208 2435084 2594122 2358642 2393644 2497699 2142875 1866584 2556652 3585219
44355 3585219 3367195 1854429 820821 1351955 2551910 3183127 3216788 3182733 3141733
44346C141733k16607l93400o55870r49553o49830L77108J058374O11318j20677
44337B202596r4063J18400n45517j488924j168282M27514J611185J238100j24270
44328B176739j198066j189322j54894R92001J097401O3637q70017p00481J12073
44319C29071N61828M40081J06377k15023k50499K63878P54442K14711r78695j171357
44309E4814j27615K28795j037338j989844q07645J228072J855249J266462R96198
44300A667148Q42027l00285j570545j131238M73978Q77608l05290j008576k41833
44291f97006N42451J32271o90481p90108k05960N81199J327843J522786O54583
44282B377578o87723j277241r20372m38709j80400Q2267J60614q5735J74281J398343
$$ plain form
44346 3141733 2925126 2531726 1875856 926303 276473 653581 1711955 2323273 2202596
44337 2202596 2108533 2226933 1681416 192492 -975790 -548276 1062909 2301009 2176739
44328 2176739 978673 -210649 -365543 626458 1723859 1787496 917479 216998 329071
44319 329071 890899 1330980 1437357 1222334 971835 1235713 1990155 2204866 1226171 54814
44309 54814 -72801 155994 -881344 -2871188 -3678833 -2450761 -595512 670950 1667148
44300 1667148 2509175 2208890 638345 -492893 -18915 858693 553403 -455173 -697006
44291 -697006 -154555 -22284 -712765 -1502873 -1708833 -1127634 200209 1722995 2377578
44282 2377578 1689855 412614 -507758 -946467 -1126867 -1044600 -883986 -969721 -795440 602903
44272F02903K055323N63170j703168j923678r9869R91432J81420p01935l06106
44263c40508L18987J55166j11565P9092R4829j22846L45479J079608K66235j847039
44253h2562k319068k5989K009549J017731j301730j608784Q0735J175888Q48849
44244b05381N54582R43129J028107K78375o66007j339715j778762j664213o93036
44235c542921M10216O65497L54557M59575R27732Q11497j23874j123912j532363
44226b693996j174128o7054J296096J899422J370285N74135J94678l28461j356363
44217b85386j722199m52272J144022J040589m22262j038259p1011R58072R26889
44208G8183N49721O04112M90178m49349j418908j158414J69963J113842Q29964
$$ plain form
44272 602903 2658226 3221396 1518228 -405450 -505319 486113 667533 -34402 -340508
44263 -340508 -21521 133645 22080 101172 196001 73155 418634 1498242 1764477 -82562
44253 -82562 -2401630 -2427619 -418070 599661 -702069 -2310853 -2230118 -1054230 -205381
44244 -205381 349201 1292330 2320437 2598812 1932805 593090 -1185672 -2849885 -3542921
44235 -3542921 -3132705 -2467208 -2112651 -1653076 -725344 86153 -37721 -1161633 -2693996
44226 -2693996 -3868124 -3935178 -2639082 -739660 630625 1204760 1399438 1070977 -285386
44217 -285386 -2007585 -2459857 -1315835 -275246 -697508 -1735767 -1806778 -848706 78183
44208 78183 627904 1232016 1722194 1272845 -146063 -1304477 -1134514 -20672 809292
44199H09292J02673K00742J098577J436803M42710q13457r09071k96721o39416
44190A432132j985854k381683q76846Q60599J065570M39247O49950J498702J409666
44181B111483O3038j194414j289388m29579N52672Q05591r8902j333194j187691
44172b000384N85153J784961O24340j403319j446971N88441K030824J297696m27847
44163A632894j509732j746102j437767m31320J057573K004186J765932Q12703
44155B148367j75484j025072j546370j243301j0310J486566K334981J886655P7579
44146C933611k046803k658450j099559R09881J258719K36609j15584Q53980J638694
44137B911098J023707l52820j256299j286513o72908J51687M74211q9729p42656
$$ plain form
44199 809292 911965 1112707 2211284 3648087 4090797 3277340 2368269 2071548 1432132
44190 1432132 -553722 -2935405 -3812251 -2951652 -1886082 -1446835 -796885 701817 2111483
44181 2111483 2174521 980107 -309281 -738860 -186188 619403 520501 -812693 -2000384
44172 -2000384 -1415231 369730 994070 -409249 -1856220 -1267779 763045 2060741 1632894
44163 1632894 123162 -1622940 -3060707 -3492027 -2434454 -430268 1335664 2148367
44155 2148367 1972883 947811 -598559 -1841860 -1852170 -365604 1969377 3856032 3933611
44146 3933611 1886808 -771642 -1871201 -961320 297399 534008 418424 1272404 2911098
44137 2911098 3934805 3581985 2325686 1039173 366265 517952 992163 902434 159778
44128A59778l65931P47910J238914O93320o5846o24882j315004j849733j392781
44119b774255k79172R7999m26157l80594Q33468J753218J038738o35133j749055
44110b520943j702122o50191J086818K632178K779302J431473j53578j006882
44102A896055j207565q18372L42086J491552J255330j56396r81984p38475r08840
44093A73391j959093k077813k67831J672774K055794J932444K632259K812974
44085F974899P43445k085974k736532j253644k69333o76908p56524L51928J210576
44076A501933P27043j80808m38481m17761p68262j160993j079512p20287l95392
44067b932520M2874O44434R92854P81295J81726m70226q32867n85312P4505L28968
$$ plain form
44128 159778 -206153 541757 1780671 2473991 2408145 1783263 468259 -1381474 -2774255
44119 -2774255 -3053427 -2955428 -3381585 -3762179 -2928711 -1175493 -136755 -771888 -2520943
44110 -2520943 -4223065 -4873256 -3786438 -1154260 1625042 3056515 2902937 1896055
44102 1896055 688490 -129882 212204 1703756 2959086 2802690 1820706 1082231 173391
44093 173391 -1785702 -3863515 -4131346 -2458572 -402778 1529666 4161925 6974899
44085 6974899 7718344 5632370 2895838 1642194 1372861 695953 -60571 291357 1501933
44076 1501933 2228976 2048168 1609687 1191926 423664 -737329 -1816841 -2537128 -2932520
44067 -2932520 -2889646 -2245212 -1252358 -471063 -289337 -759563 -1592430 -2177742 -2103237 -1774269
44057a774269j27002m07904J99205R09340O67216n4103j64983L9757m09559r93563
44047b115865l58414J068465J364361J87025o62088k19126K83363j82288p42850
44038a377417m11888K32131L87792M77509R42019R91900n377j047110q67254J25026
44028e52669O64572N80783N31769M85816l2477o04233k99642P24334J291516R00998
44018C690767K41211j04146m13808r48230j175596n22668M79577M93007r71115
44009G68999k562065k364458k87677J570930J557314O53493Q34587J845716J513622
44000C530461o23405k150777j214242P35996J172998N8681o85757l62916q9610
43991C71429n06916q56468n55607q9064J04085L36234P68301R01097N12840J58823
$$ plain form
44057 -1774269 -1901271 -2309175 -2109970 -1200630 -533414 -587517 -752500 -712743 -1122302 -2115865
44047 -2115865 -2474279 -1405814 -41453 145572 -516516 -735642 -452279 -634567 -1377417
44038 -1377417 -1789305 -1557174 -1169382 -691873 250146 1242046 1236669 189559 -677695 -552669
44028 -552669 111903 692686 1224455 1710271 1677794 1073561 773919 1498253 2789769 3690767
44018 3690767 3931978 3827832 3414024 2465794 1290198 767530 1247107 1740114 768999
44009 768999 -1793066 -4157524 -4445201 -2874271 -1316957 -663464 171123 2016839 3530461
44000 3530461 2907056 756279 -457963 278033 1451031 1509712 823955 461039 371429
43991 371429 -135487 -991955 -1547562 -1636626 -1532541 -1196307 -428006 473091 985931 1144754
43981A144754J65541K734o53850j021990k99016Q51004R70503j11017r23419m36800
43971c11556M10652R7882j088279j280959J92862J562411J042235m45187m49576
43962b69515J427180K810492J792781n75407j873545j290545K1973Q21246Q77905
43953C742565N54922K21880L9713j50844n33538p43306k06781P21158R16074K16555
43943D778398j96880J34987k8212j310124j962744l77160J828358J714369n51336
43934D029656j872653q58175M95818L77156l07088k43572j32167r26553j538493
43925i76071n23042J159038J340959j7018q36974r7716R26404Q30489q9532o48213
43915A068324l04167N66470J181353R04530j06756q07399m52293K89956K13534
$$ plain form
43981 1144754 1310295 1313029 659179 -362811 -661827 189177 1159680 1048663 125244 -311556
43971 -311556 99096 196978 -891301 -2172260 -1979398 -416987 625248 180061 -269515
43962 -269515 1157665 3968157 5760938 5185531 3311986 2021441 2043414 2864660 3742565
43953 3742565 4297487 4519367 4559080 4408236 3874698 3131392 2924611 3645769 4561843 4778398
43943 4778398 4581518 4716505 4688293 3378169 1415425 1038265 2866623 4580992 4029656
43934 4029656 2157003 1298828 1794646 2171802 1864714 1621142 1488975 562422 -976071
43925 -976071 -1499113 -340075 1000884 983866 146892 49176 975580 1806069 1716537 1068324
43915 1068324 764157 1330627 2511980 3416510 3309754 2502355 2050062 2340018 2553552
43906B553552o26125r97721l38250N93241J064181J239664J312914Q43187l52290
43897E292353j451567j568074r36767m58449m39059m74870l46877l01812m19176
43888a104298k95367L71827J179070J338169O38960j43170r6380N99462P55109
43879C243382k48051j434413j375264p1914J039315R23982O0359m25367r2819
43870A619210N85220Q35791K31071q51407j334490n24457Q41200J242550K12327
43861B857015j118094j478880p81910K23550Q41378O57986l12050j259582j115147
43852a485734N2803R06279N94605j85783m70681m20185o02362p85768m94415l5341
43842b926582J25473L36022R44902J223285M80101l70873J2246J077051J067348
$$ plain form
43906 2553552 1927427 929706 591456 1184697 2248878 3488542 4801456 5644643 5292353
43897 5292353 3840786 2272712 1335945 877496 438437 -36433 -383310 -685122 -1104298
43888 -1104298 -1399665 -1027838 151232 1489401 2128361 1985191 1888811 2488273 3243382
43879 3243382 2995331 1560918 185654 113740 1153055 2077037 2137396 1712029 1619210
43870 1619210 2204430 3040221 3271292 2419885 1085395 560938 1402138 2644688 2857015
43861 2857015 1738921 260041 -521869 -298319 543059 1201045 888995 -370587 -1485734
43852 -1485734 -1432931 -526652 67953 -117830 -588511 -1008696 -1611058 -2396826 -2891241 -2926582
43842 -2926582 -2801109 -2465087 -1520185 -296900 183201 -187672 -175426 901625 1968973
43833A968973q4738n38655M73310J368925O56269r68031j887248j635320p84695
43824a431210J26056O63716M51116j59279k18161M10961P48964L34016m3373J15317
43814I98123R1686n74156j081543q69812o67360q34107k53200J510183K511196
43805H31010R96643j551360k305426j121742j59335j54824R5023P70848N84137
43796b015026l48033j50574J410373J970671L43113j301332p94840O75426P31291
43787E21069l57418m21220R77996J996512J320898k97370j343634j120467q8059
43778A188307N19860k26045j581739j613547J20544J472399N50873j432619j861825
43769b863792m08123R47498J058468O17835J42602p91063j877094j706232N6211
$$ plain form
43833 1968973 1884235 1345580 1818890 3187815 3844084 2876053 988805 -646515 -1431210
43824 -1431210 -1305154 -641438 -190322 -349601 -567762 -156801 592163 926179 882806 998123
43814 998123 1089809 515653 -565890 -1435702 -2103062 -2937169 -3190369 -1680186 831010
43805 831010 1827653 276293 -2029133 -3150875 -3310210 -3465034 -3370011 -2599163 -2015026
43796 -2015026 -2363059 -2513633 -1103260 867411 1210524 -90808 -885648 -210222 521069
43787 521069 163651 -257569 720427 2716939 4037837 3740467 2396833 1276366 1188307
43778 1188307 1708167 1482122 -99617 -1713164 -1592620 -120221 430652 -1001967 -2863792
43769 -2863792 -3271915 -2324417 -1265949 -648114 -505512 -1296575 -3173669 -4879901 -4823690
43760d823690J713613J732495O45521j50027l57447m99601n51134l376J090717
43751a202929J983420J992517J008000m22152j276210q57247L16072R59011N66422
43742C066904j25718l69663k51821m4727L07903N92453K10787o89244r51083j10368
43732A635423N81078r5612j345652j437131k50987O83657N46759J68354L83030
43723H68919P60155N82050J11558Q6425N24453P97180N99390J82302k32777o38816
43713C640839q29690m44415L18987O09480O1572m25612J26997J036357N80815
43704D675330j353973k585088j500821N59768J231697N19794L28829J044483R62248
43695C882267n29179j581443p75966O39626Q46340R5619l76769n78513j032700
$$ plain form
43760 -4823690 -3110077 -1377582 -732061 -882088 -1239535 -1739136 -2290270 -2293646 -1202929
43751 -1202929 780491 2773008 3781008 3358856 2082646 1225399 1541471 2500482 3066904
43742 3066904 2941186 2571523 2319702 2274975 2582878 3175331 3386118 2696874 1745791 1635423
43732 1635423 2216501 2120889 775237 -661894 -912881 -229224 317535 485889 868919
43723 868919 1629074 2211124 2322682 2409107 2933560 3730740 4330130 4512432 4279655 3640839
43713 3640839 2811149 2366734 2685721 3295201 3356773 2931161 3058158 4094515 4675330
43704 4675330 3321357 736269 -764552 -204784 1026913 1546707 1875536 2920019 3882267
43695 3882267 3353088 1771645 995679 1635305 2481645 2577264 2200495 1621982 589282
43686E89282j116507k37787L82350n62776j761124r17782J327147J956927J65481
43677a74789j489643j157506j30270o4473l48412R3203N21575p7287p61038j8356
43667c606996J645109K360198J418697l24169j766867j961755k58327K396850
43659i7260L356100J277234j625719k220624n41411Q37261P80277M77498O25415
43650B868771L63366o19156j274792j160428j160119j542051j256745j0386Q47438
43641b944102M99753m3041R4550J50372n29704r35037j51764P94043O23840Q6481
43631b354609N81199J464320R24675q99689j833485p56130J034793J846375J475098
43622A482547O86967P4397j02562J29295K98796k2052m91253m71739j26503j53159
$$ plain form
43686 589282 -527225 -765012 -382662 -945438 -2706562 -3624344 -2297197 -340270 -174789
43677 -174789 -1664432 -2821938 -2952208 -3016681 -3365093 -3271890 -2750315 -2827602 -3588640 -3606996
43667 -3606996 -1961887 398311 1817008 1492839 -274028 -2235783 -2494110 -97260
43659 -97260 3258840 4536074 2910355 689731 148320 985581 1765858 2243356 2868771
43650 2868771 3232137 2612981 1338189 177761 -982358 -2524409 -3781154 -3791540 -2944102
43641 -2944102 -2444349 -2487390 -2392840 -2242468 -2772172 -3707209 -3858973 -3064930 -2441090 -2354609
43631 -2354609 -1773410 -309090 615585 -284104 -2117589 -2873719 -1838926 7449 1482547
43622 1482547 2169514 2243911 2141349 2270644 2569440 2547388 2056135 1584396 1457893 1304734
43612A304734n29986n54953j48461m3979n10726q78103n94141O1055N01205L78054
43602a015301l34863j011059m43822J581979L121014K099365n28483j616380k13771
43593A638679J061374K2522j909053k223146j121012m61316k30626J093473L090591
43584I61486L265109R28529j303725j107935L82925N77894p64226j565490o60737
43575G13830P69459J099578K65005o08655p66443m36024k17581l16592m22784
43566G9793k52768q0764m27267j101760j034364M01385K175408K479262Q95540
43557C134465j037408j721259j257803p76854o46507k78839N27058J096752R34673
43548b5722M08092J3213k76990m40290M7704J306970K265673J768753K06308r49797
$$ plain form
43612 1304734 774748 219795 71334 27355 -483371 -1361474 -1955615 -1894560 -1393355 -1015301
43602 -1015301 -1350164 -2361223 -2805045 -1223066 1897948 3997313 3468830 1852450 1638679
43593 1638679 2700053 2722575 813522 -1409624 -2530636 -2991952 -3222578 -2129105 961486
43584 961486 4226595 5155124 3851399 2743464 3126389 3704283 2940057 1374567 713830
43575 713830 1483289 2582867 2847872 2239217 1472774 1036750 819169 502577 79793
43566 79793 -172975 -253739 -681006 -1782766 -2817130 -2415745 -240337 2238925 3134465
43557 3134465 2097057 375798 -882005 -1658859 -2305366 -2584205 -2057147 -960395 -25722
43548 -25722 382370 395583 118593 -321697 -273993 1032977 3298650 5067403 5273711 4323914
43538D323914j112489j014016j110855p81432L58816J398444J271473L00083l21006
43529C312932j56685K82370P01077J289361J787651J398834J23851p14655j14360
43520G910376R98428Q45875o81919j768972j262300l38095o64542j803966j883568
43511A351317n07486O67914N16814k7365K46439R81760J250232J092623P73905
43502F346153k57340k035531k837303j320991R38483J392990L85451L39475J375512
43493D326899J033365j134034k235035p55577P54251n8042j407202o18136J185548
43484A092037J153380l33627o20194M11007M88277n48912m96739P73737P37339
43475B656305j044624j609574M02405K177034J373714o7340L74464J253558j01776
$$ plain form
43538 4323914 3211425 2197409 1086554 305122 663938 2062382 3333855 3633938 3312932
43529 3312932 3156247 3438617 4139694 5429055 7216706 8615540 8739391 8024736 7910376
43520 7910376 8908804 9754679 9072760 7303788 6041488 5703393 5038851 3234885 1351317
43511 1351317 843831 1511745 2028559 2001194 2247633 3229393 4479625 5572248 6346153
43502 6346153 6088813 4053282 1215979 -105012 833471 2226461 2611912 2951387 4326899
43493 4326899 5360264 4226230 1991195 1235618 1989869 1931827 524625 -93511 1092037
43484 1092037 2245417 1911790 1291596 1702603 2190880 1641968 1145229 1918966 2656305
43475 2656305 1611681 2107 404512 2581546 3955260 3887920 4262384 5515942 5414166
43466E414166k436721k244470M01988J757631J87310j644022j196974M79618J166621
43457A885147Q78267R58854J401512J050332k62643j402169j555501j071999o85237
43448A196563o00856m40124K09452J172287J636961J038029r8854p22534o12189
43439B778735m60681n90609n18874o4826J34966j91396k17257O37397J422710
43430B930165R35526j80135o5069J549265K612248J468273q57297k119453j821248
43421D452275j372164j556886j421077j84522J076631Q17490o28229j451868r46945
43412a215295k99352m93878p59293J2768J255792J426629L50826m83682j41097
43403c46582N06255L79732K1000O55042J922123K003258K60457j580059j719927
$$ plain form
43466 5414166 2977445 732975 1134963 2892594 3079904 1435882 238908 718526 1885147
43457 1885147 2763414 3722268 5123780 6174112 5911469 4509300 2953799 1881800 1196563
43448 1196563 595707 155583 365035 1537322 3174283 4212312 4113458 3390924 2778735
43439 2778735 2318054 1727445 1208571 1143745 1278711 1087315 870058 1507455 2930165
43430 2930165 3865691 3685556 3620487 5169752 7782000 9250273 8392976 6273523 4452275
43421 4452275 3080111 1523225 102148 -82374 994257 1811747 1183518 -268350 -1215295
43412 -1215295 -1514647 -2008525 -2767818 -2755050 -1499258 -72629 278197 -205485 -346582
43403 -346582 159673 539405 560405 1215447 3137570 5140828 5401285 3821226 2101299
43394B101299p31834m33887j012624j017384j21661J68484p45565j139096K44614
43385b687654J729771J187777k79019J12892K135265K573218L55425j554236p84237
43376B789202Q23757M51346j163206j315880N9900O31094j27170k75035Q21349
43367B695357J212606j12815j174992j94506J258368N21656j982495l167752j544869
43358b489442R71166J805579P08143o55736r91497l67813N06090J096345J196295
43349A779130Q87628N01995K69228o5047q52792j652456j368426J86483J463335
43340A149078Q86685q87739j641824n65800Q34904J190683J028369J147387Q47146
43331C988889n97508j900220j274934O52377J610831J109337Q02942J292471J047309
$$ plain form
43394 2101299 1369465 935578 -77046 -1094430 -1216091 -1047607 -1793172 -2932268 -2687654
43385 -2687654 -957883 229894 -49125 63767 2199032 4772250 5127675 3573439 2789202
43376 2789202 3612959 4064305 2901099 1585219 1645119 2276213 2149043 1874008 2695357
43367 2695357 3907963 3795148 2620156 2425650 3684018 4205674 2223179 -944573 -2489442
43358 -2489442 -1518276 287303 995446 339710 -651787 -1019600 -513510 582835 1779130
43349 1779130 2666758 3168753 3437981 3372934 2520142 867686 -500740 -314257 1149078
43340 1149078 2035763 1148024 -493800 -1059600 -224696 965987 1994356 3141743 3988889
43331 3988889 3391381 1491161 216227 868604 2479435 3588772 4391714 5684185 6731494
43322F731494o15617j785468p43966J217421J625139L53607o07115l37608j2332
43313E825555o58243j492859j149678L08176J326387O61831j107906k107765j310338
43304B95160K04725P03682J45467m4443N07238M28230r07394j788175m78125J940458
43294A006823K760919J248378o21599j024138l58255m270k01220l9806Q90451
43285C657283J664924J121855m09185j079196K05104J916971J544468q56537k360008
43276E405679j153594Q72666R93948l45343n70123P83929J434245P7015j634761
43267E863661j678948l77285O39793Q38203Q50815R69876Q40682L85100R3393
43258H425290L29377P83821P20127k24780j401980j636097p26618L1605m56124
$$ plain form
43322 6731494 6115877 4330409 3586443 4803864 6429003 6782610 6175495 5837887 5825555
43313 5825555 5167312 3674453 2524775 2832951 4159338 4821169 3713263 1605498 295160
43304 295160 499885 1203567 1349034 1304591 1811829 2240059 1332665 -455510 -933635 1006823
43294 1006823 3767742 5016120 4394521 3370383 3012128 3007858 2806638 2766832 3657283
43285 3657283 5322207 6444062 6034877 4955681 5160785 7077756 8622224 7765687 5405679
43276 5405679 4252085 5124751 6118699 5773356 5203233 5987162 7421407 7498422 5863661
43267 5863661 4184713 3807428 4447221 5285424 6136239 7106115 7946797 8331897 8425290
43258 8425290 8754667 9538488 10258615 10033835 8631855 6995758 6269140 6300745 5844621
43249E844621j426201j394730m79325q8169m88605m67871L76829R01294N67603
43240C345446M46622J086174J194632j41795j507785j173907J45330M67363l74094
43231C487986q25043l00391K34215K46827L14755O42362N83703o615l96137l23779
43221C657883m05058q18007q77787l52664O2628Q6282L92661J191518J508723
43212D446179O98503m20016q21923o90206o59974o10682k42808K5202j32751p6477
43202A515047O06464Q60806l23937j811734j613725j2183O88720k76614j003097
43193a370253q7807J178932J143728M84524O92721J228305N02926j017364j198489
43184A557223L00762J387003Q72047J45293M77333Q13768r4162j121398m98610
$$ plain form
43249 5844621 4418420 3023690 2544365 2456196 1967591 1499720 1876549 2777843 3345446
43240 3345446 3792068 4878242 6072874 5931079 4423294 3249387 3394717 3862080 3487986
43231 3487986 2662943 2362552 2596767 2843594 3158349 3800711 4384414 4377799 3981662 3657883
43221 3657883 3252825 2434818 1557031 1204367 1266995 1353277 1745938 2937456 4446179
43212 4446179 5144682 4724666 3902743 3212537 2552563 1941881 1699073 1724275 1591524 1515047
43202 1515047 2121511 2982317 2658380 846646 -767079 -779262 -90542 -367156 -1370253
43193 -1370253 -1458060 -279128 864600 1349124 2041845 3270150 3773076 2755712 1557223
43184 1557223 1857985 3244988 4117035 4262328 4739661 5553429 5459267 4337869 3839259
43175C839259J011847J055528o65164k019598j738522q29365l04525L04783J272076
43166A926319J490414L16662r14917p38898K18553M14260j11415q1661P05135
43157C224452J083010M23338n53718r27113m90725L97060R61739L18874j320326
43148C116591k167105q76494J311754J987418Q88293o840K75646M95392j77860
43139D846795n22305M45913J355464M77502j348698j797239n11363M65933k56148
43130C155854j597463j724445m02067J056117J505534R60006J14067n42016q97887
43121A627700p54215J96894J514359J762493J96660j558849j027115J605315L141751
43112F704993J482743j444739k334886q71131M51540J68047o34933o15619o609
$$ plain form
43175 3839259 4851106 5906634 5241470 3221872 1483350 653985 349460 654243 1926319
43166 1926319 3416733 3733395 2818478 2079580 2298133 2712393 2600978 2519317 3224452
43157 3224452 4307462 4730800 4177082 3249969 2759244 3156304 4118043 4436917 3116591
43148 3116591 949486 72992 1384746 3372164 4260457 4253617 4529263 5024655 4846795
43139 4846795 4324490 4770403 6125867 6603369 5254671 3457432 2946069 3412002 3155854
43130 3155854 1558391 -166054 -568121 487996 1993530 2953536 3067603 2525587 1627700
43121 1627700 873485 1070379 2584738 4347231 4543891 2985042 1957927 3563242 6704993
43112 6704993 8187736 6742997 4408111 3536980 3988520 4156567 3521634 2906015 2899406
43103B899406L76580M19941L12177Q703k76699q241O81411Q45306J45919m62893
43093D941610j87375K65491k73052j540007k029756j066669K14896M21409j04873
43084F41674K95135K056787L265973K062191m67785j462222l48369L78365p46696
43075E675053j621694l6304K351561K315193O9014j309892r26639r22735k013984
43066C579573j922345M69343K743290K598905J050139q1071j155701k707332k953807
43057A620994m75327K432817K466751K17242r59814j87566K71403o56060j337967
43048C392473o73037K60195N69352Q38383J163674M87100r90397j164935P63446
43039D646254K558195K064010K86267m16043K26747O84187L97799L22906J025596
$$ plain form
43103 2899406 3275986 3695927 4008104 4016807 3740108 3731867 4413278 5258584 5404503 4941610
43093 4941610 4754235 5019726 4746674 3206667 1176911 110242 325138 746547 641674
43084 641674 936809 2993596 6259569 8321760 7853975 6391753 6043384 6421749 5675053
43075 5675053 4053359 4017055 6368616 8683809 8752823 7442931 6516292 5593557 3579573
43066 3579573 1657228 2126571 4869861 7468766 8518905 8437834 7282133 4574801 1620994
43057 1620994 1145667 3578484 6045235 6262477 5302663 5115097 5386500 4730440 3392473
43048 3392473 2719436 2979631 3548983 4387366 5551040 6038140 5047743 3882808 4646254
43039 4646254 7204449 9268459 9554726 9138683 9365430 10049617 10447416 10770322 11795918
43030A1795918J803448J810677J122591N58061Q49245J869820K616111K420971
43022B4846842K111236L104930N382779P540732R027829J0923831J4052625J7865164
43014I4855968K1980515K7209708L3571458L8236019L6994713K7732794J2031305
43007B92612480n866081k1056444l0068786l2377255k9959639k5222388j9831064
43000A28230823j5187338j2359929j0976183r617315p926898o865834o411521
42993E8885805n067496k688296j568545l037750m948901m634792k697888j565392
42985C2676745j703705j792584j546985j686297j806427q77350N90960J262933
42977B5117290J362617J973560K550374J732511J45855l98518j24218p09379j743987
$$ plain form
43030 11795918 13599366 15410043 16532634 17090695 17939940 19809760 22425871 24846842
43022 24846842 26958078 30063008 35445787 42986519 52014348 62938179 76990804 94855968
43014 94855968 116836483 144046191 177617649 215853668 252848381 280581175 292612480
43007 292612480 286746399 265689955 235621169 203243914 173284275 148061887 128230823
43000 128230823 113043485 100683556 89707373 80090058 72163160 65297326 58885805
42993 58885805 53818309 51130013 49561468 46523718 41574817 36940025 34242137 32676745
42985 32676745 30973040 29180456 27633471 25947174 24140747 23263397 23854357 25117290
42977 25117290 26479907 28453467 31003841 32736352 32882207 32483689 32359471 31650092 29906105
42968B9906105j112608R77914J924813J216114J291431K954707L779629K663594
42960D3601699K128168L823735N350110M423034K949489L500903M485632K836385
42952G3099155m92590k001971j456517j910515m259221n858557n038810l440763
42944D8640211k918583l038942k772161k310132k106484j947751j764480j757320
42936C0024358j349172J94600J884574J828687K59785n28526K41211P97417J43297
42927C3496231k46990O73262J542833J247530J095536K147973K614535O51760
42919D3222670j978863k156028j69938J015783O73626J005336K775404L732711
42911D8120701K440107O42035J66383j0872j521478l396845l558042k294309j759229
$$ plain form
42968 29906105 28793497 29771411 31696224 32912338 34203769 37158476 40938105 43601699
42960 43601699 45729867 49553602 54903712 59326746 62276235 65777138 70262770 73099155
42952 73099155 72606565 70604594 69148077 67237562 62978341 57119784 52080974 48640211
42944 48640211 45721628 42682686 39910525 37600393 35493909 33546158 31781678 30024358
42936 30024358 28675186 28869786 30754360 32583047 32842832 32314306 32555517 33352934 33496231
42927 33496231 33249241 33922503 35465336 36712866 37808402 39956375 42570910 43222670
42919 43222670 41243807 39087779 38917841 39933624 40607250 41612586 44387990 48120701
42911 48120701 50560808 51202843 51369226 51358354 49836876 46440031 42881989 40587680 38828451
42902C8828451k546645l087005k381956j256220o25133l61179l59211j034607
42894B7176495k044548k032578o11092O49473K86727j034868j719230j544896
42886A9125483j450272j690278j698565j482614j672860k130418j826059m16242
42878F758175J098967J650538J219970M23093k52122n37168m37388m46869j056967
42869H420229j877789j926312r32384L40421J163302J447902J226144M74771l42271
42860G994013n13978j19646J16987J69496P11514J488082J146248n84705j940132
42851H467879j424097P0049O75731J87948p3358N30215J202884J001600n0559
42842A0588292j044911q98281O38313K368625K725851J702953O97063K10974p11050
$$ plain form
42902 38828451 36281806 33194801 30812845 29556625 28931492 28570313 28211102 27176495
42894 27176495 25131947 23099369 22488277 23137750 23424477 22389609 20670379 19125483
42886 19125483 17675211 15984933 14286368 12803754 11130894 9000476 7174417 6758175
42878 6758175 7857142 9507680 10727650 11150743 10898621 10361453 9924065 9477196 8420229
42869 8420229 6542440 4616128 3683744 4024165 5187467 6635369 7861513 8336284 7994013
42860 7994013 7480035 7360389 7477376 7646872 8358386 9846468 10992716 10408011 8467879
42851 8467879 7043782 7113831 7789562 7977510 7904152 8434367 9637251 10638851 10588292
42842 10588292 9543381 8645100 9283413 11652038 14377889 16080842 16777905 16988879 16277829
42833A6277829k159177k472020r69679L83159j31195j217859r09261J8030k73074
42824H546753r56890J53729K282567K277290l65247k515701k149077q87995p09142
42815E676287j015179n23422L23920N22366K59860J04001J0196J51479R98999
42806F508507J752761Q02823j300867j805942J3480J297897J16492j286670l81655
42797E716826J117176J19195k279734k206390O74209K329042L45193k701054l096978
42788A7485o42586K010482K847095J861121J06232j302108j683360j081827n7690
42779B074844P75361Q54320p2547j209879j065541N31244J669663Q40923p96822
42770C601566j209762n38920l06358m07554M94115J861324J493319o95854j917199
$$ plain form
42833 16277829 14118652 11646632 10676953 11060112 10928917 9711058 8801797 8819827 8546753
42824 8546753 7589863 7743592 10026159 12303449 11938202 9422501 7273424 6385429 5676287
42815 5676287 4661108 4137686 4461606 4983972 5243832 5347833 5358029 5509508 6508507
42806 6508507 8261268 9064091 7763224 5957282 5970762 7268659 7385151 6098481 5716826
42797 5716826 6834002 6953197 4673463 2467073 3141282 5470324 5815517 3114463 17485
42788 17485 -625101 1385381 4232476 6093597 6199829 4897721 3214361 2132534 2074844
42779 2074844 2850205 3704525 3631978 2422099 1356558 1887802 3557465 4398388 3601566
42770 3601566 2391804 1852884 1546526 1138972 1633087 3494411 4987730 4291876 2374677
42761B374677n95451J261806J238013j20899r12146j026672j482932j823072o07409
42752a694085J832482L241804K289984O4685j594122k018462j562850o42736L12350
42743B29050N97897j54591j175843j111818K94850J568758J148948n49792j535628
42734f88169p86925N57244J000952O68750N88903Q51922P40301K25503N374J98936
42724C362791K24699k8582l5292K93891L98316L8899l95657n89407n35939k26315
42714B507404J26323o8277q06968r86380m9238O59664j72306j314482o12158J337435
42704F21017J745192m6540j556059j092939J0353J61611m7810L82866Q92879P97007
42694A867577P19941R64538L92654j293662k099194o43049J237937J113565l21700
$$ plain form
42761 2374677 1779226 3041032 4279045 4158146 3246000 2219328 736396 -1086676 -1694085
42752 -1694085 138397 3380201 5670185 5734870 4140748 2122286 559436 -83300 229050
42743 229050 826947 672356 -503487 -1615305 -1320455 248303 1397251 847459 -688169
42734 -688169 -1475094 -917850 83102 751852 1340755 2192677 2932978 3158481 3163855 3362791
42724 3362791 3587490 3558908 3523616 3817507 4215823 4254722 3859065 3269658 2733719 2507404
42714 2507404 2633727 2565450 1758482 772102 722864 1382528 1210222 -104260 -716418 621017
42704 621017 2366209 2319669 763610 -329329 -318976 -157365 -205175 177691 1070570 1867577
42694 1867577 2587518 3552056 3944710 2651048 551854 -91195 1146742 2260307 1938607
42685A938607o72014K40661N95308o1546l84968J24505M99568L04346J30389P3965
42675B788821l82421r63922q14955o4747L94647M51026N23067K49050p86448j560910
42665a66792q85557L40880M04046k12938K52763J240934L84938k061490k770787
42656c474003m85656J647568Q18357j169255r03351J412293K648467J539810m6854
42647A987376l68626P8283Q8175l42878l75368K88770R81563Q10538l01381j342503
42637A503949j258868k03468P99254J264428J393965R40823o34654k520074k653859
42628a368504m07854K109974K559640J144495k86296r25310j314492j580531j040611
42619a109489L39867J382550J078308j11643p55533n1783J271560J741708Q56681
$$ plain form
42685 1938607 1266593 1507254 2102562 2041016 1656048 1780553 2280121 2584467 2714856 2788821
42675 2788821 2406400 1442478 627523 562776 957423 1408449 1931516 2180566 1394118 -166792
42665 -166792 -1052349 -711469 -307423 -520361 -267598 973336 1358274 -703216 -3474003
42656 -3474003 -3959659 -2312091 -1493734 -2662989 -3566340 -2154047 494420 2034230 1987376
42647 1987376 1618750 1697033 1785208 1442330 1066962 1355732 2337295 3147833 2846452 1503949
42637 1503949 245081 41613 840867 2105295 3499260 4440083 3805429 1285355 -1368504
42628 -1368504 -1776358 333616 2893256 4037751 3751455 2826145 1511653 -68878 -1109489
42619 -1109489 -769622 612928 1691236 1579593 824060 772277 2043837 3785545 4642226
42610D642226l13159n84729k02161j14473k52822J13045N42457k47837j878551
42601A703996k026688L57979L102874L384284J140295j372860k532462k499185
42593A258233j994423j258489k01915J086601J962988J434643n06223j931359
42585a49944q41332J786913K663955O07401j701889j566481J53379J012763O57119
42576B621884L28020J76173m30606q89238j77015Q97011O70957m99809p03913
42567A993464L54676R46231J56644r85095j424431j199477m71067O89617J369695
42558A430257N45014j013054j358932j37397J024162J040075M47515j55747p53573
42549A068320q00802L61198J640999J073116q89035j425142M23714K104899J432015
$$ plain form
42610 4642226 4329067 3744338 3542177 3427704 3174882 3287927 3830384 3582547 1703996
42601 1703996 -322692 35287 3138161 6522445 7662740 6289880 3757418 1258233
42593 1258233 -736190 -1994679 -2196594 -1109993 852995 2287638 1781415 -149944
42585 -149944 -991276 795637 3459592 4066993 2365104 798623 952002 1964765 2621884
42576 2621884 2949904 3126077 2695471 1806233 1629218 2526229 3197186 2697377 1993464
42567 1993464 2348140 3294371 3451015 2465920 1041489 -157988 -629055 60562 1430257
42558 1430257 1975271 962217 -396715 -534112 490050 1530125 1977640 1821893 1068320
42549 1068320 267518 628716 2269715 3342831 2453796 1028654 1452368 3557267 4989282
42540D989282l17084r01381n26378o28653r99817n08664M33127M36248m40466
42531A536214q19134k27418M61192N87228L27597m4909l86805l94791p205K43266
42521A275235K8299j50741J61021N73327O65557P54656J012296P41999m74771
42512D586878j765903k082777j502060n85193M85795J241939P78616n19711o16598
42503B0986J227951K664163J430469j035610j618123j35138Q56163L16886k17527
42494C510220R1142M0378r52828j471824n42806O65588Q69905O37870R77781J423824
42484E249250R63684j81398j025537j291569j279432r18588m3117Q13963Q59993
42475C147249J08328o19452o25000O7796Q24217R55795M68472K08668P82153J522255
$$ plain form
42540 4989282 4672198 3770817 3244439 2615786 1615969 1107305 1540432 1976680 1536214
42531 1536214 717080 489662 950854 1538082 1865679 1820770 1433965 1039174 1031969 1275235
42521 1275235 1303534 1152793 1313814 1887141 2552698 3307354 4319650 5061649 4586878
42512 4586878 2820975 738198 -763862 -1349055 -863260 378679 1157295 637584 20986
42503 20986 1248937 3913100 5343569 4307959 2689836 2554698 3410861 3727747 3510220
42494 3510220 3601362 3641740 2688912 1217088 674282 1339870 2209775 2847645 3825426 5249250
42484 5249250 6212934 6031536 5005999 3714430 2434998 1516410 1473293 2287256 3147249
42475 3147249 3255577 2636125 2011125 2078921 2903138 3858933 4327405 4536073 5318226 6840481
42465F840481J323638L56128j23283K58080M26851l28181j161107j009279k36462
42456F346866n5510p92627j490015j106691K82093J450145J188741l21863j585301
42447C915838j571964q78156m72133r8695Q48837J583898Q22114q53455j480331
42438A815953o59226K5271j28704J18899J321320J882257O00361j190105j638809
42429B147217r96244n41176l11503K33252M96921k49358j031872m29260R59506
42420B77483J365904P05499M40550Q37629O22963m84885j111434o09665q3330
42411A960714k63904k49540N69632J011868l7959j528595j624062m18964L54112
42402b26698j3070m22852K3564O42546L83140n30362r64579l97240O45006J400315
$$ plain form
42465 6840481 8164119 8520247 8396964 8655044 9081895 8753714 7592607 6583328 6346866
42456 6346866 6291356 5498729 4008714 2902023 3184116 4634261 5823002 5501139 3915838
42447 3915838 2343874 1465718 993585 894890 1743727 3327625 4149739 3296284 1815953
42438 1815953 1156727 1181998 1053294 1172193 2493513 4375770 4976131 3786026 2147217
42429 2147217 1150973 609797 298294 531546 1028467 779109 -252763 -682023 277483
42420 277483 1643387 2348886 2789436 3627065 4250028 3765143 2653709 2044044 1960714
42411 1960714 1696810 1447270 2016902 3028770 2990811 1462216 -161846 -580810 -226698
42402 -226698 -239768 -662620 -639056 3490 386630 -143732 -1108311 -1505551 -860545 539770
42392E39770J443932O17449p98073j764658j249424K99200J116063M13807l94488
42383B23578K10174J418169J319013k813o49413j75097k97072j587257j881309
42374a422027K99636K665507J911214j449723l532339k191533N67711J701568
42366a449986Q03517k03597J24902J258664J639427N64827r64682j395420n19936
42357a42284M53595Q38364J265209J931538J579832l96051k154915j651659K18903
42348A942532Q77685j07480p98055k92575J36650l89828j022638j048214r44420
42339a646343q15913J50632J740327K228028R83112k89008j40597N53218M52466
42330C215922r7617l16362o56427j395490j171435Q74758K771770K016863n75729
$$ plain form
42392 539770 1983702 2601151 1803078 38420 -1211004 -911804 204259 618066 223578
42383 223578 433752 1851921 3170934 3168121 2518708 2343611 2046539 459282 -1422027
42374 -1422027 -1122391 1543116 3454330 2004607 -1527732 -3719265 -3151554 -1449986
42366 -1449986 -646469 -850066 -725164 533500 2172927 2737754 1773072 377652 -142284
42357 -142284 311311 1149675 2414884 4346422 5926254 5530203 3375288 1723629 1942532
42348 1942532 2820217 2712737 1914682 1622107 1758757 1368929 346291 -701923 -1646343
42339 -1646343 -2462256 -2311624 -571297 1656731 2639843 2350835 2210238 2763456 3215922
42330 3215922 3118305 2801943 2145516 750026 -421409 453349 3225119 5241982 4666253
42321D666253j853743q18236L69320Q834q75730n90531P59514J780933J554300
42312E000914K08927j310859j662059k66938J627576K047801P06197p40608j076360
42303D534591q89988j048240j136302m24604N34873N05440n64580j286605n45256
42294c20671J116251K047304J267261m48066j433137j129916p11564j224073j729136
42285b565747m76650K194193L600512J995359j031442k431153j285636N61688
42277E61124J112024L03689o02797p52834k87149K77893O36936P08924M72337
42268B430147j7918n41532p92102o23354k16327N9390M1055N1262O22296J717212
42258B730129K320075J298405j064664k882275k578729o97644Q74871J218569
$$ plain form
42321 4666253 2812510 1994274 2363594 2372428 1496698 906167 1665681 3446614 5000914
42312 5000914 5209841 3898982 2236923 1969985 3597561 5645362 6351559 5610951 4534591
42303 4534591 3644603 2596363 1460061 1035457 1570330 2075770 1511190 224585 -320671
42294 -320671 795580 2842884 4110145 3662079 2228942 1099026 387462 -836611 -2565747
42285 -2565747 -3042397 -848204 2752308 4747667 3716225 1285072 -564 561124
42277 561124 1673148 1976837 1374040 621206 334057 611950 1248886 1957810 2430147
42268 2430147 2412229 1870697 1078595 455241 238914 298304 339359 390621 1012917 2730129
42258 2730129 5050204 6348609 5283945 2401670 -177059 -874703 168 1218737
42250A218737R66499P06557J11445r08883j458834r51584j96567j60431m02365
42241a075426R6924J114292J461704P90785q4514n34443o68535o11654k87233
42232B01900P1624J21928J8159o5360o11530j711581j836300M50321L573393M017866
42222D230420J054953j807496j499742M46246M96667j524675k391160m64133J983257
42213E24337K193207N64098n47041l14273K2958l57443o00841J56752J115831
42204B757585Q18466o83471j736526j217752J40648R32539Q42468N90909O12871
42195C057737N78052P9828p97641j517359j339827P0176J798344K075665L86111
42186D391086j416434j278114K51865Q76697p9502r92181p36531j32669K5673
$$ plain form
42250 1218737 2185236 2891793 3003238 2094355 635521 -316063 -512630 -673061 -1075426
42241 -1075426 -978502 135790 1597494 2388279 2303765 1769322 1100787 489133 201900
42232 201900 273524 395452 413611 348251 -263279 -1974860 -3811160 -3360839 212554 4230420
42222 4230420 5285373 3477877 1978135 2424381 2921048 1396373 -994787 -1458920 524337
42213 524337 2717544 3281642 2734601 2420328 2443286 2085843 1485002 1641754 2757585
42204 2757585 3576051 2892580 1156054 -61698 78950 1011489 1853957 2444866 3057737
42195 3057737 3635789 3715617 2917976 1400617 60790 130966 1929310 4004975 4391086
42186 4391086 2974652 1696538 1948403 2825100 2745598 1753417 1016886 884217 909890
42177I09890L36819J059878R43356n79507j647688m96944J439677J343746o56622
42168B652605j514797K13038K247134J852696n77573k415619k093019k81840J509824
42159A592449K345742K071655J027235k41778j291982j883937j803208q87749
42151I28427N60259J629227J445213J21169j065082p98788P04960J603034N10443
42142E638862j511996j996624j86633K012785K591015J669579M54044o28293j445912
42133F596827j114392O79992K115073J161558j215923k036271o02944N34918l94905
42124E723933j749860j292045K57779N30341p06661j288395n775J681562J783462
42115D934341L37104r60306r89341k50959J85369P6073j2891K15805L67324J35595
$$ plain form
42177 909890 1246709 2306587 3249943 2670436 1022748 525804 1965481 3309227 2652605
42168 2652605 1137808 1350846 3597980 5450676 4873103 2457484 364465 82625 1592449
42159 1592449 3938191 6009846 7037081 6795303 5503321 3619384 1816176 928427
42151 928427 1488686 3117913 4563126 4684295 3619213 2820425 3525385 5128419 5638862
42142 5638862 4126866 2130242 1943609 3956394 6547409 8216988 8671032 8042739 6596827
42133 6596827 5482435 6162427 8277500 9439058 8223135 6186864 5583920 6118838 5723933
42124 5723933 3974073 2682028 2939807 3470148 2763487 1475092 1469317 3150879 4934341
42115 4934341 5271445 4311139 3321798 3070839 3256208 3332281 3319390 3535195 3902519 4038114
42105D038114j26741o3874k772l47291p40081o02204j31817R3784J41680L61823
42095B620621L90895k62698r37343n69783M03516N38669j49257p4837J128538
42086C088321J672283L82820j363550j687959o73765N21568J558551K345523J868185
42077G711977m55199k969915l251881j169476J040043J628467R50860K70683J29626
42068C885185J10936m14745j350280j586876l01952J392051J426026j59265r13559
42059B087521K79873J250523L8006j743445j516616L4904M37740j47783M40183
42050A160906J917300J643080o14746j870146q13672J29850q40205j859222q23116
42041a969971J008177J299021K65436m84342q36205j359393j242742K86264J733297
$$ plain form
42105 4038114 3911373 3847499 3844727 3497436 2757355 2155151 2023334 2117118 2258798 2620621
42095 2620621 3011516 2748818 1811475 1241692 1645208 2183877 2034620 1959783 3088321
42086 3088321 4760604 5143424 3779874 2091915 1418150 1939718 3498269 5843792 7711977
42077 7711977 7256778 4286863 1034982 -134494 905549 2534016 3484876 3755559 3885185
42068 3885185 3996121 3581376 2231096 644220 342268 1734319 3160345 3001080 2087521
42059 2087521 2367394 3617917 3655923 1912478 395862 430766 868506 720723 1160906
42050 1160906 3078206 4721286 4106540 2236394 1422722 1552572 712367 -1146855 -1969971
42041 -1969971 -961794 337227 602663 118321 -717884 -2077277 -3320019 -3033755 -1300458
42032a300458J212611l66447o11621N59602J120544N11902K38021Q13337P96133
42023B973624m93453j565516j055835K88830R55580P30699M52765N77560Q12666
42014C676920O94253N6634p66271j143400q92784n66207n08378j81723P63783
42005A132827J376979N48140j126920j900006j112121K57919J071262R48564M0581
41996A237225r25602p79035N94128J396383J57058j697961j497871P26787K212976
41987A424088J497168J20326k20491Q1403N5291j46247j75979l82472p36468n06665
41977A009954R7015k27656j417786j486232K94571J762434J084835m13370o44453
41968E9312j06908m73619j398357j357178n19600j22350J01014J135041K063680
$$ plain form
42032 -1300458 -87847 -454294 -1065915 -506313 614231 1126133 1364154 2177491 2973624
42023 2973624 2480171 914655 -141180 147650 1103230 1833929 2286694 2864254 3676920
42014 3676920 4371173 4427807 3661536 2518136 1625352 1059145 550767 369044 1132827
42005 1132827 2509806 3057946 1931026 31020 -1081101 -823182 248080 1196644 1237225
41996 1237225 311623 -467412 126716 1523099 1680157 -17804 -1515675 -788888 1424088
41987 1424088 2921256 3041582 2821091 2902494 2957785 2811538 2635559 2253087 1516619 1009954
41977 1009954 1106969 879313 -538473 -2024705 -1730134 32300 1117135 703765 59312
41968 59312 -47596 -521215 -1919572 -3276750 -3796350 -3918700 -3817686 -2682645 -618965
41959f18965J148196q66357j482373m00091K38850k97847l68157N91249Q30015
41950a225480l79605j160075l27994M53589k90136j136361l42874R84144Q54128
41941b570664j61455j95368M52086K9774j213791j259890J56700J068142O31275
41932c063191L67638J305908K155296J424621l91940j820040k133254j166249
41924c321211J025965L184656L088626L54400k203994j803921N58982J551612
41916B435115K15527j001013j80934J280605R97591q15194j733284n64690J127140
41907A760863J170282n35326k054267j752921n5404J244499J112340K41113k24919
41898I06260k93693p08741j290108r11860N81779J656489J099528k00978n88033
$$ plain form
41959 -618965 529231 -337126 -1819499 -2219590 -1980740 -2278587 -2646744 -2055495 -1225480
41950 -1225480 -1605085 -2765160 -3093154 -2639565 -2929701 -4066062 -4408936 -3424792 -2570664
41941 -2570664 -2732119 -2927487 -2475401 -2445627 -3659418 -4919308 -4762608 -3694466 -3063191
41932 -3063191 -2695553 -1389645 765651 2190272 1798332 -21708 -2154962 -3321211
41924 -3321211 -2295246 889410 3978036 4332436 2128442 324521 883503 2435115
41916 2435115 2650642 1649629 1468695 2749300 3746891 2931697 1198413 633723 1760863
41907 1760863 2931145 2395819 341552 -1411369 -1466773 -222274 890066 1131179 906260
41898 906260 612567 -96174 -1386282 -2298142 -1716363 -59874 1039654 838676 250643
41889B50643k4255K02517k86972o02446l88582l16219m57688J21950J419958J785366
41879A704272L40563j275720j111695K29729P07522O7500j24386N66329O79592
41870A783706m78489j375061m90458J367384K176260J257272l21352j269078j087386
41861A562798n7748R45467R89460J01624o30337n27737k78547o64813j030544
41852D09623k36213J199881J381292k85558j977057j719525J40394J619460J641364
41843B173661Q24563k5680r38677j885558j970696n68689J221439J516044J53152
41834D99559r02647j87247J260537J445176J92443q70132p61121j98500j07473
41825C70595l63560m86562n44087p15300p19704l32871J03066K45052L00486N12733
$$ plain form
41889 250643 226388 428905 141933 -460513 -849095 -1165314 -1623002 -1501052 -81094 1704272
41879 1704272 2044835 769115 -342580 -112851 594671 662171 537785 1104114 1783706
41870 1783706 1305217 -69844 -560302 807082 2983342 4240614 3919262 2650184 1562798
41861 1562798 1505050 2450517 3439977 3541601 2911264 2383527 2104980 1440167 409623
41852 409623 173410 1373291 2754583 2469025 491968 -1227557 -1087163 532297 2173661
41843 2173661 2998224 2972544 2033867 148309 -1822387 -2391076 -1169637 346407 499559
41834 499559 -403088 -590335 670202 2115378 2307821 1437689 676568 478068 370595
41825 370595 7035 -479527 -1023614 -1738914 -2458618 -2791489 -2688423 -2443371 -2142885 -1630152
41815a630152O44227M86749L22220L33472J67513k92872l97338K26821P58198
41806F18838L59141k63407K02857J408904J541903M1541j371012j123408R751
41797A425108L09714j90193j3232J005802J075702p89431k835798k744154q95931
41788c652413K29126k97567p25054L31444J626901J415340L29035J87820Q85533
41779C30165P90252q2613J22899J688176K236139K68949k301598k822445j506467
41770a276543m96007m89359l64283M37204J125974J068691N12188j89316q02354
41761d73805p80003J73899J212595J192137K85963l87919n45976q55244j373182
41752a551535j257300j94917J070569J834521K025427J647070O93571l18273p55595
$$ plain form
41815 -1630152 -985925 -499176 -176956 156516 324029 31157 -366181 -139360 618838
41806 618838 977979 714572 917429 2326333 3868236 3909777 2538765 1415357 1425108
41797 1425108 1734822 1544629 1531397 2537199 3612901 2823470 -12328 -2756482 -3652413
41788 -3652413 -3423287 -3720854 -4445908 -4114464 -2487563 -1072223 -743188 -555368 330165
41779 330165 1120417 1037804 1160703 2848879 5085018 5353967 3052369 229924 -1276543
41770 -1276543 -1772550 -2261909 -2626192 -2188988 -1063014 5677 517865 328549 -473805
41761 -473805 -1253808 -1079909 132686 1324823 1610786 1222867 676891 -178353 -1551535
41752 -1551535 -2808835 -3003752 -1933183 -98662 1926765 3573835 4267406 3949133 3193538
41743C193538p83603q65763o23906M71220J530139J076720m85657j087974q1465
41734B343249P49760K0988j161233j087649m0447L51927m81537j448076j168164
41725a921182O48798K732314L018538P89704j915879k332523n17152P97172J75053
41716A474843q29893p44737n15519j181476j444085J12855K008687J768533j05291
41707E43917q26648L23506J006335m47202k531122k640326k50811K690392L722802
41698A590843J975853r50118k274566r45710J095090J400287R2665q09506m83507
41689F91331p514k13431n83479m59036N6650N66048O23494l02653j868842k295127
41679c792559m03078K150865K628099J019074p8993N55077J351497R79152K33031
$$ plain form
41743 3193538 2409935 1544172 920266 1391486 2921625 3998345 3512688 2424714 2343249
41734 2343249 3093009 3113997 1952764 865115 824668 1176595 695058 -753018 -1921182
41725 -1921182 -1272384 1459930 4478468 5268172 3352293 1019770 502618 1299790 1474843
41716 1474843 644950 -99787 -615306 -1796782 -3240867 -3128012 -1119325 649208 543917
41707 543917 -282731 40775 1047110 599908 -1931214 -4571540 -4822351 -2131959 1590843
41698 1590843 3566696 2616578 342012 -603698 491392 1891679 1984344 1174838 691331
41689 691331 683817 470386 -113093 -572129 -515479 50569 674063 371410 -1497432 -3792559
41679 -3792559 -4195637 -2044772 583327 1602401 1523408 2078485 3429982 4409134 4642165
41670D642165o7426o18091j682324j809205k02950J482623J513271N98294K14846
41661D071203K2024r40196j865339j365930m8001M63208K79300O15913J073320
41652B305502K30690j322527j377543K34174J113750Q6534j072932p40390J51590
41643c91152K17085l7670K63441L25075p59415j776205r85041R08245J639914
41634e95723Q18179K25890P06338R34163j60743j558579j631877k21799J531881
41625D7730K446276J828992j54068k011230j938126q1012J273871O39621o92544
41616A359510p65434J23207K79883m19637m75446N19910J179973P05524J14086
41607B621576L39926O64563N4954j103644j650918j177612o3235J196855J947487
$$ plain form
41670 4642165 4574739 3956648 2274324 465119 262169 1744792 3258063 3856357 4071203
41661 4071203 4093227 3153031 1287692 -78238 -126239 336969 616269 1232182 2305502
41652 2305502 2536192 1213665 -163878 70296 1184046 1270580 197648 -542742 -391152
41643 -391152 -174067 -211737 51704 376779 -382636 -2158841 -3143882 -2235637 -595723
41634 -595723 222456 448346 1154684 2088847 1928104 369525 -1262352 -1484151 47730
41625 47730 2494006 4322998 4168930 2157700 219574 138562 1412433 2052054 1359510
41616 1359510 594076 717283 997166 577529 102083 621993 1801966 2507490 2621576
41607 2621576 2961502 3626065 3681019 2577375 926457 -251155 -314390 882465 2829952
41598B829952J533367K89660m95069l27032j87022p10750j033024n38062k61292
41589A100728r81182j377744j49392J307183Q67963n97400m55542J138009J244457
41580B097080r23894k415324j054962J412896K332421J717278R18400J930j296971
41571B788854j855977q22244L86120N2758j028292r93059m4640L05307J88906
41562a022267Q62732J819921J307216l61772q77540K99546R62682k48972j754076
41553I87470j697676o06296L3010J28356L71209N68314J65361l87013j71008P71992
41543A63719J548496J506266N27798j119975k502027k306999l38514J774503K193551
41534A446818Q58796p68805j508732j292681n45195M54503J512648K223119J937015
$$ plain form
41598 2829952 4363319 4652979 4157910 3830878 3643856 2933106 1900082 1362020 1100728
41589 1100728 119546 -1258198 -1407590 -100407 767556 170156 -285386 852623 2097080
41580 2097080 1173186 -1242138 -2297100 -884204 1448217 3165495 4083895 4085825 2788854
41571 2788854 932877 110633 496753 549511 -478781 -1471840 -1516480 -1211173 -1022267
41562 -1022267 -159535 1660386 2967602 2605830 1728290 2027836 2990518 2741546 987470
41553 987470 -710206 -1316502 -1283492 -1155136 -783927 -215613 -50252 -437265 -608273 163719
41543 163719 1712215 3218481 3746279 2626304 124277 -2182722 -2521236 -746733 1446818
41534 1446818 2305614 1536809 28077 -1264604 -1809799 -1355296 157352 2380471 4317486
41525D317486K89757j923723k814812j257861J368059K341278P34569j573172
41517A481581k292733j126687N56068J370533P75873o73823j448494m48175J298644
41508e07213J568288J0753j247221p47588L48204N63871M32988Q22073P39177
41499A983332q71518k507777j955070Q2106R82545L73572L23229J406519J774227
41490A591165P88337M07337J568512K082646J74394k259161k441236j012405p21905
41481A77684j887216k147597n21753J132137J253687P61062R90755J335341M86890
41472A580990j098929j664239p11804L49796L12668k10969R1420J173923J638934
41463A461790P47544n11368q53334m68765m31554p41069k75470J098375J745754
$$ plain form
41525 4317486 4607243 2683520 -131292 -1389153 -21094 2320184 3054753 1481581
41517 1481581 -811152 -1937839 -1381771 -11238 764635 90812 -1357682 -1805857 -507213
41508 -507213 1061075 1071828 -175393 -922981 -574777 -10906 422082 1244155 1983332
41499 1983332 1111814 -1395963 -3351033 -3268927 -2286382 -1912810 -1589581 -183062 1591165
41490 1591165 2379502 2786839 4355351 6437997 6612391 4353230 1911994 899589 177684
41481 177684 -1709532 -3857129 -4378882 -3246745 -1993058 -1231996 -241241 1094100 1580990
41472 1580990 482061 -1182178 -1893982 -1544186 -1231518 -1442487 -1351067 -177144 1461790
41463 1461790 2209334 1697966 844632 375867 -55687 -796756 -1072226 26149 1771903
41454A771903M57223j564747k085593o90273R07696J186391L39060n35051p66075
41445i79466m18438n211j08720p41998j091826n20914L13048K28883o20590p87007
41435d732239L11506J461129J500101R80726J027306J427748J119377P7638o44884
41426B528408o86847q80861j679603k185429j393597L12922J628724J896844J549758
41417A090319J147305O24878l10754j398188j799825r66683N79273J555387J157921
41408A679633j37009j174076j339251r05401l62659J03755M64096O65762P50525
41399b54625P74035N40198j09889o62386k66335R51074J608987P55515p17795
41390B618779j173442l96890K89398j6014p37477r30085n22684j0747L68852O09195
$$ plain form
41454 1771903 2229126 664379 -1421214 -2111487 -1203791 -17400 321660 -213391 -979466
41445 -979466 -1397904 -1403115 -1511835 -2253833 -3345659 -3866573 -3553525 -3324642 -3945232 -4732239
41435 -4732239 -4420733 -2959604 -1459503 -478777 548529 1976277 3095654 3173292 2528408
41426 2528408 1841561 960700 -718903 -2904332 -4297929 -3985007 -2356283 -459439 1090319
41417 1090319 2237624 2862502 2551748 1153560 -646265 -1612948 -1033675 521712 1679633
41408 1679633 1542624 368548 -970703 -1876104 -2238763 -2135008 -1670912 -1005150 -254625
41399 -254625 519410 1059608 949719 287333 20998 972072 2581059 3336574 2618779
41390 2618779 1445337 1048447 1337845 1321831 584354 -345731 -868415 -879162 -510310 98885
41380I8885O07645M03856L32730M67495L37329k85382p59606l93857M38297P32371
41370A979763K21221m29021p30630r38711j382602j835016j755680q23295P43573
41361d950398K026987J846241N6221j761914j801216k24688J097446J115738O83211
41352a912372P77160J000616O84781K86496N04462Q88972O31121N5634m3746L3127
41342B906251m49185r01582j65674J089954Q14033j184462k503919j529577L70966
41333a553195J242217J282908J492624J214342o31448k810462k855255o97327
41325c315596J145775J194268N52762L79380J73258l93413j79969J242451J961395
41316B760311M00124j681126j331703J095049K254842P24828j038385n99423R05093
$$ plain form
41380 98885 706530 1110386 1443116 1910611 2247940 1962558 1202952 809095 1247392 1979763
41370 1979763 2200984 1771963 1041333 102622 -1279980 -3114996 -4870676 -5693971 -4950398
41361 -4950398 -2923411 -1077170 -1020949 -2782863 -4584079 -4808767 -3711321 -2595583 -1912372
41352 -1912372 -1135212 -134596 550185 836681 1341143 2230115 2861236 2916870 2873124 2906251
41342 2906251 2457066 1555484 1389810 2479764 3293797 2109335 -394584 -1924161 -1553195
41333 -1553195 -310978 971930 2464554 3678896 3047448 236986 -2618269 -3315596
41325 -3315596 -2169821 -975553 -422791 -43411 129847 -263566 -443535 798916 2760311
41316 2760311 3160435 1479309 147606 1242655 3497497 4222325 3183940 2584517 3489610
41307C489610Q73462o70899j355015k54003Q46097L39535r03068j128165l05499
41298I32055K17015k2943k08273j1723k10195j026199j233237K7822J543088J546237
41288A553647L41162k52916J42508Q786j221017j940459j057906K6277j80575
41279b580493n43132O96586K360124J711728r07794j984749r805K234406J965620
41270B942491L16972j19788N14340K86849q24589j128701m98557n53027j528887
41261e92897j666047k79196R26127N47057m63615n33285L32707J162834J451944
41252H85629J016362j92186j173080l55870J787859K313239k79529l219493k816964
41243b034033M17006K581040J805596J04204l28975J07039K29640K03410L89551
$$ plain form
41307 3489610 4363072 3692173 2337158 2083155 2929252 3268787 2365719 1237554 932055
41298 932055 1149070 1126127 917854 906131 695936 -330263 -1563500 -1535678 7410 1553647
41288 1553647 1894809 1641893 1784401 1793187 572170 -1368289 -2426195 -2399918 -2580493
41279 -2580493 -3123625 -2427039 -66915 1644813 737019 -1247730 -1257535 976871 2942491
41270 2942491 3259463 3139675 3654015 3940864 3116275 1987574 1489017 935990 -592897
41261 -592897 -2258944 -2538140 -1612013 -1064956 -1528571 -2061856 -1729149 -566315 885629
41252 885629 1901991 1709805 536725 180855 1968714 4281953 4002424 782931 -2034033
41243 -2034033 -1617027 964013 2769609 2873813 2544838 2651877 2881517 3084927 3474478
41234C474478l2347j513133k551327j552757N72470J534419R08834L91823Q95212
41225B127672J273885M56278p52791r83423l48747k8127l89387o99397n21703
41216A34260k66456j63819K55989J099826J424010N46371n57637m12418O42471
41207B702597P84962m17535j136552j30046J152323Q12526m45634n59281L95908
41198C159268M05132r07688j519788m65045M28471m23536j658972j110751Q36633
41189a256276K008237J619587P86689L93158K09104o7577l55861o91424j044863
41180A600774q76317R3497J056646J110667N76234K48632K5343m59934o68667
41171B706875j99340j44024j442290k600775j438480J236417K315056Q53803q06399
$$ plain form
41234 3474478 3442131 1928998 -622329 -2175086 -1602616 -68197 840637 1232460 2127672
41225 2127672 3401557 3857835 3105044 2121621 1772874 1744747 1355360 655963 134260
41216 134260 -132196 -296015 -40026 1059800 2483810 3030181 2472544 2060126 2702597
41207 2702597 3487559 3070024 1933472 1803426 2955749 3768275 3322641 2763360 3159268
41198 3159268 3564400 2656712 1136924 671879 1100350 676814 -982158 -2092909 -1256276
41189 -1256276 751961 2371548 3158237 3551395 3760499 3692922 3337061 2645637 1600774
41180 1600774 724457 817954 1874600 2985267 3561501 3810133 3835476 3375542 2706875
41171 2706875 2507535 2363511 921221 -1679554 -3118034 -1881617 433439 1287242 480843
41162D80843q23424m6085L83423Q78601J570254J169754o58653k010416j614589
41153f70292r17969j377024j763731n14693J102257R40602k77938j18972J489170
41144b108590K234529J117469m71074j221444j065065l6782J612205K264717M15090
41135B741055k543195l422664j418864J110232K207644K127902J333258l55341
41127A780027j786563p19616K462655M034185J837043j484515k319001r79712
41119B824503k26659p00679p85304L5924O24807N90518O68972Q28113L04209m95642
41109C668762l64875L06864k28159k009194k749501j155741J039202J535703M74018
41100E17079l12386L8515Q14791J115616O80388k72251j121380j068278l8999
$$ plain form
41162 480843 -342581 -388666 -5243 873358 2443612 3613366 2954713 944297 -670292
41153 -670292 -1588261 -2965285 -4729016 -5243709 -4141452 -3200850 -3478788 -3597760 -2108590
41144 -2108590 125939 1243408 772334 -449110 -1514175 -1550957 61248 2325965 2741055
41135 2741055 197860 -3224804 -4643668 -3533436 -1325792 802110 2135368 1780027
41127 1780027 -6536 -726152 1736503 5770688 7607731 6123216 3804215 2824503
41119 2824503 2597844 1897165 1111861 1147785 1772592 2363110 3032082 3860195 4164404 3668762
41109 3668762 3303887 3610751 3382592 1373398 -1376103 -2531844 -1492642 43061 517079
41100 517079 204693 243208 1057999 2173615 2854003 2581752 1460372 392094 353095
41091C53095R16602P83738j45763p81427o97861l84181k67269k88998m11889p28834
41081a652787q99911k56562J114379K022743J546388L46685j72331J35653m0434
41072B143823j378686k560905j831550N47137K392256K155592N38203o69051o24982
41063G11837J07649O07204N15878J04972j49157k8151K52545L46060J83401p4562
41053B577676l23380m57375k70994J18848N0984p85360j512796j084921J1490
41044a675828K98281l77837n37804M76845J340076R62168L47976P98332J489256
41035C121465P18262j124343j857350o93966P31431Q48379O0061m59736n74657
41026G69546q75730j341902j235397j65075J215652J641155M80653j289197j768197
$$ plain form
41091 353095 1269697 2053435 1907672 1126245 428384 44203 -223066 -512064 -923953 -1652787
41081 -1652787 -2552698 -2809260 -1694881 327862 1874250 2220935 2048604 2184257 2143823
41072 2143823 765137 -1795768 -3627318 -3080181 -687925 1467667 2005870 1336819 711837
41063 711837 819486 1426690 1942568 2047540 1898383 1870232 2122777 2468837 2652238 2577676
41053 2577676 2254296 1796921 1525927 1644775 1695759 910399 -602397 -1687318 -1675828
41044 -1675828 -1377547 -1755384 -2293188 -1816343 -476267 485901 833877 1632209 3121465
41035 3121465 3839727 2715384 858034 164068 895499 1743878 1803939 1344203 769546
41026 769546 -106184 -1448086 -2683483 -2848558 -1632906 8249 488902 -800295 -2568492
41017b568492k59586J752667K404468J641743O65689j34338j198036k082146j599994
41008a378025L5086R79537L75753l84968K1435P41739K90459r49810j404986q11285
40998b485065l39462m38013k18288P38084J407526Q69297j93452m61638J15766
40989a005245L90561j19900m32381L75429J506928J216912p98062k661790k431527
40980c959075l63837J550777J914327J045951J9786n47018o28957l98426J294
40971a365178N36353J101685J123246q3273j972308k547030o74020J879724K288095
40962B87294L88796j224942r95353j76662p7780J87438J523892K307962M73517
40953B694162k771881l898733j705185J189631J941243P15232m28344l75556L79427
$$ plain form
41017 -2568492 -2828078 -1075411 1329057 2970800 3636489 3502151 2304115 221969 -1378025
41008 -1378025 -1342939 -363402 12351 -372617 -351182 390557 681016 -268794 -1673780 -2485065
40998 -2485065 -2824527 -3262540 -3480828 -2742744 -1335218 -465921 -659373 -1121011 -1005245
40989 -1005245 -614684 -734584 -1166965 -791536 715392 1932304 1134242 -1527548 -3959075
40980 -3959075 -4322912 -2772135 -857808 188143 207929 -339089 -968046 -1366472 -1365178
40971 -1365178 -828825 272860 1396106 1312833 -659475 -3206505 -3880525 -2000801 287294
40962 287294 676090 -548852 -1544205 -1720867 -1798647 -1611209 -87317 2220645 2694162
40953 2694162 -77719 -3976452 -5681637 -4492006 -2550763 -1835531 -2263875 -2639431 -2260004
40944b260004R65833R78001N03126J5101K1499M64185P50182N37007P4696l25931
40934A723695o09941o23793q7351Q10467J374475J267644Q96366O87916N42577
40925E982055K45082j84795p74100j517176j812711r66405L37590L21934j255096
40916C76378k072185l24156K252500K497544M12264q78759N2920Q94876m34335
40907B777047k296415k033192l57703j38141j564567j701939P47643L134499K654734
40898A221966K59446j059853m18528N45817N64769M004n28763r93080j122192
40889a526414l68553Q79685J273198K98614q96001j114633o62197m96578n87544
40880c200423j59372Q11146J437712J265873P74499L02101n04121j529197j454195
$$ plain form
40944 -2260004 -1294171 -316170 186956 202057 223556 687741 1437923 1974930 2049626 1723695
40934 1723695 1113754 489961 402610 1213077 2587552 3855196 4751562 5439478 5982055
40925 5982055 6227137 6042342 5268242 3751066 1938355 971950 1309540 1631474 376378
40916 376378 -1695807 -2019963 232537 2730081 3142345 2263586 2316506 3211382 2777047
40907 2777047 480632 -1552560 -1910263 -2048404 -3612971 -5314910 -4567267 -1432768 1221966
40898 1221966 1481412 421559 3031 548848 1113617 1117621 588858 -404222 -1526414
40889 -1526414 -1894967 -1015282 257916 556530 -339471 -1454104 -2116301 -2612879 -3200423
40880 -3200423 -3359795 -2548649 -1110937 154936 929435 1231536 727415 -801782 -2255977
40871b255977N39190K790182K589424j12634k162386j319630P43058J174013J79319
40862B164559N6164Q91288M35378j546621k193790j12411K012021J424383n91463
40853B539508j136485k01737J15813n95177j057267j039319j118066n84227J293814
40844a783143K640681J055607k035483k779983o72100R73599P44804J013711K821310
40835A979003L286835N31154k591086k710128q71467o5191l94864j14925N85746
40826c64923L83100j32867L45997Q29694l61219j959348j279679J181611K217944
40817H60310Q38707o69770p67991m53897n30260k19416O14329O61517l35368p51342
40807g53181J14593O63916l02426j507794j204201L56682J723442K153634J631564
$$ plain form
40871 -2255977 -1716787 1073395 3662819 3550185 1387799 68169 811227 1985240 2164559
40862 2164559 2220723 3112011 3547389 2000768 -193022 -305433 1706588 3130971 2539508
40853 2539508 1403023 1201286 1317099 721922 -335345 -1374664 -2492730 -3076957 -1783143
40844 -1783143 857538 1913145 -122338 -2902321 -3574421 -2600822 -1856018 -842307 1979003
40835 1979003 5265838 5796992 3205906 495778 -375689 -440880 -835744 -950669 -364923
40826 -364923 18177 -114690 231307 1061001 699782 -1259566 -2539245 -1357634 860310
40817 860310 1699017 1029247 261256 -192641 -722901 -942317 -327988 333529 -1839 -753181
40807 -753181 -638588 25328 -277098 -1784892 -2989093 -2632411 -908969 1244665 2876229
40798B876229K62028j290980j848994j120944j44630K51608L43417M07340P2698
40789a92228n65490n46133L87722J010123L29662q96458j248359m56817O17496
40780a560482J172873J052211O27698L88026K71373l20727j214403r67311R82333
40771D31591K544707J432768j163878j941087l93449O15161l58183j229284k98169
40762c59823R09199O81440K15296J156183K288944J524029m21719j214586o88216
40753D090747o34383j457067j707908p78984K64188O27152O77953P80346P67588
40744B629632O17378M43948L1085o03203p70068l19401l34532j265796j573704
40735a144661o1009J650453J315109k35119l75381Q66338Q12308j234752k547487
$$ plain form
40798 2876229 3138257 1847277 -1717 -1122661 -1267291 -1015683 -672266 -264926 -192228
40789 -192228 -757718 -1303851 -916129 93994 423656 -472802 -1721161 -2177978 -1560482
40780 -1560482 -387609 664602 1292300 1680326 1951699 1630972 416569 -550742 431591
40771 431591 2976298 4409066 3245188 1304101 910652 1525813 1167630 -61654 -359823
40762 -359823 549376 1230816 1446112 2602295 4891239 6415268 5993549 4778963 4090747
40753 4090747 3456364 1999297 291389 -487595 -223407 403745 1081698 1862044 2629632
40744 2629632 3247010 3690958 3722043 3118840 2348772 2029371 1694839 429043 -1144661
40735 -1144661 -1205670 444783 1759892 1524773 1149392 2015730 2828038 1593286 -954201
40726i54201j127468J416018K486946J766578M27826r15632j857589j504051P1073
40717a90500R81528o2586j543129j172509O59260J493590N18801m03486K59607
40708E40576J496624J443792M9905j165676j400036j273408j213581m59339J448442
40699e32701L008738K091090r89094l209115k438980q9308J065116O97309P37872
40690C40927J801789K066438L29803j771961j987932o35497J11093m87155r30212
40681a162707q3482J032828R01777j11443l05768P88572J716718J243014K4741
40672D044250n93407n22874n46349o41844j74444M66693J30039r38038r74320
40663B49706M78764J333592j12207k325255k340703K77994K916755L078642P79421
$$ plain form
40726 -954201 -2081669 -665651 1821295 3587873 4015699 3100067 1242478 -261573 -190500
40717 -190500 791028 728442 -814687 -1987196 -1327936 165654 684455 280969 540576
40708 540576 2037200 3480992 3530897 2365221 965185 -308223 -1521804 -1981143 -532701
40699 -532701 2476037 4567127 3578033 368918 -2070062 -2159370 -1094254 -396945 340927
40690 340927 2142716 4209154 4538957 2766996 779064 143567 254660 -232495 -1162707
40681 -1162707 -1246189 -213361 688416 576973 271205 1059777 2776495 4019509 4044250
40672 4044250 3450843 2927969 2381620 1739776 1565332 2032025 2162064 1224026 249706
40663 249706 728470 2062062 1949855 -375400 -2716103 -2438109 478646 3557288 4336709
40654D336709j993083l093386j752922O69807J741905N84045j096485j398088
40646b001498o33354j01847L13593J363602K173583J238351o70530j182140j9875
40637D79885O03952k29003p06974K76487Q94647n67557k504802k107046N50372
40628c310039K721685K645238J076130m76030j292380j245425n35016R7543q6847
40619d05141q01340r59820q0963J086944J457317P43250l28234p18046q4852Q00068
40609G09183R02789K25170k43781m637K10696m17068j512127j958867j286466
40600c375108o3119Q90196J247774J222226J130144R52959M06952m42898r71374
40591I97752q00812m39156m72146n31192J0779O77543M88874j96366M3828J290687
$$ plain form
40654 4336709 2343626 -749760 -2502682 -1832875 -90970 493075 -603410 -2001498
40646 -2001498 -2634852 -2736699 -2423106 -1059504 1114079 2352430 1681900 499760 479885
40637 479885 1083837 854834 147860 424347 1318994 751437 -1753365 -3860411 -3310039
40628 -3310039 -588354 2056884 3133014 2656984 1364604 119179 -415837 -318294 -405141
40619 -405141 -1206481 -2166301 -2247264 -1160320 296997 1040247 712013 -6033 -90885 709183
40609 709183 1611972 1837142 1593361 1588724 1799420 1382352 -129775 -2088642 -3375108
40600 -3375108 -3438227 -2548031 -1300257 -78031 1052113 2005072 2412024 1969126 997752
40591 997752 196940 -242216 -714362 -1245554 -1234775 -557232 -68358 -264724 -220896 1069791
40581A069791J750163L94035j262438j196894K79945J065186J69182j217402j594030
40572e42462j062331q54508j370479j424793Q2594K131260K379565M00625j236119
40563a496648k95882J921665K515367J189159J56287K69964N1020j124115j738554
40554A448263j007468l63974o66480m25440J327152K659870J571134n69091j004907
40545B969059J91097N73203o39678j575744p70825Q90407J647330Q46425p68608
40536C362666j769256j142477N49141J523966R55338l7486l12321l55062q69946
40527A904563j149524m61680K32398j80381q59706m82154K67316p0857r61730
40518a761755q09057J11883K68493k10408l0074L47103o09581k050900j394188
$$ plain form
40581 1069791 2819954 3213989 1951551 754657 1034602 2099788 2268970 1051568 -542462
40572 -542462 -1604793 -2459301 -3829780 -5254573 -5171979 -3040719 -661154 -260529 -1496648
40563 -1496648 -1792530 129135 2644502 3833661 3989948 4259912 4310932 3186817 1448263
40554 1448263 440795 76821 -589659 -1015099 312053 2971923 4543057 3973966 2969059
40545 2969059 3160156 3733359 3093681 1517937 747112 1637519 3284849 4131274 3362666
40536 3362666 1593410 450933 1000074 2524040 3479378 3441892 3129571 2774509 1904563
40527 1904563 755039 293359 525757 345376 -514330 -996484 -729168 -800025 -1761755
40518 -1761755 -2570812 -2458929 -2190436 -2400844 -2430918 -2083815 -2693396 -4744296 -6138484
40509f138484J200411K468298J091831k67639N36540J803645J225507k59118l87665
40500A273326O28410Q26636k74145j476089k040748k059154j428694j78685Q26832
40491c902311R47449P96115R60887P21046m90029j391703m21767J697783K723656
40482A641126J809010J30862r94788j176951n19198M51329P19464r6307r34770
40473A029777p53704j59399k35080n35149M116P93360L37172r90583j161267L07982
40463a362775J536706J230821M07501K73606K56799n43638j416253j107900N4632
40454f70501N81772n1917q42991o55322N54066J719650J508755l33142k197449
40445c87079k017852P1388J554043P88128p57047p59988N93724J318389R56669
$$ plain form
40509 -6138484 -4938073 -2469775 -1377944 -1645583 -1109043 694602 1920109 1660991 1273326
40500 1273326 1901736 2728372 2454227 978138 -1062610 -3121764 -4550458 -4729143 -3902311
40491 -3902311 -2954862 -2158747 -1197860 -476814 -966843 -2358546 -2780313 -1082530 1641126
40482 1641126 3450136 3580998 2586210 1409259 890061 1341390 2060854 1964547 1029777
40473 1029777 276073 116674 -118406 -653555 -649439 143921 481093 -509490 -1670757 -1362775
40463 -1362775 173931 1404752 1812253 2085859 2342658 1799020 382767 -725133 -670501
40454 -670501 -88729 -140646 -983637 -1638959 -1084893 634757 2143512 1810370 -387079
40445 -387079 -2404931 -2333543 -779500 8628 -748419 -1508407 -914683 403706 1360375
40436A360375R36866J631115J442653l72917k030648j724793k83807K94228j43670
40427A109402j59788O39823J118432O70581O1316q2822j78826n89488q17788m34492
40417A336350R0147R4890m01092r76251j317303j137834l05110O65728J025739
40408i24736R14189J086344J309081M14402j444315k188195o82114J203240J088052
40399G75948m34964q81888J86580P07087l18035j211248m77979P50230O52503
40390b51766k75786m3894J551711K365172R42000j341489k066483q47910N01740
40381E33295N76760r6823l88160j95697L2168L75417Q23789M07326j391813k866463
40371b190201j827009Q63455J859049O0296j672414p85384J351569J986525J100549
$$ plain form
40436 1360375 2297241 3928356 5371009 4998092 2967444 1242651 958844 1253072 1109402
40427 1109402 949614 1589437 2707869 3378450 3439766 3356944 3178118 2588630 1770842 1336350
40417 1336350 1426497 1521387 1120295 144044 -1173259 -2311093 -2616203 -1950475 -924736
40408 -924736 -10547 1075797 2384878 2799280 1354965 -833230 -1515344 -312104 775948
40399 775948 340984 -540904 -354324 352763 34728 -1176520 -1654499 -904269 -251766
40390 -251766 -527552 -571446 980265 3345437 4287437 2945948 879465 31555 533295
40381 533295 1110055 1013232 625072 429375 461543 836960 1660749 2068075 676262 -2190201
40371 -2190201 -4017210 -3153755 -1294706 -1234410 -2906824 -3692208 -2340639 -354114 746435
40362G46435N62908O73763K24113q70532j522050j503223j285862m92489J190996
40353b275941K277792J232925o18119p19795O09762P62066o67825j343575m18405
40344a161115J98601m07125n97938L83753P53879m00011j166294k28419O88739
40335a935930M7659n73912N60636J863277R30852j265231j834053m20537P51168
40326a876071N34340j32764m23534m51640j75144N19385R22088M04743k26498
40317i05095J20814R44160J035206N39331M15092N37816J37010m78428m26794
40308A919112J5027j07629o72099p92230m08962j08795N8695K19672p3028q59997
40298h10234j076860k98032J39612n12879n39659J459319L438049K465810o27696
$$ plain form
40362 746435 1309343 1983106 2207219 1336687 -185363 -1688586 -2974448 -3466937 -2275941
40353 -2275941 1851 1234776 616657 -103138 506624 1268690 600865 -742710 -1161115
40344 -1161115 -962514 -1369639 -1967577 -1583824 -829945 -1229956 -2396250 -2624669 -1935930
40335 -1935930 -1888271 -2462183 -1901547 -38270 892582 -372649 -2206702 -2627239 -1876071
40326 -1876071 -1341731 -1474495 -1898029 -2349669 -2524813 -2005428 -1083340 -678597 -905095
40317 -905095 -784281 159879 1195085 1734416 2149508 2687324 2824334 2345906 1919112
40308 1919112 1934139 1826510 1154411 362181 -46781 -155576 -96881 122791 49763 -810234
40298 -810234 -1887094 -2185126 -2045514 -2558393 -3098052 -1638733 1799316 4265126 3637430
$$ [...]
##END NTUPLES=NMR SPECTRUM
##END=
