##TITLE=31Pdec_LR-685B-C1M-TFA
 CDCl3, 24 sc
 30.7.2019
##JCAMPDX= 6.0         $$ Bruker NMR JCAMP-DX V2.0
##DATA TYPE= NMR SPECTRUM
##DATA CLASS= NTUPLES
##ORIGIN= UXNMR, Bruker Analytische Messtechnik GmbH
##OWNER= root
$$ XWIN-NMR		Version 3.5
$$ Tue Jul 30 15:24:57 2019 Russian Standard Time (UT+4h)  she@DPX200
##.OBSERVE FREQUENCY= 81.013821
##.OBSERVE NUCLEUS= ^31P
##.ACQUISITION MODE= SIMULTANEOUS
##.ACQUISITION SCHEME= undefined
##.AVERAGES= 24
##.DIGITISER RES= 17
##SPECTROMETER/DATA SYSTEM= spect
##.PULSE SEQUENCE= zgpg30
##.SOLVENT NAME= CDCl3
##.SHIFT REFERENCE= (INTERNAL, CDCl3, 0, 182.463)
##AUDIT TRAIL= $$ (NUMBER, WHEN, WHO, WHERE, WHAT)
$$ ##TITLE= Audit trail, XWIN-NMR		Version 3.5
$$ ##JCAMPDX= 5.01
$$ ##ORIGIN= Bruker BioSpin GmbH
$$ ##OWNER= she
$$ F:/spectra/data/she/nmr/P31/1/pdata/1/auditp.txt
$$ ##AUDIT TRAIL=  $$ (NUMBER, WHEN, WHO, WHERE, WHAT)
(   1,<2019-07-30 15:24:04.42 +0400>,<she>,<DPX200>,
      <created by zg, POWCHK disabled, PULCHK disabled
       configuration hash MD5:
       00 E9 B6 7A A2 85 ED C7 34 08 36 98 17 FE 4E 26
       data hash MD5: 32K
       FC 62 C7 19 3A DE C4 CF BE E5 5B CE 87 D8 98 4E>)
(   2,<2019-07-30 15:24:06.95 +0400>,<she>,<DPX200>,
      <Start of raw data processing
       efp BC_mod = 2 LB = 1 FT_mod = 6 PKNL = 1 PHC0 = -389.2312 PHC1 = 101.2 SI = 64K 
       data hash MD5: 64K
       63 C0 EC C8 7A 73 08 77 0F 75 25 2A 83 EA 8F A3>)
(   3,<2019-07-30 15:24:20.12 +0400>,<she>,<DPX200>,
      <pk PHC0 = -6.466655 PHC1 = 0 
       data hash MD5: 64K
       F3 CF 33 BB 44 1B 7A 5A 13 D7 F8 84 3C 90 D8 C0>)
(   4,<2019-07-30 15:24:22.93 +0400>,<she>,<DPX200>,
      <abs ABSG = 5 
       data hash MD5: 64K
       8F AB 5A 6D FE 13 A8 4D 65 6D FB 33 34 19 46 AC>)
$$ ##END=
$$ 
$$ hash MD5
$$ D7 56 06 57 B6 F7 38 34 7A 26 5F 46 1C 80 02 F8
##$RELAX= 
##$RELAX= 
##$RELAX= 
##$RELAX= 
##$RELAX= 
##$RELAX= 
##$RELAX= 
##$RELAX= 
$$ Bruker specific parameters
$$ --------------------------
##$DU= <F:/spectra>
##$EXPNO= 1
##$NAME= <P31>
##$PROCNO= 1
##$TYPE= <nmr>
##$USER= <she>
##$AMP= (0..31)
100 100 100 100 100 100 100 100 100 100 100 100 100 100 100 100 100 100 
100 100 100 100 100 100 100 100 100 100 100 100 100 100 
##$AQSEQ= 0
##$AQ_mod= 1
##$AUNM= <au_zg>
##$AUTOPOS= <>
##$BF1= 81.014009
##$BF2= 200.13
##$BF3= 200.13
##$BF4= 200.13
##$BF5= 200.13
##$BF6= 200.13
##$BF7= 200.13
##$BF8= 200.13
##$BYTORDA= 1
##$CFDGTYP= 0
##$CFRGTYP= 5
##$CHEMSTR= <none>
##$CNST= (0..31)
1 1 145 1 1 1 1 1 1 1 1 1 1 1 1 1 1 1 1 1 1 1 1 1 1 1 1 1 1 1 1 1 
##$CPDPRG= <waltz16>
##$CPDPRG1= <>
##$CPDPRG2= <waltz16>
##$CPDPRG3= <>
##$CPDPRG4= <mlev>
##$CPDPRG5= <mlev>
##$CPDPRG6= <mlev>
##$CPDPRG7= <mlev>
##$CPDPRG8= <mlev>
##$CPDPRGB= <>
##$CPDPRGT= <>
##$D= (0..31)
0 1 0 0 0 0 0 0 0 0 0 0.03 2e-05 3e-06 0 0 0 0 0 0 0 0 0 0 0 0 0 0 0 0 
0 0 
##$DATE= 1564485843
##$DBL= (0..7)
120 120 120 11 120 120 24 19 
##$DBP= (0..7)
150 150 150 150 150 150 150 150 
##$DBP07= 0
##$DBPNAM0= <>
##$DBPNAM1= <>
##$DBPNAM2= <>
$$ [...]
##$SUBNAM3= <"">
##$SUBNAM4= <"">
##$SUBNAM5= <"">
##$SUBNAM6= <"">
##$SUBNAM7= <"">
##$SUBNAM8= <"">
##$SUBNAM9= <"">
##$SW= 369.568048894756
##$SWIBOX= (0..15)
0 1 3 0 0 0 0 0 0 0 0 0 0 0 0 0 
##$SW_h= 29940.119760479
##$TD= 32768
##$TD0= 1
##$TE= 0
##$TE2= 300
##$TE3= 300
##$TEG= 300
##$TL= (0..7)
0 120 53 12 22 120 120 120 
##$TP= (0..7)
150 150 150 150 150 150 150 150 
##$TP07= 0
##$TPNAME0= <>
##$TPNAME1= <>
##$TPNAME2= <>
##$TPNAME3= <>
##$TPNAME4= <>
##$TPNAME5= <>
##$TPNAME6= <>
##$TPNAME7= <>
##$TPOAL= (0..7)
0.5 0.5 0.5 0.5 0.5 0.5 0.5 0.5 
##$TPOFFS= (0..7)
0 0 0 0 0 0 0 0 
##$TUNHIN= 0
##$TUNHOUT= 0
##$TUNXOUT= 0
##$USERA1= <user>
##$USERA2= <user>
##$USERA3= <user>
##$USERA4= <user>
##$USERA5= <user>
##$V9= 5
##$VALIST= <valist>
##$VCLIST= <CCCCCCCCCCCCCCC>
##$VD= 0
##$VDLIST= <DDDDDDDDDDDDDDD>
##$VPLIST= <PPPPPPPPPPPPPPP>
##$VTLIST= <TTTTTTTTTTTTTTT>
##$WBST= 1024
##$WBSW= 4
##$XGAIN= (0..3)
0 0 0 0 
##$XL= 0
##$YL= 0
##$YMAX_a= 12829
##$YMIN_a= -13323
##$ZGOPTNS= <>
##$ZL1= 120
##$ZL2= 120
##$ZL3= 120
##$ZL4= 120
##$ABSF1= 182.463
##$ABSF2= -187.1042
##$ABSG= 5
##$ABSL= 3
##$ALPHA= 0
##$AQORDER= 0
##$ASSFAC= 0
##$ASSFACI= 0
##$ASSFACX= 0
##$ASSWID= 0
##$AUNMP= <proc_1d>
##$AZFE= 0.1
##$AZFW= 0.5
##$BCFW= 0
##$BC_mod= 2
##$BYTORDP= 0
##$COROFFS= 0
##$CY= -3
##$DATMOD= 1
##$DC= 0
##$DFILT= <>
##$DTYPP= 0
##$F1P= 0
##$F2P= 0
##$FCOR= 1
##$FTSIZE= 65536
##$FT_mod= 6
##$GAMMA= 0
##$GB= 0
##$INTBC= 1
##$INTSCL= 5.30512e-09
##$ISEN= 30
##$LB= 1
##$LEV0= 0
##$LPBIN= 0
##$MAXI= 10000
##$MC2= 0
##$MEAN= 0
##$ME_mod= 0
##$MI= 50
##$NCOEF= 0
##$NC_proc= -6
##$NLEV= 6
##$NOISF1= 182.463
##$NOISF2= 159.3651
##$NSP= 0
##$NTH_PI= 0
##$NZP= 0
##$OFFSET= 182.463
##$PC= 4
##$PHC0= -395.6978
##$PHC1= 101.2
##$PH_mod= 1
##$PKNL= yes
##$PPARMOD= 0
##$PSCAL= 0
##$PSIGN= 0
##$REVERSE= no
##$SF= 81.0140089999434
##$SI= 65536
##$SIGF1= 159.3651
##$SIGF2= -187.1042
##$SINO= 113.3802
##$SIOLD= 16384
##$SREGLST= <1H.CDCl3>
##$SSB= 0
##$STSI= 65536
##$STSR= 0
##$SW_p= 29940.119760479
##$SYMM= 0
##$S_DEV= 0
##$TDeff= 32768
##$TDoff= 0
##$TI= <>
##$TILT= no
##$TM1= 0
##$TM2= 0
##$TOPLEV= 0
##$USERP1= <user>
##$USERP2= <user>
##$USERP3= <user>
##$USERP4= <user>
##$USERP5= <user>
##$WDW= 1
##$XDIM= 65536
##$YMAX_p= 329645026
##$YMIN_p= -12915061
$$ End of Bruker specific parameters
$$ ---------------------------------
##NTUPLES= NMR SPECTRUM
##VAR_NAME=  FREQUENCY,     SPECTRUM/REAL,   SPECTRUM/IMAG
##SYMBOL=    X,             R,               I
##VAR_TYPE=  INDEPENDENT,   DEPENDENT,       DEPENDENT
##VAR_FORM=  AFFN,          ASDF,            ASDF
##VAR_DIM=   65536,         65536,           65536
##UNITS=     HZ,            ARBITRARY UNITS, ARBITRARY UNITS
##FACTOR=    0.456856943014862, 1,           1
##FIRST=     14782.0589164792, 0,            0
##LAST=      -15158.0608439998, 0,           0
##MIN=       -15158.0608439998, -12915061,   0
##MAX=       14782.0589164792, 329645026,    0
$$ Real data points
##PAGE= N=1
##DATA TABLE= (X++(R..R)), XYDATA
$$ [...]
46297d328680P0785J130771P55875n75281j341380o31029P60360J121265l3995
46288c071309j083028l40740J411687J782756J77064j284866q03086P73948J609506
46279h28068J339185O39193k14796q47682j99938J758367K919915J663193m88421
46270E740948j080462n53884j099565k431408k040664K98525J739194Q43023m25604
46261I90103m26990l78701j361303j783081k60505J472429J313523L85436Q33381
46252G84292J748996P72543j357728j676103r4183K61266j632161k781717j060712
46243e035507J250246J072444p37857j012329P68852J953368Q13091j207904j748157
46234c883753m08195J277202J789191R56462j95190n59057n7625L81758J01867
$$ plain form
46297 -4328680 -4257895 -3127124 -2371249 -2946530 -4287910 -4918939 -4158579 -3037314 -3071309
46288 -3071309 -4154337 -4495077 -3083390 -1300634 -1123570 -2408436 -3211522 -2437574 -828068
46279 -828068 511117 1150310 935514 87832 -112106 1646261 4566176 6229369 5740948
46270 5740948 4660486 4106602 3007037 575629 -1465035 -1166510 572684 1415707 990103
46261 990103 563113 184412 -1176891 -2959972 -3220477 -1748048 -434525 -49089 784292
46252 784292 2533288 3305831 1948103 272000 177817 439083 -1193078 -3974795 -5035507
46243 -5035507 -3785261 -2712817 -3450674 -4463003 -3694151 -1740783 -927692 -2135596 -3883753
46234 -3883753 -4291948 -3014746 -1225555 -269093 -464283 -1023340 -1080965 -699207 -597340
46225e97340l65738r0418Q31635J289406O11450n44780r82175l40263N65417P14810
46215A092004L5892n49664k77759N00730Q38098M81600O3917n665p2442l48714
46205A757997l27486K22535L85768o99967k128702k002533m2226J818496J923609
46196I07491Q34069j1744m83040j274943j930692j121136R82072K279267J433586
46187A614930k74625p95943l7840N05775J79711k51840k24405p6412L7870N26828
46177A204049J149305P11329j161377k924650k846882j222371J91459N32063N15465
46168c851610Q98257J378089J314022P42434K20744P1577J25500J9846m03332
46159E15527q67030q46668j87335N47294O21942j8712p11865q43615m05466J46223
$$ plain form
46225 -597340 -963078 -1053496 -221861 1067545 1678995 1134215 152040 -188223 377194 1092004
46215 1092004 1127896 578232 300473 801203 1639301 2120901 2184818 2179153 2106711 1757997
46205 1757997 1430511 1653046 2038814 1338847 -789855 -2792388 -2834614 -1016118 907491
46196 907491 1741560 1729816 1246776 -28167 -1958859 -3079995 -2097923 181344 1614930
46187 1614930 1340305 544362 506522 1012297 1192008 940168 715763 639351 677221 1204049
46177 1204049 2353354 3064683 1903306 -1021344 -3868226 -5090597 -4899138 -4367075 -3851610
46168 -3851610 -2953353 -1575264 -261242 481192 701936 773513 899013 918859 515527
46159 515527 -351503 -1198171 -1385506 -838212 -216270 -234982 -946847 -1790462 -2195928 -2049705
46149b049705L38688O8153k57875j24611L44229L87829k47341n92036L35383J770758
46139b6528J698104n08640k794365k603777o881K256227J991826O0767q91105
46130h24372J93655J567611J075581j001407k309266j386125O72836J782654J345530
46121A116697N38915M76198P89734K64662j363402k640557j869010N92034K252435
46112A57706J403420n85948j117884m8546L09528r92612j919133p06964J258153
46103b242280J604730N13746p1897K40631K06255l09472n0491J034344J333420
46094B258986K78331o78984o12084n46457j184454j204104M62017K187246J590286
46085B550783q82135k366100j398343M44490R47385j50979j488646j913555j245277
$$ plain form
46149 -2049705 -1711017 -1642864 -1900739 -2025350 -1681121 -1293292 -1540633 -2132669 -1797286 -26528
46139 -26528 1671576 1162936 -1631429 -4235206 -4242087 -1985860 5966 66733 -824372
46130 -824372 -630717 936894 2012475 1011068 -1298198 -2684323 -2011487 -228833 1116697
46121 1116697 1655612 2131810 2921544 3186206 1822804 -817753 -2686763 -2094729 157706
46112 157706 1561126 975178 -142706 -191252 118276 -874336 -2793469 -3500433 -2242280
46103 -2242280 -637550 -123804 -195701 44930 251185 -58287 -108778 925566 2258986
46094 2258986 2537317 1858333 1246249 699792 -484662 -1688766 -1226749 960497 2550783
46085 2550783 1668648 -697452 -2095795 -1651305 -703920 -854899 -2343545 -4257100 -5502377
46076e502377J27879J540407K087576J179672n61531j435413l77660J559081K247935
46067H65569J147624j06771k35878j19437r41568j830372j237055J62220L04330
46058a991338p68844q50904O53672J588225O57735m17623M5131Q23738J32679
46049a27529j042233n58819J117471J521558J19634r43538k08231J137540J254959
46040B270812P2484r95206q51647K04992P89119j06880j660352j887629k89785
46031b454092J218710R66646j02661j48426O10154N49667m96886j102723o36104
46022a595715J29406O01201Q05595N02078l71358p35049K28718J156847K24864
46013I46587j596993j644736J56281J058201n5912j062962l73057P13488Q26281
$$ plain form
46076 -5502377 -5374498 -3834091 -1746515 -566843 -1128374 -2563787 -2941447 -1382366 865569
46067 865569 2013193 1906422 1670544 1551107 609539 -1220833 -2457888 -2295668 -1991338
46058 -1991338 -2760182 -3611086 -2957414 -1369189 -711454 -1129077 -1083946 -260208 -127529
46049 -127529 -1169762 -1728581 -611110 910448 1030082 86544 -121687 1015853 2270812
46040 2270812 2343296 1348090 496443 701435 1490554 1383674 -276678 -2164307 -2454092
46031 -2454092 -1235382 -268736 -371397 -519823 90331 639998 143112 -959611 -1595715
46022 -1595715 -1466309 -865108 -59513 442565 71207 -663842 -435124 721723 946587
46013 946587 -650406 -2295142 -2138861 -1080660 -1136572 -2199534 -2572591 -1859103 -1032822
46004a032822Q27660J459493J337796m39731j954364j272524K70654K59776q88578
45995a432640j050166k10164p2577n48514J67483K022659K621937R43382r87980
45986A453420j101963O1182P85774O58920M15734M35786N26029N30500L13448
45977D078830l73479j365507j829445j120607K69862J041096M41760p85778j028394
45968f71662L35665J894561J716315j30895j603252j439106n47168l9937N04357
45959A8878J544374J839458J44443k270431k906780j478461j06061j91022r48718
45950d354320j143629n74424L93342J289806J402783N75779O7681J033836K315307
45941A006161J696126n99726j919056j102858j58j69537m83747M64813J649465
$$ plain form
46004 -1032822 -205162 1254331 2592127 2152396 198032 -1074492 -803838 -544062 -1432640
45995 -1432640 -2482806 -2692970 -2765547 -3314061 -3146578 -1123919 1498018 2441400 1453420
45986 1453420 351457 412639 1198413 1857333 2273067 2708853 3234882 3765382 4078830
45977 4078830 3705351 2339844 510399 -610208 -340346 700750 1142510 356732 -671662
45968 -671662 -335997 1558564 3274879 3143984 1540732 101626 -445542 -485479 18878
45959 18878 1563252 3402710 3547153 1276722 -1630058 -3108519 -3214580 -3405602 -4354320
45950 -4354320 -5497949 -6072373 -5679031 -4389225 -2986442 -2410663 -2342982 -1309146 1006161
45941 1006161 2702287 2102561 183505 -919353 -919511 -1089048 -1572795 -1107982 541483
45932E41483J276881k92123j283975j144176n78358J46079J024079J118475m04176
45923D04189k303800k322951l46458J282691J019231Q1443M12651J952387K980849
45914C160232K449561R26460n12310j416412j843371j779324j199645n05871k96877
45905a017557n01095k67621P93536J706498J231631l49857j457293j215492l13279
45896a390529K74777M52722N65362O85020P61533P64438L86025o36826j733560
45887A28962j969702j458092j157822j095767k67056J284911K036788J430771
45879a067007R12908J356824J372605j22759j480658p53101Q78945Q01806q03523
45870A096040j337384n6715R91479N87915Q0074O74292J406684R83237k47183
$$ plain form
45932 541483 1818364 1526241 242266 -901910 -1480268 -1334189 -310110 808365 404189
45923 404189 -1899611 -4222562 -4569020 -3286329 -2267098 -2185655 -1773004 179383 3160232
45914 3160232 5609793 6536253 6023943 4607531 2764160 984836 -214809 -720680 -1017557
45905 -1017557 -1518652 -1786273 -992737 713761 1945392 1595535 138242 -1077250 -1390529
45896 -1390529 -1115752 -663030 -97668 587352 1348885 2113323 2499348 1862522 128962
45887 128962 -1840740 -3298832 -4456654 -5552421 -5819477 -4534566 -2497778 -1067007
45879 -1067007 -154099 1202725 2575330 2452571 971913 218812 1097757 1899563 1096040
45870 1096040 -241344 -298059 693420 1281335 1361409 2035701 3442385 4425622 4178439
45861D178439j283519j847441j810281q07010O30249J100774M51770K50265J106330
45852A969576J349660j57414j655067r35906J154415J925281P68936m02488l35392
45843C681601J60502J51679m0540K7249o4863p09162j435652j597480j146814
45834i73480l22273P16981J560294J508290L58933j086688j604090n91029J279286
45825H46224K293874J162479j235148k290738p84628J179028P75823j530412k526069
45816b109567q28736J295248J502364O09596O34978J277085O51656j231891k194328
45807c93595j232038P100j59606j066705j061683J838R90637J419517J673412
45798A78877J645717O98674q12639j362841l00144R26206N35424j161621k138782
$$ plain form
45861 4178439 2894920 1047479 -762802 -1569812 -939563 161211 612981 863246 1969576
45852 1969576 3319236 3161822 1506755 570849 1725264 3650545 4419481 4016993 3681601
45843 3681601 3842103 3993782 3953242 3980491 3915628 3206466 1770814 173334 -973480
45834 -973480 -1295753 -578772 981522 2489812 2848745 1762057 157967 -433062 846224
45825 846224 3140098 4302577 3067429 776691 -7937 1171091 1946914 416502 -2109567
45816 -2109567 -2938303 -1643055 -140691 468905 1103883 2380968 3032624 1800733 -393595
45807 -393595 -1625633 -1618533 -1778139 -2844844 -3906527 -3904689 -2914052 -1494535 178877
45798 178877 1824594 2523268 1710629 347788 47644 973850 1509274 347653 -1791129
45789a791129j261404M66210J391612J107250M34467P4097j51309p96233j831460
45780b357899k311213j232865J047683K661843K182635N15541j54699O72440J221406
45771B244872L17846o45608R0424J650426J612898l74806k115767k122449j343555
45762f85719j015374p53199l947K89888p38742j777682q67367J473316K718778
45753a360048J888262O06391K75094K19503m63277j052028o18858Q4920j58552
45744e78593q79981p72082p3494j56937r51266q20626P04963K026378J960558
45735D58920J327198J104854P34879l85417j256070q61892j92015o51473j356536
45726a077552l73607J756133K329117N76120j077307o96271M85780L82488q47725
$$ plain form
45789 -1791129 -3052533 -2586323 -1194711 -87461 347006 421103 269794 -526439 -2357899
45780 -2357899 -4669112 -5901977 -4854294 -2192451 -9816 505725 351026 1023466 2244872
45771 2244872 2562718 1917110 2007534 3657960 5270858 4896052 2780285 657836 -685719
45762 -685719 -1701093 -2454292 -2458239 -2168351 -2907093 -4684775 -5552142 -4078826 -1360048
45753 -1360048 528214 1134605 1409699 1629202 1165925 113897 -504961 -420041 -578593
45744 -578593 -1458574 -2230656 -2304150 -2461087 -3412353 -4232979 -3528016 -1501638 458920
45735 458920 1786118 2890972 3625851 3240434 1984364 1122472 930457 278984 -1077552
45726 -1077552 -1451159 304974 2634091 3210211 2132904 1436633 1922413 2304901 1457176
45717A457176j622208j399160o80681K74888J129108R11395n39074j546082p51026
45708b765664O57906P87444J31015M82487J527177J328768j9278k94153R19587
45699B755289J293736k41697j533779q23415L63322m008j085734r68636K0156
45690b24766L44930J07475K42413J70634r36013j652251j93362J931212J592515
45681A382787q62175j828891j26666J302377M51244p10665j45786O94629j32787
45672B4067j303810o36553Q31579O69867m38200K44075K493569K946662L27670
45663E158926k494156k725099j138571K6421K91804L70953K58084j83957n0126
45654d85721J236759K254018J211608j201108k466571j654952m12532k52832n76056
$$ plain form
45717 1457176 -165032 -1564192 -2244873 -1969985 -840877 70518 -468556 -2014638 -2765664
45708 -2765664 -2107758 -1320314 -1189299 -706812 820365 2149133 2129855 1835702 2755289
45699 2755289 4049025 3807328 2273549 1450134 1813456 1809448 723714 -244922 -224766
45690 -224766 120164 227639 470052 640686 -295327 -1947578 -2140940 -209728 1382787
45681 1382787 520612 -1308279 -1434945 -132568 318676 -391989 -537775 156854 24067
45672 24067 -1279743 -1916296 -1084717 -414850 -853050 -608975 1884594 4831256 5158926
45663 5158926 2664770 -60329 -1198900 -1172479 -880675 -509722 -251638 -435595 -485721
45654 -485721 751038 3005056 4216664 3015556 548985 -1105967 -1518499 -1771331 -2347387
45645b347387k03293N44256O31387L10876P28663J721535J652191q0398j785991
45636A171839j728108n35456L39k15745K87318J724437K337740J062562p86902
45627C318024j431858q46292m5988N15235O56178j09072j399753j445789N13211
45618b76104K372184J724908n72105j659523q59435n8923k31340l88108j66483
45609a14929n35973j239969m28163J959445L133737J381395j322286k386528k046961
45600a600232j729852j146920M75709J966239J704344L75966k85583m26678j156647
45591a823654j740717o47366J214713J389479j17494p26965N64479J823009J563873
45582A499357P42454M24283P871r76530j511888r63293m13994o74355o71003N66234
$$ plain form
45645 -2347387 -2550680 -2006424 -1375037 -1064161 -335498 1386037 3038228 2957830 1171839
45636 1171839 -556269 -1091725 -1091386 -1307131 -1019813 704624 3042364 4104926 3318024
45627 3318024 1886166 1039874 993886 1509121 2165299 2056227 656474 -789315 -276104
45618 -276104 2096080 3820988 3248883 1589360 729925 671002 439662 51554 -114929
45609 -114929 -650902 -1890871 -2319034 -359589 2774148 4155543 2833257 446729 -1600232
45600 -1600232 -3330084 -4477004 -4001295 -2035056 -330712 45254 -240329 -667007 -1823654
45591 -1823654 -3564371 -4211737 -2997024 -1607545 -1725039 -2452004 -1887525 -64516 1499357
45582 1499357 2241811 2666094 2673965 1697435 185547 -777746 -1191740 -1866095 -2537098 -1970864
45572a970864J804209J347497j52298n48502O05262J453947N14196j358827k147554
45563d52934j150209K96565O02397k731O8015J130423J361144m37395k471248
45554a055973k179690k1203J211454N31099k62819J28147Q12164R24103J057013
45545A144295J483314J178557k00905j331224j326418r45510p35293o8990R26325
45536A24151Q21224m65612r34451R2221N05597p99241j535091R9860J910988J161732
45526I81378q29445j035176K57882N12467m21655n85119J55273K15897l39227
45517a087725j67123K39367n34392j392616j24728K147190K080022l34815j589052
45508g63872l75033Q34509N90089M35073R94262N29832j053740j096554R80425
$$ plain form
45572 -1970864 -166655 1180842 1028544 480042 1085304 2539251 3053447 1694620 -452934
45563 -452934 -1603143 -1306578 -704181 -706912 -638897 491526 1852670 1415275 -1055973
45554 -1055973 -3235663 -3256866 -2045412 -1514313 -1777132 -1648985 -836821 87282 1144295
45545 1144295 2627609 3806166 3605261 2274037 947619 2109 -733184 -802174 124151
45536 124151 945375 479763 -454688 -362467 143130 -656111 -2191202 -2091342 -180354 981378
45526 981378 151933 -883243 -625361 -112894 -534549 -1119668 -964395 -748498 -1087725
45517 -1087725 -1254848 -1015481 -1549873 -2942489 -3067217 -920027 1159995 825180 -763872
45508 -763872 -1138905 -304396 285693 720766 1715028 2244860 1191120 94566 1074991
45499A074991J911236m0034j964994j225580L51979J93412p17388n59420l58279
45490a334077j350471j731092R4669J787485P40469j015684o1984K306428K077384
45481A513127p19589k176934q50939P24239Q24289N27635N75577J30661p45566
45472a97500p64329o4505j25480p66880l10773J094227J471034N20077o7719O1231
45462H49383l38514q75712K62778K359578K308222l43121k274048j529000m2263
45453C77303L77906P43703J709249J468712p68840k526776j838346l01954R6347
45444f62696J62123Q32485N07090j729514l118832j180922J758235J972234K74635
45435a185162K57646K003128K138344k90244k337194j879408j54867R89498J243285
$$ plain form
45499 1074991 2986227 2946193 981199 -244381 107598 301010 -416378 -975798 -1334077
45490 -1334077 -2684548 -4415640 -4320971 -2533486 -1793017 -2808701 -2870685 -564257 1513127
45481 1513127 793538 -1383396 -2234335 -1510096 -685807 -158172 417405 548066 -197500
45472 -197500 -961829 -1026334 -1151814 -1918694 -2229467 -1135240 335794 855871 788152 849383
45462 849383 510869 -364843 -102065 2257513 4565735 4222614 1948566 419566 377303
45453 377303 755209 1498912 3208161 4676873 3908033 1381257 -457089 -759043 -662696
45444 -662696 -500573 331912 839002 -890512 -4009344 -5190266 -3432031 -1459797 -1185162
45435 -1185162 -927516 1075612 3213956 2923712 586518 -1292890 -1447757 -458259 785026
45426G85026O44340q85845k162777j468238O97593J893039J215121K04933q2667
45417H40525m16245j176193j264637j77301R08501J025341N90360N4484p19321
45408c34486j173516k48969J455634J894829P50703R1267Q40128J071609o56680
45399C690519k638452k682630j444008q23737o86810K83093J596855J513786Q6131
45390a105253q16889m56807j6289k74800m98396j28013J44625k76965p88424o19075
45380d836286P881N06311R33069J535178J810014R58998p33646j733740r11379
45371b463600R32532J779669P45867q78590j374142p36871j85362k6059N72042
45362a634514J667507K038529J161391J92248N1935n8928r71194j668110p98354
$$ plain form
45426 785026 1429366 543521 -1619256 -3087494 -2389901 -496862 718259 923192 840525
45417 840525 424280 -751913 -2016550 -2193851 -1285350 -260009 330351 384835 -334486
45408 -334486 -1508002 -1756971 -301337 1593492 2344195 2435462 3275590 4347199 3690519
45399 3690519 1052067 -1630563 -3074571 -3898308 -4585118 -4302025 -2705170 -1191384 -1105253
45390 -1105253 -1922142 -2378949 -2395238 -2670038 -3168434 -3296447 -3151822 -3428787 -4217211 -4836286
45380 -4836286 -4828405 -4322094 -3389025 -1853847 -43833 915165 181519 -1552221 -2463600
45371 -2463600 -1531068 248601 994468 115878 -1258264 -1995135 -2180497 -2206556 -1634514
45362 -1634514 32993 2071522 3232913 3425161 3477096 3418168 2446974 778864 -19490
45353a9490Q38169J272674L89537n6561N85658R09394o8661j301358j450248p92751
45343C06363l77319l76500l28614j86326j12814J33037O83597R80322N84943P2030
45333A378719K14011P19886P31556K09031j82914k91343m98944o88153l46564
45324A245285K57092J91439o14106j130470q91964p09921j135692j393318p11872
45315d893527L25616Q02872Q82261R94475N81232p62478j646108l86059K106122
45306a995594L058733J652052j4104k72572p619m38023r47799o84396m68810j170297
45296a288429j658827n70292J017877J063963n2818j56918J088305J784248J082191
45287B309300K71022J46441j87962j076279j243779j67491N75393k32371j393987
$$ plain form
45353 -19490 818679 2091353 2480890 2424329 3009987 3919381 3850720 2549362 1099114 306363
45343 306363 -70956 -447456 -776070 -962396 -1075210 -942173 -258576 721746 1306689 1378719
45333 1378719 1592730 2312616 3044172 3253203 3070289 2778946 2280002 1591849 1245285
45324 1245285 1502377 1693816 1079710 -50760 -942724 -1652645 -2788337 -4181655 -4893527
45315 -4893527 -4567911 -3765039 -2882778 -1888303 -1307071 -2069549 -3715657 -4101716 -1995594
45306 -1995594 1063139 2715191 2701087 2428515 2420896 1982873 1035074 350678 -118132 -1288429
45296 -1288429 -2947256 -3517548 -2499671 -1435708 -1488526 -1645444 -557139 1227109 2309300
45287 2309300 2580322 2726763 2538801 1462522 218743 51252 626645 394274 -999713
45278i99713j231918r3917O05768N61208K95555q9409l97536K13990J665283K043886
45268B573197J42062k116860j919112M10189J804266O54715j431954k179606j190873
45259c253976L13844R39045J36959j165827j201222L43872J403373L90625j008575
45250c101882j41508K246979K866083J022444l48307M61557J349565L15382j043737
45241C626576m28660J052198O60629j438941k479698j409335r9220j17776p07574
45232a341801n77281J61745O75081P41724O59455O20363O40667N50110k0563j017516
45222A091984j524042q08249M16319Q32055M24154K93428O58190N47515k95297
45213A636057q00558m40331j76498o52474q55928J71606J425899J237869k30823
$$ plain form
45278 -999713 -2231631 -2325548 -1719780 -1158572 -863017 -952426 -1349962 -1135972 529311 2573197
45268 2573197 2715259 598399 -1320713 -910524 893742 1548457 116503 -2063103 -3253976
45259 -3253976 -2940132 -2001087 -1864128 -3029955 -4231177 -3887305 -2483932 -2093307 -3101882
45250 -3101882 -3243390 -996411 1869672 2892116 2543809 3005366 4354931 4670313 3626576
45241 3626576 3197916 4250114 4910743 3471802 992104 -417231 -516451 -634227 -1341801
45232 -1341801 -1919082 -1757337 -1082256 -340532 318923 939286 1579953 2130063 2109500 1091984
45222 1091984 -432058 -1240307 -823988 8067 432221 725649 1383839 1931354 1636057
45213 1636057 835499 395168 218670 -433804 -1289732 -1118126 307773 1545642 1314819
45204A314819j285458j087547l43580J44283K34472j30271q57513j044048J57272
45195b897571J793206J763925k66884k098472j888199l88301P12242J227826J785723
45186b56505J906167P07434j090491j838835j439712j270528j610107j114868
45178f007445O88468K240809K116051Q65060j70206n77020n66181k31978m683
45169a647125n66455j413350r20196J076825K330919J273129m86375n87290N42525
45160c97393Q15838M4403k29533J94336O3439n02162J11012J903644K636918J107674
45150E748176j152264k287316k230741j616663n77888M71552P35853N59647J124815
45141G75171J913029Q47493j938380l143874r40307J869740J713975p07131j945257
$$ plain form
45204 1314819 29361 -1058186 -1401766 -1257483 -1023011 -1153282 -2010795 -3054843 -2897571
45195 -2897571 -1104365 659560 392676 -1705796 -3593995 -3982296 -3270054 -2042228 -256505
45186 -256505 1649662 2357096 1266605 -572230 -2011942 -3282470 -4892577 -6007445
45178 -6007445 -5318977 -3078168 -962117 -97057 -267263 -844283 -1410464 -1642442 -1647125
45169 -1647125 -2213580 -3626930 -4547126 -3470301 -1139382 133747 -352628 -939918 -397393
45160 -397393 418445 462848 233315 427651 491090 -11072 99940 2003584 4640502 5748176
45150 5748176 4595912 2308596 77855 -1538808 -2116696 -1645144 -909291 -349644 775171
45141 775171 2688200 3535693 1597313 -1546561 -2486868 -617128 1096847 389716 -1555541
45132a555541r24210L29789K85248m32278p24062k80092O45959J211445L81909
45123a061833j275267j419145P42114K551084J602951l45118j47429J524795J441328
45114C613480n97781j554693m47593L29882m26722r00349j07989K63908n83327
45105d11184q21622L16012O43893r04088j702215K69667K601068K166509J03182
45096B261222m64859M04395L79740n70200m62762O56313P68080l02991o77569
45087A991369o5490k33201j471649j841540o68581K17482k40024n71547L69001
45078b514180J251918O02713o77402q69413o3655M22444J77642k60587p16669
45069b647189j368383j895396j724574q78072J13599Q53313J204343J208676J210439
$$ plain form
45132 -1555541 -2479751 -2149962 -1864714 -2296992 -3021054 -3301146 -2655187 -1443742 -1061833
45123 -1061833 -2337100 -3756245 -3014131 -463047 1139904 794786 647357 2172152 3613480
45114 3613480 3015699 1461006 1013413 1343295 916573 16224 -91765 172143 -411184
45105 -411184 -1232806 -916794 -272901 -1176989 -2879204 -2609537 -8469 2158040 2261222
45096 2261222 1796363 2200758 2580498 2010298 1547536 2203849 2971929 2668938 1991369
45087 1991369 1925879 1692678 221029 -1620511 -2289092 -2071610 -2311634 -2883181 -2514180
45078 -2514180 -1262262 -659549 -1336951 -2206364 -2270019 -1847575 -1669933 -1930520 -2647189
45069 -2647189 -4015572 -5910968 -7635542 -8513614 -8400015 -7546702 -6342359 -5133683 -3923244
45060c923244J554693J914401J526563L55649o30869o62825q4852J85368l39419
45051a04535j348127j934250j288374K90117J378800J097015L10402K93948Q37097
45042d67907R22922O19203O23188M63285p46303j978341j174226J241510K283002
45033A786333O78824j227100j111359J01779L43282l00351m72023j70536k45225
45024f16376l38019M46171J476856J295670L9284o95325k59942M05738M92623
45015B246680K23200j3230k06738l51053m58889p96720j251719r01840O92814
45006h17495K187197J749792m51324k246923j999526k00385J450610J728788O90500
44997B091234m92809n77619L79216R90848L04740r76747j552358j064423N37J055085
$$ plain form
45060 -3923244 -2368551 -454150 1072413 1428062 797193 134368 49516 234884 -104535
45051 -104535 -1452662 -3386912 -4675286 -4385169 -3006369 -1909354 -1598952 -1305004 -467907
45042 -467907 455015 1074218 1697406 2160691 1414388 -563953 -1738179 -496669 1786333
45033 1786333 2465157 1238057 126698 228477 571759 271408 -200615 -371151 -616376
45024 -616376 -954395 -508224 968632 2264302 2303586 1608261 1348319 1754057 2246680
45015 2246680 2469880 2456650 2249912 1898859 1439970 643250 -608469 -1510309 -817495
45006 -817495 1369702 3119494 2668170 421247 -1578279 -1778664 -328054 1400734 2091234
44997 2091234 1598425 1020806 1400022 2390870 2695610 1718863 166505 -897918 -897381 157704
44987A57704J373139L94128j084884j245932K07139J255707N74653l24111K81001
44978A588544J238624M61449j385550j902548p92493J70787M04704P58925Q70249
44969A412691m72364k233967j761221Q42871K156674L65964k080326k114654N5376
44960c828956K085194K472324J194413p57037j566851k23976J486874R12673j180650
44951E94008j286388J130228K281892O4509k390445j758773L52344O47561m07172
44942g72236k34998R34565Q84225k58611m47186L93539N38796j25511l13756l40220
44932B58607j377379k208981n12535K646765L429311Q26996j921903k312262j532647
44923b704028j311410j066647J28981J381560J565173J101802P12029J35615p38887
$$ plain form
44987 157704 1530843 1924971 840087 -405845 -198706 1057001 1631654 1307543 1588544
44978 1588544 2827168 3288617 1903067 519 -791974 -621187 -216483 542442 1412691
44969 1412691 940327 -1293640 -3054861 -2211990 -55316 310648 -1769678 -3884332 -3828956
44960 -3828956 -1743762 728562 1922975 1165938 -400913 -624889 861985 1774658 594008
44951 594008 -692380 437848 2719740 2784249 393804 -1364969 -1012625 -365064 -772236
44942 -772236 -1007234 -72669 811556 552945 105759 499298 1038094 912583 598827 258607
44932 258607 -1118772 -3327753 -3840288 -1193523 2235788 3062784 1140881 -1171381 -2704028
44923 -2704028 -4015438 -5082085 -4953104 -3571544 -2006371 -904569 -192540 -56925 -795812
44914g95812j156120q71567n93713l82336M81045J444257Q25937j128367j825509
44905d002185k06212J407502R06117n03105o31337L73886J087559J315478J414018
44896A161721P69860q44307j872030j133832m61j63803o51644L85100K140831
44887b08565K312248J005706M49885J095587J063987k66592j074365l26059L86549
44878D438381m57735j798866j727463l43323O56918M48246k06784l77765p7173
44869E54436J04183o6860j50495K58607O18021j29749j820863k598292j138559
44860d369571J292749K306898J512187O24043N64629K89573r54278j933124j196268
44851a863162N82691J441870P66472k33129n12080l88374m85663n86008k54653
$$ plain form
44914 -795812 -1951932 -2823499 -3417212 -3799548 -3318503 -1874246 -1048309 -2176676 -4002185
44905 -4002185 -4208397 -2800895 -1894778 -2397883 -3029220 -2655334 -1567775 -252297 1161721
44896 1161721 1931581 1087274 -784756 -1918588 -1919049 -2082852 -2734496 -2349396 -208565
44887 -208565 2103683 3109389 3559274 4654861 5718848 5452256 4377891 4051832 4438381
44878 4438381 3980646 2181780 454317 110994 767912 1216158 1009374 631609 554436
44869 554436 658619 591759 441264 699871 1317892 1188143 -632720 -3231012 -4369571
44860 -4369571 -3076822 -769924 742263 1366306 1930935 2220508 1266230 -666894 -1863162
44851 -1863162 -1280471 161399 927871 694742 182662 -205712 -691375 -1277383 -1532036
44842a532036J17967j10948n34746j10804J036511J479741O76812k8801L71798
44833A365494O63737n55300k027397j431563O31897J114140o94915j851047l42746
44824c127700J883816K254502J276873O11252j46235j804022k665592q02650J980125
44815e39631K164067q3637j280986k80336L94190o01150j247974k05539P01754
44806i79242Q3531k73486J118421K140995M67129k001291j816055L38104O94429
44797b27465j338197k151527J07398K424375J648851p03400j062827P67543J884631
44788A349382J078208J61771L41153K66844j065335j963178o66499J359386J319833
44779B181565n88184j541454o20959K2020p86235j066700P45514K675184K140189
$$ plain form
44842 -1532036 -1414069 -1525017 -2059763 -2170567 -1134056 345685 1022497 993696 1365494
44833 1365494 2029231 1473931 -553466 -1985029 -1353132 -238992 -933907 -2784954 -3127700
44824 -3127700 -1243884 1010618 2287491 2898743 2752508 948486 -1717106 -2519756 -539631
44815 -539631 1624436 1540799 259813 -20523 373667 -227483 -1475457 -1680996 -979242
44806 -979242 -895711 -1169197 -50776 2090219 2557348 556057 -1259998 -921894 -227465
44797 -227465 -1565662 -3717189 -3609791 -1185416 463435 -239965 -1302792 -535249 1349382
44788 1349382 2427590 2589361 2930514 3197358 2132023 168845 -497654 861732 2181565
44779 2181565 1593381 51927 -569032 -547012 -1333247 -2399947 -1654433 1020751 3160940
44770C160940J15415n24516M00353N50328p29511j564351j026202m45664o06562
44761f69770l72890Q21567J500519N16632j026802j595023j349231j138951q06506
44752d120455J45750J317547K005852K101820J602637L74356r04682r61985R9577
44743A660417N55502l28999j110292o61859k7904l44747p15011N883Q64612L63137
44733B60739q41298r63230N6683Q01447P64774M81851o9979j144836j799836q42927
44723c296612J079656K188364K018001J402181N82627o27614j318482m63243Q21858
44714B386736M44128j252058j769042l79990Q66255O18605J6256N4030j91227
44705G93693j255482j628212k81343J144410Q03119l22996j54083R78018J087987
$$ plain form
44770 3160940 3276355 2751839 3152192 3702520 2973009 1408658 382456 -63208 -669770
44761 -669770 -1042660 -221093 1279426 1796058 769256 -825767 -2174998 -3313949 -4120455
44752 -4120455 -3974705 -2657158 -651306 1450514 3053151 3427507 2522825 1560840 1660417
44743 1660417 2215919 1886920 776628 114769 86865 -257882 -972893 -967010 -102398 260739
44733 260739 -580559 -1543789 -1487106 -685659 79115 560966 490987 -653849 -2453685 -3296612
44723 -3296612 -2216956 -28592 1989409 3391590 3974217 3346603 2028121 1564878 2386736
44714 2386736 2830864 1578806 -190236 -570226 296029 914634 930890 984920 793693
44705 793693 -461789 -2090001 -2371344 -1226934 -423815 -746811 -900894 77124 1165111
44696A165111P5201j76916P97302J126409k08659j438095o06817J328412J681859
44687C743807k42942k183997j848804L45106K079176J970811O92539n09095j305779
44678B740822j874544j913985j030270K75478R85708Q77169O16097N62943L83490
44669A622908l2223k17863k5172J2032l23793l83037K78553R47464O30062n33099
44659A975832j438227j362208n58603K86096O68276M85226P7239o7075O0761n6424
44649G0893n37824o00899L77188J655052J862982Q39525k31243o24684r02939
44640A908051j459022j435746j89662J084123P82089m73448n29934Q30315J255699
44631A772465m73147k225915j658220K32040R26140L35869J36422J45244j164204
$$ plain form
44696 1165111 1240312 1063396 1860698 2987107 2778448 1340353 733536 2061948 3743807
44687 3743807 3500865 1316868 -531936 -186830 1892346 3863157 4555696 4046601 2740822
44678 2740822 866278 -1047707 -2077977 -1802499 -816791 60378 676475 1239418 1622908
44669 1622908 1590685 1372822 1347650 1359682 1035889 652852 931405 1878869 2508931 1975832
44659 1975832 537605 -824603 -1383206 -1097110 -428834 56392 133631 66556 127317 70893
44649 70893 -466931 -1067830 -690642 964410 2827392 3666917 3435674 2810990 1908051
44640 1908051 449029 -986717 -1176379 -92256 689833 216385 -313549 516766 1772465
44631 1772465 1299318 -926597 -2584817 -2352777 -1426637 -1090768 -954346 -809102 -1973306
44622a973306k727560j427673K473306M345770J664807j993563k213110P718P75412
44613a068199k97445m41794Q36029J167376J6602k37212J349241K457947J272995
44604E055540q72597j956373j881416j330870l02664Q05697O80262q62463j990702
44595b655586j335556J67615J027776J184753J134852P40472J52955L18582J269465
44586B005328J487067L14781o35515l8379Q09777J05438j362825j384091K52998
44577A554579J597642J381323K20147q20236j325130j262641q33759n58476o76890
44568g23441p12992k65977K98256N45267N95982M39539l43520j388542j296862
44559b852290L47117J890430J774289O47171J3242j7195j00489J9783P51675J193966
$$ plain form
44622 -1973306 -4700866 -6128539 -3655233 690537 2355344 361781 -1851329 -1843611 -1068199
44613 -1068199 -1365644 -1807438 -971409 195967 212569 -24643 1324598 3782545 5055540
44604 5055540 4182943 2226570 345154 -985716 -1288380 -482683 197579 -664884 -2655586
44595 -2655586 -3991142 -3823527 -2795751 -1610998 -476146 264326 417281 735863 2005328
44586 2005328 3492395 3807176 3171661 3133282 3943059 4048497 2685672 1301581 1554579
44577 1554579 3152221 4533544 4753691 3933455 2608325 1345684 511925 -46551 -723441
44568 -723441 -1436433 -1702410 -1404154 -858887 -262905 176634 -166886 -1555428 -2852290
44559 -2852290 -2505173 -614743 1159546 1806717 1819959 1802764 1702275 1722058 2473733 3667699
44549C667699L73355q21453q83353j90018k45178r88308j021985j85688L00662
44540E733J63752L83236J075381J166306M51756n046R3048k21616j163629j587166
44530C61755j050851o36192q41497m41830J335140K953887K375307j25445k236827
44521A693447k260067n51992J294814J922301J096202k48572q84171m59508K94454
44512A896908M92624n9080q54145j164622o62739J27421L12417j21305j44980
44503a77501P11970J436181J068878K68483J00491J10454p49507j843986j473890
44494e48427K87381J325829M54533j005409j224746j28191R96129J163492M36479
44485A757070l16791k12170N50359O77427l52581j123140k93103R89163N84893
$$ plain form
44549 3667699 4041054 3219601 2336248 2146230 1901052 912744 -109241 -294929 5733
44540 5733 169485 552721 1628102 2794408 3246164 3241118 3334166 3112550 1948921 361755
44530 361755 -689096 -1325288 -2166785 -2608615 -1273475 1680412 4055719 3930274 1693447
44521 1693447 -566620 -1118612 176202 2098503 3194705 2946133 2061962 1602454 1896908
44512 1896908 2389532 2330452 1476307 311685 -351054 -223633 88784 -32521 -177501
44503 -177501 534469 1970650 3039528 3308011 3408502 3518956 2769449 925463 -548427
44494 -548427 -261046 1064783 1519316 513907 -710839 -839030 157099 1320591 1757070
44485 1757070 1440279 1228109 1778468 2455895 2103314 980174 687071 1676234 2261127
44476B261127j192808j918649q17058K50509J4302l86222K69963J258354J387248
44467A126766P75276K5577q33629j543510j241858P5352J110425J161828R78312
44458A634539R30947J48473j437671k093651q13676Q26473R66326J06564k07517
44449F0807J16836L67287Q00058J718208J933430L86156j516869j474112K65646
44440B657447J234196L36397r75511j202603n68564L4309K46755m8698q87516
44431H26212j631236j295128R7468J323258J448000Q26374L70003L78658L66951
44422B710560j86550j027127j210002l83361L10321l54227j468818q13068J662691
44413g59581L122641J759601m92995r33296p8589l12180j737792k169026q43130
$$ plain form
44476 2261127 1068319 -850330 -1667388 -1416879 -1402577 -1788799 -1518836 -260482 1126766
44467 1126766 1902042 1927619 1093990 -449520 -1691378 -1616026 -505601 656227 1634539
44458 1634539 2565486 2713959 1276288 -817363 -1631039 -804566 161760 268324 60807
44449 60807 177643 544930 1344988 3063196 4996626 5382782 3865913 2391801 2657447
44440 2657447 3891643 4228040 3252529 2049926 1481362 1515671 1762426 1713728 826212
44431 826212 -805024 -2100152 -2002684 -679426 768574 1594948 1964951 2343609 2710560
44422 2710560 2524010 1496883 286881 -96480 213841 -140386 -1609204 -2422272 -759581
44413 -759581 2363060 4122661 3629666 2696370 2617781 2305601 567809 -1601217 -2444347
44404b444347N57785P57820L63134N3959m96735j185114r23718M84738J499564
44395a332914R44032k55206m57861M94320J417872J433693O54522k86019p45478
44386A866961m48977K13151N18227K28043k35343m60075m72347m66225n03407
44377B40008m97386k49614L15101P70462N29327j62056l08256L10223O59272J85364
44367A792445j50292L66229O90981j80327j101829m93638P53082N26160q40396
44358A362415q88320Q55528J896608P10450q74919o08470Q90195J448665N65439
44349E357591l91786m56468r4248k03266r47499j523322r13375P60932J864078
44340C452637J073348o91878j378158o05519J59292J13120n7431p586l43105r38761
$$ plain form
44404 -2444347 -1886562 -1128742 -765608 -711649 -1208384 -2393498 -3317216 -2832478 -1332914
44395 -1332914 -388882 -644088 -1101949 -607629 810243 2243936 2898458 2612439 1866961
44386 1866961 1417984 1631135 2149362 2377405 2142062 1681987 1209640 743415 240008
44377 240008 -257378 -506992 -191891 578571 1107898 945842 637586 947809 1607081 1792445
44367 1792445 1642153 2008382 2699363 2519036 1417207 923569 1676651 2202811 1362415
44358 1362415 474095 1329623 3226231 3936681 3061762 2453292 3343487 4792152 5357591
44349 5357591 4965805 4509337 4415089 4211823 3264324 1741002 827627 1588559 3452637
44340 3452637 4525985 3834107 2455949 1850430 2009722 2122842 2065411 2057825 1714720 775959
44330G75959p35918J33966K08173n24088j56954J599652K105293n5210k122895
44321A227978j027892J785619K494425N23089j240349j152929m43104k14449K8183
44312A980571L89965n1972j064228r02505Q12799K030080J254292l29879j009169
44303C109954j012266j293507j430213o02601M26987K85460o59073p75157K59452
44294a690964J107945J012278O98142P01996L86155o13184j276703o73703L32478
44285a5560J69352j037557j466324r7269J917586K775089K033409N95113n67997
44276D305842j000539o62351m7452m3865q91951j574325j078549P861K18166n58285
44266a325448q26825J91555J251974R22039k19014l62489R74566K316690K196147
$$ plain form
44330 775959 40041 174007 382180 -141908 -298862 1300790 3406083 3350873 1227978
44321 1227978 200086 1985705 4480130 5003219 3762870 2609941 2166837 1952388 1980571
44312 1980571 2370536 2318564 1254336 351831 1164630 3194710 4449002 4119123 3109954
44303 3109954 2097688 804181 -626032 -1228633 -801646 -516186 -1175259 -1950416 -1690964
44294 -1690964 -583019 429259 1127401 1829397 2215552 1602368 325665 -348038 -15560
44285 -15560 153792 -883765 -2350089 -2447358 -529772 2245317 4278726 4873839 4305842
44276 4305842 3305303 2642952 2595500 2551635 1659684 85359 -993190 -985329 -767163 -1325448
44266 -1325448 -2152273 -1960718 -708744 213295 -5719 -368208 606358 2923048 5119195
44257E119195Q51043l86767q19122r38138j359854j744059j244041O0280Q91254
44248D29791M20073m04124r7975J073309J307310m4688j327118q72323O39191
44239A123446J243416M26267n38472p33207o78069r84503j142275m28220P14829
44230i96788J186474Q58827O99759J094963J018950m00063k149094k313137o89073
44221a689182Q06241O92454k89123o66485l95112l61398n57042k16149O10189
44212b065607J070125R81231R22527R00973L38970n10581n93840K21220Q55521
44203B120539P95383P06539Q26380L21417j004221j869804j388103m66470k61716
44194b20056m36565j27094M50920O26240N27734M26512k14966j575281k224364
$$ plain form
44257 5119195 5970238 5583471 4764349 3826211 2466357 722298 -521743 -461463 429791
44248 429791 849864 445740 347765 1421074 2728384 2683696 1356578 484255 1123446
44239 1123446 2366862 2793129 2254657 1521450 843381 -141122 -1283397 -1711617 -996788
44230 -996788 189686 1048513 1748272 2843235 3862185 3462122 1313028 -1000109 -1689182
44221 -1689182 -882941 -190487 -479610 -1146095 -1541207 -1902605 -2459647 -2675796 -2065607
44212 -2065607 -995482 -14251 908276 1809249 2148219 1637638 1043798 1265018 2120539
44203 2120539 2915922 3622461 4448841 4770258 3766037 1896233 508130 41660 -220056
44194 -220056 -656621 -783715 -332795 293445 821179 1247691 1032725 -542556 -2766920
44185b766920p82296J664531K591829J367674j18243l18112P9365k79363j196459
44176B42006j277574N866J498910J737780P00185k81324l80536l43960j034297
44167H67056j622121o70176J201688J640311K2661j367938o98998P13483O55997
44158G41963n65803r57949m6846Q55691J013442Q86636O99197K39422p8731L10285
44148C097307P29688O9952j114487j167238p2698L08664q03760j757684r15778
44139a626034R86906J938957J148011m30021j430256j303065n75302j89433l35672
44130a815909j66383P98579J526265P99917o95560j014568L68608J925396K263121
44121C989466J559808N26627o32933j645414j780186q13783M43509J138374J164143
$$ plain form
44185 -2766920 -3549216 -1884685 707144 2074818 1956575 1638463 1717828 1438465 242006
44176 242006 -1035568 -1029702 469208 2206988 2907173 2625849 2245313 1901353 867056
44167 867056 -755065 -1425241 -223553 1416758 1439419 71481 -627517 85966 741963
44158 741963 176160 -781789 -828635 27056 1040498 1927134 2626331 2865753 2787022 3097307
44148 3097307 3826995 3896947 2782460 1615222 1542524 1851188 1047428 -710256 -1626034
44139 -1626034 -639128 1299829 2447840 2017819 587563 -715502 -1290804 -1480237 -1815909
44130 -1815909 -1982292 -1183713 342552 1142469 446909 -567659 -199051 1726345 3989466
44121 3989466 5549274 6075901 5442968 3797554 2017368 1203585 1647094 2785468 3949611
44112C949611O56980l32953j222733r69278N25515J850211J665301K93232r31573
44103E484313j400511j553362j723798j518104o14272L73126N10560J8895K52374
44094a70779J582536K225605O17777j636769j403614J265812K734245J125973
44086F340786p76302k5020J760056J213350j196909k119539p69882M71607N78625
44077E476772J062798K239853K074679j29428k067666j802113j65820J311839
44069H000914K298119K435981R73493j105313j256765Q75838K466242J707538
44061A6396047L24737K63906P06916M12188K55718J034470J324595J94071m07139
44052B0505509J066480K415869J057058j306215j257752N66751N54566j751407
$$ plain form
44112 3949611 4606591 4273638 3050905 2081627 2607142 4457353 6122654 6415886 5484313
44103 5484313 4083802 2530440 806642 -711462 -1325734 -952608 -442048 -423153 -170779
44094 -170779 1411757 3637362 4255139 2618370 1214756 2480568 5214813 6340786
44086 6340786 5564484 5539464 7299520 8512870 7315961 5196422 4426540 4898147 5476772
44077 5476772 6539570 8779423 10854102 10724674 8657008 6854895 6689075 8000914
44069 8000914 10299033 12735014 13708507 12603194 11346429 12222267 14688509 16396047
44061 16396047 16720784 16984690 17691606 18103794 18359512 19393982 20718577 20912648 20505509
44052 20505509 21571989 23987858 25044916 23738701 22480949 23047700 23602266 21850859
44044B1850859k980887j595830q4334m98997j433159j078808l63380r65585k240012
44035A0609867k269799q74601K57729L3354p48570o29982N90313J475531O65449
44026I109291j143655j746843l25771J295956J151096k37687r73937n38364R1398
44017F681484K86784J53927k88923q21037o23379L14593L41478j477731l139963
44008A427233k133455O76344K136984J323928K52841K39793M33356K66673M95423
43999E119120J039501M70443j251610j937780m19510J423741J373845q7753r59165
43990D770832n72553J88818N17524K62646m00605r86298j004741p13492p46030
43981A316101q35093j49993Q92575P64023p05343j664710q82986M86385P69418
$$ plain form
44044 21850859 18869972 17274142 17189808 16690811 15257652 14178844 13815464 12849879 10609867
44035 10609867 8340068 7465467 7723196 7756550 7007980 6377998 6968311 8443842 9109291
44026 9109291 7965636 6218793 5893022 7188978 8340074 8102387 7128450 6590086 6681484
44017 6681484 6968268 7122195 6833272 6012235 5388856 5703449 6044927 4567196 1427233
44008 1427233 -706222 -29878 2107106 3431034 3683875 3923668 4357024 4623697 5119120
43999 5119120 6158621 6629064 5377454 3439674 3020164 4443905 5817750 5729997 4770832
43990 4770832 4198279 4387097 4904621 5167267 4766662 3780364 2775623 2062131 1316101
43981 1316101 481008 331015 1223590 1987613 1282270 -382440 -1265426 -779041 -9623
43972i623L2665n79995n93676k46845K17948M20663p3203q42054p91442J71058
43962b294504Q09169M72729P699J02301J85016k06774m33171q0270J45563j51714
43952a443956j76465M60880P71741J79773k72918J69703M62038l04068r96899
43943a150171k85329J009108J359974J072787J242299J315723J28806j419434
43935C273763j341383J10456O63470l30088r25996J89582J672437J659120L19150
43926E290511p88360q74621n26099o63602j402580j797649r10501O07774Q25651
43917b39476p60064j876100l22782K660528L815963K216110O4373p60309o66854
43908D131389n08448j15616L99452o6999j673297k589530j383885P32165J522520
$$ plain form
43972 -9623 23042 -556953 -1150629 -1397474 -1179526 -758863 -832066 -1674120 -2465562 -2294504
43962 -2294504 -1485335 -1012606 -1004907 -902606 -717590 -924364 -1357535 -1437805 -1292242 -1443956
43952 -1443956 -1620421 -1159541 -387800 -208027 -480945 -311242 150796 -153272 -1150171
43943 -1150171 -1435500 -426392 933582 2006369 3248668 4564391 4693197 3273763
43935 3273763 1932380 2042836 2706306 2376218 1450222 1639804 3312241 4971361 5290511
43926 5290511 4502151 3627530 3101431 2437829 1035249 -762400 -1672901 -1065127 -239476
43917 -239476 -999540 -2875640 -3198422 -537894 3278069 5494179 5558552 4798243 4131389
43908 4131389 3622941 3507325 3906777 3839778 2166481 -423049 -1806934 -1074769 447751
43899D47751P07133j33007l3413M07443L61290j28400m70319k43937M23190Q18558
43889B156289K45736r91979j647273r80698L46779J268624J568049J549185J137499
43880D652211J79859p92248r91592l60161N35948J250739J429211N92434j033750
43871E462651j929686q60167J079347J477870q8064j334743n70249Q08788M64661
43862D510408j327892k095152p95325Q11801P95575m77091j327778j122392n77073
43853a604919l22179k27388R512M01634P97218R65709O86561J66592O9071N97596
43843A539407R26708K81272p31965q09824J67340J006143J035805R15787J207807
43834E538480J281345M52747o30877p83078q813N77640M13833R3720J60983J56313
$$ plain form
43899 447751 1154884 1021877 988464 1395907 1757197 1628797 1158478 914541 1337731 2156289
43889 2156289 2402025 1410046 -237227 -1217925 -871146 397478 1965527 3514712 4652211
43880 4652211 4832070 4039822 3048230 2688069 3224017 4474756 5903967 6496401 5462651
43871 5462651 3532965 2672798 3752145 5230015 5141951 3807208 3236959 4045747 4510408
43862 4510408 3182516 1087364 292039 1103840 1899415 1422324 94546 -1027846 -1604919
43853 -1604919 -1927098 -2154486 -2144974 -1743340 -946122 19587 706148 872740 941811 1539407
43843 1539407 2466115 2747387 2015422 1205598 1372938 2379081 3414886 4330673 5538480
43834 5538480 6819825 7272572 6641695 5858617 5849804 6427444 6841277 6934997 7095980 7252293
43824G252293o03357j757207k104738j145199R6247K11824p92636j433097o58187
43815i34057P73959J349725P75415J16268J43695M36285K91304k26271n24775
43806B201548l08180J71379M18428J17803n07686p97264l96873K72458O60450
43797A832063Q53371J112049J084732L82276l81074k35035N78210Q54327K44274
43788F325193m01337n74247o48458o44935J28800J727347L103606L439248K750552
43779A5205769R81441j867958m301780m025232j093081J453627J356777j36111
43771G573452p02443l25380l91230r01817p93459j07363K52403L19756P81882
43762E705801J439716J600605J370634J027371M9285j490104j747431M10425K797702
$$ plain form
43824 7252293 6648936 4891729 2786991 1641792 1738039 1949863 1157227 -275870 -934057
43815 -934057 -160098 1189627 1965042 2081310 2225005 2661290 2952594 2726323 2201548
43806 2201548 1893368 2064747 2483175 2600978 2093292 1296028 899155 1171613 1832063
43797 1832063 2685434 3797483 4882215 5264491 4883417 4648382 5226592 6080919 6325193
43788 6325193 5923856 5349609 4701151 4056216 4185016 5912363 9015969 12455217 15205769
43779 15205769 16187210 14319252 10017472 5992240 4899159 6352786 7709563 7573452
43771 7573452 6871009 6545629 6154399 5252582 4459123 4351760 4604163 4923919 5705801
43762 5705801 7145517 8746122 10116756 11144127 11193412 9703308 7955877 8366302 11164004
43753A1164004K467934J40478r28307q6067R9729j410087k350443j225207J32880
43744H004914j39103q14664L0881J597435J734932L69768p19185p36425m99742
43735H828811o61932r10131p69107j12775Q60720J427960O92188j105960k302989
43726E946785j636355K69042J882511K436168J946376N68856j101631j904732
43718H407020j307251j48956N38470P23131P23086L63111l37236o40535k68233
43709H052607r6515n82908o17270O61324J956044J465245k85828j133740l85415
43700I033544O22319Q84125P59844N44869j56939j192630j577013j042052n50026
43691G326041o93667q15305l17014L39396O24241Q03294J022249O11552o87949
$$ plain form
43753 11164004 13631938 13772416 12844109 12758042 12857771 11447684 9097241 7872034 8004914
43744 8004914 7865811 7051147 7082028 8679463 10414395 10784163 10064978 9328553 8828811
43735 8828811 8166879 7256748 6487641 6374866 7235586 8663546 9355734 8249774 5946785
43726 5946785 4310430 4579472 6461983 8898151 10844527 11413383 10311752 8407020
43718 8407020 7099769 6950813 7489283 8212414 8935500 9298611 8961375 8320840 8052607
43709 8052607 7956092 7373184 6755914 7417238 9373282 10838527 10552699 9418959 9033544
43700 9033544 9655863 10539988 11299832 11844701 11687762 10495132 8918119 7876067 7326041
43691 7326041 6632374 5817069 5500055 5839451 6463692 7266986 8289235 8900787 8212838
43682H212838j680663j063878P01148J931241J794676Q90434M5549m80045o92531
43673I658769o60596o28175o35771j71355J003671J891131J225174n40956j443823
43664I698069n71506Q03937J274798J214383J618534K176536J982934J407677
43656A9605362J512804J958923J375760j20814p34792J73928R50853K94500o86796
43647B4329728m34964M72663M12280n93075j117769p45959m47505p19746j002658
43638B0152995j000398j072365j075282k13512J500715K787877K667264J643211
43630B5390505Q47128O88032Q18963R31122J118972J607383K261484K416147J558461
43621C7638197L04142J742R61878J931638J962359J772411K293614K999200L088962
$$ plain form
43682 8212838 6532175 5468297 6169445 8100686 9895362 10785796 10831345 10351300 9658769
43673 9658769 8998173 8369998 7734227 7562872 8566543 10457674 11682848 11141892 9698069
43664 9698069 9126563 9930500 11205298 12419681 14038215 16214751 18197685 19605362
43656 19605362 21118166 23077089 24452849 24332035 23597243 23771171 24722024 25016524 24329728
43647 24329728 23894764 24367427 24779707 24186632 23068863 22322904 21875399 21155653 20152995
43638 20152995 19152597 18080232 17004950 16791438 18292153 21080030 23747294 25390505
43630 25390505 26237633 26925665 27744628 28675750 29794722 31402105 33663589 36079736 37638197
43621 37638197 37942339 37944081 38905959 40837597 42799956 44572367 46865981 49865181 52954143
43612E2954143L311358M779783O683800P228261O524944O519461Q146357J0539243
43604A06687350J3064944J6117453J9746288K3498072K7741210L2800391L6153072
43597B75808780L2837415K0141880Q56951j8687432l2751641l8643536l7379048
43590B02183369l2788239k8457481k4916082k0820714j6297688j2908743j0693214
43583E5301208q164674n447482m325059m657033m098197k278974j674453k932474
43575B1722862l131692p60186J278991L26932j773502k174525j607055j939115
43567A1942710k044832j63753J941739J505006l13928l72826R11684M44177j938819
43558A1911158l214723k315749j320575j322975r82087L25941J340972J437681
$$ plain form
43612 52954143 56265501 61045284 67729084 74957345 81482289 88001750 96148107 106687350
43604 106687350 119752294 135869747 155616035 179114107 206855317 239655708 275808780
43597 275808780 308646195 328788075 329645026 310957594 278205953 239562417 202183369
43590 202183369 169395130 140937649 116021567 95200853 78903165 65994422 55301208
43583 55301208 47136534 41689052 37363993 32706960 28608763 26329789 24655336 21722862
43575 21722862 18591170 17830984 19109975 19436907 17663405 15488880 13881825 11942710
43567 11942710 9897878 9734125 11675864 13180870 12866942 12494116 13405800 13849977 11911158
43558 11911158 8696435 6380686 5060111 3737136 2755049 3080990 4421962 5859643
43550E859643J345027J122702K70230k56383Q17228K203828J639640P68P8445
43541A3081128J482432J101332j065667j236684J928346N044706N629727N638066
43533C1603386P212238Q990818R198743Q598680P477192L378074m522369j1711450
43525F0225312j3053785r420131o038329n587533o267336n775589m007628k036162
43517H038819p94901o92071j063090o32393M22013K41170j648298k924064j827996
43508h80811P2499N91182L54139R46947J534468M73633j069460n39323J648436
43499C131710K466054Q44936j100259j565090j067295n96876j64041K44138K38582
43490B431859O8855M51769J099690R88207J90788j82773M2838j06544q30118j110155
$$ plain form
43550 5859643 7204670 8327372 8597602 8341219 9158447 11362275 13001915 13002683 13081128
43541 13081128 14563560 15664892 14599225 13362541 15290887 20335593 25965320 31603386
43533 31603386 38815624 47806442 57005185 65603865 73081057 76459131 71936762 60225312
43525 60225312 47171527 37751396 31713067 26125534 19858198 14082609 10074981 8038819
43517 8038819 7243918 6551847 5488757 4856364 5278377 5519547 3871249 947185 -880811
43508 -880811 -808312 -217130 137009 1083956 2618424 3092057 2022597 1483274 3131710
43499 3131710 5597764 6442700 5342441 3777351 2710056 2113180 1949139 2193277 2431859
43490 2431859 2500714 2952483 4052173 5040380 5231168 5048395 5091233 4984689 4154571 3044416
43480C044416n40828n3716l47942q76150q35059j52666P54478J333223J034889
43471C360645K5284m81800L38189J499505J468092M53550o0274J98641K0219j000428
43461E821623j662601j111026j19548J95141j91644o35608p75344n91903k45539
43452F83551j52562n62501r13552l18222J155702K319780K125064O69880r72999
43443D034141j588214q06722L48302M26976n35902r12629J22414J222133R11131
43434C221630j60653m49856l1566j34961p99125q32649J10799J020778J026292
43425B970689J65632j052547j756724j021374O78902J223984l80756k014956j196260
43416b383410J146283K038024Q88182j19705K72711J061014J303112J078721O5400
$$ plain form
43480 3044416 2503588 2449872 2101930 1225780 390721 238055 992533 2325756 3360645
43471 3360645 3385929 2904129 3242318 4741823 6209915 6663465 6603191 6801832 6822051 5821623
43461 5821623 4159022 3047996 2928448 3123589 2931945 2296337 1520993 929090 683551
43452 683551 530989 -31512 -945064 -1263286 -107584 2212196 4337260 5007140 4034141
43443 4034141 2445927 1639205 1987507 2414483 1878581 965952 1088366 2310499 3221630
43434 3221630 3060977 2611121 2579555 2444594 1645469 812820 923619 1944397 2970689
43425 2970689 3136321 2083774 327050 -694324 -15422 1208562 827806 -1187150 -2383410
43416 -2383410 -1237127 800897 1689079 1569374 1842085 2903099 4206211 5284932 5350332
43407E350332k039142l507746k059790J169703K355961N30609r54626J64633J659176
43398B669110Q79510r47010j245309l70632k65746p23638j99143Q84247P72540
43389A453929l43511n85290L30239O72842l48482j469518j502832p16520K51210
43380b257933J246943J975254J830076P74888n00249j425958j812020j461223
43372a630222m16234O31319J042982J037661J003483O19671k79539o96961K11563
43363A523723J368445J063691k67588n37659N87055R21829p81858k578332k022359
43354g23053K36889J429406O01902l99883k4589P70400L67203p84647q63445M21917
43344A032100J364434R18467J82325M00714R30540N67382j75354J22155J282893
$$ plain form
43407 5350332 3311190 -196556 -2256346 -1086643 1269318 1799927 845301 1009934 2669110
43398 2669110 3548620 2601610 1356301 985669 719923 -3715 -202858 681389 1453929
43389 1453929 1110418 525128 855367 1528209 1179727 -289791 -1792623 -2509143 -2257933
43380 -2257933 -1010990 964264 2794340 3569228 3068979 1643021 -168999 -1630222
43372 -1630222 -2046456 -1415137 -372155 665506 1668989 2288660 2009121 1312160 1523723
43363 1523723 2892168 3955859 3688271 3150612 3737667 4659496 3877638 1299306 -723053
43354 -723053 -486164 943242 1545144 1145261 1120672 1891072 2258275 1473628 610183 1032100
43344 1032100 2396534 3315001 3497326 3898040 4828580 5395962 5220608 5342763 6625656
43335F625656J747379J108366M96013L43219j83595j075953r23339O15341J722251
43326A0475338J072599j07614j14852N61531L35427q34009j650125j546970r47198
43317G244127j22927O78551O20674o33306j755271j269955J98324Q09067K74500
43308F043784O133O06430R93199L17640p44742j115898o31462J67220P03474N89676
43298F935454r1079o66330o93569o86384j205474j595824p88300Q37136J703543
43289C749173J202644L08853j85750p01827j578685j941011q41340J056221J907399
43280B975677Q27167r57470j424836j56468J036901L48270j557475k332931j147042
43271b388207L60326P72938Q23867J484416J804574N41731j231538j392278m0980
$$ plain form
43335 6625656 8373035 9481401 9977414 10320633 10137038 9061085 8137746 8753087 10475338
43326 10475338 11547937 11440323 11325471 11887002 12222429 11388420 9738295 8191325 7244127
43317 7244127 7121200 7799751 8420425 7787119 6031848 4761893 4960217 5769284 6043784
43308 6043784 6049917 6656347 7649546 7967186 7222444 6106546 5475084 5642304 6345778 6935454
43298 6935454 6844375 6178045 5484476 4798092 3592618 1996794 1208494 2045630 3749173
43289 3749173 4951817 5260670 5074920 4373093 2794408 853397 12057 1068278 2975677
43280 2975677 3802844 2845374 1420538 1264070 2300971 2649241 1091766 -1241165 -2388207
43271 -2388207 -2027881 -1254943 -431076 1053340 2857914 3399645 2168107 775829 734849
43262G34849P59987L14513P5942Q96130J671530J364740N30105P68m30407j132036
43252D786121j626805j307376l43295O40395J087972O07361n43798j135662l05432
43243A859481Q98850P52412m73103q58739L0614M60804m82825j402667j108996
43234c24169n83360r78996j418247n54399R76528J526314R82706N72288O68151
43225H66816M68268l26560r19476n98384M16405J374394J704662J426934J103521
43216E516580J037605N74622r14991k381136j888888M76563K135260J343233n79522
43207E319326j511877j415672j407646j426615p92393j6295L4212J7971J051334
43198a47655K300076J849285k21126j757288j563779n29508L76177J178070J630470
$$ plain form
43262 734849 1494836 1809349 1885291 2781421 4452951 5817691 6347796 6348564 5918157 4786121
43252 4786121 3159316 1851940 1508645 2149040 3237012 3844373 3300575 2164913 1859481
43243 1859481 2758331 3510743 3037640 2178901 2209515 2670319 2187494 784827 -324169
43234 -324169 -907529 -1886525 -3304772 -3859171 -2882643 -1356329 -373623 198665 866816
43225 866816 1335084 1008524 89048 -509336 -92931 1281463 2986125 4413059 5516580
43216 5516580 6554185 7128807 6213816 3832680 1943792 2420355 4555615 5898848 5319326
43207 5319326 3807449 2391777 984131 -442484 -1234877 -1251172 -1216960 -1198989 -147655
43198 -147655 2152421 4001706 3780580 2023292 459513 -69995 306182 1484252 3114722
43189C114722R44227n19930j104914k62594N04408J1934q57654q67370l99445
43180E63384l15327r5284J116387K352866J688044p35730k314439j278444Q90706
43171A872163J406594j57375j497112q99519M78464N74524l66107k42709J427617
43162B596540K483628J307669p23893j324029m23733M71471R03318J367657J371957
43153H030585k8455j966432k419492j310117o50730j207452j417246l77728N14663
43144h32404J19414m98968j88951K75268M4378J13965J324663K193932J154949
43135C706246m87517m99826N52470M61781n89462m80597O68742M07179j475040
43126B263976j949316L21462K426964J658967l96324q73905l28314j130967k767888
$$ plain form
43189 3114722 4058949 3539019 2434105 2171511 2675919 2687853 1830199 962829 563384
43180 563384 248057 152773 1269160 3622026 5310070 4574340 2259901 981457 1872163
43171 1872163 3278757 3121382 1624270 724751 1203215 1777739 1411632 1168923 2596540
43162 2596540 5080168 6387837 5663944 4339915 3916182 4387653 5290971 6658628 8030585
43153 8030585 8002130 6035698 3616206 2306089 1655359 447907 -969339 -1347067 -832404
43144 -832404 -712990 -1211958 -1400909 -1125641 -1081263 -967298 357365 2551297 3706246
43135 3706246 3218729 2718903 3271373 3733154 3143692 2663095 3331837 3739016 2263976
43126 2263976 314660 636122 3063086 4722053 4325729 3451824 3123510 1992543 -775345
43117g75345k447730P2881J827692J204132L4808J71558P46355L56037k96775
43108H93613J25730J089070J148328L47735k26111m86091j058087j534220r73571
43099f73604J44298M65256K05750R06850K418664K438245N6965k339426k299470
43090A323528p44413j99515q41143p09860O62785J388302L29002j100924j158198
43081a050436j84436L41109N6120j73696K00978P66412Q21603J07103r48779j453787
43071a517809r01182Q4257M27215Q0365k4671L82590M78013m7025k42960M65257
43061h15950J153901R35376M39113N12017N82689j18813p32074q5816Q84569K74561
43051C029573j524253k082445o49042P75685P13710K18537N06961P70174p180
$$ plain form
43117 -775345 -3223075 -3150194 -1322502 -118370 -83562 87996 834351 1190388 893613
43108 893613 1019343 2108413 3256741 3604476 3378365 2892274 1834187 299967 -673604
43099 -673604 -529306 -64050 141700 1048550 3467214 5905459 5962424 3622998 1323528
43090 1323528 579115 379600 -461543 -1171403 -508618 879684 1208686 107762 -1050436
43081 -1050436 -1234872 -893763 -837643 -1011339 -810361 -43949 777654 884757 -64022 -1517809
43071 -1517809 -2418991 -2334734 -1907519 -1827154 -1851825 -1469235 -991222 -1038247 -1281207 -815950
43061 -815950 337951 1273327 1712440 2224457 2807146 2688333 1956259 1870443 2755012 3029573
43051 3029573 1505320 -577125 -1226167 -450482 263228 481765 988726 1758900 1751720
43042A751720q27907l07842P29421M83046p10301p48745Q54222K047344J155683
43033D426641r17269k123168j716805m67446P37048J584448J962200J649236N72501
43024E707386q22995j662993j347252k54308N30293L63186l57515q49635p46130
43015E60037p8041Q87062J452324Q90031m32554j097395m85740K46055p5324q02679
43005A063776o43644Q1791j3181r46447j272933n24113J1310n12816j044815k98993
42995d100065J191608J733769O71435q86232j364640l28921J139634J605776Q87919
42986E50283J63242K27625M26351M0562k37699M29386J124511M34275q92765q50620
42976A415151L34426K88358j375809j875279L71427K816610K379395r0356j480028
$$ plain form
43042 1751720 923813 615971 1345392 1828438 1118137 369392 1223614 3270958 4426641
43033 4426641 3509372 1386204 -330601 -798047 -60999 1523449 3485649 5134885 5707386
43024 5707386 4884391 3221398 1874146 1619838 2150131 2513317 2155802 1306167 560037
43015 560037 481996 1369058 2821382 3711413 3278859 2181464 1695724 1941779 1866455 1063776
43005 1063776 420132 501923 488742 -457705 -1730638 -2254751 -2243441 -2756257 -3801072 -4100065
42995 -4100065 -2908457 -1174688 -503253 -1389485 -2754125 -3083046 -1943412 -337636 550283
42986 550283 713525 941150 1367501 1408063 1170364 1599750 2724261 3158536 2265771 1415151
42976 1415151 1749577 2037935 662126 -1213153 -841726 1974884 4354279 4263923 2783895
42967B783895j012341l56393j29708O12857J585004J027460j075118k141899o13810
42958F79947J545867J515611n51874k014897j360993K51331R94794N90544K7529
42949A677859j33416l29978r56875j517595j286233l88128M62003J089570J879742
42940D96949K670562K607438J389634k15385j412391k032627j909292p97955O04784
42931A401717R06896L9360l44444N43568J113213j66837k181833k741494j680491
42922c110345n41895O647M94371R70186R58827P44573Q90568Q18660l26475j739153
42912h34036j771289m45511P25226J160237J472501J577524P46911n01517q01829
42903A328217k85485k85913o90842j10378J141131J061744m70508j094115P1310
$$ plain form
42967 2783895 1771554 1415161 1285453 1898310 3483314 4510774 3435656 1293757 679947
42958 679947 2225814 3741425 3189551 1174654 -186339 64992 1059786 1650330 1677859
42949 1677859 1544443 1214465 257590 -1260005 -2546238 -2934366 -2472363 -1382793 496949
42940 496949 3167511 5774949 7164583 6949198 5536807 3504180 1594888 796933 1401717
42931 1401717 2308613 2347973 2003529 2547097 3660310 3493473 1311640 -1429854 -3110345
42922 -3110345 -3652240 -3645593 -3151222 -2181036 -1222209 -477636 412932 1231592 905117 -834036
42912 -834036 -2605325 -3050836 -2325610 -1165373 307128 1884652 2631563 2130046 1328217
42903 1328217 1042732 756819 65977 -44401 1096730 2158474 1687966 593851 665161
42894F65161Q11780l62012j606330q93622P21247J220827Q72449R17189Q27126
42885C173815m37813j739934j119125Q19897J416534k88362k348457k561973q28352
42876c913770J219085J910227R57046k47497k10005N86639L69191r03770j144036
42867a376890L90725J492270M27644j221747j211422j24397K39833J81425R63322
42858b39237J767385Q88436r28873j387056k76672O59424R27993J384746J632763
42849D428909N04692j088164j061618R2924j65194j945982k547787j139349r8171
42840c019740n69503m51514J431312K703239J397841m96518k69186J177321J232799
42831C136051o4553o86919l49773n47444j531972j952784j229420q2729J009347
$$ plain form
42894 665161 1476941 1114929 -491401 -1385023 -663776 557051 1429500 2346689 3173815
42885 3173815 2736002 996068 -123057 696840 2113374 1825012 -523445 -3085418 -3913770
42876 -3913770 -2694685 -784458 172588 -74909 -284914 301725 670916 -232854 -1376890
42867 -1376890 -986165 506105 933749 -287998 -1499420 -1623817 -1383984 -1202559 -239237
42858 -239237 1528148 2416584 1487711 100655 -176017 483407 1411400 2796146 4428909
42849 4428909 4933601 3845437 2783819 2876743 2711549 765567 -1782220 -2921569 -3019740
42840 -3019740 -3589243 -4040757 -2609445 93794 1491635 995117 725931 1903252 3136051
42831 3136051 3071498 2384579 2034806 1487362 -44610 -1997394 -3226814 -3309543 -2300196
42822b300196J940920J985887O65270p33953n11588P74205R74951l68611j426398
42813A000487r61780R2941M05277p0693p18949j107539o86559R05411K588922
42804A447518K342741j20584k404049k251258l56445Q42512M16334l96533m05197
42795h84961J24963M27817L68616J31028l18114q15263p17572K17075J097788
42786c68623Q67982j92624p67650l07192K99690O5719q23713j421009j092007
42777c739427J21764J596857K306480J634809L32135j98122J06331j17265j152286
42768H91276j202029P84178K782822K230660j04623j197865k65545M27417n59916
42759C786375j776416j533606m02581J60122m7700m23984p10427n95103M49363
$$ plain form
42822 -2300196 -359276 1626611 2291881 1557928 1046340 1820545 2795496 2426885 1000487
42813 1000487 38707 131648 536925 466232 -252717 -1360256 -2046815 -1141404 1447518
42804 1447518 3790259 3669675 1265626 -985632 -1342077 -499565 -83231 -479764 -884961
42795 -884961 -759998 -332181 36435 167463 -150651 -965914 -1683486 -1466411 -368623
42786 -368623 499359 306735 -460915 -768107 -468417 -402698 -1226411 -2647420 -3739427
42777 -3739427 -3617663 -2020806 285674 1920483 2252618 2054496 2160827 2043562 891276
42768 891276 -310753 473425 3256247 5486907 5382284 4184419 3918874 4346291 3786375
42759 3786375 2009959 476353 73772 233894 186194 -237790 -948217 -1543320 -1093957
42750a093957J888292K137279R56214K34351J019198J475984k59279k638891k578511
42741A140680r270K010266J636587L11286P2591Q96519J602521J804403J835685
42732A1301268J759938J500749J318985J301125Q46590n23653k133496k718656
42724A2652850j993266r53380m60837k26574K64532M03339q59000k939726l567831
42715B320107j643614Q60303J183549o19544j922376j185702L31193Q07327J77330
42706C08573m93061o24296k45226N05892J186969J122653K84100n81180r98100
42697D66324j061905o04863N97462J567404P97024j211407j931067l30788J430562
42688b81254J150665l48867r48687m12424R0385K88216N35852L25866p58614j475058
$$ plain form
42750 -1093957 794335 2931614 3887828 4122179 5141377 6617361 6358082 3719191 1140680
42741 1140680 1131410 3141676 4778263 5089549 5162140 6058659 7661180 9465583 11301268
42732 11301268 13061206 14561955 15880940 17182065 18028655 17505002 15371506 12652850
42724 12652850 10659584 9706204 9245367 9018793 9283325 9686664 8827664 5887938 2320107
42715 2320107 676493 1536796 2720345 2100801 178425 -1007277 -676084 131243 308573
42706 308573 -184488 -808784 -1054010 -548118 638851 1761504 2045604 1464424 466324
42697 466324 -595581 -1200444 -602982 964422 1761446 550039 -1381028 -1711816 -281254
42688 -281254 869411 520544 -428143 -840567 -750182 -461966 73886 399752 -358862 -1833920
42678a833920n23114R73039Q62167o36023j262815k42157Q21963O56084j61620
42669a346396o43918n72391n0982N38958K21803j276064k213185p99063J771018
42660d370220K524980R32275n48577l56135L84398N23253N84058P77432J8278
42651D69742j591353j819043K49724K051760J122691j023820j236293M15915J099890
42642b60787p2975q68947K00894J536171J105669n04922j249442o89236k67169
42633a070744q77445j643843j434426m86621K39917O22316J176469J575745Q00160
42624a098472q73339j516619j79733J412241J241694K0102o7914J058148J357121
42615A353229J25122r59229p74160m34323r68896j335936k90944J238001J385540
$$ plain form
42678 -1833920 -2357034 -1383995 -521828 -1157851 -2420666 -2662823 -1840860 -1184776 -1346396
42669 -1346396 -1990314 -2562705 -2613687 -2074729 -1852926 -3128990 -5342175 -6141238 -4370220
42660 -4370220 -1845240 -912965 -1461542 -1817677 -1433279 -910026 -325968 451464 469742
42651 469742 -1121611 -2940654 -2690930 -639170 483521 -540299 -1776592 -1360677 -260787
42642 -260787 -333762 -1202709 -1001815 534356 1640025 1135103 -114339 -803575 -1070744
42633 -1070744 -1948189 -3592032 -5026458 -5513079 -5273162 -4650846 -3474377 -1898632 -1098472
42624 -1098472 -1971811 -3488430 -3668163 -2255922 -1014228 -994126 -1062040 -3892 1353229
42615 1353229 1478351 519122 -255038 -689361 -1658257 -2994193 -3285137 -2047136 -661596
42606f61596J34687p04901K0704J518945K169666J252309l76791j116619m04279
42597A832125N03467K01277q26177j088508o34138q29349j591723j182895O25694
42588b990227J681134R60333M65836J777136L014651J739210r19429j936063j009806
42579B782775m57761j111884j437273p34860k40691n07403l89513M66796N61447
42570a068367p80309j771435p89921R97439J405765M67982L6746P86133J460095
42561G44128J077204K89852P3932K06477j67631j043334j476602r23298J6204
42552a203068M18897J20209l93436p28373o46438J76020J513164J987253M50084
42543A694312j897101k378893n11714R36933j19064j748438p64867K235418L384688
$$ plain form
42606 -661596 -526909 -1231810 -1211106 307839 2477505 3729814 3353023 2236404 1832125
42597 1832125 2335592 2536869 1710692 622184 -11954 -841303 -2433026 -3615921 -2990227
42588 -2990227 -1309093 -348760 117076 1894212 4908863 6648073 5728644 3792581 2782775
42579 2782775 2325014 1213130 -224143 -959003 -1199694 -1707097 -2096610 -1629814 -1068367
42570 -1068367 -1848676 -3620111 -4410032 -3412593 -2006828 -1538846 -1502100 -715967 744128
42561 744128 1821332 2111184 2185116 2391593 2223962 1180628 -295974 -1219272 -1203068
42552 -1203068 -784171 -663962 -1057398 -1785771 -2432209 -2256189 -743025 1244228 1694312
42543 1694312 -202789 -2581682 -3093396 -2156463 -2275527 -4023965 -4788832 -2553414 831274
42534H31274J076900j784819k015734k96859N36459k98900j099886o86529K01765
42525c536329N77783O20454Q19664Q30069Q0971r78502j176943k27896O76190
42516b314539L54468o56213o36179R93852K674201K580809R32490m11398m02242
42507C115249J37164K8406o51293j015964p68959m12910l28871l32519j67272
42498c96969Q0065K21751K87372L97399N27344N70651M65605J18806n34170j137012
42488F00842r49870J48355R75325L11577j105936j103333Q27647K270283J002063
42479B976953j647302k373645l83767J726015J681184Q4492j299839j840563j604444
42470b680916m17235J220122J701072L84096j022030p29631N14035Q30072K44311
$$ plain form
42534 831274 1908174 123355 -1892379 -2189238 -1652779 -1951679 -3051565 -3738094 -3536329
42525 -3536329 -2958546 -2338092 -1518428 -688359 -607388 -1585890 -2762833 -2990729 -2314539
42516 -2314539 -1960071 -2616284 -3252463 -2258611 415590 2996399 3928889 3517491 3115249
42507 3115249 3252413 3280819 2629526 1613562 844603 431693 102822 -229697 -396969
42498 -396969 -316904 -95153 192219 589618 1116962 1687613 2153218 2272024 1737854 600842
42488 600842 -349028 -200673 774652 1086229 -19707 -1123040 -295393 1974890 2976953
42479 2976953 1329651 -1043994 -1427761 298254 1979438 2063930 764091 -1076472 -2680916
42470 -2680916 -3098151 -1878029 -176957 207139 -814891 -1544522 -1030487 -200415 43896
42461D3896K11144P66856N80256k91154k25094R52120J248325j69603j177338
42452A939408J39867K262174K269031P9043j562135j015791M38064R94927O30674
42443F175262J78343l71491j323481j954669j266674K19441Q21023l6710j135111
42434A305933j355261j039408q72294o05718J12409O20510K28085l61111n94R57074
42424a010375J115170K00578o68443p82767m83209p6897L96648M10755l67872
42415a266412p36407P04643K788945K738621L67349j282840m96642O52398j1265
42406C458390j283511j066792o2529j76816r05529l58628J106453J271811l20257
42397A662592j756105j641110m26545R40110J721569J154678n03659j249566K13988
$$ plain form
42461 43896 255040 1021896 1602152 1310998 1085904 2038024 3286349 3116746 1939408
42452 1939408 2079275 4341449 6610480 6689523 5127388 4111597 4549661 5544588 6175262
42443 6175262 6353605 5982114 4658633 2703964 1437290 1656731 2477754 2441044 1305933
42434 1305933 -49328 -1088736 -1961030 -2566748 -2454339 -1833829 -1605744 -1966855 -1967449 -1010375
42424 -1010375 104795 305373 -363070 -1145837 -1629046 -1705943 -1309295 -898540 -1266412
42415 -1266412 -2002819 -1298176 1490769 4229390 4596739 3313899 2817257 3469655 3458390
42406 3458390 2174879 1108087 1045558 868742 -36787 -395415 711038 1982849 1662592
42397 1662592 -93513 -1734623 -2161168 -1221058 500511 1655189 1151530 -98036 115952
42388A15952J956014J200344j349775k404630j078508J04848m66880j241105n38704
42379c702444Q01265J165259N63323J30r4488J27827L42956N7347o38912m86164
42369a863901J179816K528791J353215j219889j896611j51332J109617L32745
42361A372451n61247M0438Q21945M02285j52678K54943M45216o65743j668666
42352B88944j019154J99189K92911n1523O55670J642236J044925q75816k137925
42343C9457j925751r73069J90892J368775J752555P86544n41267r08569n56164
42334g66597n11005p07961m13588K46900O49176Q04326Q85491N72395Q73J01318
42324H61328Q37933P60035l52544m96303J058340J649420p62175l650039l296550
$$ plain form
42388 115952 2071966 3272310 1922535 -482095 -1560603 -1455755 -1922635 -3163740 -3702444
42379 -3702444 -2901179 -1735920 -1172597 -1172467 -1266955 -1139128 -796172 -738825 -1377737 -1863901
42369 -1863901 -684085 1844706 3197921 1978032 81421 -69911 1039706 1372451
42361 1372451 811204 851642 1673587 2075872 1923194 2178137 2623353 1957610 288944
42352 288944 -730210 -531021 -238110 -289633 366037 2008273 3053198 2177382 39457
42343 39457 -1886294 -2859363 -2668471 -1299696 452859 1239403 698136 -210433 -766597
42334 -766597 -1277602 -1985563 -2399151 -2152251 -1503075 -698749 186742 759137 760010 861328
42324 861328 1699261 2459296 2106752 1610449 2668789 4318209 3556034 -94005 -3390555
42315c390555l82076J492223J538193J870746K556642J161885k295658m191240
42307a639840k425995O84301K101677J730726R47784J66000m79636k83982N49522
42298A350557M61468j018732k159969j646452m92783o947L11342J234454J817793
42289a49269Q23684r83344j722200q79504M69394J276307J169280J37203j260790
42280a119239j838487r59168N28334J264588R59901M21710L53666O39745O43316
42271H94366O989p34996o25199K69738N62185m41292j273691l28409J353538J317258
42261A000487n76508j922629j418067l87205j30546j00669L43726N50819J51790
42252b488802R5051Q31695J253968P17627L21548Q09199J076920L64854R36R72587
$$ plain form
42315 -3390555 -3772631 -2280408 -742215 1128531 3685173 4847058 2551400 -1639840
42307 -1639840 -4065835 -3381534 -1279857 450869 1398653 1564653 1085017 801035 1350557
42298 1350557 1812025 793293 -1366676 -3013128 -3505911 -3512858 -3201516 -1967062 -149269
42289 -149269 674415 -308929 -2031129 -2910633 -2441239 -1164932 4348 141551 -1119239
42280 -1119239 -2957726 -3916894 -3388560 -2123972 -1164071 -742361 -388695 251050 894366
42271 894366 901355 166359 -458840 -189102 373083 -68209 -1341900 -1670309 -316771 1000487
42261 1000487 423979 -1498650 -2916717 -3303922 -3434468 -3535137 -3191411 -2640592 -2488802
42252 -2488802 -2393751 -1562056 -308088 409539 731087 1540286 2617206 2982060 2982996 3955583
42242C955583J559674j60170k805334l373984j595794P9929M03376N19532J165414
42233b51774J259206L3544j378947j470340k49609J070896J426973O52920l34399
42224G58470j50155J348446K268333Q58238j791462k842041j516442k589j15270
42215a184472r06181n86562P11607J469908J075912J95179n45026r79392q90310
42206a639337k43823K64148k9228n83348l36940N10216O63043j29888n18477K25368
42196a818266Q36155J12803q10225m293K061938K939649J809162N06657L52446
42187E986026J42096j390683l016990k839925j333402l87935k16340M42348J492376
42178a122429J373009p5808j011162m45987L80338L12608L7462M29362Q17750
$$ plain form
42242 3955583 5515257 5355087 2549753 -824231 -2420025 -2340096 -1936720 -1417188 -251774
42233 -251774 1007432 1040976 -337971 -1808311 -2057920 -987024 439949 1092869 758470
42224 758470 608315 1956761 4225094 5083332 3291870 449829 -1066613 -1069202 -1184472
42215 -1184472 -2090653 -2677215 -1965608 -495700 580212 775391 230365 -749027 -1639337
42206 -1639337 -1883160 -1619012 -1648240 -2231588 -2568528 -2058312 -1395269 -1525157 -2043634 -1818266
42196 -1818266 -982111 -869308 -1679533 -1683826 378112 3317761 5126923 5633580 5986026
42187 5986026 6128122 4737439 1720449 -1119476 -2452878 -2840813 -3057153 -2614805 -1122429
42178 -1122429 250580 174772 -836390 -1282377 -902039 -589431 -551969 -122607 695143
42169F95143K85505n50494m95457L04532O99839K91062k41744l04781q5306j55651
42159D42648p51683j355053j094905O2678R31845O50258R910R6039L45070k87134
42149i50327q89136K22778K092332J841565p07355k234641r09670Q88104O05677
42140d0673o27089n62294K56661J9618q29193o34962K43996K11642n23225m77969
42130b963488K50313L03160l43666n72737l41544l37082j01380J039768J928197
42121a138459J107719l24475k73808O54236K63511r48911l64923J855265K450370
42112C280525M22249j187882l21775R43255K71711j106693r13573L95639R49400
42103B732856N97509K93515m2382p56434r72424o9421O03739l55156j859805j827238
$$ plain form
42169 695143 980648 430154 -65303 239229 939068 1230130 988386 683605 598299 442648
42159 442648 -309035 -1664088 -2758993 -2696315 -1764470 -1114212 -1104302 -1008263 -663193 -950327
42149 -950327 -1839463 -1616685 475647 2317212 1609857 -624784 -1534454 -646350 -40673
42140 -40673 -667762 -1230056 -973395 -953777 -1782970 -2417932 -2173936 -1962294 -2485519 -2963488
42130 -2963488 -2713175 -2410015 -2753681 -3326418 -3667962 -4005044 -4106424 -3066656 -1138459
42121 -1138459 -30740 -355215 -629023 25213 288724 -660187 -1025110 830155 3280525
42112 3280525 3702774 2514892 2193117 3136372 3408083 2301390 1387817 1783456 2732856
42103 2732856 3330365 3623880 3581498 2825064 1852640 1783219 2386958 2031802 171997 -1655241
42093a655241l11023Q75743Q95232L35968l31150q70793n54835P96352J680051
42084H60304P21652r83071j324270m14988j48873q39482p58461P44150K003309
42075a39730J636848M21687l42174o93894j157286j331150n51842Q11477J709222
42066C63158J593859O65023n21272j239737j026057l52651k14290o67753o32496
42057b032216L18262R64942K04140r98268p67313Q74126J817235P40895j111536
42048A0267j721123q78556K3759J62896K738L36p1358j72892L85159J612210K171119
42037A524555J153424k73891m07349L16076o2107j733269k443926q75040J093627
42028a707900R76482o68879j077074O54226K243258J404778j077208k401499j192470
$$ plain form
42093 -1655241 -1966264 -1090521 -195289 140679 -190471 -1061264 -1616099 -819747 860304
42084 860304 1581956 598885 -725385 -1140373 -1289246 -2128728 -2887189 -2143039 -139730
42075 -139730 1497118 1918805 1576631 882737 -274549 -1605699 -2157541 -1346064 363158
42066 363158 1957017 2622040 2100768 861031 -165026 -517677 -731967 -1399720 -2032216
42057 -2032216 -1713954 -749012 -544872 -1543140 -2310453 -1436327 380908 1121803 10267
42048 10267 -1710856 -2589412 -2565653 -2402757 -2400019 -2399683 -2471041 -2643933 -2258774 -646564 1524555
42037 1524555 2677979 2404088 1996739 2312815 2250708 517439 -1926487 -2801527 -1707900
42028 -1707900 -731418 -1400297 -2477371 -1823145 420113 1824891 747683 -1653816 -2846286
42019b846286J062457J933313P05560j167745j892241j091535K65149J096636
42011a934692R51494j1772j054779j084015K93331J908685K080892O80992p05857
42002A124279q83266l28250j1882l1250q9570l31680p97685q68764k33775L20830
41992b131013J14242j72929L44818J044995P56547m2521K00535J381071J538386
41983C034131o2020j478044q52564P88644J038789l95099j385888m70215J250977
41974A468711J780607P90975k68486k13592N28367P77775K93636Q934N01719Q73990
41964F542636j13304j982503k675324j225284O35838N88873j071043j773669l25271
41955a399051J345001J001860n99098q54414P75160J920255P44891j462481k186858
$$ plain form
42019 -2846286 -1783829 149484 855044 -312701 -2204942 -3296477 -3031328 -1934692
42011 -1934692 -983198 -994970 -2049749 -3133764 -2840433 -931748 1149144 1830136 1124279
42002 1124279 241013 -87237 -99119 -130369 -219939 -551619 -1349304 -2218068 -2451843 -2131013
41992 -2131013 -2016771 -2189700 -1844882 -799887 -43340 -85861 114674 1495745 3034131
41983 3034131 2972111 1494067 641503 1430147 2468936 2073837 687949 217734 1468711
41974 1468711 3249318 4040293 3771807 3558215 4086582 4864357 5157993 5166927 5668646 6542636
41964 6542636 6429332 4446829 1771505 546221 1182059 1770932 699889 -1073780 -1399051
41955 -1399051 -54050 947810 348712 -505702 269458 2189713 2934604 1472123 -714735
41946g14735r96621M10554Q11900O14038N15862M08395L015m15004m18666q0247
41936A38491K37494L72039L60979K31694J4167j71237j19553L43218J013042J088465
41926C508799p2040j710297k060372o39209P82434N26531n84250n98230N41958
41917c04676J170414O56078n9999n52659j305894j845416r04023R62713J433115
41908g50347O5808o86215M91575J411366J20649j536088r08327R39342J048255
41899A96018m46077p99876M83156J024441p2113q29887j32742M40132k48036q55473
41889a240457k51025L42761k49126q41619m6532J123330J004480J03951j03570
41880a57807Q2866n21888j336441q53208M06472M54414p02479q07227R73412K571030
$$ plain form
41946 -714735 -1711356 -1300802 -488902 125136 640998 1049393 1052408 637404 218738 138491
41936 138491 375985 748024 1109003 1340697 1354864 1183627 1064074 1407292 2420334 3508799
41926 3508799 3436759 1726462 -333910 -973119 -190685 335846 -248404 -846634 -304676
41917 -304676 865738 1521816 1461817 909158 -396736 -2242152 -3146175 -2183462 -750347
41908 -750347 -684539 -1370754 -879179 532187 652836 -883252 -1791579 -852237 196018
41899 196018 -250059 -1049935 -566779 457662 385549 -444338 -577080 -136948 -384984 -1240457
41889 -1240457 -1491482 -1148721 -1397847 -2239466 -2285998 -1162668 -158188 -54237 -157807
41880 -157807 -74941 -596829 -1933270 -2786478 -2380006 -1925592 -2628071 -3435298 -2461886 109144
41870A09144K158664O88761L8263L08422M06649J7492m98966j202646k110851
41861h5068k394312j444178j12934M85112P32175J470745J887544N73171j492088
41852c79833j524356Q59571K457680Q94689j838572k239263j87103J392782R57663
41843C93258p3107j13922M92769O97528L00836l52213q97996p41981L94248J435104
41833A534524R23201o47050j137483P3888J081235M49422o68287o66688J5865
41824I58627J30221j66140j14735j05307p06838j032171j03225J036183P00797
41815E97412o35405j107694m84290j31963l38881r4422N89329O08638Q8955K66183
41805f42138Q72882L76432p44982l9777K566959L632029J217293j833895k089636
$$ plain form
41870 109144 2267808 2956569 2994832 3303254 3709903 3727395 3228429 2025783 -85068
41861 -85068 -2479380 -3923558 -4036492 -3551380 -2819205 -1348460 539084 1112255 -379833
41852 -379833 -1904189 -1044618 1413062 2307751 469179 -1770084 -1957187 -564405 393258
41843 393258 320151 206229 698998 1396526 1697362 1345149 447153 -294828 99420 1534524
41833 1534524 2457725 1810675 673192 747080 1828315 2277737 1609450 942762 958627
41824 958627 1088848 922708 807973 702666 -4172 -1036343 -1139568 -103385 597412
41815 597412 -37993 -1145687 -1629977 -1761940 -2100821 -2195243 -1605914 -997276 -908321 -642138
41805 -642138 230744 607176 -137806 -177583 2389376 6021405 7238698 5404803 3315167
41796C315167n38757l94385j745671j929422l52201O54286j10564j006480o41304
41787b749331N1470J4645R9358J292480K513712J995454K6784j328203r90938
41778I25431k1741J03756o10269r57767k48497P84409R19659K5668p73415o34882
41768d87648q3338j5558k17930J10958O77786L16710r02356j258982J40922J737834
41758A8398J583419J00787p13073k43291L21711K94726K40405J69395q54691k405329
41748a487543k175903N62766K903428K050638l55825o41865J094681J234084j237186
41739A947275k855814j264534J102429J262612L31420P54664J562031L11665j946988
41730A204760j952276K46533J291412Q2376p54782L49043J522381J095732J32625
$$ plain form
41796 3315167 2776410 2382025 636354 -1293068 -1645269 -990983 -1101547 -2108027 -2749331
41787 -2749331 -2697861 -2683216 -2583858 -1291378 1222334 3217788 3244572 1916369 925431
41778 925431 903690 1007446 397177 -560590 -809087 -24678 894981 920649 147234 -487648
41768 -487648 -570986 -586544 -804474 -693516 -15730 300980 -601376 -1860358 -1719436 18398
41758 18398 1601817 1702604 989531 746240 1067951 1362677 1603082 1772477 917786 -1487543
41748 -1487543 -3663446 -3100680 -197252 1853386 1497561 855696 1950377 3184461 1947275
41739 1947275 -908539 -2173073 -1070644 191968 523388 1278052 2840083 3151748 1204760
41730 1204760 -747516 -500983 790429 872805 118023 467066 1989447 3085179 3217804
41721C217804k44457q41450j910881j743287J64939J403621M58594n30354M77711
41712D52240J597957K71638j923235j625761O60261J454827J05809n58310N33386
41703I68812R74257n98331j964804j077579N57995M39581j017484j381005J17538
41694b981020J775392J867681N13861q28018r42437Q6932J153986J488884J395565
41685C530826J240973M84495j195374k485603j777875L05409J431952O70737n66635
41676A638905q69876m31150K8455K63828l4817j182619k367021k152935o77248
41667e784478K97310J29310K84587J683010K906988K363498O91342m20583n43153
41658A607831k47391K65663Q16695O04830n67842j355760o83325L49238n442j406632
$$ plain form
41721 3217804 2973347 2131897 221016 -1522271 -1357332 46289 504883 -25471 452240
41712 452240 2050197 2321835 398600 -1227161 -566900 887927 993736 435426 968812
41703 968812 1943069 1344738 -620066 -1697645 -1139650 -700069 -1717553 -3098558 -2981020
41694 -2981020 -1205628 662053 1175914 347896 -594541 -507609 646377 2135261 3530826
41685 3530826 4771799 5256294 4060920 1575317 -202558 102851 1534803 2205540 1638905
41676 1638905 769029 337879 366334 630162 595345 -587274 -2954295 -5107230 -5784478
41667 -5784478 -5487168 -5357858 -5073271 -3390261 -483273 1880225 2571567 2150984 1607831
41658 1607831 1360440 1626103 2442798 3047628 2479786 1124026 440701 789939 784497 -622135
41648f22135j946066r76988K77393P75521P22140N17123P6097m75779n26601J66102
41638b013193R66414R74044q7377j440622j613065J16276K350306K668865O90337
41629B611985j152279q23968O32989R78137M3120p13739r23967j386072j941635
41620b675429j519823k11495P41718J016857J269481J183229k39204k173099k238006
41611d845771o2541J720756J184776k81993m87745L24235N03662j68138n28714
41602b641473l5725Q47982J574035J585076L50805j446915j815390j0125J821101
41593B29371J306940o51866j090611P07333K252940J426306q35979k091382j373214
41584a20162R8060N20508n97281j892276j624876J03573J350962J051947N15131
$$ plain form
41648 -622135 -2568201 -3545189 -3267796 -2492275 -1770135 -1253012 -1176915 -1652694 -2179295 -2013193
41638 -2013193 -1046779 -72735 -160112 -1600734 -3213799 -3097523 -747217 1921648 2611985
41629 2611985 1459706 635738 1268727 2246864 2289984 1576245 652278 -733794 -2675429
41620 -2675429 -4195252 -4406747 -3665029 -2648172 -1378691 -195462 -434666 -2607765 -4845771
41611 -4845771 -4908312 -3187556 -2002780 -2284773 -2772518 -2448283 -1944621 -2112759 -2641473
41602 -2641473 -2677198 -1829216 -255181 1329895 1680700 233785 -1581605 -1591730 229371
41593 229371 1536311 884445 -206166 501167 2754107 4180413 3344434 1253052 -120162
41584 -120162 -22102 498406 -98875 -1991151 -3616027 -3512454 -2161492 -1109545 -594414
41575e94414J083380J689967O75899j025634j050894N12847J177385R6753p87441
41566A777848l01145R4596p55281j500817q02774J56529k16009j052170n39179
41557c138402R83857J729206J336891Q65491O08902L6943n98363o14876m32027
41548G77622q13686j077142j64625R42600K90311j695283k466991j197426K29696
41539e174924O13654J114161K455059L070897J748242n1129n14707l56295j145126
41530A759832k203585j751846k86697k8011j098015r98822J352899L413216K359533
41521B518504q37758k565742j253992R09101J254075P1471l99142M67911R70323
41512A134751J12624n95069L28332J528221O89704j551354k181952l69295J289865
$$ plain form
41575 -594414 488966 2178933 2854832 1829198 778304 1291151 2468536 2565289 1777848
41566 1777848 1476703 1571299 816018 -684799 -1487573 -1331044 -1547053 -2599223 -3138402
41557 -3138402 -2154545 -425339 911552 1777043 2385945 2422888 1824525 1209649 777622
41548 777622 -36064 -1113206 -1277831 -335231 -44920 -1740203 -4207194 -5404620 -5174924
41539 -5174924 -4561270 -3447109 -992050 2078847 3827089 3775960 3261253 2904958 1759832
41530 1759832 -443753 -2195599 -2482296 -2510307 -3608322 -4607144 -3254245 158971 2518504
41521 2518504 1680746 -884996 -2138988 -1229887 24188 95659 -303483 164428 1134751
41512 1134751 1247375 652306 980638 2508859 3198563 1647209 -534743 -904038 385827
41503C85827R19796O4942N94489J330660K16176j876162k358694r96783J28110
41494a591639K85141P49535J659599J262100p48548j832736j87400K285890K518812
41485D400754M23528j458730j601079q12775k53445j0541R2468k08509q70829
41476b99158j104848m08167N82542R47102P56271P61793J031596P50214m20304
41467B597041j524773j419903k66351P34532Q64005M46189p066m01810o91548
41458C30316o78680m70841m78951o83400n55509J7470M36079L21044k524k47177
41448b012173n18874n78828K15453J670238K479912J872149N87182l72447q77523
41439B465089j001160o05504l05256j160956k471971j923047O74981K150917N63914
$$ plain form
41503 385827 1305623 1370565 1965054 3295714 3511890 1635728 -722966 -1719749 -1591639
41494 -1591639 -1306498 -556963 1102636 2364736 1616188 -216548 -403948 1881942 4400754
41485 4400754 4824282 3365552 1764473 951698 698253 687712 780180 571671 -299158
41476 -299158 -1404006 -1812173 -1229631 -282529 473742 1235535 2267131 3017345 2597041
41467 2597041 1072268 -347635 -613986 120546 984551 1430740 1423674 1021864 330316
41458 330316 -348364 -819205 -1298156 -1981556 -2537065 -2519595 -2083516 -1762472 -1764996 -2012173
41448 -2012173 -2531047 -3109875 -2894422 -1224184 1255728 3127877 3715059 3342612 2465089
41439 2465089 1463929 858425 553169 -607787 -3079758 -5002805 -4327824 -2176907 -1612993
41430a612993j432297p20753J140940P94920q00094l3624K456238K153456j517001
41421D28792l404524o32973K754371K192066p01798j581976j14210R27735Q42849
41412G10332J003187J240013K92133j031007q04130M53751N15907o91635j196479
41403D92072o52787o55224j378039j121211L83330J223200N84726P2508Q19671
41394b31754J668562J319904K95589l28773n25798p30359r84341j268147j475009
41385b260126r04606P52356K035853J258695o07665r32260M70443R51859n39227
41376B25322j566579k04092J780246J807496L78092k90099J05653J40562n84309
41367A792292j182783j313945j275793q25862K64738J004115L25725r61965j092016
$$ plain form
41430 -1612993 -3045290 -3766043 -2625103 -1830183 -2630277 -2663901 -207663 1945793 428792
41421 428792 -2975732 -3608705 -854334 1337732 635934 -946042 -1060252 -132517 710332
41412 710332 1713519 2953532 3245665 2214658 1410528 1864279 2380186 1688551 492072
41403 492072 -160715 -815939 -2193978 -3315189 -2931859 -1708659 -1123933 -1051425 -231754
41394 -231754 1436808 2756712 3052301 2723528 2197730 1467371 483030 -785117 -2260126
41385 -2260126 -3164732 -2412376 -376523 882172 274507 -657753 -187310 764549 225322
41376 225322 -1341257 -1545349 234897 2042393 2420485 2130386 2236039 2376601 1792292
41367 1792292 609509 -704436 -1980229 -2806091 -2541353 -1537238 -1211513 -2173478 -3265494
41358c265494J18325J285543J701137J849042J872412J265713J52034o99582j225762
41349C053368j952213k455451j548783O50407K298309J999711K88684j395713
41341I38319k093269j440658L19533J992124K193384R12733n76376j448999j814155
41332a017364j544206l15121R35152N80535r80269j304283L10613J323936l905
41323b014912j367177R1650K812502K824592n9496j853574m98023J324603P29819
41314A989984j247071k052718j530572j008923m47886Q23903J862753J328112
41306b82418J18962J29828Q97497K65379j711825k433566q55512Q11510N94296
41297b465849m54785m65629K73733M05069O1630L11916R60309Q37399j75333j065621
$$ plain form
41358 -3265494 -3147169 -1861626 -160489 1688553 3560965 4826678 4978712 4279130 3053368
41349 3053368 1101155 -1354296 -2903079 -2252672 45637 2045348 2334032 938319
41341 938319 -1154950 -2595608 -2276075 -283951 1909433 2822166 2245790 796791 -1017364
41332 -1017364 -2561570 -2876691 -1941539 -1361004 -2341273 -3645556 -3334943 -2011007 -2014912
41323 -2014912 -3382089 -3290439 -477937 2346655 2287159 433585 -64438 1260165 1989984
41314 1989984 742913 -1309805 -2840377 -3849300 -4297186 -3473283 -1610530 -282418
41306 -282418 -163456 -33628 863869 1129248 -582577 -3016143 -3871655 -3060145 -2465849
41297 -2465849 -2920634 -3386263 -3112530 -2707461 -2645831 -2333915 -1373606 -536207 -711540 -1777161
41287a777161j341518j286453q04738M81180J958461K238327R54921o51288j193917
41278a422186m07266J062435K237740K143937N64187j292661j760705o62923N01593
41269I64151O09841K60831N19475J137493R69842j76574j109884q51760N7116
41260B380531L33470l61803j142880j214694p52196k37406L34167R89857J151841
41251A480887L69736p05424j076306q54238q52757r80507m34404N48742P56061
41242a748210Q4984j22503O40154J141233N24856l91218q03698j095781j299603
41233c069786m20414J337605J847275L62940o80612N39656J897120P18754j516501
41224A016037j541281J63199L97775j023711j140954N76063J200790k71570j041477
$$ plain form
41287 -1777161 -3118679 -4405132 -5209870 -4728690 -2770229 -531902 423019 -228269 -1422186
41278 -1422186 -1829452 -767017 1470723 3614660 4178847 2886186 1125481 462558 964151
41269 964151 1573992 1834823 2354298 3491791 4461633 4285059 3175175 2323415 2380531
41260 2380531 2714001 2352198 1209318 -5376 -757572 -994978 -660811 329046 1480887
41251 1480887 1850623 1145199 68893 -785345 -1638102 -2618609 -3053013 -2504271 -1748210
41242 -1748210 -1663226 -1785729 -1145575 -4342 520514 129296 -674402 -1770183 -3069786
41233 -3069786 -3490200 -2152595 -305320 57620 -622992 -83336 1813784 2532538 1016037
41224 1016037 -525244 -362045 35730 -987981 -2128935 -1552872 -352082 -623652 -1665129
41215a665129M51758J797935J014663j54141J51869M96928p21728j809319p38047
41206a175211R59878P37750n66631m17352R52900J336315N81272K63481K32015
41197B904417q95147k295119j652639O85056J731992M66549p72574k05638R85400
41188I52297J150226N13734p2065n23579o24904K53483J507913J300166o74604
41179C782667k179365j405520N60034J421166N37975r43728j661063q72116J054240
41170B94290K249349Q85829k039743l096181p76810K160230K303340J02157j253744
41161H28717m88457N86085L54103m09895k70604N66315P40265k41403j372750
41152B92376j383201j41483J210973J435828M77057n66228p61829l13866k5850
$$ plain form
41215 -1665129 -1213371 584564 1599227 1445086 1596955 2093883 1372155 -437164 -1175211
41206 -1175211 -215333 522417 -44214 -461566 491334 1827649 2408921 2672402 2904417
41197 2904417 2009270 -285849 -1938488 -1253432 478560 945109 172535 -33103 952297
41188 952297 2102523 2616257 2544192 2020613 1395709 1649192 3157105 4457271 3782667
41179 3782667 1603302 197782 757816 2178982 2716957 1773229 112166 -759950 294290
41170 294290 2543639 3429468 1389725 -1706456 -2483266 -323036 1980304 2082461 828717
41161 828717 340260 926345 1280448 870553 599949 1166264 1906529 1665126 292376
41152 292376 -1090825 -1232308 -21335 1414493 1891550 1325322 563493 249627 223777
41143B23777j70471l06383o5006K90902K06684l84519p71244j96157J026748J551656
41133A405987N87307r49845j537535r65120k33602K26618R75783K036875K322599
41124C869067J270011n8879m15800p1974j21343p47471j239975j281485j139762
41115F2389q39655k01721L92526L02408k53443l79252j0383k29108j551322k717934
41105e425495k017877N13710K909563L227729J305471j274527k548842j672137
41097d982405M15736J808813J530053N39097L76385J028556J075710K5561q16075
41088A001431n24561k85207j493157l046601k544913L3633K009308J757938P02524
41079b389605O73323J287964J348266J058851J036347N88061q71613j849114o86022
$$ plain form
41143 223777 53306 -253077 -318083 -27181 179503 -205016 -976260 -1172417 -145669 1405987
41133 1405987 1993294 1043449 -494086 -1459206 -1692808 -1466190 -490407 1546468 3869067
41124 3869067 5139078 5080199 4664399 4592425 4471082 3723611 2483636 1202151 62389
41115 62389 -777266 -978987 -586461 -284053 -537496 -916748 -927131 -1156239 -2707561 -5425495
41105 -5425495 -7443372 -6929662 -4020099 -792370 513101 -761426 -3310268 -4982405
41097 -4982405 -4566669 -2757856 -1227803 -688706 -312321 716235 1791945 1817506 1001431
41088 1001431 476870 191663 -1301494 -4348095 -6893008 -6859375 -4850067 -3092129 -2389605
41079 -2389605 -1716282 -428318 919948 1978799 3015146 3603207 2731594 882480 196458
41070A96458J305824J339848m96731j292067L2816J147656L66120o48736J9210
41061A970398J200638P40681q25179j292993m07327J64526o0582Q3908P54496
41052B328566N13863r42869j719305n70454R40101O99161p77367j240768j29103
41043h98175Q68355O70861K90722P20863R96521j91139j970355k200417o21775
41034b334539P45406O22591R5350M12651Q43125J57585r61087p96284O74524J674332
41024A133654J140194j36192r18709p94726N195Q53820P86015n06436j783648
41015b20833j569965k03694P74341R86689J233600J354474L13828j319371j447917
41006i8848J81250J121698J4707j147888l21621J223445J163304P645j3336J133205
$$ plain form
41070 196458 1502282 2842130 2345399 1053332 1086148 2233804 2599924 1951188 1970398
41061 1970398 3171036 3911717 3086538 1793545 1386218 1550744 1490162 1574070 2328566
41052 2328566 2842429 1899560 180255 -390199 549902 1249063 471696 -769072 -898175
41043 -898175 -29820 641041 931763 1652626 2649147 2458008 487653 -1712764 -2334539
41034 -2334539 -1589133 -966542 -871192 -458541 384584 542169 -418918 -1215202 -540678 1133654
41024 1133654 2273848 2137656 1218947 424221 429416 1283236 2069251 1562815 -220833
41015 -220833 -1790798 -1994492 -1220151 -233462 1000138 2354612 2668440 1349069 -98848
41006 -98848 82402 1204100 1218807 70919 -250702 972743 2136047 2143692 2130356 3263561
40996C263561J349224K3573j069049o60089M31773R96089Q84182L59203m36245
40987E142222r54646n27574M87486R77665O05376m7193p35106j610742k174616
40978A162872j724511q25322o71005r61707k98601J125240J397451N1495q77200
40969a621288l4527J113070P69909m59167j079284j232526j624913j390957M57686
40960e101997K414053K062526q6859j106798o0487R09990M39580m3741N79193
40951E460Q14762n48660j594005j38172K191533K051833k40865j044280P55745
40942B253351J960025L59214j679903j244825L87307K24472j238374j089889O53559
40933E84937Q62887j257083k461106o13951J807486J606051l04872p33555P65850
$$ plain form
40996 3263561 4612785 4636358 3567309 2907220 3338993 4335082 5219264 5578467 5142222
40987 5142222 4187576 3660002 4147488 5125153 5730529 5683336 4948230 3337488 1162872
40978 1162872 -561639 -1386961 -2057966 -3019673 -3318274 -2193034 -795583 -744088 -1621288
40969 -1621288 -1655815 -542745 227164 -232003 -1311287 -2543813 -4168726 -5559683 -5101997
40960 -5101997 -2687944 -625418 -712277 -1819075 -1879562 -969572 -529992 -573733 5460
40951 5460 820222 271562 -1322443 -1460615 730918 2782751 2541886 1497606 2253351
40942 2253351 4213376 4572590 2892687 1647862 2035169 2259641 1021267 -68622 584937
40933 584937 1447824 190741 -2270365 -2884316 -1076830 529221 224349 -509206 256644
40924B56644J655250N33671j179327j729478j076398j19483M97217M24074k94143
40915a031973q73275n55200K29042M78038K74019N52183J230155J052892l03267
40906A052614j346295p48907P54593J290608J30720j585986k139782r12896R89413
40897b515918J752893P83177n79527p61636J7284K93143l60732q33906l83163
40888b588385K06151j06790j098746j657307j108620K49137J485218J714153R36992
$$ plain form
40924 256644 1911894 2445565 1266238 -463240 -1539638 -1659121 -1161904 -737830 -1031973
40915 -1031973 -1905248 -2460448 -2231406 -1753368 -1479349 -927166 302989 1355881 1052614
40906 1052614 -293681 -1042588 -287995 1002613 1133333 -452653 -2592435 -3505331 -2515918
40897 -2515918 -763025 20152 -559375 -1321011 -1303727 -1010584 -1371316 -2205222 -2588385
40888 -2588385 -2382234 -2489024 -3587770 -5245077 -6353697 -6104560 -4619342 -2905189 -1968197
$$ [...]
##END NTUPLES=NMR SPECTRUM
##END=
