##TITLE=31Pdec_LR-685B-2(R)
 , 24 sc
 25.7.2019
##JCAMPDX= 6.0         $$ Bruker NMR JCAMP-DX V2.0
##DATA TYPE= NMR SPECTRUM
##DATA CLASS= NTUPLES
##ORIGIN= UXNMR, Bruker Analytische Messtechnik GmbH
##OWNER= root
$$ XWIN-NMR		Version 3.5
$$ Thu Jul 25 15:00:57 2019 Russian Standard Time (UT+4h)  she@DPX200
##.OBSERVE FREQUENCY= 81.013821
##.OBSERVE NUCLEUS= ^31P
##.ACQUISITION MODE= SIMULTANEOUS
##.ACQUISITION SCHEME= undefined
##.AVERAGES= 24
##.DIGITISER RES= 17
##SPECTROMETER/DATA SYSTEM= spect
##.PULSE SEQUENCE= zgpg30
##.SOLVENT NAME= CDCl3
##.SHIFT REFERENCE= (INTERNAL, CDCl3, 0, 182.463)
##AUDIT TRAIL= $$ (NUMBER, WHEN, WHO, WHERE, WHAT)
$$ ##TITLE= Audit trail, XWIN-NMR		Version 3.5
$$ ##JCAMPDX= 5.01
$$ ##ORIGIN= Bruker BioSpin GmbH
$$ ##OWNER= she
$$ F:/spectra/data/she/nmr/P31/1/pdata/1/auditp.txt
$$ ##AUDIT TRAIL=  $$ (NUMBER, WHEN, WHO, WHERE, WHAT)
(   1,<2019-07-25 14:59:53.00 +0400>,<she>,<DPX200>,
      <created by zg, POWCHK disabled, PULCHK disabled
       configuration hash MD5:
       00 E9 B6 7A A2 85 ED C7 34 08 36 98 17 FE 4E 26
       data hash MD5: 32K
       CE 14 88 71 1A 42 44 8C 3C 0B F3 EA A7 55 A7 42>)
(   2,<2019-07-25 14:59:59.84 +0400>,<she>,<DPX200>,
      <Start of raw data processing
       efp BC_mod = 2 LB = 1 FT_mod = 6 PKNL = 1 PHC0 = -425.8126 PHC1 = 149 SI = 64K 
       data hash MD5: 64K
       3B EB 1B 5B E8 5A 98 22 90 02 3B 98 81 BD 54 D1>)
(   3,<2019-07-25 15:00:15.01 +0400>,<she>,<DPX200>,
      <pk PHC0 = 9.895323 PHC1 = -7 
       data hash MD5: 64K
       3C 29 53 2D C4 31 60 2B 37 3F CD BD A3 B9 A0 83>)
(   4,<2019-07-25 15:00:25.96 +0400>,<she>,<DPX200>,
      <abs ABSG = 5 
       data hash MD5: 64K
       93 BC 98 19 DB B6 87 87 CD 9D 94 45 BB BD 5F 3E>)
$$ ##END=
$$ 
$$ hash MD5
$$ 7A FE F3 73 61 31 86 65 A2 D8 8D 3B EE 34 C8 FA
##$RELAX= 
##$RELAX= 
##$RELAX= 
##$RELAX= 
##$RELAX= 
##$RELAX= 
##$RELAX= 
##$RELAX= 
$$ Bruker specific parameters
$$ --------------------------
##$DU= <F:/spectra>
##$EXPNO= 1
##$NAME= <P31>
##$PROCNO= 1
##$TYPE= <nmr>
##$USER= <she>
##$AMP= (0..31)
100 100 100 100 100 100 100 100 100 100 100 100 100 100 100 100 100 100 
100 100 100 100 100 100 100 100 100 100 100 100 100 100 
##$AQSEQ= 0
##$AQ_mod= 1
##$AUNM= <au_zg>
##$AUTOPOS= <>
##$BF1= 81.014009
##$BF2= 200.13
##$BF3= 200.13
##$BF4= 200.13
##$BF5= 200.13
##$BF6= 200.13
##$BF7= 200.13
##$BF8= 200.13
##$BYTORDA= 1
##$CFDGTYP= 0
##$CFRGTYP= 5
##$CHEMSTR= <none>
##$CNST= (0..31)
1 1 145 1 1 1 1 1 1 1 1 1 1 1 1 1 1 1 1 1 1 1 1 1 1 1 1 1 1 1 1 1 
##$CPDPRG= <waltz16>
##$CPDPRG1= <>
##$CPDPRG2= <waltz16>
##$CPDPRG3= <>
##$CPDPRG4= <mlev>
##$CPDPRG5= <mlev>
##$CPDPRG6= <mlev>
##$CPDPRG7= <mlev>
##$CPDPRG8= <mlev>
##$CPDPRGB= <>
##$CPDPRGT= <>
##$D= (0..31)
0 1 0 0 0 0 0 0 0 0 0 0.03 2e-05 3e-06 0 0 0 0 0 0 0 0 0 0 0 0 0 0 0 0 
0 0 
##$DATE= 1564052392
##$DBL= (0..7)
120 120 120 11 120 120 24 19 
##$DBP= (0..7)
150 150 150 150 150 150 150 150 
##$DBP07= 0
##$DBPNAM0= <>
##$DBPNAM1= <>
##$DBPNAM2= <>
$$ [...]
##$SUBNAM3= <"">
##$SUBNAM4= <"">
##$SUBNAM5= <"">
##$SUBNAM6= <"">
##$SUBNAM7= <"">
##$SUBNAM8= <"">
##$SUBNAM9= <"">
##$SW= 369.568048894756
##$SWIBOX= (0..15)
0 1 3 0 0 0 0 0 0 0 0 0 0 0 0 0 
##$SW_h= 29940.119760479
##$TD= 32768
##$TD0= 1
##$TE= 0
##$TE2= 300
##$TE3= 300
##$TEG= 300
##$TL= (0..7)
0 120 53 12 22 120 120 120 
##$TP= (0..7)
150 150 150 150 150 150 150 150 
##$TP07= 0
##$TPNAME0= <>
##$TPNAME1= <>
##$TPNAME2= <>
##$TPNAME3= <>
##$TPNAME4= <>
##$TPNAME5= <>
##$TPNAME6= <>
##$TPNAME7= <>
##$TPOAL= (0..7)
0.5 0.5 0.5 0.5 0.5 0.5 0.5 0.5 
##$TPOFFS= (0..7)
0 0 0 0 0 0 0 0 
##$TUNHIN= 0
##$TUNHOUT= 0
##$TUNXOUT= 0
##$USERA1= <user>
##$USERA2= <user>
##$USERA3= <user>
##$USERA4= <user>
##$USERA5= <user>
##$V9= 5
##$VALIST= <valist>
##$VCLIST= <CCCCCCCCCCCCCCC>
##$VD= 0
##$VDLIST= <DDDDDDDDDDDDDDD>
##$VPLIST= <PPPPPPPPPPPPPPP>
##$VTLIST= <TTTTTTTTTTTTTTT>
##$WBST= 1024
##$WBSW= 4
##$XGAIN= (0..3)
0 0 0 0 
##$XL= 0
##$YL= 0
##$YMAX_a= 105789
##$YMIN_a= -127110
##$ZGOPTNS= <>
##$ZL1= 120
##$ZL2= 120
##$ZL3= 120
##$ZL4= 120
##$ABSF1= 182.463
##$ABSF2= -187.1042
##$ABSG= 5
##$ABSL= 3
##$ALPHA= 0
##$AQORDER= 0
##$ASSFAC= 0
##$ASSFACI= 0
##$ASSFACX= 0
##$ASSWID= 0
##$AUNMP= <proc_1d>
##$AZFE= 0.1
##$AZFW= 0.5
##$BCFW= 0
##$BC_mod= 2
##$BYTORDP= 0
##$COROFFS= 0
##$CY= -3
##$DATMOD= 1
##$DC= 0
##$DFILT= <>
##$DTYPP= 0
##$F1P= 0
##$F2P= 0
##$FCOR= 1
##$FTSIZE= 65536
##$FT_mod= 6
##$GAMMA= 0
##$GB= 0
##$INTBC= 1
##$INTSCL= 5.30512e-09
##$ISEN= 30
##$LB= 1
##$LEV0= 0
##$LPBIN= 0
##$MAXI= 10000
##$MC2= 0
##$MEAN= 0
##$ME_mod= 0
##$MI= 50
##$NCOEF= 0
##$NC_proc= -4
##$NLEV= 6
##$NOISF1= 182.463
##$NOISF2= 159.3651
##$NSP= 0
##$NTH_PI= 0
##$NZP= 0
##$OFFSET= 182.463
##$PC= 4
##$PHC0= -415.9173
##$PHC1= 142
##$PH_mod= 1
##$PKNL= yes
##$PPARMOD= 0
##$PSCAL= 0
##$PSIGN= 0
##$REVERSE= no
##$SF= 81.0140089999434
##$SI= 65536
##$SIGF1= 159.3651
##$SIGF2= -187.1042
##$SINO= 113.3802
##$SIOLD= 16384
##$SREGLST= <1H.CDCl3>
##$SSB= 0
##$STSI= 65536
##$STSR= 0
##$SW_p= 29940.119760479
##$SYMM= 0
##$S_DEV= 0
##$TDeff= 32768
##$TDoff= 0
##$TI= <>
##$TILT= no
##$TM1= 0
##$TM2= 0
##$TOPLEV= 0
##$USERP1= <user>
##$USERP2= <user>
##$USERP3= <user>
##$USERP4= <user>
##$USERP5= <user>
##$WDW= 1
##$XDIM= 65536
##$YMAX_p= 313153144
##$YMIN_p= -38062830
$$ End of Bruker specific parameters
$$ ---------------------------------
##NTUPLES= NMR SPECTRUM
##VAR_NAME=  FREQUENCY,     SPECTRUM/REAL,   SPECTRUM/IMAG
##SYMBOL=    X,             R,               I
##VAR_TYPE=  INDEPENDENT,   DEPENDENT,       DEPENDENT
##VAR_FORM=  AFFN,          ASDF,            ASDF
##VAR_DIM=   65536,         65536,           65536
##UNITS=     HZ,            ARBITRARY UNITS, ARBITRARY UNITS
##FACTOR=    0.456856943014862, 1,           1
##FIRST=     14782.0589164792, 0,            0
##LAST=      -15158.0608439998, 0,           0
##MIN=       -15158.0608439998, -38062830,   0
##MAX=       14782.0589164792, 313153144,    0
$$ Real data points
##PAGE= N=1
##DATA TABLE= (X++(R..R)), XYDATA
$$ [...]
47725a223477P990M7949q6031j75651n5268J53912K36779J71381J08272J54469
47715f59675K47046K08362k6140k00830L8279N71516P56233K59292l73638m42400
47705C78045r9199j8620k78062l34480n3391Q8458o5518p6775J85468K12921j92235
47694b53388m44039j41428K37583J87034J6917J73501L56482J01371k74514j61975
47684b02456K71183L47776k5408l23391k85572j01035J23670L72604L64047q8965
47674D52453n13889l22246K15283L22622n8081k46952j313J88775O4898l6499
47664F5051K7170p5475l66675l40054J10669L42908m97l42676r3914M24374N72081
47653C22962L63999K19845J71672l4278l37327m48556l39245j73525L4132K68857
$$ plain form
47725 -1223477 -1215487 -1167538 -1253569 -1429220 -1484488 -1330576 -1093797 -922416 -814144 -659675
47715 -659675 -412629 -204267 -230407 -431237 -392958 178558 934791 1194083 820445 378045
47705 378045 278846 260226 -17836 -352316 -405707 -317249 -382767 -459542 -274074 -61153 -253388
47694 -253388 -697427 -838855 -601272 -414238 -397321 -223820 132662 234033 -40481 -202456
47684 -202456 68727 416503 391095 67704 -217868 -318903 -195233 177371 541418 452453
47674 452453 -61436 -383682 -168399 154223 96142 -150810 -152123 36652 101550 65051
47664 65051 92221 16746 -349929 -689983 -579314 -236406 -236903 -579579 -673493 -249119 322962
47653 322962 686961 906806 1078478 1044200 706873 258317 -80928 -254453 -220321 48536
47643D8536K69863j09021n01520m42953k0061K98801L14529J82756K3986j32132
47633f7216j45379Q8229L78561M65831L74831K35204m1353n09920q24867o09491
47623f55570q0211J83908L8119j35173r8503k2041k8304L1812K06297K69193J11890
47612a78583l2433M6457K18227K41797R0786j04343k40580k40256o5179J36702
47602a27405R7082k07168m28971k67725J21249L23916J96927J670L385J10364
47592a76676L0014k77610m73167k64660J54726L11773R3969p9311J47135N39403
47582E596N84067J73004k94485m35078k51515J9322J95493K20115J04220r2629
47572B28110k61914k78419q4119J94501K70060L893l26352l11011Q361J50108
$$ plain form
47643 48536 318399 209378 -292142 -735095 -755156 -456355 -141826 40930 64916 -67216
47633 -67216 -212595 -124366 254195 720026 1094857 1330061 1288708 778788 -46079 -655570
47623 -655570 -735781 -551873 -513754 -648927 -747430 -769471 -797775 -765963 -559666 -290473 -178583
47612 -178583 -211016 -164559 53668 295465 386251 281908 41328 -198928 -264107 -127405
47602 -127405 -30323 -237491 -666462 -934187 -812938 -489022 -292095 -290425 -287040 -176676
47592 -176676 -146662 -424272 -897439 -1162099 -1007373 -695600 -601631 -680942 -533807 5596
47582 5596 589663 762667 468182 33104 -218411 -199089 -3596 216519 320739 228110
47572 228110 -33804 -312223 -396342 -201841 68219 72112 -254240 -565251 -556890 -406782
47562d06782j05980l88126l14590l6967J15439J86829L64334M76120K33661j86203
47552f2265l26582j45983k3253r0606p5528J35141K63191J10888j39850k52068
47542f06915k16895q2754J71756M48856M97293K17397j93009m58997m21235o5847
47532g10350L82086M98565J41418k19671q4009K89246K37228k17002l46656Q3974
47522E4829L78474J5051n00041m22318J15872M06981K46547O9628J50975K37477
47512G53475K3528l78820n56846k63543K39129L55657j23499n79576k77990N04723
47502c03762P15075N3989m98318j41119N15868M22332k88588n90405j81291J84842
47492a11377k1833m04048m24881j63842L5822J25212K03652K01293L7010j46635
$$ plain form
47562 -406782 -512762 -900888 -1215478 -1252445 -1137006 -950177 -585843 -109723 123938 -62265
47552 -62265 -388847 -534830 -558083 -648689 -724217 -589076 -325885 -214997 -354847 -606915
47542 -606915 -823810 -906564 -734808 -285952 211341 428738 235729 -223268 -644503 -710350
47532 -710350 -328264 170301 311719 92048 8039 297285 534513 317511 -29145 54829
47522 54829 433303 448354 -51687 -474005 -358133 48848 295395 365023 515998 753475
47512 753475 777003 398183 -158663 -422206 -183077 172580 49081 -530495 -808485 -303762
47502 -303762 411313 465302 -33016 -174135 341733 764065 475477 -114928 -296219 -111377
47492 -111377 -133210 -537258 -962139 -1125981 -1090159 -964947 -761295 -560002 -522992 -669627
47482f69627j51174K5721K36307L38503K49178L207k07765k01469q119K05999
47472a79239L33511L17123J16328j26386j05616J96374L26938j8775m48496l92646
47462A9116L5230K33697M0389j25157k5506P6158m4063k19530k22375m7744K13694
47451f6091M32015L73329k3985l65038k55140M5065j5814l41150l12471J31229
47441c98051L41290O0834j38691J45719M80745L74358L9055j38373k75886n64807
47431g3807o90498l21553K19196L75928J43751q2820j24702p723K93710O11121
47421C42603M89995j14948m94573j61449K91510P4958m75096m01822L03923O85784
47411E40885L38334j00440j36714j14152l67519n47705k90816J18130K85802L70109
$$ plain form
47482 -669627 -820801 -795080 -558773 -220270 28908 32115 -175650 -377119 -385238 -179239
47472 -179239 154272 471395 587723 461337 355721 552095 879033 860258 411762 19116
47462 19116 54346 288043 328432 203275 177769 253927 209864 -9666 -232041 -279785 -66091
47451 -66091 365924 739253 715268 350230 95090 140155 124341 -216809 -529280 -398051
47441 -398051 -56761 4073 -134618 11101 491846 866204 905259 766886 491000 -73807
47431 -73807 -764305 -1085858 -866662 -490734 -346983 -429803 -554505 -562228 -268518 342603
47421 342603 832598 717650 223077 61628 353138 428096 -47000 -448822 -144899 540885
47411 540885 879219 778779 642065 527913 160394 -387311 -678127 -559997 -274195 95914
47401I5914O45119Q41376N15904j83759o71082o93205m90116k77491k0459K59190
47391B1391L37270R5873k39592l29943j10535J55798K01660M8110q0318p1747
47381B7967j7994P342N8634J30158Q5366q7586j86312j28328r0395r9976J31352
47370a69772O06551P03457K2618p58886o47194K05899O50781J90540l98854l52870
47360E2270J7571K6566k90588l93422j29879J56608J77506o3722l84646m81416
47350a313152j34884L95140N22503J38962j50893P8106M14018K89567j18207k30808
47340a09648K4011K40138K28909J16578n6407k78841k94879N3170L83587K56904
47330E63522p9107o3614K21041K02929j51336k80063n0375J2874k75905l79248
$$ plain form
47401 95914 741033 1582409 2098313 1914554 1243472 550267 60151 -217340 -237799 21391
47391 21391 358661 454534 214942 -115001 -225536 -69738 131922 180032 99714 27967
47381 27967 9973 17315 75949 206107 291473 203887 17575 -110753 -201148 -301124 -169772
47370 -169772 436779 1140236 1162854 403968 -243226 -37327 613454 803994 405140 52270
47360 52270 69841 96407 -194181 -587603 -717482 -560874 -383368 -447090 -831736 -1313152
47350 -1313152 -1448036 -1052896 -530393 -391431 -542324 -464218 -50200 239367 121160 -109648
47340 -109648 -85637 154501 383410 499988 443581 164740 -130139 -76969 306618 563522
47330 563522 484415 420801 641842 844771 693435 413372 362997 375871 99966 -279282
47320b79282o021L22064J65306p7413P9466L03865L5982m58668m51517O5257L75541
47309G4580J71229p6457J8689K04531J39622n9567j33431j18590j43268j14646
47299c7308M9195J33435o9892l54788l64699j50177p8868k15628j96369J73534
47289a111565N53289N28439J94147k834J28284L49796L71761J43156k11252m89938
47279D53283m50709l3405M04780L88878k8302k59028r225K61962M9996l74033
47269D04197l66091P2169L01135N4482k03466j00335P2510n5006k90471k74693
47259c85569j11938p4724M236M10555P97822M92399l98605r02300m77881K13591
47249d32414K73942j82918l33058R3066N16752M44575P4483j87892l03191m00291
$$ plain form
47320 -279282 -285303 36761 202067 124654 204120 507985 543967 85299 -366218 -300961 74580
47309 74580 245809 169352 188041 392572 532194 472627 339196 220606 77338 -37308
47299 -37308 11887 145322 75430 -279358 -644057 -794234 -873102 -1088730 -1285099 -1111565
47289 -1111565 -558276 -29837 164310 161476 289760 639556 1011317 1154473 943221 453283
47279 453283 2574 -30831 373949 762827 734525 475497 466272 728234 778230 404197
47269 404197 38106 110275 411410 465892 262426 162091 234601 179595 -110876 -385569
47259 -385569 -497507 -572231 -567995 -157440 640382 1132781 734176 -168124 -646005 -432414
47249 -432414 -158472 -341390 -674448 -581382 -64630 379945 454428 266536 -36655 -436946
47239d36946l90475j52350J26615J63242J4780k9450P7784J00930o0121k24373
47229h10364k40016j56509k5859J86991L94594L60638M2006k59686k57294k1038
47219g86537J73578J71897L115j83220j40735K54273O71915N48234j33798o37712
47209e8990l93135K10997M04210J15151r8927j3156N1380m5854k1016K00327K40003
47198E90990p1060l27874j79755J30294K10888J12473R0411J10474p740k02093
47188D57008k87731k61788j87876r493K33821K79546M9191j12517M1652K19770
47178D21583Q2846j52775j10212N4620m5636k73815j95482Q0026K7768l40054
47168d51131m13093k32L22752J36764j96596j72605J34994L54413L73810K73420
$$ plain form
47239 -436946 -827421 -979771 -853156 -689914 -675134 -704584 -626800 -525870 -585991 -810364
47229 -810364 -1050380 -1206889 -1232748 -1045757 -651163 -290525 -248519 -508205 -765499 -786537
47219 -786537 -612959 -441062 -437947 -621167 -761902 -507629 164286 712520 578722 -58990
47209 -58990 -452125 -241128 163082 278233 179306 166150 217530 171676 150660 350987 590990
47198 590990 519930 192056 12301 142595 353483 465956 556367 666841 659101 457008
47188 457008 169277 -92511 -280387 -289880 -56059 223487 272678 160161 201813 421583
47178 421583 504429 351654 241442 296062 250426 -23389 -218871 -138845 -111077 -451131
47168 -451131 -864224 -864456 -541704 -404940 -601536 -774141 -639147 -284734 89076 362496
47158C62496Q4305p8175n926K08336J60754k18472m46300k13275J34824J94695
47148A83262J04356J22639R5385j43288k81816l0400K78629K11918q994M5589
47138E77280J62899j19879n45406m58594L9757K07565q9191k23427j980K3581
47128d27395k89535k73354L06280O08950M3906o25606m05664L53078N22929o2884
47118b49295m92620k49654J86039K85239J72199J54825K02519J63862N3446o8546
47108A58014j53116m5365K99134N00009J60202l90985l74812K63762O11611N8936
47098A087390p65303q42095j33435M92601M85998J43361p7619j94945m17993o05337
47088h27377l94963J92420O13361M30598q7080k68258P6500M16566K92685l1463
$$ plain form
47158 362496 446801 368626 362700 571036 731790 513318 67018 -146257 -11433 183262
47148 183262 287618 410257 505642 362354 80538 50138 328767 540685 531691 577280
47138 577280 740179 620300 74894 -383700 -343943 -136378 -225569 -448996 -450976 -427395
47128 -427395 -716930 -990284 -684004 -75054 -31148 -656754 -1062418 -709340 -186411 -249295
47118 -249295 -741915 -991569 -805530 -520291 -348092 -193267 9252 173114 226560 158014
47108 158014 4898 -40467 258667 758676 918878 527893 153081 416843 1028454 1087390
47098 1087390 322087 -520008 -653443 -160842 325156 468517 390898 195953 -222040 -827377
47088 -827377 -1222340 -1029920 -416559 14039 -73041 -341299 -264799 151767 444452 412989
47078D12989n8325J23046M1894l00043m18773j90227l0889r7891k954L76528M87698
47067C43053p907n26557l79329J54490K93127k3471j71878L7612J17934j49687
47057c12613l03650K102M11816M32070J22206j40191k30073k50055j96967j2114
47047d77469J87026K25558J34971P0377M1142o7692k39775k73111k5240L55586
47037f8627N01490J93123l20832n08252j75400K58054L08393O5327m4044L7226
47027B46458m834j97921j84338J05424K34320l2723l05505k04912K6816l427j35992
47016d56634L1406L76675L89768l789l07915j89865J14573K35917J26518n5197
47006B61457j97625k19679n9641J63316J88419k6047j59234O4621M32267M23842
$$ plain form
47078 412989 354664 477710 519604 219561 -199212 -389439 -420328 -518219 -521173 -144645 343053
47067 343053 335146 -191411 -570740 -416250 -123123 -146594 -318472 -280860 -162926 -312613
47057 -312613 -616263 -614161 -202345 229725 351931 211740 -18333 -268388 -465355 -477469
47047 -477469 -290443 -64885 70086 140463 181605 113913 -125862 -398973 -424213 -68627
47037 -68627 432863 625986 305154 -203098 -378498 -120444 187949 253276 209232 246458
47027 246458 241624 43703 -140635 -35211 199109 166386 -139119 -344031 -317215 -320642 -456634
47016 -456634 -425228 -48553 341215 337426 29511 -160354 -45781 190136 316654 261457
47006 261457 63832 -155847 -215488 -52172 136247 110200 -49034 15587 447854 871696
46996H71696j29789p28579o99986j1437O08718N20549l2486l00164r3945L0346
46986C4923k42623m28811o2187M55536M40322J8155j00847K07515L20854n7645
46976E85192m17397k87014O7426J60266J6953k5752R3512J66660Q7573q1671k35228
46965A30520k25365K3888K69375J50245k11315k52793J45399L47860n7178n00906
46955a80270k64210L61712N05672N5583k66849j03358J19964Q1936M9697J82030
46945E41907J06348l48155o23747k27000M10829N06180N0522k91006k25880r0499
46935a90501q8964K1313L06314L44657r7600n49632m58677k5607J03665j65482
46925h00514k58967J25969N04592L15055k41090m82390j79194K31347L22267J58031
$$ plain form
46996 871696 741907 13328 -686658 -698095 -89377 431172 398686 98522 4577 34923
46986 34923 -207700 -636511 -698698 -243162 197160 215315 114468 321983 642837 585192
46976 585192 167795 -119219 -51793 108473 125426 99674 193186 359846 447419 365748 130520
46965 130520 -94845 -70957 198418 348663 137348 -115445 29954 377814 320636 -180270
46955 -180270 -444480 -82768 422904 478487 211638 108280 228244 310180 359877 541907
46945 541907 648255 300100 -323647 -550647 -139818 366362 416884 125878 -100002 -190501
46935 -190501 -279465 -258152 48162 392819 295219 -254413 -713090 -738697 -635032 -800514
46925 -800514 -1059481 -933512 -428920 -113865 -354955 -837345 -1016539 -785192 -462925 -304894
46915c04894J5509j9043O78N8937R8307j7462k45519k72952O4448M49719M63209
46904B90937J56478p6271j00291j40337l01142l79401k31780P732J85958L02561
46894b85556L22318J44348j01632q2916K00339K66785j47352n66351l79179K48240
46884c80956N51097J80957m27057p21293o15140k92651J30330N07653N57423J80591
46874c29046k85230m12397j87064O7761J80952K72260M15353M45802K27482p2832
46864C23041j56562K2592K04729J65812k1968j48507j75913k28459k98622j84850
46854d98707J60850M11472K32132k05937l63435l1005L78311L75482J5155k44699
46844B29619j56186J01456K57212K36223Q8159j32332l15874l10200j13786N8539
$$ plain form
46915 -304894 -289385 -308428 -307750 -248813 -150506 -167968 -413487 -686439 -621991 -172272 290937
46904 290937 447415 371144 270853 130516 -170626 -550027 -781807 -774075 -588117 -285556
46894 -285556 36762 181110 79478 -3438 196901 463686 316334 -250017 -629196 -380956
46884 -380956 170141 351098 -75959 -797252 -1412392 -1705043 -1574713 -1067060 -509637 -329046
46874 -329046 -614276 -1026673 -1213737 -1145976 -965024 -692764 -277411 168391 395873 323041
46864 323041 166479 189071 393800 559612 537644 389137 213224 -15235 -313857 -498707
46854 -498707 -337857 73615 305747 99810 -263625 -294630 83681 459163 474318 229619
46844 229619 73433 174889 432101 668324 756483 624151 308277 -1923 -115709 -57170
46834e7170K5491j34035k18271j81540j40178j58093j78449j54352j08525n0904
46824a356026M6109J73537K87481L83229M53043L90308J11062k10782k51233K4500
46814E1228K50429J47423r0691j31725k9495p4557k35496j75399J40937K87902
46804A40556L710l90718m58982k39178m7367O5134K54931M28353L02598n9829
46794g92k08845O4344M07544M13538J55923k5750m0793m0315m4954O6417K19073
46783I65390J37209k20559m91693l59325O455J74261K0478j66212j34140K6672
46773d1464J16905J48249K46135L62196L11597O4078k06204l63155m08159l33722
46763a03544j16049R0498K3943k77152l96610r2062L02202L08079l6097k79367
$$ plain form
46834 -57170 -31679 -165714 -383985 -565525 -705703 -863796 -1042245 -1196597 -1305122 -1356026
46824 -1356026 -1309917 -1136380 -848899 -465670 -12627 377681 488743 277961 26728 51228
46814 51228 301657 449080 358389 226664 197169 122612 -112884 -288283 -147346 140556
46804 140556 144266 -246452 -705434 -944612 -991979 -926845 -671914 -243561 59037 -792
46794 -792 -209637 -145293 262251 675789 831712 805962 765169 724854 679900 746317 965390
46783 965390 1102599 882040 390347 31022 37477 211738 232216 66004 -68136 -41464
46773 -41464 75441 223690 469825 832021 1143618 1207696 1001492 638337 230178 -103544
46763 -103544 -219593 -129095 -105152 -382304 -778914 -870976 -568774 -260695 -296792 -576159
46753e76159k01739J4046J93827L54770M55413L60448J49140R3778K04254J52624
46743A200402j85115m73208m22470k12101j37534j53277q0906J3504M445J5779
46733d30481J59610K04366n5836l09632j25531K99818L80510Q9477J6258L63701
46723E92260N53495J46475m18159m75426j16094L9142j75291k86862J7672L98322
46713B75534L39353j63285n99319n29860l9908L93680M27277J75005k7841p0614
46703A80022r2965j26878j3482K44888L51047J20315k10367k95843j15269J19943
46693A61411K90483L50634J81933k15265n21268m34919j29576j4297q9225M8386
46683c71703M98068P76190M52920k30536o52874n55349k32732m4767J7806J93506
$$ plain form
46753 -576159 -777898 -763852 -570025 -215255 240158 600606 749746 843524 1047778 1200402
46743 1200402 1015287 542079 119609 -92492 -230026 -383303 -464209 -450705 -446260 -430481
46733 -430481 -270871 -66505 -122341 -431973 -557504 -257686 122824 212301 228559 592260
46723 592260 1145755 1292230 874071 398645 282551 321693 146402 -140460 -122788 275534
46713 275534 614887 451602 -147717 -677577 -717485 -323805 103472 278477 250636 180022
46703 180022 87057 -39821 -53303 191585 542632 662947 452580 156737 41468 161411
46693 161411 451894 802528 984461 769196 247928 -186991 -316567 -330864 -420089 -371703
46683 -371703 126365 902555 1355475 1124939 472065 -83284 -316016 -360783 -342977 -149471
46673a49471M95967N76862J53563n01651p40374l06610K99120M30144P7466k37400
46663I7616j97095M6988K60572L59240K49406j24690m80573l79991J13711L81987
46653C27171J02004k60380j56956K12290K47206j16323l58236j92128Q0534J07012
46643g806m5230j07694L407J85268L13213K68361j6716m05999n96190m29704p7180
46632i16270J70640J97783R4496O616K5272J34495K02242R7906j31698k74978
46622c93496j85838N8915K54365K57870Q3323j18080j73437o1735N1236L9290
46612a87587Q256J01525J81384k9044m53706o15698k43901L16744N33549L43273
46602d5205J02372O497q7087k54340k89958o3288J88625J83826M4165J06701L37898
$$ plain form
46673 -149471 346496 923358 1076921 575270 -165104 -471714 -172594 257550 335016 97616
46663 97616 -99479 -52491 208081 567321 816727 692037 211464 -168527 -54816 327171
46653 327171 429175 168795 11839 224129 471335 355012 -3224 -195352 -114818 -7806
46643 -7806 -53036 -160730 -157323 27945 341158 609519 592803 186804 -409386 -839090 -916270
46632 -916270 -745630 -547847 -453351 -446735 -421463 -286968 -84726 13180 -118518 -393496
46622 -393496 -579334 -520419 -266054 -8184 75139 -42941 -216378 -278113 -226877 -187587
46612 -187587 -179331 -77806 103578 74534 -379172 -994870 -1238771 -922027 -388478 -45205
46602 -45205 57167 63664 -23423 -277763 -567721 -631009 -442384 -258558 -214393 -107692 230206
46591B30206K96329j95860o59574n29101N4092L89878J56301j85823q5072L31973
46581a96651M92571J89469k06966l10632j52350J6327O9061K5861o0905j00422
46571b34637l483J44536J04052j87248m50909m03879j36248L9729K6390J013P2249
46560a028435J19376L7359n5718M945J50448J37029j05507l06472j39910L38176
46550h48709O62939M63112q7039m64693m12130j58759j1938K2899P9821J23821
46540f30676M7170o4667l0389J28912K37404K63060L04322L04396Q6438k81769
46530C64201m70057l42123j37717n3534N2446L13751N05427L69702P8866j1433
46520F69529O2437k7929k75118k83006O7433L51342K11472j42272l21344l18635
$$ plain form
46591 230206 526535 330675 -328899 -858000 -803908 -414030 -257729 -443552 -528624 -196651
46581 -196651 295920 485389 278423 -32209 -184559 -168232 -99171 -73310 -134215 -234637
46571 -234637 -238120 -93584 10468 -176780 -627689 -1031568 -1167816 -1128087 -1101697 -1100684 -1028435
46560 -1028435 -909059 -871700 -927418 -922473 -772025 -634996 -740503 -1046975 -1186885 -848709
46550 -848709 -185770 277342 190303 -274390 -686520 -845279 -857217 -834318 -754497 -630676
46540 -630676 -583506 -648173 -678562 -549650 -312246 -49186 255136 559532 645970 364201
46530 364201 -105856 -447979 -585696 -639230 -586784 -273033 232394 602096 680962 669529
46520 669529 731966 704037 428919 145913 213346 564688 776160 633888 312544 -6091
46510f091l35165l17425r4390J84587K00616p476j02139j7596j4368j25398n8247
46499f93092J98051K01437k07798m94486j95090L06564L27287p0745k20811Q6805
46489g61878L46716J81141j70779l50201l20286j23273K78378O70216O05300P8806
46479D34140k87111j04758J92538P1654k47537k40406k367k3120k66317k36675
46469g09959J01470K32273j2471j79678L669K22766K17529J98822L00899K31819
46459F07139j08154k32015J68308N40586K03335n66742q57267l60680L42270O54298
46449C91078N12414R2380m28202p28109n19903l4989J32383j64944m07338j83883
46439a339113K46922M23625L12655J56178J6684j62605k74353j91484m8737m6717
$$ plain form
46510 -6091 -341256 -658681 -753071 -568484 -367868 -375344 -477483 -495079 -509447 -634845 -693092
46499 -693092 -495041 -293604 -501402 -995888 -1190978 -884414 -557127 -627872 -848683 -761878
46489 -761878 -415162 -234021 -404800 -755001 -1075287 -1198560 -920182 -249966 355334 434140
46479 434140 147029 42271 234809 306463 58926 -181480 -183847 -206967 -473284 -709959
46469 -709959 -608489 -376216 -388687 -568365 -564696 -341930 -124401 74421 375320 607139
46459 607139 498985 266970 435278 975864 1179199 612457 -244810 -605490 -263220 391078
46449 391078 903492 995872 567670 -160439 -680342 -715331 -582948 -747892 -1155230 -1339113
46439 -1339113 -1092191 -668566 -355911 -199733 -183049 -345654 -620007 -811491 -860228 -906945
46429i06945q2009R7743M26624N42255L04627j258r1833q4937k75144o06248o16876
46418a294001l7063O99034Q21689J89302m21365k78261L00166L96082j44255m62775
46408b31447j562O09514M79362k30102o05702l32105K6099N7902M7789K64655
46398H4403L83017N4955l96211l83805O8667L66518J95497j11784j35737O3016
46388A88536J29755m6491k25277j95464n8047n0931k00709k86946j54583O7390
46378h32767J42496M4455j8955J11804L34524L79562R4076l53346n62288k87970
46368i48409K39428N21851L76067J20870P1681J03595l4944k13309j17137J70107
46358B89800K41491K0959j19940K784Q8271j09838l53117l11129o2651J04221
$$ plain form
46429 -906945 -988954 -891211 -464587 77668 382295 381037 289204 204267 -70877 -677125 -1294001
46418 -1294001 -1331064 -632030 189659 378961 -42404 -320665 -20499 375583 231328 -231447
46408 -231447 -233009 376505 855867 625765 20063 -312042 -285943 -228041 -180252 84403
46398 84403 467420 522375 126164 -257641 -188974 177544 373041 261257 125520 188536
46388 188536 318291 271800 46523 -148941 -206988 -257919 -458628 -745574 -900157 -832767
46378 -832767 -690271 -645816 -664771 -552967 -218443 161119 255195 -98151 -660439 -948409
46368 -948409 -708981 -187130 188937 309807 381488 485083 450139 236830 119693 289800
46358 289800 531291 552250 432310 435094 523365 413527 60410 -250719 -313370 -209149
46348b09149J34170J35460Q9256n0504j46350q4299l5107j87585l60913k29386
46338i44407J56265M09783L22741L9516k21483l28755j94994J07420K53297K6872
46328c73745k79664k04240J85382L57738J11665j53435q4695J42012J94768P2808
46318c1406k7038m1241K017J18782K60495K85204J89275J20405M7757k32236o00850
46307I1164n76665p6687K43870j10147o22475m37248L56002Q22614N18470j649
46297B07249j48543q0065j78734l10944j16036K88555M20299J49720j24262m4845
46287F2394K61756L99281J71190k43932m98127m10480j21225R9368J71237K29870
46277A21332L32580L21221P0130k90178n27504n52970l87701n0978L36306M96659
$$ plain form
46348 -209149 -74979 60481 149737 99233 -47117 -131416 -166523 -354108 -715021 -944407
46338 -944407 -788142 -378359 -55618 -16102 -237585 -566340 -761334 -653914 -400617 -373745
46328 -373745 -653409 -857649 -672267 -314529 -202864 -356299 -440994 -298982 -104214 -31406
46318 -31406 -58444 -99685 -97668 21114 281609 566813 756088 876493 924250 692014 91164
46307 91164 -485501 -562188 -318318 -428465 -1050940 -1488188 -1132186 -309572 208898 207249
46297 207249 58706 -21359 -200093 -511037 -627073 -338518 81781 231501 107239 62394
46287 62394 324150 723431 894621 650689 152562 -257918 -379143 -279775 -108538 121332
46277 121332 453912 775133 845263 555085 27581 -525389 -913090 -964068 -627762 -131103
46267a31103K97050M690k7926J37771J46382p0382k01526r9625j4447j06943j19915
46256a85974J49012L63586Q7389m59930n92178j16055L73582L14994j00279k90069
46246d55922p8147J94812K10996K0273j29292r0692P1530J65538Q9802o212Q3868
46235G6554K31162M5870m86666p67522l35519L93335O16957K37590j02004n0897
46225a41140L3143j31915k23568K5745K14383r3934n28656m07578J48511L60819
46215g44190K7200j74971J79497N66220L75291j14648k22665N5807J37268j45042
46205f0233l17303r7527J77200J69193M7887N0699n20k84475m34219O95P07802
46194d0801Q71792L16485k35059k29304q359j05127l51025k47362J30598K55052
$$ plain form
46267 -131103 165947 170637 142711 280482 426864 356482 154956 55331 40884 -66059 -185974
46256 -185974 -36962 326624 414013 -45917 -638095 -754150 -380568 -65574 -165853 -455922
46246 -455922 -534069 -339257 -128261 -107988 -237280 -327972 -256442 -90904 -1102 -7314 76554
46235 76554 307716 353586 -133080 -900602 -1236121 -842786 -225829 11761 -90243 -141140
46225 -141140 -107997 -239912 -463480 -437735 -223352 -317286 -845942 -1253520 -1105009 -744190
46215 -744190 -716990 -891961 -712464 -146244 229047 114399 -108266 -52459 84809 -60233
46205 -60233 -377536 -475063 -297863 -128670 -80783 -30084 -30604 -315079 -749298 -748603 -40801
46194 -40801 830991 1147476 912417 683113 674754 569627 218602 -28760 101838 356890
46184C56890J0545k08445k31815l04509m58522l29094J71522N52163M32345P5137
46174F6217r8544r4398p4374O9344M03813N77418K88940j24162j25972J66805
46164A055087J51562l27832p83589q21968n58219k46967J6790J48042P5107r589
46154a301576J77083M97054M87288P3478k68142k12977R747J17973K08692L94919
46144A83539M37056J26305k62036k92558K7198K80487J54968k89862p19470p40010
46134a094383k32986L83333M95154M7511l63273l19760r4504o5239q3454J39960
46124a187641M14258L79559J62710J47344K73680J58531j86787l52561k29403
46115d20310j41231k29089k43294o0758R3418R4989J28214K62549K58361J7603
$$ plain form
46184 356890 367435 158990 -72825 -377334 -835856 -1164950 -993428 -441265 -8920 66217
46174 66217 -32327 -126725 -201099 -131755 272058 849476 1138416 1014254 888282 1055087
46164 1055087 1206649 878817 95228 -726740 -1284959 -1531926 -1515136 -1367094 -1291987 -1301576
46154 -1301576 -1124493 -627439 -140151 -66673 -334815 -547792 -538045 -420072 -211380 183539
46144 183539 620595 746900 484864 192306 219504 499991 654959 365097 -354373 -1094383
46134 -1094383 -1327369 -944036 -448882 -401371 -764644 -1084404 -1178908 -1244147 -1327601 -1187641
46124 -1187641 -773383 -393824 -231114 -83770 189910 348441 161654 -190907 -420310
46115 -420310 -561541 -790630 -1033924 -1094682 -1001264 -906275 -778061 -515512 -257151 -239548
46105b39548j68110p3076J07611J22045N9242R5450J31460Q527j38263q0033J06029
46094f8666J54822K8371p7840p0074k0318O4080K57381M77103M71487J42381k69988
46083A088739m35603l01958j23670j32910k56828k38419j7885J56033Q6164o2947
46073b39284k2260J31406Q7678j57525k33190L4000L18871K76089M4817P394K30059
46062D78055M23412L55649O4677k66785m40942l27550j8203J76385P9202r4884
46052D29016n9851O5618p9772m79107o44575k79807K66685M46066K11141j0424
46042a35010M4575J80030J37994K31o613P9219K6123j68535k46486j35595r5328
46031c19395k36103k24401J95496O42918N42249R277k59148k9166J30579k03769
$$ plain form
46105 -239548 -407658 -480734 -373123 -251078 -191836 -96386 35074 43601 -94662 -174695 -68666
46094 -68666 86156 114527 36687 -33387 -53705 10375 267756 744859 1216346 1358727 1088739
46083 1088739 653136 351178 227508 94598 -162230 -400649 -418534 -262501 -176337 -239284
46073 -239284 -261544 -130138 -42460 -199985 -433175 -399175 -80304 195785 240602 247996 478055
46062 478055 901467 1257116 1321793 1055008 614066 286516 268313 444698 523900 429016
46052 429016 369165 434783 355011 -124096 -768671 -1048478 -781793 -335727 -124586 -135010
46042 -135010 -90435 89595 227589 227820 221207 300426 326549 158014 -88472 -224067 -319395
46031 -319395 -555498 -779899 -584403 58515 600764 610041 350893 321727 452306 248537
46021B48537n87318l89541K04435M67944K15767r579J46296L24885P9588l86016
46011C14998m70908j1783M65706L86493j60823n07284k08625L87577N61206J43525
46001I00082k76657j63876K68038M22001J30016k45448l75519k57380k163K93668
45991F92762M34604K18750k53474n97997n56123k17951J62767L82662L49265J55598
45981G70863N7559J44188J28254k19575n54623l39827K94037O21754L45772l2238
45971A216164n4554Q1027P5092Q8257K63992K26013l14525q53761p15995j18335
45961a06625J38901j00362k25347M7053K76288J62102K8893J30356J57894j26804
45951C82349l52156j43362J95080J60853j33571k06726j7382N8425p9147j46043
$$ plain form
46021 248537 -338781 -728322 -523887 -55943 159824 150245 296541 621426 701014 314998
46011 314998 -155910 -167693 298013 684506 523683 16399 -192226 195351 756557 900082
46001 900082 623425 459549 727587 1149588 1279604 1034156 658637 401257 399094 692762
45991 692762 1127366 1346116 1092642 494645 -61478 -279429 -116662 266000 615265 770863
45981 770863 828422 972610 1100864 881289 326666 -13161 280876 902630 1248402 1216164
45971 1216164 1161610 1242637 1317729 1405986 1669978 1895991 1581466 727705 11710 -106625
45961 -106625 32276 -68086 -293433 -246380 29908 192010 220903 351259 509153 382349
45951 382349 30193 -113169 81911 242764 109193 -97533 -114915 -56490 -135637 -281680
45941b81680k4519P4595K4086n5311o7032l0531P3117K13180J59563j84729m29434
45930e28695j75802K61799K44720j13694m2263N63084P78447N7866p89719p11696
45920d55953R3355N84405L70509m9480k84581m00989l46598R1226O30287N84273
45910H16454j34686p45578o10223K7154N54233P00718M77889k5405m57585l52271
45900B50700J68429L56857j00452n43587l46258J22233J90646L149J10626L45343
45890E57686R2024m89905n60702J6658M01807J46431j30972R7485L32587k5051
45880D38048n16563k96196M43257O79639J01971m67547l70105m0502j99962o67465
45870h95425o06825K15511J014425R66884K09808m28357m70418j86750O111R6974
$$ plain form
45941 -281680 -306199 -231604 -207518 -262829 -329861 -360392 -287275 -74095 85468 -99261 -528695
45930 -528695 -704497 -442698 -197978 -311672 -353935 209149 987596 1045462 255743 -455953
45920 -455953 -362598 221807 592316 542836 258255 -142734 -489332 -398106 232181 816454
45910 816454 681768 -63810 -674033 -646879 -92646 608072 1085961 1060556 602971 250700
45900 250700 419129 775986 675534 131947 -214311 -92078 98568 101717 212343 557686
45890 557686 649710 159805 -400897 -384239 17568 163999 33027 130512 463099 438048
45880 438048 -78515 -374711 68546 748185 850156 382609 12504 -27998 -227960 -895425
45870 -895425 -1502250 -1286739 -272314 694570 904378 476021 5603 -181147 -175036 -78062
45860g8062K27348K65344L7377k17568j01518K85998M23750J49005j22192r2560
45850G76922l678r9438j44611J19105M07510K73501j78219m47376l76085k47943
45840G9688j99518j3887M17459Q10338Q19556M32178n5540l01752j71398J09805
45830A926929J19820k55396o04168n14107j51435J3471r6553j62860n9857L9597
45820B55441J07888K83020M23110K13828j82368k04004J87970L26004r5734m37964
45810H77191j11289M43765M46084j0600k07905J5356J50619j8797j43275l9651
45800A401498K8808n6131m9648R3337M1394k93642n18414l99552k12243j72425
45790a37018o9307J96241K62228o5640l44414j63985J75130K21165J58428L50750
$$ plain form
45860 -78062 149286 414630 452007 234439 132921 418919 842669 991674 869482 776922
45850 776922 773244 673806 529195 648300 1055810 1329311 1151092 703716 327631 79688
45840 79688 -119830 -133717 283742 1094080 1913636 2345814 2290274 1988522 1817124 1926929
45830 1926929 2046749 1791353 1187185 673078 521643 535114 438561 275701 215844 255441
45820 255441 363329 646349 1069459 1283287 1100919 896915 1084885 1410889 1315155 877191
45810 877191 765902 1209667 1655751 1645151 1437246 1452602 1603221 1584424 1441149 1401498
45800 1401498 1430306 1374175 1324527 1417864 1459258 1165616 647202 247650 35407 -137018
45790 -137018 -206325 -10084 252144 186504 -157910 -321895 -146765 74400 232828 583578
45780E83578M94593P5814n58559n32482J67762N86917K67147j07823P6924L69964
45770A423835Q9178m96704n85804p2459L73011K90391j21826m69825n50359l08443
45760d29005J24478L59627J32052k60909k91106O9645L72896M11640M11640M53478
45750A354436K61298k16204n20782l33383k0452j05004m53047m65197J9521M78110
45740g04M36697Q5895l4638K35837N07478L74368o6015l49868k42138m77M7643
45729I94078p308J39036M05486L26117k32937p28651o03671m7843K64580O9595
45719E78482k50309l06608j63079k4640J50308M42194O31841M43004K7486j65761
45709A362918k7383O8678j19855l05394j49964J60199K18499Q4237J59157M18287
$$ plain form
45780 583578 1078171 1153985 595426 62944 230706 817623 1084770 976947 1053871 1423835
45770 1423835 1513013 1016309 430505 358046 731057 1021448 899622 429797 -120562 -429005
45760 -429005 -304527 55100 187152 -73757 -364863 -295218 77678 489318 900958 1354436
45750 1354436 1615734 1399530 878748 545365 524913 419909 -33138 -498335 -478814 -704
45740 -704 435993 521888 487250 723087 1230565 1604933 1538918 1189050 946912 946435 994078
45729 994078 986770 1125806 1531292 1857409 1624472 895821 292150 244307 508887 578482
45719 578482 328173 21565 -141514 -166154 -15846 426348 1058189 1501193 1528679 1362918
45709 1362918 1335535 1404213 1284358 978964 829000 989199 1207698 1291935 1451092 1869379
45699A869379L39856k32854p06785n51253m0422K43792K49083K52512J63952k66963
45689A320297p17368n57986J01701M14744N3012k89759k2648M18434L33598j20380
45679I33645k78256o9479r418k43693l44833j00411J44385J01038k5286N0074
45669A57766K30158K47241P0887j16399j75406q9060P1323J66111J16737N5896
45659G35254J68016L57012L16228K671k25442r7579J73652K02439k2779j54687
45649A454785J137K23270J78893j53226m62431m59370j65949J49661K57050J45692
45639A169512j1219r343K00930L92442K34127k57045n82873l66248M6531K6988
45629H43802l44036l40814K09904N22207P3347m55444j70265O21213Q80428M27360
$$ plain form
45699 1869379 2209235 1976381 1269596 718343 677921 921713 1170796 1423308 1587260 1320297
45689 1320297 602929 44943 146644 561388 614400 324641 301993 720427 1054025 933645
45679 933645 655389 585910 576492 332799 -12034 -112445 31940 132978 107692 157766
45669 157766 387924 635165 706052 589653 414247 325187 396510 562621 679358 735254
45659 735254 903270 1260282 1576510 1579181 1353739 1256160 1429812 1632251 1609472 1454785
45649 1454785 1455922 1679192 1858085 1704859 1242428 783058 617109 766770 1023820 1169512
45639 1169512 1158293 1148950 1349880 1742322 1976449 1719404 1136531 770283 816814 843802
45629 843802 499766 158952 368856 891063 964410 508966 338701 959914 1840342 2267702
45619B267702P1555K14888L33735M1181k65222j90589O205K035j6379J43092J93003
45608B801206p8703k87163o0426K64796J57112k53060m31924k68322m7939J45831
45598A941408L87804M62941J11210l72780m09261R311L01528J64153q9574j38011
45588B368729q7979j54154l13783m35724m39620k46700J22271L73779K12942j82338
45578A217423l27115j09008R7710P3461P5165L39979O46053O19884K32471k21783
45568B644240m65630m22907k22692r9026j38496j38680Q1276L10861K09724j23163
45558A635507k60534j29603r4619k60365k32506J77800N05488K68018l12860o30427
45548F65899m74330j11039K02347L86505L54795N1850l35233m88937l09260J3088
$$ plain form
45619 2267702 2339257 2554145 2887880 2929061 2663839 2473250 2479455 2481490 2465111 2608203 2801206
45608 2801206 2722503 2435340 2374914 2639710 2796822 2543762 2111838 1843516 1795577 1941408
45598 1941408 2329212 2792153 2903363 2530583 2121322 2130633 2432161 2596314 2506740 2368729
45588 2368729 2280750 2126596 1812813 1377089 937469 690769 813040 1186819 1399761 1217423
45578 1217423 890308 781300 879010 952471 1027636 1367615 2013668 2633552 2866023 2644240
45568 2644240 2178610 1755703 1533011 1433985 1295489 1156809 1238085 1548946 1758670 1635507
45558 1635507 1374973 1245370 1150751 890386 657880 835680 1341168 1609186 1296326 665899
45548 665899 191569 80530 282877 669382 1024177 1076027 740794 251857 -57403 -44315
45538d4315K39702K74817J78519J02926J57336K84152L50117L33800K60704L9383
45528B177141l37844n12761j37223M55372N17625l2537m25328k04304J01536p4912
45518A526765l95983k87106L3428K5023j10340K06225P48698P00711J9396m24571
45508B042246k06451J11024N4888o4964N5937R5935j73088k84762J46404O37513
45498B414682N24593j1476k97634j90203n7670k8672M5694Q1711r4502k31685
45488B154838L5256M45571L89774q8494l01470k0123J76042j14342m80251m28794
45478A768007j50462p1966j14633N0276L24094L24263M1844j53477r8711J1854
45468A931089L5891L6537R853j51264l39143k35056K08310N66614M31113q1753
$$ plain form
45538 -44315 195387 470204 648723 751649 908985 1193137 1543254 1877054 2137758 2177141
45528 2177141 1839297 1326536 1189313 1644685 2162310 2129773 1704445 1500141 1601677 1526765
45518 1526765 1130782 843676 877104 902127 791787 998012 1746710 2447421 2466817 2042246
45508 2042246 1835795 1946819 2001707 1936743 1992680 2088615 1915527 1630765 1777169 2414682
45498 2414682 2939275 2927799 2630165 2439962 2382292 2353620 2399314 2481025 2386523 2154838
45488 2154838 2190094 2635665 3025439 2936945 2635475 2615352 2791394 2677052 2196801 1768007
45478 1768007 1617545 1545579 1430946 1481222 1805316 2129579 2171423 2017946 1919235 1931089
45468 1931089 1966980 2003517 2013370 1862106 1522963 1287907 1496217 2062831 2493944 2412191
45458B412191m93965n11906k32838R9771L43932M61923M41405L01536J24828R180
45448B956057k6692n9895j56262k66052k85849k23644k02412k47892j92610P8139
45438A372888L74373L93049J45274l0644N4263J72322M3792k08147k10012J18615
45428B225773M29159L95316R3658j69461k53337k55939k84747l26187l29463k77623
45418A247149j53215M5702K13369J78787p3849l12857k96039n0326J94841L08980
45408A302542L48568L51492K33579j9144k08045j31153J33578L03927K26675R776
45398B551795j54322j65785l4422J32361J57508k6507k07297r3968K51001M00590
45388B810954J15719l06102m43656l26484k99159m23795l92058o2736K75916L35620
$$ plain form
45458 2412191 1918226 1406320 1173482 1273253 1617185 2079108 2520513 2822049 2946877 2956057
45448 2956057 2929365 2869470 2713208 2447156 2161307 1937663 1735251 1487359 1294749 1372888
45438 1372888 1747261 2140310 2285584 2254940 2309203 2481525 2525317 2317170 2107158 2225773
45428 2225773 2654932 3050248 3143906 2974445 2721108 2465169 2180422 1854235 1524772 1247149
45418 1247149 1093934 1139636 1353005 1531792 1457943 1145086 849047 798721 993562 1302542
45408 1302542 1651110 2002602 2236181 2217037 2008992 1877839 2011417 2315344 2542019 2551795
45398 2551795 2397473 2231688 2197266 2329627 2487135 2460628 2253331 2159363 2410364 2810954
45388 2810954 2926673 2620571 2176915 1850431 1551272 1127477 735419 672683 948599 1284219
45378A284219K29486K18198K69158J53535j17234k40353l2532L07844M23463J89593
45368B685377j60414k72279m9585K10206J61632j04534j42655J80384L97458J05956
45358C011546l41052k72404K85670N88701K35212l20542n41609n33053n89363
45349A523106n17247k0470N50900N50837M9398k06604Q7420L96536K81046O8721
45339B763643J95547M31110L11962m0363j57357n2627j52330m51722m07281J71900
45329B612482O85271N06503j83366o63937n43705n0304L93736N69753M72967J94068
45319C993468j16499k83786k12031K1012J90551J23379o9775n8332K78717N89815
45309D456519M43511o2738l67674j52202L03147N48157M65342K15571l2822j35466
$$ plain form
45378 1284219 1513705 1731903 2001061 2154596 2037362 1797009 1764477 2072321 2495784 2685377
45368 2685377 2524963 2252684 2203099 2413305 2574937 2470403 2327748 2508132 2905590 3011546
45358 3011546 2670494 2398090 2683760 3272461 3507673 3187131 2645522 2112469 1523106
45349 1523106 1005859 985389 1536289 2087126 2136524 1929920 2017340 2413876 2694922 2763643
45339 2763643 2959190 3390300 3702262 3661899 3504542 3451915 3299585 2847863 2440582 2612482
45329 2612482 3297753 3804256 3620890 2956953 2413248 2362944 2756680 3326433 3799400 3993468
45319 3993468 3876969 3593183 3381152 3402164 3592715 3716094 3646319 3587987 3866704 4456519
45309 4456519 4900030 4837292 4469618 4317416 4620563 5168720 5634062 5849633 5816811 5681345
45299E681345J3868K89721L82907K46723K34831N41781Q01705O15665K30379K12596
45289I251521N82318P99029O05485L54371L69579M69175L73297K05998K71578
45280A3282351N73207Q57907R93027J037124J034711R77206R27244R88202J141622
45271B1812601J240555J189061J065851J041722J171195J289275J210397J057836
45263C1078493J201699J707692K065540J787462J130981P99377R68075J101751
45255D1841070Q04871L13576o4683m56883j003722j404712j376473j219899j382754
45246C6050391j696117j634697j209914r88576j208214j454902j357158j096242
45238B5404571j007512j080250j110780j046504r31159p47580n36767m72415o16765
$$ plain form
45299 5681345 5695213 5984934 6367841 6614564 6849395 7391176 8192881 8808546 9038925 9251521
45289 9251521 9833839 10632868 11238353 11592724 11962303 12431478 12804775 13010773 13282351
45280 13282351 13855558 14713465 15706492 16743616 17778327 18755533 19682777 20670979 21812601
45271 21812601 23053156 24242217 25308068 26349790 27520985 28810260 30020657 31078493
45263 31078493 32280192 33987884 36053424 37840886 38971867 39771244 40739319 41841070
45255 41841070 42645941 42959517 42894834 42437951 41434229 40029517 38653044 37433145 36050391
45246 36050391 34354274 32719577 31509663 30521087 29312873 27857971 26500813 25404571
45238 25404571 24397059 23316809 22206029 21159525 20228366 19480786 18944019 18471604 17854839
45229A7854839p73963p53515o06546m56550l06191j86804k69562n86267q34034
45220A3081407p39386m61941l24704k78100l4983K93850J82847n00456j072966
45211A0145568p95432J43235Q12675O84769J90153P489J69485K02434n6625k28962
45201A1274789j3271L53244M46553K04198j15253l28719m14098l37082j08014
45192A0962347M3576j19403m28514m25545J1167M47336M57090J48316q9278j37543
45182A0869549j57994j76115N280M63636R95397J361935J483304J318720P93779
45173A6957491J7657o02789p14087m41337k56102m04236o37124n56078p5345N17373
45163A3805423Q32651O65917J76512j44068J23067Q16292J281036J135654P33306
$$ plain form
45229 17854839 17080876 16327361 15720815 15264265 14958074 14771270 14501708 13915441 13081407
45220 13081407 12342021 11880080 11555376 11277276 11242293 11536143 11718990 11218534 10145568
45211 10145568 9350136 9493371 10306046 10990815 11180968 11188457 11357942 11560376 11503751 11274789
45201 11274789 11261518 11614762 12061315 12265513 12150260 11821541 11407443 11070361 10962347
45192 10962347 11005923 10886520 10458006 10032461 10043628 10490964 10948054 11096370 11007092 10869549
45182 10869549 10711555 10535440 10540720 11004356 11999753 13361688 14844992 16163712 16957491
45173 16957491 16975148 16372359 15658272 15216935 14960833 14556597 13919473 13363395 13288050 13805423
45163 13805423 14638074 15303991 15480503 15336435 15459502 16275794 17556830 18692484 19425790
45154A9425790O20508P85786Q30449O86628O37535O82576M77355N985k72309j66874
45144B3713429r1688l53836o39739o04936m68650n34011n85392l45634j17301
45135A9972242k88328n36048k95852K05117K26111k62970n02122j43850L03478
45126A8677778M03815L64542M15954L75350J88477K30541O57824J055318J144067
45117B3513666J269024J735106K196467K197986J843342J425752Q51612l3392
45109C4999563r41662j495285j731925j801028j579875j098204q67536j161210
45101B4322838j404133r84449k77946p4344l11141k54634K72093P58861J003318
45092B3050463J300242J612304J469382Q45218K97657M3292l10909r01441j287872
$$ plain form
45154 19425790 20046298 20832084 21662533 22349161 22986696 23669272 24146627 24152612 23880303 23713429
45144 23713429 23621741 23267905 22628166 22023230 21554580 21020569 20435177 20089543 19972242
45135 19972242 19683914 19147866 18852014 19057131 19283242 19020272 18518150 18374300 18677778
45126 18677778 19081593 19446135 19862089 20237439 20425916 20656457 21314281 22369599 23513666
45117 23513666 24782690 26517796 28714263 30912249 32755591 34181343 35032955 34999563
45109 34999563 34057901 32562616 30830691 29029663 27449788 26351584 25484048 24322838
45101 24322838 22918705 21934256 21656310 21581966 21270825 21016191 21288284 22047145 23050463
45092 23050463 24350705 25963009 27432391 28277609 28575266 28618558 28307649 27406208 26118336
45083B6118336j280790j280341j425594j216994m74203R4436j00195o01770o87676
45074A9145209n28560p79699j391571j658322j294027p23556l39711j14737R539
45065A2324565q6012l79793o04871o03055m90984m03717l40507l16976m17497
45056H681153o16315p24931n82953k09310K17846M50370L18631r9531n23628p37524
45046F173808o99802m06915Q0285M28216K45232k99344m82543K4082O06133N43444
45036F212596M1079j51082J00458K28903j5305j96445r263J88217M418l11635
45026F091941k69041R1648K83219J14192n6949J51015O38306R69579Q97639O25255
45016I536804N52183Q26515J212240J404543J378579J353695J508418J858003
$$ plain form
45083 26118336 24837546 23557205 22131611 20914617 20440414 20534850 20434655 19832885 19145209
45074 19145209 18616649 17836950 16445379 14787057 13493030 12769474 12429763 12315026 12324565
45065 12324565 12238553 11858760 11253889 10650834 10159850 9756133 9415626 9098650 8681153
45056 8681153 8064838 7339907 6756954 6547644 6765490 7215860 7534491 7434960 6911332 6173808
45046 6173808 5474006 5067091 5147376 5575592 5820824 5521480 5038937 5063019 5669152 6212596
45036 6212596 6253675 6102593 6203051 6431954 6416649 6220204 6210941 6399158 6403576 6091941
45026 6091941 5822900 5914548 6197767 6311959 6255010 6406025 7044331 8013910 8911549 9536804
45016 9536804 10088987 10915502 12127742 13532285 14910864 16264559 17772977 19630980
45008A9630980K335702K811362L047412K836750K245586J572556R89439L42004
45000C5811791n87165j691875k550495k843330k680934k443876k323677k143313
44992A8547126j694507j124508q13454r07420j156587j220948r67724m75623M3393
44983A0229748L08903J94003p3529j64057j07855j87460l48606j80191L38192
44974A0009148N68692O9243o87376r21993n79886k29074j34298j9394K89191N32335
44964H896588M42841J15391j57801j69452Q8376L57397K51454k54050o20231m05744
44954H544769L2695j0587n45990q77544o47390k71360j84256k42141j47040L3276
44944E684432J00226Q9123R0041M0028l7863N9173K88802K27343k83084p07331
$$ plain form
45008 19630980 21966682 24778044 27825456 30662206 32907792 34480348 35469787 35811791
45000 35811791 35224626 33532751 30982256 28138926 25457992 23014116 20690439 18547126
44992 18547126 16852619 15728111 14914657 14007237 12850650 11629702 10661978 10186355 10229748
44983 10229748 10538651 10732654 10659125 10495068 10387213 10199753 9851147 9670956 10009148
44974 10009148 10577840 10647083 9959707 9037714 8457828 8228754 8094456 8075062 8364253 8896588
44964 8896588 9339429 9454820 9297019 9127567 9215943 9573340 9824794 9570744 8950513 8544769
44954 8544769 8577464 8566877 8020887 7143343 6495953 6224593 6040337 5798196 5651156 5684432
44944 5684432 5784658 5873781 5963822 6003850 5965987 6025160 6313962 6541305 6258221 5550890
44934E550890m89052J07119L21101o5812n00699m51267q358L77328M29814J92674
44924E463738j30400l28997k87146m2365K61057M79026N23829L85728J59772K241
44914F486483K426J14538K14187J82738j1733k25336k01516J37360N35286P00269
44904G934702O43397N05334K18624k87479o73999n03387J1399J34712l35904o95926
44894F951473l45431L11582M50272k3316m33921l13826N9383J32399k31958o19145
44884E937512m97804K10084R71336J166625P67395K83893O7790J1113k3799P1615
44874H965760L10590M21768K75701J45224K75607N32138P06075P89130P26392
44865A3148385L77514j148J83531R13117J293214Q04536K05627M43669J205904
$$ plain form
44934 5550890 5061838 5168957 5490058 5424246 4923547 4472280 4463922 4841250 5271064 5463738
44924 5463738 5333338 5004341 4717195 4674830 4935887 5414913 5938742 6324470 6484242 6486483
44914 6486483 6488909 6603447 6817634 7000372 6988639 6763303 6561787 6699147 7234433 7934702
44904 7934702 8578099 9083433 9302057 9014578 8340579 7837192 7848591 7983303 7647399 6951473
44894 6951473 6606042 6917624 7367896 7344580 6910659 6596833 6656216 6788615 6556657 5937512
44884 5937512 5439708 5649792 6621128 7787753 8555148 8839041 8906831 8917944 8894145 8965760
44874 8965760 9276350 9698118 9973819 10119043 10394650 10926788 11632863 12421993 13148385
44865 13148385 13525899 13524751 13708282 14621399 15914613 16719149 16924776 17368445 18574349
44856A8574349J477691J159083J073940J521293J888498J793580J646865J838866
44848C0974165K189029K494795K927056L569676M166936M628010N276245O364834
44840F2590746P812527R559863J1664407J3927786J6022842J8137486K0846268
44833A60561925K4112974K6999897K8494690K7888879K4193955J6305721M595103
44826C13153144q235953j8717491k4930652k7069981k6372555k4146517k1410085
44819A62269910j8665459j5959903j3408620j1381296r937920q579912o995354
44812G7341446n585035m750913m147568l270421k374372k069726k267352k278201
44804E0597858j852942j443361j440108j711685j917232j844262j481380j111219
$$ plain form
44856 18574349 20052040 21211123 22285063 23806356 25694854 27488434 29135299 30974165
44848 30974165 33163194 35657989 38585045 42154721 46321657 50949667 56225912 62590746
44840 62590746 70403273 79963136 91627543 105555329 121578171 139715657 160561925
44833 160561925 184674899 211674796 240169486 268058365 292252320 308558041 313153144
44826 313153144 304917191 286199700 261269048 234199067 207826512 183679995 162269910
44819 162269910 143604451 127644548 114235928 102854632 92916712 84336800 77341446
44812 77341446 71756411 67005498 62857930 59587509 57213137 55143411 52876059 50597858
44804 50597858 48744916 47301555 45861447 44149762 42232530 40388268 38906888 37795669
44796C7795669j168631j638502j863913j404041p54270o41619r32837r44217n68103
44787B7879536k80073j83400Q0927M98131O23667M33050L75482M40748M1305r19462
44777B8989911j691456j743641j438203j263631j126731q49880o66005o89014
44769A9521350n25705J4936M12647K43740o7904N630J35036k61210q64787q54045
44759A7759688k48200J07794j01390k50970Q9319M61731L50628K5821M2348L69142
44749A8605911N67768N51998O12366P84971P16150K57224j91545j66172K32260
44740B1970931M67784K94687Q5081K96180P96897R96431O18934N8970j48855K5932
44730B5462972J93673J03939j26653k75369k70689j83712j28859j92739l53796
$$ plain form
44796 37795669 36627038 34988536 33124623 31720582 30966312 30324693 29391856 28447639 27879536
44787 27879536 27599463 27416063 27496990 27995121 28618788 29051838 29427320 29868068 29909373 28989911
44777 28989911 27298455 25554814 24116611 22852980 21726249 20876369 20210364 19521350
44769 19521350 18995645 19010581 19423228 19666968 19599064 19604694 19739730 19478520 18613733 17759688
44759 17759688 17511488 17619282 17517892 17266922 17356241 17817972 18168600 18194421 18236769 18605911
44749 18605911 19173679 19725677 20338043 21123014 21839164 22096388 21904843 21738671 21970931
44740 21970931 22438715 22733402 22818483 23114663 23911560 24907991 25526925 25585895 25437040 25462972
44730 25462972 25656645 25760584 25633931 25358562 25087873 24904161 24775302 24582563 24228767
44721B4228767m83223n12001n42789o87661q70374r40187r14413r13151q88009
44712A7476959o60207k77473q0149k50394m88319l89397n6290j9826m85976r77010
44702A3791918r60969o03081m98738p45369p86790l25945J17260m9942n66884
44693I371460o84654k72840M4755j33958m63386m69433j99869R557L6021n8711
44683G178942k65526n37892o65543m94976j47631J31493J92496r307l64321n13047
44673D504688j57726M13930N33775O7169l41181k04188J31320J47129k107J35112
44663E227921M67543N31347K60129j8321j71137k75193k40912k5744j4093m91629
44653E249911r23197n74440K26469L83443l10076p92861l41969L85072M59489
$$ plain form
44721 24228767 23745544 23233543 22690754 22003093 21132719 20192532 19278119 18364968 17476959
44712 17476959 16816752 16539279 16459130 16208736 15720417 15331020 15274730 15254904 14768928 13791918
44702 13791918 12830949 12227868 11729130 10983761 10196971 9871026 9988286 9938344 9371460
44693 9371460 8686806 8413966 8458721 8324763 7861377 7391944 7192075 7201632 7237653 7178942
44683 7178942 6913416 6375524 5709981 5215005 5067374 5198867 5391363 5382056 5017735 4504688
44673 4504688 4346962 4760892 5294667 5361836 5020655 4816467 4947787 5094916 5092809 5227921
44663 5227921 5695464 6226811 6486940 6468619 6297482 6022289 5781377 5755633 5741540 5249911
44653 5249911 4326714 3752274 3978743 4362186 4052110 3259249 2917280 3302352 3761841
44644C761841K1494k00436r0530o6965k07294k41371j87623k77958l80749j60593
44634A969816K55104L95354K17978J55175L34956L62021M1330k35616j14392J56174
44624C537900J46931o4982l3813L69759P82113Q65873P28131P10011R16363J114503
44614I072789J071502Q33018N80026L30042k9655m51358p17298p76643q32464
44605I079959r56306q82634m32307O6846J06472l42794p90305q07161m01747J33169
44595D773192M76273M08706j3211l80221k89204J62540M75043L76656R4915o5945
44585F018744j09916j49232j02429J33807L74624L14630k0922k44406q1907K97199
44575F430192N24519M86159L83925L73627L24794O2248k60854k57950J78187O59985
$$ plain form
44644 3761841 3783335 3582899 3492369 3425404 3218110 2976739 2789116 2511158 2130409 1969816
44634 1969816 2224920 2620274 2838252 2993427 3328383 3690404 3731734 3496118 3381726 3537900
44624 3537900 3684831 3619849 3586036 3955795 4737908 5603781 6331912 7041923 7958286 9072789
44614 9072789 10144291 10977309 11557335 11887377 11857722 11406364 10689066 9912423 9079959
44605 9079959 8123653 7241019 6808712 6875558 6982030 6639236 5848931 5041770 4640023 4773192
44595 4773192 5249465 5658171 5644960 5264739 4975535 5138075 5613118 5989774 6084689 6018744
44585 6018744 5908828 5759596 5657167 5790974 6165598 6480228 6459306 6214900 6132993 6430192
44575 6430192 6954711 7440870 7824795 8198422 8523216 8585464 8324610 8066660 8244847 8904832
44565H904832P38753M12357L8534j41138j86843k35122l08099l57758l36572k07802
44555H321142m911J36438J18074M927j01483k22615l86390m73639l90977k81242
44545F719324l10296l59054k29015m1415n9033j95986j51893M477q5239l65523
44535D926347l52248R819J32395k37325m78609p1503M55227K59299n11435r28405
44525C203562n98662n772L89211O21208P35256N57353J57012n4495Q8404L14335
44515E407412M58987O62382Q78338Q10987N67072O85468J158139J139481J83341
44506A1951607q84076j055009n84674m88400r46872j180005q09657l86066m07155
44497E209693o36201o75937n47297l73699o8211L05134L50440r1158n76892o21312
$$ plain form
44565 8904832 9643585 10055942 10094476 9953338 9766495 9531373 9223274 8865516 8528944 8321142
44555 8321142 8316231 8452669 8570743 8575670 8474187 8251572 7865182 7391543 7000566 6719324
44545 6719324 6409028 6049974 5820959 5779544 5720511 5524525 5372632 5377109 5291870 4926347
44535 4926347 4574099 4583918 4716313 4478988 4000379 3928876 4384103 4643402 4131967 3203562
44525 3203562 2604900 2599128 2988339 3609547 4344803 4902156 5059168 5004673 5093077 5407412
44515 5407412 5866399 6528781 7407119 8218106 8785178 9470646 10628785 11768266 11951607
44506 11951607 11067531 10012522 9427848 8939448 7992576 6812571 6002914 5616848 5209693
44497 5209693 4573492 3897555 3350258 2976559 2908348 3213482 3563922 3472764 2895872 2274560
44487B274560k88971P5653L50333N21942M21654k213l91563l70691o7161J03459
44477B627002R591j58146k48247k30723q4074J01943R6371j15426j94065P493
44467A811719Q6105k63953n79712k47555M28405N51552p171l99963j24029K57155
44457A512553J03903k95372k99299Q378J8494l56315n13700o9004N81459P71818
44447A462915L47853k27049m11800j25984K26564K45187j7984k03038j67194j14062
44437A015408j74314j73391L0988K62612K99716K07450J54151Q6607j41149m46018
44427A122060n83752m65440k05569O6894K75502L67752L72162L85912L98963K89492
44417B023976R6933O2464K38955L35067J71200L320J04716L11200L36380K66843
$$ plain form
44487 2274560 1985589 2061242 2411575 2933517 3355171 3352958 2961395 2590704 2523543 2627002
44477 2627002 2636593 2478447 2230200 1999477 1915403 2017346 2113717 1998291 1804226 1811719
44467 1811719 1897824 1633871 1054159 806604 1235009 1786561 1779390 1379427 1255398 1512553
44457 1512553 1616456 1321084 1021785 1030163 1048657 692342 178642 109638 691097 1462915
44447 1462915 1810768 1583719 1171919 1045935 1272499 1517686 1499702 1296664 1129470 1015408
44437 1015408 841094 667703 698691 961303 1261019 1468469 1622620 1709227 1568078 1122060
44427 1122060 538308 72868 -132701 -65807 209695 577447 949609 1335521 1734484 2023976
44417 2023976 2120909 2183373 2422328 2757395 2928595 2931915 3036631 3347831 3684211 3951054
44407C951054L18245L41377P7167k70273k78873m0728n6522l91338n45496k93423
44397B811190o6453k44143n50622m95502q0418K59227K12322j37653m42631l65798
44387H99519R3771N00012M30391K5531k18221j73167j59878k81291k35596L7024
44377I18095J07219k18557m54284j46605M04874O13146M24139J75478l8471l06726
44367A478308m49124k08889K23052M00132K58559J01213M9682q827l4984Q2388
44357A891510J38231j38619m82428l41231K26559N29791K48539j61677k77744
44348A632931k84552m08904l89033q881L18501J04285l80033m32328N8996M95755
44338G06737M46686J28080o9905j00156j28842j91594j82774m6850J38116K09780
$$ plain form
44407 3951054 4269299 4610676 4687843 4417570 4138697 4097969 4041447 3650109 3104613 2811190
44397 2811190 2744737 2500594 1949972 1454470 1374052 1633279 1845601 1707948 1265317 899519
44387 899519 993290 1493302 1923693 1949224 1731003 1557836 1397958 1116667 881071 918095
44377 918095 1025314 806757 352473 205868 610742 1223888 1648027 1823505 1785034 1478308
44367 1478308 1029184 820295 1043347 1443479 1702038 1803251 1852933 1844106 1809122 1891510
44357 1891510 2029741 1891122 1408694 1067463 1294022 1823813 2072352 1910675 1632931
44348 1632931 1348379 939475 550442 541561 860062 964347 584314 151986 210982 706737
44338 706737 1153423 1281503 1211598 1111442 982600 791006 608232 561382 699498 909278
44328I09278O7455j44546j04191K57634N16527K35144l76278o41524l03619J51831
44318E67711K11675Q858k5K50735M24813L51272K02772J01600q7598m35387o77114
44307I19312m75757J36830P22728Q26191L73099k54586n42591l35427Q492O5436
44297A443727j13598j35868Q4462J52217k02201o68999p62989m33817O451L40820
44287b89795N07887M13247P8581j66673o7562J02557o0213l56908k41914K20982
44277A40189L68219K9553j57827J53226L87325N2183l33942q3413M39482L70907
44267A365902j95197l26151K14398N59140J01241n97516o92721k07212K06712
44258D28596K23180P1272M4638J71179K78539J95434k2094o1415K23408M39240
$$ plain form
44328 909278 976733 832187 727996 985630 1502157 1737301 1361023 719499 415880 567711
44318 567711 779386 788244 788219 1038954 1463767 1815039 2017811 2119411 2031813 1596426 919312
44307 919312 443555 580385 1303113 2129304 2502403 2247817 1705226 1369799 1378291 1443727
44297 1443727 1330129 1194261 1278723 1430940 1228739 559740 -203249 -637066 -630615 -289795
44287 -289795 218092 631339 709920 543247 475685 578242 518029 161121 -80793 140189
44277 140189 508408 537961 380134 533360 920685 972868 638926 555513 994995 1365902
44267 1365902 1170705 844554 1058952 1618092 1719333 1121817 429096 221884 428596
44258 428596 651776 723048 767686 938865 1217404 1412838 1390744 1329329 1552737 1991977
44248A991977J23845m47844n13455J6371L33305k7901m22597j09261N51061O27460
44238B122961n450n81737n80453k43384K9986J74721K43284K00978R1670M7987
44228A500563M1115p3730k30662j95348L4631J90024J27715k6543j47000k19919
44218A000846j87866j54J80231J45268L794K1994J35692N0083j77895j69479Q1251
44207A083765J08889k20445l84593l8923L49968K02193k49562l31115J8008J99869
44197G38054q2645m15733l40994L4448K96205K65832P5848p4460m3291K18471
44187F71735N64369O57602K53845m78052r87333p93767L288P06890O89345J20856
44177A408778j96903J43019N87464L99163k55855n27026j41011J84836j59833
$$ plain form
44248 1991977 2115822 1667978 1154523 1170894 1504199 1476298 1053701 944440 1495501 2122961
44238 2122961 2117511 1535774 955321 711937 741923 916644 1159928 1360906 1452576 1500563
44228 1500563 1541678 1467948 1237286 1041938 1076569 1266593 1394308 1367765 1220765 1000846
44218 1000846 812980 812826 993057 1138325 1142119 1164113 1299805 1349888 1171993 1002514 1083765
44207 1083765 1192654 972209 587616 548693 898661 1100854 851292 520177 538185 738054
44197 738054 655409 239676 -101318 -66870 229335 495167 571015 496555 453264 671735
44187 671735 1236104 1893706 2147551 1669499 682166 -111601 -108313 598577 1287922 1408778
44177 1408778 1211875 1354894 1942358 2341521 2085666 1558640 1417629 1602465 1442632
44168A442632p20129o23964J35001O89386N17751O1391n1262J23494J17511j45473
44158A546338k93143j33895J00316J72160J34741J09628Q1969N8805J44994K72721
44148B194634J30940l68017p80130o28063o3869L29923L12035J54165P0745n3864
44138A298499k58036k84141k0702K11675J40337j497J14752K90164P5298m30514
44128A135835n91089j40873L82378L55220j14794m12097k60969Q948K1186j46515
44118B37230j59401O6382K70591K33080M8709o7999r3119j24418r3209J81821
44108D99667O10686P79504M46283j14020m50392m43295k62736k3743K07652K22898
44098A472504j12673m95372m47489J0596L47869K68726N7017J8125J6434j47053
$$ plain form
44168 1442632 722503 98539 233540 922926 1440677 1502068 1450806 1574300 1691811 1546338
44158 1546338 1253195 1119300 1219616 1391776 1526517 1636145 1718114 1776919 1921913 2194634
44148 2194634 2325574 1957557 1177427 549364 485495 815418 1127453 1281618 1352363 1298499
44138 1298499 1040463 756322 735620 947295 1087632 1086135 1200887 1491051 1566349 1135835
44128 1135835 544746 403873 786251 1141471 1026677 614580 353611 362559 383745 237230
44118 237230 77829 144211 414802 647882 696591 628592 535473 411055 317846 499667
44108 499667 1110353 1889857 2336140 2222120 1771728 1328433 1065697 1041954 1249606 1472504
44098 1472504 1359831 864459 416970 427566 775435 1044161 1101178 1119303 1135737 988684
44088I88684k86756j55686O7694M9229j36991j59404j7358j1154j64640j48066
44078B5552J59528M45547M22146J69527r0891k48180k21197L8835L24264K78444
44068A303575r6791l49578j83545J54352L02054K69893K30986J48949m0487j52721
44058A586687m7849K7265j94821m89664m49739j54704l7326j69789k09666l8257
44048a77863Q9038Q2058J60429L35912K89773l5054k33735q7806P2743m4101k17077
44037B34317j75355p3537q7288O222L34303M52362l58n21472l77755J99297K89718
44026B80454k83070o71221l20706K60040M06545K46047K25135K65878K6470l51817
44016H3755l95345m0209L06198L74220K65805J33039K0123j430J04053J62925
$$ plain form
44088 988684 701928 546242 613936 663165 526174 366770 349412 338258 173618 25552
44078 25552 185080 630627 1052773 1222300 1131409 883229 662032 700867 1025131 1303575
44068 1303575 1206784 857206 673661 828013 1130067 1399960 1630946 1779895 1739408 1586687
44058 1586687 1538838 1566103 1371282 881618 431879 277175 239849 70060 -139606 -177863
44048 -177863 -88825 -6767 153662 489574 779347 744293 510558 422752 495495 451394 234317
44037 234317 58962 -14575 -101863 -95641 238662 691024 690666 169194 -208561 -9264 280454
44026 280454 -2616 -673837 -994543 -734503 -327958 -81911 143224 409102 435572 83755
44016 83755 -311590 -351799 -45601 328619 594424 727463 747586 746156 850209 1013134
44006A013134J0823j70629r8853R3057L6960j78237n0652M41564N84673m1176
43996A640664p68185o66025J23958N67179J96896l11777k27974K14254L24483
43987A093473L3292j40560q351L4150k60243n29384l26275K29481O15105N48164
43977A288852K27845J4037L6996J09339k6123l25028l95381n370M54885L66513
43967A746565k54210p17745o11075l00722k33262k52159m3053K09282J90857J12973
43957a52549L15035M98437J54199m03641l40665L27057O15106P3426n16557m03339
43947A66509J7118j48l11631k47860K23769N13704L66001Q0807r6642j76835j02107
43936D32685J84851L98156J94705k20986l15406l5989J45950K0067j11708o0116
$$ plain form
44006 1013134 1023957 853328 754475 847532 884492 706255 655603 1097167 1681840 1640664
43996 1640664 872479 206454 330412 897591 1094487 782710 554736 768990 1093473
43987 1093473 1126765 986205 977854 1012004 751761 222377 -103898 125583 740688 1288852
43977 1288852 1516697 1530734 1567730 1677069 1650946 1325918 930537 925167 1380052 1746565
43967 1746565 1492355 774610 163535 -137187 -370449 -622608 -665661 -456379 -265522 -152549
43957 -152549 162486 660923 815122 411481 70816 397873 1012979 1086405 569848 166509
43947 166509 183627 183479 -128152 -376012 -152243 361461 727462 808269 711627 534792 432685
43936 432685 617536 1015692 1210397 989411 674005 638016 783966 804033 692325 632209
43926F32209m0929j47932q2144K85479N34349K65858k52860m13679p2399L11380
43916A019332K81991j13739m43443l68008K0075L14556K61963L2540p3416n7031
43906H74820j28756k74650k35351O2250L59020M30094L34960K14769R4860J688
43896A733704M2451K24908L70322L25883J34577o4844j61580p4434J80440L85579
43886C097006K89130n6357k93844j66041K07410M76864L84929k285k77323n7684
43876C601805M64774N95970N2899n15077l96444J01526J40532k76800l31364J65121
43866C602942L56382k50828q95649p11058j8180K96938J35954N2420J31767o0266
43856B640422n08866n96869o7714N17622N35881P3564k88930j81471K45436N46444
$$ plain form
43926 632209 591280 443348 361204 646683 1181032 1446890 1194030 780351 707952 1019332
43916 1019332 1301323 1187584 744141 376133 396208 710764 972727 1005267 931851 874820
43906 874820 746064 471414 236063 298313 657333 1087427 1422387 1637156 1732016 1733704
43896 1733704 1776155 2001063 2371385 2697268 2831845 2767001 2605421 2530987 2711427 3097006
43886 3097006 3386136 3329779 3035935 2869894 3077304 3554168 3939097 3936812 3659489 3601805
43876 3601805 4066579 4662549 4715448 4200371 3803927 3905453 4045985 3769185 3437821 3602942
43866 3602942 3959324 3708496 2812847 2101789 2083609 2380547 2516501 2568921 2700688 2640422
43856 2640422 2131556 1534687 1466973 1984595 2520476 2594040 2305110 2123639 2369075 2915519
43846B915519M11295n6561m75131n87781m13973n6394L34676M15892n0869o38370
43836A798303n75223J17295M71548k4412n98113m15982P8369k4429n07312l92624
43826g2580L76798Q25023M98371L417j47033j61054k01603k0362K89975J44440
43816A535392m85758p67660k61051L56367L79963Q8471K2931K9630k08779l54678
43806C34828M568M63463L65209j08901k68740m9087K9526j54808k01491K6535
43796D41102K22735K16434J10624q4104l57690l82810N5833M67506K39673k95623
43786F33680k43719L91016N79385j58413r66232q90254j42392M36826N66568N32298
43776G38763M40032J52517k28884l99884l08046j51026P182K44348M61665M17791
$$ plain form
43846 2915519 3326814 3270253 2795122 2207341 1793368 1736974 2071650 2487542 2436673 1798303
43836 1798303 1223080 1340375 1811923 1787511 1189398 773416 851785 827356 320044 -72580
43826 -72580 304218 1129241 1627612 1631029 1483996 1322942 1121339 1100977 1390952 1535392
43816 1535392 1049634 281974 20923 377290 757253 845724 868655 898285 689506 334828
43806 334828 339396 802859 1168068 1059167 790427 741340 770866 616058 414567 441102
43796 441102 663837 880271 990895 906791 549101 166291 222124 689630 929303 633680
43786 633680 389961 780977 1360362 1201949 235717 -654537 -796929 -360103 206465 738763
43776 738763 1178795 1331312 1102428 702544 394498 243472 250654 495002 956667 1374458
43766A374458R8116k27080l47967l13211k63156k41693k11216j31117J5209K01937
43756d5720L53072L86000K65817L1530j95254k68736j66428l9276k2508n8787
43746B39710k6364M9082P5194Q1085J12568N5118j60987k89421o3764K97969L12487
43735F82677l7514k61694j33050J0771p8577j33047Q5402K89584J53325q4894
43725D92983k898K91585L53202J35422M225Q3197R8603q0444j99369m4427K31037
43714A363116L56059K75731J16194n74j9462L4865O8065L8720K8293O3846j7068
43703B307785l11422n65971m42776l9879J64641o2570m14659m63567j54289K16685
43693B33978L45123J60877j36110k33600k0969K54012K78674Q3990l4989K8801
$$ plain form
43766 1374458 1472574 1245494 897527 584316 321160 79467 -131749 -262866 -247657 -45720
43756 -45720 307352 693352 959169 990699 795445 526709 360281 321005 298497 239710
43746 239710 213346 262428 337622 418707 531275 586393 425406 135985 72221 370190 682677
43735 682677 645163 383469 250419 261190 182613 49566 134968 424552 577877 492983
43725 492983 490085 781670 1134872 1270294 1274519 1357716 1456319 1375875 1176506 1132079 1363116
43714 1363116 1719175 1994906 2111100 2110526 2091064 2125929 2193994 2232714 2261007 2324853 2307785
43703 2307785 1996363 1430392 987616 947737 1112378 1049808 635149 171582 17293 233978
43693 233978 579101 739978 603868 370268 349299 603311 881985 965975 930986 959787
43683I59787P9263j6842j15079n3506P7301O1950j59260m27984n11966k95903
43673d02239Q2146L16307K69729J53861K20383L93182M37708L68835L62388L42826
43663B545126O2866l98344o32779m75762j87990J7490J99009L14064J16862l27652
43653A232890n00984j51516K44337J39144l11713n62520m60910k46804j7963K78305
43643c57734M71593L15827l7087j74964k1098J21909R9825O2975J00048J27419
43633G08713J63012L10782M38487K67132j59412m63296m39726k19583P0928L79932
43623A056969M50794J6173n99201o41402L7046O30889M50092j24731k38596K28877
43613A266910O17179M93526J59200J08331L91702O66107O61628M72227M31676
$$ plain form
43683 959787 1039050 1022208 907129 853623 930924 992874 833614 405630 -106336 -402239
43673 -402239 -320093 -3786 265943 419804 640187 1033369 1471077 1839912 2202300 2545126
43663 2545126 2607992 2209648 1576869 1101107 913117 930607 1129616 1443680 1560542 1232890
43653 1232890 731906 580390 824727 963871 652158 89638 -371272 -618076 -636039 -357734
43643 -357734 113859 429686 392599 217635 196537 318446 418271 481246 581294 708713
43633 708713 871725 1182507 1620994 1888126 1728714 1265418 825692 606109 677037 1056969
43623 1056969 1507763 1523936 924735 283333 320379 951268 1401360 1276629 1038033 1266910
43613 1266910 1884089 2377615 2536815 2645146 3036848 3702955 4364583 4836810 5268486
43604E268486P08630J042968J017647O08204K48760K77205N51080P15542N83101
43595A1021623J16724o42242j412596j743340j509612j079925p64468m38891q652
43586C538621J72984j69011o20755n78410j46934P0211n6089q4683J32592J83533
43576B442059j50830m84990m42298k01033j28968k41106l05546k10084K773K26193
43566E06170K62855k1706l95460m21337n6435K51548K19725J00105J83242L28392
43556I57099K87424J48751J11784J08096O108o0468N3671J41732o0060l70065
43546A324072l64161Q78L35313L42078P8177k50321m42758l13634J20816M85333
43536A315793L89112o5659l96704l53872j29241L6703J26128J60050P0273r9961
$$ plain form
43604 5268486 5977116 7020084 8037731 8645935 8894695 9171900 9722980 10438522 11021623
43595 11021623 11138347 10496105 9083509 7340169 5830557 4750632 3986164 3547273 3538621
43586 3538621 3711605 3542594 2921839 2343429 2196495 2266706 2210617 2125934 2258526 2442059
43576 2442059 2291229 1806239 1363941 1162908 1033940 792834 487288 277204 279977 506170
43566 506170 769025 747319 351859 -69478 -125913 125635 345360 445465 628707 957099
43556 957099 1244523 1393274 1505058 1613154 1619262 1558794 1612465 1754197 1694137 1324072
43546 1324072 959911 960789 1296102 1638180 1716357 1466036 1023278 709644 830460 1315793
43536 1315793 1704905 1639246 1242542 888670 759429 796132 922260 1082310 1152583 1052622
43526A052622j24550R2118L05923K27233p0870k12677J9589M02399N10129K15216
43516B417132j40759j61460R5034K19482N7073p6948R0997L58047L58881P8764
43506C296243k32801m60665o05772n37468j57227K76873L85629J99210P5184J07796
43496B347002L5317k22587l69140k09297N0553J54981J30796R4545L4199l3451
43486B012918J3650J16285k4712m54738o91534k96849M48631Q09853M82083j01877
43476B313710l47392j03604L55963P07482P87944N77195J59176k81880n31494
43467C637100m92077k54372J8195K48918M18026M28523J93190j15617j54939J10131
43457D037078K68748L0831l09543k84385Q9957M44113O52084Q20294Q18588M15374
$$ plain form
43526 1052622 928072 1020190 1326113 1553346 1482476 1269799 1289388 1691787 2201916 2417132
43516 2417132 2276373 2114913 2209947 2429429 2486502 2409554 2500551 2858598 3217479 3296243
43506 3296243 3063442 2602777 1997005 1459537 1302310 1579183 1964812 2164022 2239206 2347002
43496 2347002 2382319 2159732 1790592 1581295 1631848 1786829 1917625 2012170 2046369 2012918
43486 2012918 2026568 2142853 2118141 1663403 971869 675020 1123651 1933504 2415587 2313710
43476 2313710 1966318 1862714 2218677 2926159 3714103 4291298 4450474 4168594 3637100
43467 3637100 3145023 2890651 2908846 3157764 3575790 4004313 4197503 4081886 3926947 4037078
43457 4037078 4305826 4336657 4027114 3742729 3832686 4276799 4928883 5749177 6567765 6983139
43447F983139j09785j15364M73605R57970Q41624M93732N01592Q27293J024061
43438A1877867R36253P44071N46096K90600j9358l24753n62715n67759k05058
43429A2715244K35817J83217m15858q71637o84355k59209k33145n11492n58363
43420I600219l27643k55938m99216p72732q50511p16719l61021P6920J54308l16668
43410E730999p52952m84996K02417M26146M502l72473k69278j36J02278J27322
43400D713829J18980p9493l07953j71261J41601n1933p12382q61736p3668P15851
43390C431835N70978p9948k84260p4459j31949m37138l63677J09843L52442K06806
43380C300473J78848M21353M53960R8312j57621l0630Q7016r7720k30964m481
$$ plain form
43447 6983139 6873354 6757990 7231595 8189565 9031189 9524921 10026513 10853806 11877867
43438 11877867 12814120 13558191 14104287 14394887 14375529 14050776 13488061 12920302 12715244
43429 12715244 12951061 13134278 12718420 11846783 11162428 10903219 10670074 10158582 9600219
43420 9600219 9272576 9016638 8517422 7744690 6894179 6177460 5816439 5893359 6047667 5730999
43410 5730999 4978047 4493051 4695468 5121614 5126116 4753643 4484365 4484229 4586507 4713829
43400 4713829 4832809 4753316 4445363 4274102 4415703 4363770 3651388 2789652 2715984 3431835
43390 3431835 4002813 3922865 3638605 3564146 3432197 2995059 2631382 2741225 3093667 3300473
43380 3300473 3479321 3900674 4354634 4452946 4295325 4264695 4351711 4253991 4023027 4018546
43370D018546K16590K3111k67491j10873L22342L84109j7368k82447n0596L22961
43360D558884M07285L31746M56730P16541O94869K72153j56572j88747J04105
43351G196994L52597L90651L69056M18671M43128L43449K78623N14627J042307
43342A1350103J496986J515364J110939O41389M29253M91100O74940R46201J335271
43333A9991546J618457J383658O20276n2913j18976R0490j30912p68314j095447
43324B1537865q32231n76548p94019j074650r11177o24242q00373j211867j121956
43315A3590802m97274r0505k83324o07382n98683m53254n16595o58854n59010
43306I325921k60300p1264j24527l09475m82407n40955m30217k19270m9114N1498
$$ plain form
43370 4018546 4235136 4258247 3990756 3879883 4202225 4586334 4568966 4286519 4235923 4558884
43360 4558884 4966169 5297915 5754645 6471186 7166055 7438208 7281636 7092889 7196994
43351 7196994 7549591 7940242 8309298 8727969 9171097 9514546 9793169 10307796 11350103
43342 11350103 12847089 14362453 15473392 16114781 16544034 17035134 17710074 18656275 19991546
43333 19991546 21610003 22993661 23613937 23561024 23442048 23532538 23401626 22633312 21537865
43324 21537865 20705634 20129086 19335067 18260417 17349240 16724998 15924625 14712758 13590802
43315 13590802 13093528 13003023 12719699 12112317 11513634 11060380 10543785 9884931 9325921
43306 9325921 9065621 8994357 8869830 8560355 8077948 7536993 7106776 6887506 6838392 6889890
43296F889890J31920J10108j31817m20995m01157o3465J72160O0036j17351j0666
43286F218663K71304L66547J95515L2086J31271M61317P61089P99731O35935N70096
43276A0443554P16715P79392N15065K32135L90275Q36007R99337Q06857P36455
43267A6455792R05345Q66339N28402M67070R11425J205100Q41088L11381K32302
43258B2724244K84390j36739p60819q91275o20594n91808q08227p26564l97976
43249A8074632m25340p71986p19696j83423K6850m10912p33445l71235J27576
43240A4613021P7756k69137l46531k55920l39883l64592J5102M20752K69969j64903
43230A3655634j05749M75728Q10946N26834Q3878p6002r1308j90322k67446k25823
$$ plain form
43296 6889890 7021810 7131918 7000101 6579106 6177949 6114484 6286644 6346680 6229329 6218663
43286 6218663 6489967 6856514 7052029 7084115 7215386 7676703 8437792 9237523 9873458 10443554
43276 10443554 11160269 11939661 12454726 12686861 13077136 13913143 14912480 15719337 16455792
43267 16455792 17361137 18227476 18755878 19222948 20134373 21339473 22180561 22491942 22724244
43258 22724244 23008634 22871895 22111076 21219801 20599207 20007399 19199172 18472608 18074632
43249 18074632 17649292 16877306 16157610 15974187 16001037 15590125 14856680 14485445 14613021
43240 14613021 14690777 14421640 14075109 13819189 13479306 13114714 13129816 13550568 13820537 13655634
43230 13655634 13549885 14025613 14836559 15363393 15447271 15371269 15279961 15089639 14822193 14596370
43220A4596370k39114l76216l69183n1342K92209K93878j7811l46386n20366n34023
43210A2728016l87695j37718O711j31156m36514n83405l90802l2601J19292j33014
43200A0621114n76152p68007n13961q3917J33633P8368l3643q3254j28560j75058
43190H470563j42323p1322j02809j94275j04271K41051N69342N74249K67292p7167
43180I430330k14658j01312J20218K49374K17830J50029J53551J32350j9812j32822
43170I985078N6713M54784O54708M88618K26794J24235Q6823l2902j02382O6521
43160A2008990L63683N26174N12155M80727M81811M01326J95031L299K0778L18221
43150A5312195P38857R52413P72812M79351N89206J177928J696073J691787J441329
$$ plain form
43220 14596370 14357256 13981040 13611857 13560515 13852724 14146602 14128791 13782405 13262039 12728016
43210 12728016 12340321 12202603 12209314 12078158 11641644 11058239 10667437 10634836 10754128 10621114
43200 10621114 10044962 9276955 8762994 8679077 8812710 8891078 8857435 8774181 8645621 8470563
43190 8470563 8328240 8256918 8154109 7959834 7855563 8096614 8665956 9240205 9507497 9430330
43180 9430330 9215672 9114360 9234578 9483952 9701782 9851811 10005362 10137712 10117900 9985078
43170 9985078 10041791 10496575 11151283 11639901 11866695 11990930 12077753 12044851 11942469 12008990
43160 12008990 12372673 12898847 13411002 13891729 14373540 14774866 14969897 14973196 14993974 15312195
43150 15312195 16051052 17003465 17776277 18255628 18844834 20022762 21718835 23410622 24851951
43141B4851951J504252J863978J991942J705720J435547J513144J675224J556411
43133C8098169J305186J303512J469083J288294N55413k99896p73380r07845j120408
43124D0918128j549315j857934j720966j281164r75920j009538j150431j043300
43116C0329560o22320j90958j14487m05413o27017l44162K81720N62086J22710
43107B8991719n43426o84412k99628j01929m87317j037370j193861r64263o88150
43098B2991363m95111l37138k53131k43874j38049P3064L7618m28675q84101p98006
43088A9523960l24582k4807j2828J6457M5747k50322p13786o83235m574N94129
43078A8166159M80895p1568m21098m03447k39840n6964L6215k07386p38032r53115
$$ plain form
43141 24851951 26356203 28220181 30212123 31917843 33353390 34866534 36541758 38098169
43133 38098169 39403355 40706867 42175950 43464244 44019657 43719761 42946381 42038536 40918128
43124 40918128 39368813 37510879 35789913 34508749 33532829 32523291 31372860 30329560
43116 30329560 29707240 29516282 29401795 28996382 28369365 28025203 28306923 28869009 28991719
43107 28991719 28448293 27763881 27464253 27362324 26875007 25837637 24643776 23679513 22991363
43098 22991363 22496252 22159114 21905983 21662109 21524060 21597124 21634742 21206067 20321966 19523960
43088 19523960 19199378 19174571 19161743 19178200 19223947 18973625 18259839 17576604 17572030 18166159
43078 18166159 18647054 18575486 18154388 17750941 17511101 17454137 17490352 17282966 16544934 15591819
43068A5591819m34170L16146M61149k4017m07588l09655r9932j27554j79168N6634
43058A4843664M44379O04396L71204j42361o79677r03835o25322j36470k4942
43049A3751036m40263q19061o10561m4531J72810j88895o18920n89151k02459
43040A0410005O6933M7870j6668K9795P232j93261k66607Q0585N33636M92139
43030A1191659k972k22189J77801O13207N05145J92602K76283M90301R8515p65517
43020A2554835j128563o57158j64230k91122n53283k77940K25777K06983k79336
43011I635963m92618j65974K11919K28387J2546j59700j71246O9207N43105Q42844
43001A0554433N06482k40190n85963j73859M36985O03278M38838M64529P74742
$$ plain form
43068 15591819 15157649 15473795 15934944 15910927 15503339 15193684 15093752 14966198 14787030 14843664
43058 14843664 15288043 15892439 16263643 16121282 15441605 14537770 13912448 13775978 13751036
43049 13751036 13310773 12491712 11881151 11836620 12009430 11820535 11201615 10612464 10410005
43040 10410005 10476938 10524808 10508140 10537935 10545167 10351906 10085299 10165884 10699520 11191659
43030 11191659 11188687 10966498 11144299 11757506 12262651 12455253 12731536 13221837 13320352 12554835
43020 12554835 11426272 10769114 10604884 10313762 9760479 9482539 9708316 9915299 9635963
43011 9635963 9143345 8977371 9189290 9417677 9430223 9270523 9099277 9168484 9711589 10554433
43001 10554433 11060915 10820725 10234762 10060903 10497888 11101166 11540004 12004533 12779275
42992A2779275R90629Q50334M46886k6361m30558o32731n96676n13791o09323
42983A2257684q25327q93931p04454m05118j64036l0345k1006j31442k37370j92203
42973H652452p0151j10614l39818m47522j87013K46362M20674J93895j27027j54324
42963H076914J69077N48252O48817M02873M8206j12815l720J80437K17751J05552
42953A0281344K6688J07551K67733L08832J22860j82778l63545k76642m5676P6653
42943A0323020J0851j05009k02136m03839p04439p46946k55047M10374N49710
42934H876539M6500m25243l05808J29292K62727J2889k08250j84784n1131J27857
42924H280588M06269N94692L91946j0030J0618N97852J061594P93200J47889m0188
$$ plain form
42992 12779275 13769904 14620238 15067124 15040763 14610205 13977474 13380798 12867007 12257684
42983 12257684 11432357 10538426 9833972 9428854 9264818 9234473 9213467 9082025 8844655 8652452
42973 8652452 8582301 8471687 8131869 7684347 7497334 7743696 8164370 8358265 8231238 8076914
42963 8076914 8245991 8794243 9443060 9845933 9894139 9781324 9777604 9958041 10175792 10281344
42953 10281344 10308032 10415583 10683316 10992148 11115008 10932230 10568685 10292043 10246367 10323020
42943 10323020 10333871 10228862 10026726 9622887 8918448 8171502 7916455 8326829 8876539
42934 8876539 8923039 8497796 8191988 8321280 8584007 8596896 8388646 8203862 8152731 8280588
42924 8280588 8686857 9281549 9673495 9663465 9674083 10271935 11333529 12126729 12274618 12234430
42914A2234430M29135R77887J106394R32592Q50145J013152J266784J363997J160687
42905B1335203P15619K17730k38525p01601j107207j191440q70943n06898m93541
42896A7158397p34344q49642p62230o90871o67881n23810l37319m10368p08246
42887A1473686p99462n21178k54567k97567l86977j77585J54896J96823n0986
42878I337083k17139j27023M8563J45325J73805J65093J35173J76908L18805L31167
42868A0487760k0172n26684o85775l84594j01177k36936n47269n47368k88778
42859G149007k98181p20459r65465m90014L51623O72374K03329l88319m62945
42850E050950k30473k64064n47135n34473l8275M87169N93476L14265r5321m51487
$$ plain form
42914 12234430 12663565 13641452 14747846 15680438 16530583 17543735 18810519 20174516 21335203
42905 21335203 22050822 22268552 22030027 21328426 20221219 19029779 18158836 17651938 17158397
42896 17158397 16424053 15574411 14812181 14121310 13453429 12929619 12592300 12181932 11473686
42887 11473686 10674224 10153046 9898479 9600912 9213935 9036350 9191246 9388069 9337083
42878 9337083 9119944 8992921 9041484 9186809 9360614 9525707 9660880 9837788 10156593 10487760
42868 10487760 10467588 9940904 9255129 8870535 8769358 8532422 7985153 7437785 7149007
42859 7149007 6850826 6130367 5164902 4674888 5026511 5698885 5902214 5513895 5050950
42850 5050950 4820477 4556413 4009278 3474805 3436530 3923699 4517175 4831440 4736119 4284632
42840D284632n39561j76276M03388O38672L79999J26097K40815L92561J78961
42831E929288j44829j22521P6072n0508m37444n63875l60668k65714l49348j52184
42821C558269M17064P50947M51393n1232k04461j25152k05316l83911l63507k09672
42811C634422j60916j01109J83313M15287J54804l57240l75279K37447P29348
42802D360077N34143L6897j01318J07529J96479O6273J4520R1673L071l05903
42792E003441m58843k07568J93758L87043L83790L87161L79200K02359p4352j98880
42782E997109j29827j01501k44303l80492l02207p0149R7269J11494N6229J2114
42772E045736l0717q6071q0113R8514M29589O67295N34238Q2063k75645k42680
$$ plain form
42840 4284632 3745071 3568795 3972183 4610855 4990854 5116951 5357766 5750327 5929288
42831 5929288 5784459 5661938 5738010 5687502 5250058 4686183 4325515 4059801 3710453 3558269
42821 3558269 3975333 4726280 5177673 5126441 4921980 4796828 4591512 4207601 3844094 3634422
42811 3634422 3473506 3372397 3555710 3970997 4125801 3768561 3393282 3630729 4360077
42802 4360077 4894220 4931117 4829799 4937328 5133807 5200080 5214600 5306273 5309344 5003441
42792 5003441 4544598 4337030 4530788 4917831 5301621 5688782 6067982 6270341 6195989 5997109
42782 5997109 5867282 5765781 5521478 5140986 4838779 4768630 4865899 4977393 5033622 5045736
42772 5045736 5015019 4928948 4848835 4947349 5376938 6044233 6578471 6660534 6384889 6142209
42762F142209k3166j336j65908j94112n1656o2763k96728l61540n0839K37590
42752E171751R5750k33840k44944L0911J17230j28484l29471j91504J37130L77443
42742D801972M53266M34535M03358M15887M04994J86230k20509m35416k08357
42733F235960J17154O3426k19466k01339J11647J69620j68037l81774j95533m1683
42723E489975k81691n82716n13675k36822j15876q8962M3116R7632j52882m34064
42713C224035l38348r025R9494n0231j42225j25747j88572k26660O0996N76614
42703B880331Q78150Q31894O89156N23782J63385k74121l79358j36070l8967l09450
42693D828732n28326l40930l4153k7684j94234j40358J08345J78457j9664j65324
$$ plain form
42762 6142209 6119043 6117707 5951799 5757687 5706031 5643268 5346540 4985000 4934161 5171751
42752 5171751 5267501 5033661 4788717 4819628 4936858 4808374 4478903 4287399 4424529 4801972
42742 4801972 5255238 5689773 6093131 6509018 6914012 7100242 6879733 6444317 6235960
42733 6235960 6353114 6416540 6197074 5995735 6107382 6277002 6108965 5727191 5531658 5489975
42723 5489975 5208284 4625568 4111893 3875071 3759195 3670233 3713349 3810981 3658099 3224035
42713 3224035 2885687 2876662 2976156 2925925 2783700 2657953 2469381 2242721 2303717 2880331
42703 2880331 3758481 4590375 5279531 5803313 5966698 5692577 5313219 5177149 5138182 4828732
42693 4828732 4300406 3959476 3925323 3897639 3703405 3563047 3671392 3849849 3830185 3664861
42683C664861m0448J67178J66122m5213k09840j51409J5172K7804j99438m59619
42673B935170m87894k37945J30008M30946N33546L90976J37311K3696R7331J01517
42663D054662j08938k60370o2264K76086L14366L4656k00144k59607l53928n45067
42653B889452o20118m96949l20888j22494J70326L61519J57859k19223j80714
42644A618770L10076N69142J95736l46126m80250k85988j13383L3402K48413L25074
42634B074866J25232l8470J08328K97302K01768L6334J18793K26359L4907j55751
42624C029668J11074N19851L67767k23968l59347K80512R34077Q45519J98233
42615E703386l25969l95144j49505J05477Q7844k38837m91036k66051K20109L44462
$$ plain form
42683 3664861 3624413 3791591 3957713 3912500 3702660 3551251 3566423 3594227 3394789 2935170
42673 2935170 2447276 2209331 2339339 2770285 3303831 3694807 3832118 3855814 3953145 4054662
42663 4054662 3945724 3685354 3623090 3899176 4213542 4248198 4048054 3788447 3434519 2889452
42653 2889452 2269334 1772385 1451497 1329003 1499329 1860848 2018707 1799484 1618770
42644 1618770 1928846 2497988 2693724 2347598 1867348 1581360 1467977 1501379 1749792 2074866
42634 2074866 2200098 2161628 2269956 2567258 2769026 2805360 2924153 3150512 3185419 3029668
42624 3029668 3140742 3660593 4028360 3804392 3445045 3725557 4659634 5505153 5703386
42615 5703386 5377417 4982273 4832768 4938245 5026089 4787252 4296216 4030165 4250274 4594736
42605D594736P691j87483J22930N03208M20551K6840j70437n6137J01661J62293
42595E525853K10153K72094K48011O0265k89913o97474r09225p26226l29696j21381
42585C242461j56853r9601J46914K27266r826j38629J75592N74274N60183K97385
42575D819166K89798N15233N06898J82626l8902K3038L0019k80710o90142q66833
42565D490191p65835m86800p7789L20043M29170J68509j82338l45121l73392m32469
42555B744169m48911k30887J75888M99802N75489M74114L26362J92869J08593
42546D417488Q6535N0925q2495k31271k22801r5546r5087k31438j15704M46030
42536C926636R20589O25783k01045n50168n7391L98935k69p28910p11886p149
$$ plain form
42605 4594736 4602427 4414944 4537874 5041082 5461633 5488473 5318036 5261899 5363560 5525853
42595 5525853 5736006 6008100 6256111 6316376 6026463 5328989 4419764 3693538 3363842 3242461
42585 3242461 3085608 2986007 3132921 3360187 3350361 3211732 3387324 3961598 4521781 4819166
42575 4819166 5108964 5624197 6131095 6313721 6274819 6297857 6327876 6047166 5357024 4490191
42565 4490191 3724356 3237556 3159767 3479810 3908980 4077489 3895151 3550030 3176638 2744169
42555 2744169 2295258 2064371 2240259 2740061 3315550 3789664 4116026 4308895 4417488
42546 4417488 4504023 4554948 4472453 4241182 4018381 3922835 3827748 3596310 3480606 3926636
42536 3926636 4847225 5473008 5271963 4721795 4664404 5063339 5063070 4334160 3622274 3615125
42526C615125L03005j79704o26616l85113O5549O1378j84256j45159N0954J759
42516B576922j07715J44855N22698M19062j26082m87462m42614l31430k65134
42507A903100K3619M58063N31808J56497j13804K3541J65026k5435k20237m4071
42497B858107K52996K49758O6935R7228L23016M18602L34847L12350M34914N70744
42487E919497O64793P43233P11539M57960Q6860k05917l92984n30614n70553n01986
42477F381828m97344o30769o43830l29168L2047J4540k92856m01255j37162J79964
42467C675995K67883J73919M755k25297l93486l04904n3329P719k07737l61448
42457B584070k21960j1886j2317j27605j02386P0924K17534K52519J59502r1409
$$ plain form
42526 3615125 3918130 3738426 3111810 2726697 2792246 2853624 2669368 2524209 2575163 2576922
42516 2576922 2469207 2614062 3136760 3555822 3429740 2942278 2499664 2168234 1903100
42507 1903100 1926719 2384782 2916590 3073087 2959283 2982824 3147850 3122415 2902178 2858107
42497 2858107 3111103 3360861 3427796 3525024 3848040 4266642 4601489 4913839 5348753 5919497
42487 5919497 6584290 7327523 8039062 8497022 8583882 8377965 7984981 7454367 6883814 6381828
42477 6381828 5884484 5253715 4609885 4280717 4312764 4327304 4034448 3633193 3496031 3675995
42467 3675995 3943878 4117797 4122552 3897255 3503769 3198865 3145536 3153255 2945518 2584070
42457 2584070 2362110 2350224 2337907 2210302 2107916 2178840 2396374 2648893 2808395 2716986
42447B716986l66097l39085O2271M04901K96716l458L8022L60709L55441j64366
42437C362040n79815l13183L62179P27823N61199K49606R4972m1398l32884o02356
42427C488183n77221l40550k54097m39155n57854k45922L47186O67724M50379
42418B538673Q1967P8048L51205L33010j78465o78966o44510k24424O4129R1717
42408A812384J47015L14223K97073m1193l65367l17140o761J87901J37930L8751
42398B204816O9336J95487K84027K51251R5471j14504k70785k86521j25482J88937
42388B492033N19127O35550M59259K37076K45324L39876J12881m51381q47254
42379C742491p30476l56449r4899J11042M37666O69505M84867N7450j29093K2690
$$ plain form
42447 2716986 2350889 2011804 2074075 2478976 2775692 2772234 2810256 3170965 3526406 3362040
42437 3362040 2782225 2469042 2831221 3559044 4120243 4369849 4464821 4423423 4090539 3488183
42427 3488183 2910962 2570412 2316315 1877160 1319306 1073384 1420570 2088294 2538673
42418 2538673 2620640 2698688 3049893 3382903 3204438 2525472 1880962 1656538 1720667 1812384
42408 1812384 1959399 2273622 2570695 2529502 2164135 1846995 1840234 2028135 2166065 2204816
42398 2204816 2274152 2469639 2753666 3004917 3100388 2985884 2715099 2428578 2303096 2492033
42388 2492033 3011160 3646710 4105969 4343045 4588369 4928245 5041126 4589745 3742491
42379 3742491 3012015 2655566 2560667 2671709 3109375 3778880 4263747 4321197 4192104 4214794
42369D214794J73736J29203M894j51743m19004o55125n77702k61582r8329j78846
42359B180296j95290n8078p2044l05257l32735Q1232N31002N62742K93139N6504
42349B741511j46838m06151m89511k02503J31294R2172j49724j21354J41703J52642
42339A743241k14879n24228m14312K1601N11233Q19446P00210J18701m41190l88660
42329A931163J65028M93639K57330j08072j74310j19970k23209k81360j1692L45271
42319B273818L48147M6362j56796j78928k80874m72060m16609j8078L50051L73329
42309A868362K03763J28231J23791J2930j43999j24884O6264J72959N4960j48242
42299B214135k65533k97030k87822j95531k1053R1408O3845O0546K30896L81910
$$ plain form
42369 4214794 4388530 4517733 4522627 4370884 3951880 3296755 2719053 2457471 2359142 2180296
42359 2180296 1985006 1926928 1854884 1549627 1216892 1298124 1829126 2391868 2685007 2741511
42349 2741511 2594673 2188522 1699011 1496508 1627802 1719974 1570250 1448896 1590599 1743241
42339 1743241 1528362 1004134 589822 611423 1122656 1942102 2642312 2761013 2319823 1931163
42329 1931163 2096191 2589830 2847160 2739088 2564778 2444808 2221599 1940239 1928547 2273818
42319 2273818 2621965 2668327 2511531 2332603 2051729 1579669 1163060 1144982 1495033 1868362
42309 1868362 2072125 2200356 2324147 2337077 2193078 2068194 2134458 2307417 2362377 2214135
42299 2214135 1948602 1651572 1363750 1168219 1147166 1238574 1302419 1362965 1593861 1975771
42289A975771K04931k00655l79936j75528L3552o5751k28854q6439K04448J84963
42279A466502j49725l00831k3849K99127K39979m7660o8811L10095O93283O82489
42269C100599L49123P1019k11j22045n24924r43895q57905k21187L61599L82054
42259A594227P5771J9604K90536M33126J85053j95376l73871l39049k48059j79939
42249A262023j64863k05251j70551Q2891M11284M75129K22954j796M9081K19053
42239B179954K56628J40739m6743k63762l60265j31102K67597L19388j41914n78343
42229A642177m77593j04287n0691l05995l50833m8475J77730Q6840l9830M7165
42219E76208J78392J61529J27472J94492J62400j10703l26923j46108K37444L42623
$$ plain form
42289 1975771 2180702 1980047 1600111 1424583 1458135 1392384 1163530 1077091 1281539 1466502
42279 1466502 1316777 1015946 992097 1291224 1531203 1483543 1414732 1724827 2418110 3100599
42269 3100599 3449722 3520741 3520530 3398485 2873561 1929666 1071761 850574 1212173 1594227
42259 1594227 1669998 1689602 1980138 2413264 2598317 2402941 2029070 1690021 1441962 1262023
42249 1262023 1097160 891909 721358 804249 1215533 1690662 1913616 1911820 1960901 2179954
42239 2179954 2436582 2577321 2530578 2266816 1906551 1775449 2043046 2362434 2220520 1642177
42229 1642177 1164584 1060297 1009606 703611 352778 304303 482033 568873 529043 576208
42219 576208 754600 916129 1043601 1238093 1400493 1289790 962867 816759 1054203 1396826
42209A396826J14735n3708N347K1805j33513j31596K40713N56940K70529m13077
42199A875001p06278l09006J88101J64804j96538k90617k14K27490J05671j33565
42189I24849j54560M8600K46035K69866J30794M234J16002M55180O34536L04560
42179B980096k99134n49596k32270J89350K38745O493j43635j25588q8581n4990
42169A920890O1552J86624J31550j09905l11420k61689L4675L52956L97998P4298
42159B477529l49632m94934l10684o0884J10591K83246L95450K05833k13783l89148
42149A653584j27897J15190q7205m66565m87781j37445J70750K28113J22660o6871
42139I16533k24656r4591L08135M61182M2575m32693l29459N7279j5547m19326
$$ plain form
42209 1396826 1511561 1457853 1463200 1485005 1351492 1219896 1460609 2017549 2288078 1875001
42199 1875001 1168723 859717 1047818 1212622 1016084 725467 725253 952743 1058414 924849
42189 924849 770289 818889 1064924 1334790 1465584 1469818 1585820 2041000 2675536 2980096
42179 2980096 2680962 2131366 1899096 2088446 2327191 2333684 2190049 2064461 1975880 1920890
42169 1920890 1982442 2169066 2300616 2190711 1879291 1617602 1652277 2005233 2403231 2477529
42159 2477529 2127897 1632963 1322279 1261395 1371986 1655232 2050682 2256515 2042732 1653584
42149 1653584 1525687 1640877 1553672 1087107 599326 461881 632631 860744 983404 916533
42139 916533 691877 597286 905421 1366603 1409178 976485 647026 704305 688758 269432
42129B69432l14081L65904O73794J80803l03563p6039L28101J04346m49932m48833
42119C29932J46719N42227L66059N6145l215J6596j08596k41530j89052o438J87209
42108A096056L69231M43218K19228k51691n64152l94034P5244L33278J10724l35640
42098A101462n15847k50176J34222K14483J5973n2750J74745L57096J81594j15457
42088A245345r6658J76936K13762j40053m11340j54354L95233N93612J99175l50127
42078A671531m87634j50534K44790L39714J68167l3825j50923k07234k10907j58920
42068A024225j20162j39178j20862N455Q4793o2442k91545k71123L1291K94271
42058D34723K98575J36853n9723k50791k79227M6997N03971N14208o9788o30250
$$ plain form
42129 269432 -44649 321255 995049 1175852 872289 796250 1124351 1228697 778765 329932
42119 329932 476651 1018878 1384937 1441082 1437867 1454463 1345867 1104337 915285 908847 1096056
42108 1096056 1465287 1908505 2127733 1876042 1311890 917856 993100 1326378 1437102 1101462
42098 1101462 585615 335439 469661 684144 700117 647367 822112 1179208 1360802 1245345
42088 1245345 1148687 1325623 1539385 1399332 987992 833638 1228871 1822483 2021658 1671531
42078 1671531 1183897 1033363 1278153 1617867 1786034 1752209 1601286 1394052 1183145 1024225
42068 1024225 904063 764885 644023 649478 734271 671829 380284 109161 140452 434723
42058 434723 733298 870151 810428 559637 280410 327407 831378 1345586 1275798 645548
42048F45548n71209j02845J55001N9331l8838K9267P1667j1628n4554M3639J62885
42037C88264K04318K17657K42545K44149K16454J55341k5993l32893n07336k85207
42027E17299J84753M47840K81631j01420l78907m08261k06386R5280K49000R2991
42017G73820j91735k41194K5000K95722K80566M7934j14787l8778J81254K87669
42007A305471J04916k43563m32752l38803j99671k20676k23825K5121L12576K12239
41997C01033k15052l99010m4800M41367N13811J86647q5137m9542R2442N3030
41987G94789j38432j99851l681K20524J96177J9927L1868K51402K69774j26890
41977A315607n51336n25542j32309J98505L22949L76253L21318J9531l20959k99063
$$ plain form
42048 645548 74339 -28506 126495 185826 146988 176255 247922 236294 181740 225379 388264
42037 388264 592582 810239 1052784 1296933 1513387 1668728 1642735 1309842 802506 517299
42027 517299 702052 1149892 1431523 1330103 951196 542935 336549 431829 680829 773820
42017 773820 582085 340891 365891 661613 942179 990113 875326 836548 1017802 1305471
42007 1305471 1410387 1166824 734072 395269 195598 -25078 -248903 -223782 88794 301033
41997 301033 85981 -313029 -357829 83538 597349 783996 698859 649317 741759 794789
41987 794789 656357 456506 452825 673349 869526 889453 921321 1172723 1442497 1315607
41977 1315607 764271 238729 106420 304925 627874 1004127 1325445 1344976 1024017 724954
41967G24954M5984K44697J10725l7062J9442N7197j17794k92441k09099K3187
$$ plain form
41967 724954 770938 1015635 1126360 1089298 1108740 1165937 1048143 755702 546603 569790
$$ [...]
##END NTUPLES=NMR SPECTRUM
##END=
