##TITLE=31Pdec_LR-685B-1(R)
 , 24 sc
 24.7.2019
##JCAMPDX= 6.0         $$ Bruker NMR JCAMP-DX V2.0
##DATA TYPE= NMR SPECTRUM
##DATA CLASS= NTUPLES
##ORIGIN= UXNMR, Bruker Analytische Messtechnik GmbH
##OWNER= root
$$ XWIN-NMR		Version 3.5
$$ Wed Jul 24 15:08:40 2019 Russian Standard Time (UT+4h)  she@DPX200
##.OBSERVE FREQUENCY= 81.014009
##.OBSERVE NUCLEUS= ^31P
##.ACQUISITION MODE= SIMULTANEOUS
##.ACQUISITION SCHEME= undefined
##.AVERAGES= 24
##.DIGITISER RES= 16
##SPECTROMETER/DATA SYSTEM= spect
##.PULSE SEQUENCE= zgpg30
##.SOLVENT NAME= CDCl3
##.SHIFT REFERENCE= (INTERNAL, CDCl3, 0, 250.885)
##AUDIT TRAIL= $$ (NUMBER, WHEN, WHO, WHERE, WHAT)
$$ ##TITLE= Audit trail, XWIN-NMR		Version 3.5
$$ ##JCAMPDX= 5.01
$$ ##ORIGIN= Bruker BioSpin GmbH
$$ ##OWNER= she
$$ F:/spectra/data/she/nmr/P31/1/pdata/1/auditp.txt
$$ ##AUDIT TRAIL=  $$ (NUMBER, WHEN, WHO, WHERE, WHAT)
(   1,<2019-07-24 15:07:37.21 +0400>,<she>,<DPX200>,
      <created by zg, POWCHK disabled, PULCHK disabled
       configuration hash MD5:
       00 E9 B6 7A A2 85 ED C7 34 08 36 98 17 FE 4E 26
       data hash MD5: 32K
       40 DC C6 F2 25 C5 07 AB 7F 36 D1 76 B3 96 10 9B>)
(   2,<2019-07-24 15:07:39.54 +0400>,<she>,<DPX200>,
      <Start of raw data processing
       efp BC_mod = 2 LB = 1 FT_mod = 6 PKNL = 1 PHC0 = -201.089 PHC1 = 93.79999 SI = 64K 
       data hash MD5: 64K
       10 DC C6 B0 10 76 43 11 F0 83 34 4B 07 97 E3 BD>)
(   3,<2019-07-24 15:07:58.01 +0400>,<she>,<DPX200>,
      <pk PHC0 = 1.086635 PHC1 = 1.4 
       data hash MD5: 64K
       AE 90 5E C8 C4 87 15 90 61 12 37 77 55 27 FD 6C>)
(   4,<2019-07-24 15:08:00.60 +0400>,<she>,<DPX200>,
      <abs ABSG = 5 
       data hash MD5: 64K
       9C 56 46 4C CD 34 D7 85 97 A5 1F D8 3B 45 AE 24>)
$$ ##END=
$$ 
$$ hash MD5
$$ DC 94 1D 7A 86 4E 66 61 BF 33 9A 53 46 51 7E 2B
##$RELAX= 
##$RELAX= 
##$RELAX= 
##$RELAX= 
##$RELAX= 
##$RELAX= 
##$RELAX= 
##$RELAX= 
$$ Bruker specific parameters
$$ --------------------------
##$DU= <F:/spectra>
##$EXPNO= 1
##$NAME= <P31>
##$PROCNO= 1
##$TYPE= <nmr>
##$USER= <she>
##$AMP= (0..31)
100 100 100 100 100 100 100 100 100 100 100 100 100 100 100 100 100 100 
100 100 100 100 100 100 100 100 100 100 100 100 100 100 
##$AQSEQ= 0
##$AQ_mod= 1
##$AUNM= <au_zg>
##$AUTOPOS= <>
##$BF1= 81.014009
##$BF2= 200.13
##$BF3= 200.13
##$BF4= 200.13
##$BF5= 200.13
##$BF6= 200.13
##$BF7= 200.13
##$BF8= 200.13
##$BYTORDA= 1
##$CFDGTYP= 0
##$CFRGTYP= 5
##$CHEMSTR= <none>
##$CNST= (0..31)
1 1 145 1 1 1 1 1 1 1 1 1 1 1 1 1 1 1 1 1 1 1 1 1 1 1 1 1 1 1 1 1 
##$CPDPRG= <waltz16>
##$CPDPRG1= <>
##$CPDPRG2= <waltz16>
##$CPDPRG3= <>
##$CPDPRG4= <mlev>
##$CPDPRG5= <mlev>
##$CPDPRG6= <mlev>
##$CPDPRG7= <mlev>
##$CPDPRG8= <mlev>
##$CPDPRGB= <>
##$CPDPRGT= <>
##$D= (0..31)
0 1 0 0 0 0 0 0 0 0 0 0.03 2e-05 3e-06 0 0 0 0 0 0 0 0 0 0 0 0 0 0 0 0 
0 0 
##$DATE= 1563966456
##$DBL= (0..7)
120 120 120 11 120 120 24 19 
##$DBP= (0..7)
150 150 150 150 150 150 150 150 
##$DBP07= 0
##$DBPNAM0= <>
##$DBPNAM1= <>
##$DBPNAM2= <>
$$ [...]
##$SUBNAM3= <"">
##$SUBNAM4= <"">
##$SUBNAM5= <"">
##$SUBNAM6= <"">
##$SUBNAM7= <"">
##$SUBNAM8= <"">
##$SUBNAM9= <"">
##$SW= 501.770088973933
##$SWIBOX= (0..15)
0 1 3 0 0 0 0 0 0 0 0 0 0 0 0 0 
##$SW_h= 40650.406504065
##$TD= 32768
##$TD0= 1
##$TE= 0
##$TE2= 300
##$TE3= 300
##$TEG= 300
##$TL= (0..7)
0 120 53 12 22 120 120 120 
##$TP= (0..7)
150 150 150 150 150 150 150 150 
##$TP07= 0
##$TPNAME0= <>
##$TPNAME1= <>
##$TPNAME2= <>
##$TPNAME3= <>
##$TPNAME4= <>
##$TPNAME5= <>
##$TPNAME6= <>
##$TPNAME7= <>
##$TPOAL= (0..7)
0.5 0.5 0.5 0.5 0.5 0.5 0.5 0.5 
##$TPOFFS= (0..7)
0 0 0 0 0 0 0 0 
##$TUNHIN= 0
##$TUNHOUT= 0
##$TUNXOUT= 0
##$USERA1= <user>
##$USERA2= <user>
##$USERA3= <user>
##$USERA4= <user>
##$USERA5= <user>
##$V9= 5
##$VALIST= <valist>
##$VCLIST= <CCCCCCCCCCCCCCC>
##$VD= 0
##$VDLIST= <DDDDDDDDDDDDDDD>
##$VPLIST= <PPPPPPPPPPPPPPP>
##$VTLIST= <TTTTTTTTTTTTTTT>
##$WBST= 1024
##$WBSW= 4
##$XGAIN= (0..3)
0 0 0 0 
##$XL= 0
##$YL= 0
##$YMAX_a= 45862
##$YMIN_a= -57868
##$ZGOPTNS= <>
##$ZL1= 120
##$ZL2= 120
##$ZL3= 120
##$ZL4= 120
##$ABSF1= 250.885
##$ABSF2= -250.8851
##$ABSG= 5
##$ABSL= 3
##$ALPHA= 0
##$AQORDER= 0
##$ASSFAC= 0
##$ASSFACI= 0
##$ASSFACX= 0
##$ASSWID= 0
##$AUNMP= <proc_1d>
##$AZFE= 0.1
##$AZFW= 0.5
##$BCFW= 0
##$BC_mod= 2
##$BYTORDP= 0
##$COROFFS= 0
##$CY= -3
##$DATMOD= 1
##$DC= 0
##$DFILT= <>
##$DTYPP= 0
##$F1P= 0
##$F2P= 0
##$FCOR= 1
##$FTSIZE= 65536
##$FT_mod= 6
##$GAMMA= 0
##$GB= 0
##$INTBC= 1
##$INTSCL= 5.30512e-09
##$ISEN= 30
##$LB= 1
##$LEV0= 0
##$LPBIN= 0
##$MAXI= 10000
##$MC2= 0
##$MEAN= 0
##$ME_mod= 0
##$MI= 50
##$NCOEF= 0
##$NC_proc= -5
##$NLEV= 6
##$NOISF1= 182.463
##$NOISF2= 159.3651
##$NSP= 0
##$NTH_PI= 0
##$NZP= 0
##$OFFSET= 250.885
##$PC= 4
##$PHC0= -200.0024
##$PHC1= 95.19999
##$PH_mod= 1
##$PKNL= yes
##$PPARMOD= 0
##$PSCAL= 0
##$PSIGN= 0
##$REVERSE= no
##$SF= 81.0140089999434
##$SI= 65536
##$SIGF1= 159.3651
##$SIGF2= -187.1042
##$SINO= 113.3802
##$SIOLD= 16384
##$SREGLST= <1H.CDCl3>
##$SSB= 0
##$STSI= 65536
##$STSR= 0
##$SW_p= 40650.406504065
##$SYMM= 0
##$S_DEV= 0
##$TDeff= 32768
##$TDoff= 0
##$TI= <>
##$TILT= no
##$TM1= 0
##$TM2= 0
##$TOPLEV= 0
##$USERP1= <user>
##$USERP2= <user>
##$USERP3= <user>
##$USERP4= <user>
##$USERP5= <user>
##$WDW= 1
##$XDIM= 65536
##$YMAX_p= 472321160
##$YMIN_p= -30786614
$$ End of Bruker specific parameters
$$ ---------------------------------
##NTUPLES= NMR SPECTRUM
##VAR_NAME=  FREQUENCY,     SPECTRUM/REAL,   SPECTRUM/IMAG
##SYMBOL=    X,             R,               I
##VAR_TYPE=  INDEPENDENT,   DEPENDENT,       DEPENDENT
##VAR_FORM=  AFFN,          ASDF,            ASDF
##VAR_DIM=   65536,         65536,           65536
##UNITS=     HZ,            ARBITRARY UNITS, ARBITRARY UNITS
##FACTOR=    0.620285442955139, 1,           1
##FIRST=     20325.1992029276, 0,            0
##LAST=      -20325.2073011374, 0,           0
##MIN=       -20325.2073011374, -30786614,   0
##MAX=       20325.1992029276, 472321160,    0
$$ Real data points
##PAGE= N=1
##DATA TABLE= (X++(R..R)), XYDATA
$$ [...]
44049b197576N88168j7622p2097j12953q82641j389854n10959R12478J352299
$$ -2197576 -1609408 -1627030 -1699127 -1812080 -2694721 -4084575 -4595534 -3683056 -2330757
44040b330757P96460J78570k19700m13605K9752J002340J290510L46786n33693
$$ -2330757 -1534297 -1355727 -1575427 -1989032 -1959280 -956940 333570 680356 146663
44031A46663j44249P02880N74577l78901j058408j213329j151626o16164N67228
$$ 146663 2414 705294 1279871 900970 -157438 -1370767 -2522393 -3138557 -2571329
44022b571329J517301J353286N36761k944k87413p24013j006726p21066k04096
$$ -2571329 -1054028 299258 836019 833075 545662 -178351 -1185077 -1906143 -2110239
44013b110239K03965P93349J442268J181490j06515r07292k62661O41571M53841
$$ -2110239 -1906274 -1112925 329343 1510833 1404318 497026 234365 875936 1329777
44004A329777k49241m09251m74750j089649j293592j68192J067465R26358L57767
$$ 1329777 1080536 671285 196535 -893114 -2186706 -2354898 -1287433 -361075 -3308
43995c308R97999J848207P15089j688693k337588n88122Q41177J25551j234229
$$ -3308 994691 2842898 3557987 1869294 -468294 -1056416 -215239 -89688 -1323917
43986a323917j174299P9231J055276J149625O65177P8246o1373L75958N23856
$$ -1323917 -2498216 -2418985 -1363709 -214084 451093 529339 467966 843924 1367780
43977A367780k79587r30574J1363J549118J222459r77704k245463j143459M66191
$$ 1367780 1088193 157619 168982 1718100 2940559 1962855 -282608 -1426067 -959876
43968i59876P31450M66087R47875J403933O62519n58314j052475j218266j700653
$$ -959876 -228426 237661 1185536 2589469 3251988 2693674 1641199 422933 -1277720
43959a277720j493254K57471J863829J186815p46188j057800M40773J037769l13299
$$ -1277720 -2770974 -2513503 -649674 537141 -209047 -1266847 -826074 211695 -101604
43950a01604j261136P436J728769J296324p87999j830026q40133N39840P22731
$$ -101604 -1362740 -1355304 373465 1669789 881790 -948236 -1788369 -1248529 -525798
43941e25798J1012m97719m74579k34129J03639O09589J024538Q21643j21652j151762
$$ -525798 -514786 -1012505 -1487084 -1721213 -1617574 -1007985 16553 838196 716544 -435218
43931d35218j373514o50932J23739P6509m80998m88627K70833Q41251O55780M53228
$$ -435218 -1808732 -2459664 -2335925 -2259416 -2740414 -3229041 -2958208 -2116957 -1461177 -1007949
43921a007949Q92481J199039M19724o67258n24412N42920O47547n88868j227809
$$ -1007949 -115468 1083571 1503295 836037 311625 854545 1502092 913224 -314585
43912c14585j28605J064187M84688r97871j261483k43098L46321k7172k59552
$$ -314585 -443190 620997 1105685 107814 -1153669 -1396767 -1050446 -1077618 -1337170
43903a337170P6305J04790m25125n41583J15125N76414K78548m4997J35129K42095
$$ -1337170 -1260865 -1156075 -1581200 -2122783 -2007658 -1431244 -1152696 -1197693 -1062564 -820469
43893h20469o6540j10762L87509M80009l73851j088522n22330P44493J321889
$$ -820469 -887009 -997771 -610262 -130253 -504104 -1592626 -2114956 -1370463 -48574
43884d8574Q46211q4958r35137j223231m44900R41271J383716K39002j000256
$$ -48574 797637 712679 -222458 -1445689 -1890589 -949318 434398 673400 -326856
43875c26856p03801N68816J119808O53802J69060m8751n34644j031495n85746
$$ -326856 -1030657 -461841 657967 1311769 1480829 1432078 897434 -134061 -719807
43866g19807O07183J056150J12922r92790q16164M70973J410707Q99466p55302
$$ -719807 -112624 943526 1056448 63658 -752506 -281533 1129174 2028640 1273338
43857A273338k063101j678880J13879J493174J135020k44747r95459o54555p2458
$$ 1273338 -789763 -2468643 -2354764 -861590 273430 28683 -966776 -1621331 -1693789
43848a693789J61023K76833M05292K17222k68655l82435K73157J088698J040166
$$ -1693789 -1532766 -1255933 -850641 -633419 -902074 -1284509 -1011352 77346 1117512
43839A117512q6124j237466j069908M03682J482396P75218p70598j006854L08111
$$ 1117512 1031388 -206078 -1275986 -872304 610092 1385310 614712 -392142 -84031
43830h4031J145053L57170o54859m37986J87411j16549p00384k20927P03022M25752
$$ -84031 1061022 1418192 763333 325347 512758 396209 -304175 -525102 177920 603672
43820F03672p72641r98281J63365J049818O06881k49289l71278J12969N23570
$$ 603672 -168969 -1167250 -1003885 45933 652814 403525 32247 145216 668786
43811F68786O01024L54423p7727k53099K4963J32757m47562j020852o98455n4901
$$ 668786 1269810 1624233 1546506 1293407 1318370 1451127 1003565 -17287 -715742 -770643
43801g70643k72654r93683p43812O03458J535721J196894L49639j52795l23007
$$ -770643 -1043297 -2036980 -2780792 -2177334 -641613 555281 904920 752125 429118
43792D29118k44290K14689O35470L31572m42845q00762o73987o38341n65727k2596
$$ 429118 184828 399517 1034987 1366559 923714 122952 -551035 -1189376 -1755103 -1777699
43782a777699L37170l54479j218200o69776P86865J198008M78209L38326P81225
$$ -1777699 -1440529 -1795008 -3013208 -3682984 -2896119 -1698111 -1219902 -881576 -100351
43773a00351j09892k184160k496836n7438K017789J239444l85206Q4616J691744
$$ -100351 -210243 -2394403 -4891239 -4948677 -2930888 -1691444 -2076650 -1992034 -300290
43764c00290J568282j46094r17286k63719r3579r64824j253239k74823N94606
$$ -300290 1267992 1121898 204612 -59107 -152686 -1117510 -2370749 -2645572 -2050966
43755b050966N07921M26744R69943J046300k16077j676976j573267J27300J730377
$$ -2050966 -1543045 -1116301 -146358 899942 683865 -993111 -2566378 -2439078 -708701
43746g08701J762973L59391j017298r87564L53834J450361R98549n12278j425061
$$ -708701 1054272 1413663 396365 -591199 -237365 1212996 2211545 1699267 274206
43737B74206r03571K57160P60376K44919n25263o79131l04429k85298q88398j040133
$$ 274206 -629365 -372205 388171 633090 107827 -571304 -875733 -1161031 -2049429 -3089562
43727c089562J64990J668577J563074p876p92338K11249J192232M37545r28842
$$ -3089562 -2924572 -1255995 307079 299203 -493135 -281886 910346 1347891 419049
43718D19049q23691M67298R15993L9130n71815L5860Q27206N95627l05452p55515
$$ 419049 -404642 62656 978649 1017779 445964 481824 1309030 1904657 1599205 843690
43708H43690n03091k69328n42439q13798k34147J002833J452150K63479j200815
$$ 843690 340599 71271 -471168 -1284966 -1519113 -516280 935870 1199349 -1466
43699a466r09069P42311J175984m89514j849546p75805J333406J786221N87398
$$ -1466 -910535 -168224 1007760 518246 -1331300 -2107105 -773699 1012522 1599920
43690A599920j56347J40270J11429o66307q88658L6095Q76432N34433n09016j272425
$$ 1599920 1443573 1583843 1695272 1028965 140307 176402 1052834 1587267 1078251 -194174
43680a94174j433891r71499O2997R86459Q98935L2470m40845j92714p7593m16046
$$ -194174 -1628065 -2599564 -2536567 -1550108 -651173 -618703 -1059548 -1252262 -1329855 -1745901
43670a745901l56270N20152J302660J180874N99094K37147m7034m32951l94565
$$ -1745901 -2102171 -1582019 -279359 901515 1500609 1737756 1690722 1257771 863206
43661H63206K33650M16688o01192j683081j115882P45101J646786M79343j180481
$$ 863206 1096856 1513544 912352 -770729 -1886611 -1141510 505276 984619 -195862
43652a95862j260696N2072Q23740J71674p29904o17144R1642K37972k41079n03302
$$ -195862 -1456558 -1404486 -580746 -409072 -1138976 -1756120 -1664478 -1426506 -1667585 -2170887
43642b170887k92484Q838N02715J492586K151056J200145p46587j403740j65770
$$ -2170887 -2463371 -2454533 -1951818 -459232 1691824 2891969 2145382 741642 575872
43633E75872P04072m37964j812706q90172J565501K566820J258246l26292o82285
$$ 575872 1279944 841980 -970726 -1860898 -295397 2271423 3529669 3203377 2521092
43624B521092n67882r49372j358693j104185n27701k14832r8320K6440P0347J77727
$$ 2521092 1953210 1003838 -354855 -1459040 -1986741 -2201573 -2299893 -2273453 -2203106 -2025379
43614b025379P34428J475757J495282M99923p14007j253015r18296m4235O94661
$$ -2025379 -1290951 184806 1680088 2180011 1466004 212989 -705307 -749542 -54881
43605e4881N28429m75261j079284m80270L51279K45435n2227P61559J755126Q60465
$$ -54881 473548 -1713 -1080997 -1561267 -1209988 -964553 -1016780 -255221 1499905 2360370
43595B360370j388714k093684m66290Q59753Q4181j050015n07104O67020M94611
$$ 2360370 971656 -1122028 -1588318 -728565 -644384 -1694399 -2201503 -1534483 -1039872
43586a039872m70599m30097L65449K80688o64667r93901m94083l17355n87269
$$ -1039872 -1510471 -1940568 -1575119 -1294431 -1959098 -2952999 -3447082 -3764437 -4351706
43577d351706k08231Q50029J206980L94796k98030J42371J071535J400311R68714
$$ -4351706 -4559937 -3709908 -2502928 -2108132 -2406162 -2263791 -1192256 208055 1176769
43568A176769K06849n35824r11719p30381m57759o96276j079062o97329K98684
$$ 1176769 1383618 847794 -63925 -794306 -1252065 -1948341 -3027403 -3724732 -3426048
43559c426048P29746K47095j24481K58457O54530L76411K5606L42439Q11311N25940
$$ -3426048 -2696302 -2449207 -2573688 -2315231 -1660701 -1284290 -1258684 -916245 -104934 421006
43549D21006k76551p08603p33719r44053j150295n36897P27327J337424P18571
$$ 421006 144455 -564148 -1297867 -2241920 -3392215 -3929112 -3201785 -1864361 -1145790
43540a145790p6832L514M40192J43629o43777o55021L75582J185258P42040l96542
$$ -1145790 -1222622 -1219108 -778916 -635287 -1279064 -1934085 -1558503 -373245 368795 -27747
43530b7747r32564l68918P36600J503873J312278J87750r89233j199790n50819
$$ -27747 -960311 -1329229 -592629 911244 2223522 2411272 1422039 222249 -328570
43521c28570j35323k90642m4738R92511J435919J48313j572315j605633j74620
$$ -328570 -463893 -754535 -799273 193238 1629157 1777470 205155 -1400478 -1575098
43512a575098O09947R0670k70525K65742N42094j06071m87711K34005Q90773L49680
$$ -1575098 -965151 -874481 -1145006 -879264 -337170 -443241 -930952 -696947 193826 543506
43502E43506m35176j22086O16198L05758o87527p51746K65675Q74761L09310o05209
$$ 543506 108330 -13756 602442 908200 220673 -531073 -265398 609363 918673 313464
43492C13464r89461q80672n37978k113M65915M70693J20150j46725k36942k32352
$$ 313464 -675997 -1556669 -2094647 -2096760 -1630845 -1160152 -1040002 -1186727 -1423669 -1656021
43482a656021P5742O86923R31693M21609j33006o5566L2687n13676r17112j69980
$$ -1656021 -1580279 -893356 38337 459946 326940 261374 294061 -219615 -1136727 -1306707
43472a306707Q82799O26284o50732j220196p22856k75055L2416J161070K471231
$$ -1306707 -423908 202376 -448356 -1668552 -2391408 -2666463 -2634047 -1472977 998254
43463I98254J884820n14378j829384n90978R51061M73839q89002q21285L79904
$$ 998254 2883074 2368696 539312 -51666 899395 1373234 484232 -337053 42851
43454D2851P68732N9206n24678o57356q03998n92714L63213Q34549l49555j691208
$$ 42851 811583 870789 346111 -311245 -1115243 -1707957 -1344744 -510195 -859750 -2550958
43444b550958q43158J351643J682405m13970j818289n49646J382381J454319L56738
$$ -2550958 -3394116 -2042473 -360068 -774038 -2592327 -3141973 -1759592 -305273 51465
43435E1465J74572Q05884O13627m95932j011352m05913K00481j7524n06769l95630
$$ 51465 226037 1031921 1645548 1149616 138264 -267649 -67168 -84692 -591461 -987091
43425i87091L95419J222219J220976n1485j812477k331668q95370R64158J278367
$$ -987091 -591672 630547 1851523 1800038 -12439 -2344107 -3239477 -2275319 -996952
43416i96952K78554j20340O98666J213061K91126r97409j078995k36012O2726
$$ -996952 -718398 -838738 -140072 1072989 1364115 366706 -712289 -948301 -885575
43407h85575m36103n46810J95717O25349j71540j179112p74313Q26379J732328
$$ -885575 -1321678 -1868488 -1672771 -1047422 -1218962 -2398074 -3172387 -2346008 -613680
43398f13680R81975k72777o07685k07067q5011l42363l29138J9281K21115L12244
$$ -613680 368295 95518 -512167 -719234 -804245 -1146608 -1475746 -1456465 -1235350 -923106
43388i23106O72684R88070O20276j20633l96524l95213q89622j292320j50244
$$ -923106 -250422 737648 1357924 1237291 840767 445554 -444068 -1736388 -1886632
43379a886632K033208K712795J001067p63465n89245K01211m20595j602852j274586
$$ -1886632 146576 2859371 3860438 3096973 2507728 2708939 2288344 685492 -589094
43370e89094P7658L17364n34286n67012L41268M23824l10554K15018K027582K175813
$$ -589094 -511436 -194072 -728358 -1295370 -954102 -530278 -840832 -625814 1401768 3577581
43360C577581n25958k944239k026724P43344J827365O48206n86508p33708o05180
$$ 3577581 3051623 107384 -1919340 -1175996 651369 1299575 713067 -20641 -625821
43351f25821o98899n73902k61747k22805p8953P70558J544336R65579m46055q76858
$$ -625821 -1324720 -1898622 -2160369 -2383174 -2462127 -1691569 -147233 818346 372291 -504567
43341e04567L6256Q36655O76721K36743L9683k48988n04111n2063N94921p7020
$$ -504567 -468311 368344 1045065 1281808 1321491 1072503 568392 516329 1111250 1034230
43331A034230j853825k290223k29013K004325J676328m76950j497100m72415O65367
$$ 1034230 -819595 -3109818 -3338831 -1334506 341822 -135128 -1632228 -2104643 -1439276
43322a439276M28218l13867k66148J83716q0785q63871q83607K06848J118575
$$ -1439276 -1011058 -1324925 -1591073 -1407357 -1488142 -2352013 -3235620 -3028772 -1910197
43313a910197N79092r22592j597609m50724J555709K603679J969353N52047l59431
$$ -1910197 -1331105 -2253697 -3851306 -4302030 -2746321 -142642 1826711 2378758 2019327
43304B019327l88767o9319M5416o5000j20908k5331M8219l0660j79833l34886
$$ 2019327 1630560 1561241 1606657 1541657 1420749 1395418 1443637 1412977 1233144 898258
43294H98258n60491o74924j62267R31723J376097R8756j862193k143377l04814
$$ 898258 337767 -337157 -499424 432299 1808396 1907152 44959 -2098418 -2403232
43285b403232J187465L16661j508215j513676L58940J566564Q42646k92190k51885
$$ -2403232 -1215767 -899106 -2407321 -3920997 -3562057 -1995493 -1152847 -1445037 -1696922
43276a696922M50751O38970L94338L81802M83201L07464J79441M99196P88769
$$ -1696922 -1246171 -607201 -212863 168939 652140 959604 1139045 1638241 2427010
43267B427010L92432m26269r87129j232523j361834j001380J96785J491700J668524
$$ 2427010 2819442 2393173 1406044 173521 -1188313 -2189693 -1992908 -501208 1167316
43258A167316O08042o28645j170873r90211l39314N36830J094915P87183r5083
$$ 1167316 1775358 1146713 -24160 -1014371 -1353685 -816855 278060 1065243 970160
43249I70160n53819j22982N82501P85024M46618o1228o27888j197254j252927
$$ 970160 416341 293359 875860 1660884 2107502 2046274 1418386 221132 -1031795
43240a031795k58253J321195K091543J245965l79360j303395j201238r60170j003569
$$ -1031795 -1290048 31147 2122690 3368655 2989295 1685900 484662 -475508 -1479077
43231a479077o39339M46312J143254M24733q50246r92608N5441P97987N86270
$$ -1479077 -2118416 -1672104 -528850 -104117 -954363 -1946971 -1891530 -1093543 -507273
43222e07273K81413L15473r1477j064125j177208L30170J856163J499048j83404
$$ -507273 -225860 89613 -1864 -1065989 -2243197 -1913027 -56864 1442184 1258780
43213A258780j107850o38021Q3048L03527L45585K35432n21667j526524j506989
$$ 1258780 150930 -487091 -404043 -100516 245069 480501 -41166 -1567690 -3074679
43204c074679k74497Q00246Q76853P71170J186202J285748K74403q32715o48962
$$ -3074679 -3349176 -2548930 -1672077 -900907 285295 1571043 1845446 1012731 363769
43195C63769J86842p8442j323324j487672K00333J851957J668604M55208L8198
$$ 363769 550611 472169 -851155 -2338827 -2138494 -286537 1382067 1837275 1875473
43186A875473M01434J51353q34517j193590m94411J8943l89408o87351P8906J052104
$$ 1875473 2276907 2428260 1593743 400153 -94258 -75315 -464723 -1152074 -1073168 -21064
43176b1064R11597l6394m90268k43199k29573p66320j084552o57258Q2589N17659
$$ -21064 890533 854139 363871 120672 -108901 -875221 -1959773 -2617031 -2534442 -2016783
43166b016783N58415M81853O13123J056650J314412O39781o86274j249626n40288
$$ -2016783 -1458368 -976515 -363392 693258 2007670 2647451 1961177 711551 171263
43157A71263k8150q37876j532366l00806J581213J276926r30865j717475K8397
$$ 171263 143113 -694763 -2227129 -2527935 -946722 330204 -600661 -2318136 -2289739
43148b289739J428739M60492p60449J46214J580254P80991j205739j138098Q98908
$$ -2289739 -861000 -400508 -1160957 -1014743 565511 1346502 140763 -997335 -98427
43139i8427J501534m87073k102807r82202J100544J175321n98425j621733p07258
$$ -98427 1403107 916034 -1186773 -2168975 -1068431 106890 -491535 -2113268 -2820526
43130b820526P05479Q82258r8203q05571k91223Q99164J452907Q71091j228j97518
$$ -2820526 -2115047 -1232789 -1330992 -2136563 -2427786 -1528622 -75715 795376 794148 596630
43120E96630J38479K63983L9018j92801m66202r07028r17599J14454J400960J402537
$$ 596630 735109 999092 1038110 845309 379107 -527921 -1445520 -1331066 69894 1472431
43110A472431P5631q71949m09770M15941K29105o62165j003254n34477m4141P6232
$$ 1472431 1548062 676113 266343 682284 911389 249224 -754030 -1288507 -1332648 -1256416
43100a256416J56245K14479k56736j142410j290731Q105J668446J891381N11261
$$ -1256416 -1100171 -885692 -1142428 -2284838 -3575569 -3567464 -1899018 -7637 503624
43091E03624p38095n80645K28529M01733J48522M03859P70934M6732j374852j631047
$$ 503624 -234471 -815116 -586587 -184854 -36332 367527 1138461 1185193 -189659 -1820706
43081a820706k83931Q98558P76206M12853O89744M60762j124190k311929j127252
$$ -1820706 -2104637 -1206079 -429873 -17020 672724 1133486 9296 -2302633 -3429885
43072c429885J222800J898733N97524m40946j72944J97414p1521j45873K91275
$$ -3429885 -2207085 -308352 289172 -151774 -324718 -127304 -198825 -344698 -53423
43063e3423K14022p00196j243494p31482m1620K09808O83511J557316J569495
$$ -53423 160599 -539597 -1783091 -2514573 -2556193 -2346385 -1662874 -105558 1463937
43054A463937P9744j429418j286348P8586J003473P79135j06505r55172j095497
$$ 1463937 1543681 114263 -1172085 -1093499 -90026 689109 582604 -372568 -1468065
43045a468065r8938J270412J330663k64681j586216r20049P73684J259536J19984
$$ -1468065 -1567003 -296591 1034072 769391 -816825 -1736874 -963190 296346 416330
43036D16330j028273r65262r6589O04759O93417K67120k19146j63361M80268Q68278
$$ 416330 -611943 -1577205 -1673794 -1069035 -375618 -108498 -327644 -491005 -10737 857541
43026H57541K92413p00044r24692j28154P56353Q39092J56236o39038r45688n42345
$$ 857541 1149954 449910 -474782 -602936 153417 992509 1148745 509707 -435981 -978326
43016i78326L63376J285772J758375J512480N47801o87117j389189j173978o07486
$$ -978326 -614950 670822 2429197 3941677 4489478 3802361 2413172 1239194 631708
43007F31708m05039l55474J57707Q19131O66850l14224j055485r74878n15082
$$ 631708 226669 -128805 28902 848033 1514883 1200659 145174 -829704 -1344786
42998a344786j4322O28714R82633K99930r09311j112811r8159N94866K29780k9560
$$ -1344786 -1359108 -730394 252239 552169 -357142 -1469953 -1568112 -973246 -743466 -773026
42988g73026M81080N06634o82736j422627k17971J475475J347688j39015p20048
$$ -773026 -291946 214688 -468048 -1890675 -2108646 -633171 714517 575502 -144546
42979a44546n3415J90351m24249m59863N92429J316690P89742l2956j25380J00923
$$ -144546 -197961 -7610 -431859 -891722 -299293 1017397 1807139 1774183 1648803 1749726
42969A749726n3866l09412j71315R6174M4951k30487n28666r45609j356523j223100
$$ 1749726 1695860 1386448 1215133 1311307 1356258 1125771 597105 -348504 -1705027 -2928127
42959b928127m04446M41923O77957M09273J14640K7207J04823K09588J83822N9914
$$ -2928127 -3332573 -2890650 -2212693 -1803420 -1688780 -1661573 -1556750 -1347162 -1163340 -1103426
42949a103426J28289M50126N45831N7016n76129p00391m26931l64009o38575q56526
$$ -1103426 -975137 -525011 20820 77836 -498293 -1198684 -1625615 -1989624 -2628199 -3484725
42939c484725p73903l62943M48511J428950J857711J426868Q46436P57844O60646
$$ -3484725 -4258628 -4621571 -4173060 -2744110 -886399 540469 1386905 2144749 2805395
42930B805395q1789q07913l97480Q73827J605213J123523r0683j438408k425605
$$ 2805395 2723606 1915693 1518213 2392040 3997253 5120776 5030093 3591685 1166080
42921A166080k315463r83261K64805K10575l63141P4481J122991J067265p6510
$$ 1166080 -1149383 -2132644 -1867839 -1657264 -2020405 -1945924 -822933 244332 167822
42912A67822m87551L01447O28822k67995q47506R775J025665P21140k18105m06553
$$ 167822 -319729 -18282 610540 342545 -504961 -495186 530479 1251619 1033514 626961
42902F26961j17471m06872r64724o56953M09357R97607O28937Q150l09087n30017
$$ 626961 509490 102618 -862106 -1519059 -1109702 -112095 516842 524992 215905 -314112
42892c14112q30759q04670L07J286771J921035Q91829j303155k628468j692141
$$ -314112 -1144871 -1949541 -1949234 -662463 1258572 2150401 847246 -1781222 -3473363
42883c473363L46544J180464M41337j16703M57983J042469O30609l3181k2327
$$ -3473363 -3126819 -1946355 -1505018 -1621721 -1163738 -121269 509340 476159 453832
42874D53832J18743m58751j280692j350627o86246K2801N01444P37085N66535
$$ 453832 572575 113824 -1166868 -2517495 -3203741 -3180940 -2679496 -1942411 -1375876
42865a375876K02825K86833P31462N62422m17952j044699o28404o950J09295L09173
$$ -1375876 -1173051 -886218 -154756 407666 -10286 -1054985 -1683389 -1690339 -1581044 -1271871
42855a271871R18188R05292k55087j183484o48137M19922O25474L61017N30803
$$ -1271871 -353683 551609 296522 -886962 -1535099 -1115177 -489703 -128686 402117
42846D02117N22446m09463j112037k95478Q50834M10555q74856q07112M03416
$$ 402117 924563 515100 -596937 -892415 -41581 368974 -505882 -1312994 -909578
42837i09578N43404o27830r71974K49330J205487P07339j42226k88819k26479
$$ -909578 -366174 -994004 -1965978 -1716648 -511161 196178 53952 -234867 -461346
42828d61346l01767J38348R76019R16381j89683p59159j69101J74651m58551o71041
$$ -461346 -763113 -624765 351254 1267635 1077952 318793 149692 324343 -134208 -805249
42818h05249L89881J146878K00341j097596p43451P31322J297961N78908r3653
$$ -805249 -415368 731510 931851 -165745 -909196 -177874 1120087 1698995 1605342
42809A605342p6791k0506m16133r81976j265091r15266J37305J077422O85718
$$ 1605342 1528551 1508045 1091912 109936 -1155155 -2070421 -1933116 -855694 -169976
42800a69976q04066j522013n92875M70537K71202j60001O38125J676213R86658
$$ -169976 -974042 -2496055 -3088930 -2618393 -2347191 -2507192 -1869067 -192854 793804
42791G93804q97457j489217j21899J234626J109528K87912p7884j68259m74471
$$ 793804 -103653 -1592870 -1714769 -480143 629385 917297 839413 671154 196683
42782A96683o10151j31602M98599O32054L80443J73325J871k75544l50700J88886
$$ 196683 -413468 -545070 -46471 585583 966026 1139351 1141222 865678 514978 703864
42772G03864J102062J520801Q32368n52813j472524j253974n19614k93767n11365
$$ 703864 1805926 3326727 4159095 3606282 2133758 879784 360170 66403 -444962
42763d44962k92274L37412K77857p06974j294337o32778K95945L92424J73871
$$ -444962 -737236 -399824 -121967 -828941 -2123278 -2756056 -2460111 -2067687 -1893816
42754a893816M80943P48056J76265m93685j71171N91153O60583M17788P36101
$$ -1893816 -1412873 -664817 -488552 -982237 -1153408 -562255 98328 516116 1252217
42745A252217Q67501k17197j253854l51698J299413P21100j810257k617476l30771
$$ 1252217 2119718 1902521 648667 296969 1596382 2317482 507225 -2110251 -2441022
42736b441022J839247J135742o97548o82210P75556J283703N37620Q2431J83587
$$ -2441022 -601775 533967 -163581 -845791 -70235 1213468 1751088 1833519 2017106
42727B017106k87717j341814j593951m46768J135173J945111J451199j53030j721858
$$ 2017106 1729389 387575 -1206376 -1653144 -517971 1427140 2878339 2725309 1003451
42718A003451j681208O5493J559649J259517M9798n21193o95807j383231j801568
$$ 1003451 -677757 -612264 947385 2206902 2256700 1735507 1039700 -343531 -2145099
42709b145099n94575J378261J833686M72091o97827n32830q9696m19797r74002
$$ -2145099 -2739674 -1361413 472273 944364 246537 -286293 -375989 -795786 -1769788
42700a769788q36835p2591O88685R02418K27347r06783j113495K01634J402565
$$ -1769788 -2606623 -2679214 -1990529 -1088111 -860764 -1767547 -2881042 -2679408 -1276843
42691a276843P38163o37909j55417J877479K367384K80727j653362j254742R837
$$ -1276843 -538680 -1176589 -1332006 545473 2912857 3193584 1540222 285480 295317
42682B95317M2163m03336L14555J313239N99903j302666j956293p30792N50384
$$ 295317 337480 -65856 248699 1561938 2161841 859175 -1097118 -1827910 -1277526
42673a277526N78616L4999n1136L50723Q23960J030736N75230m78474j062690
$$ -1277526 -698910 -663911 -715047 -364324 459636 1490372 2065602 1587128 524438
42664E24438l09950R00914R44743j91985j000878p65683k13255J24972M79538
$$ 524438 214488 1115402 2060145 1868160 867282 101599 -111656 13316 492854
42655D92854N88437k74317j512997j333897M53334J541921L41847j455631j243002
$$ 492854 1081291 806974 -706023 -2039920 -1586586 -44665 297182 -1158449 -2401451
42646b401451O80675J667014O17750p33860o40839L59327P27262K10719k17834
$$ -2401451 -1720776 -53762 563988 -169872 -810711 -451384 275878 486597 268763
42637B68763m2184K19385k9482o66537j088933q30939P6817J033951J187165K30100
$$ 268763 226579 445964 416482 -250055 -1338988 -2169927 -2093110 -1059159 128006 358106
42627C58106j022065j262826j42314J224860J513275O84243k01085m80375n72134
$$ 358106 -663959 -1926785 -2069099 -844239 669036 1353279 1152194 671819 99685
42618I9685j021782j450358r54664N91816K059617K092812O17732q49183p54128
$$ 99685 -922097 -2372455 -3327119 -2735303 -675686 1417126 2034858 1185675 431547
42609D31547N67993J122138j43991j701984j431627L03521J143042K31056o91006
$$ 431547 999540 2121678 1977687 275703 -1155924 -852403 290639 521695 -169311
42600a69311k97606K36402m55735j302199n24463J186539J620939N85509k2280
$$ -169311 -466917 -230515 -686250 -1988449 -2512912 -1326373 294566 880075 857795
42591H57795M21770M36513n63032r96199N8172J016164L08035j067444j257334
$$ 857795 1279565 1716078 1153046 156847 215019 1231183 1539218 471774 -785560
42582g85560l80172K22374L88376P82779J000697J58478j073882j123522n2919
$$ -785560 -1165732 -943358 -554982 227797 1228494 1386972 313090 -810432 -863351
42573h63351N36689J50448p3023K80851J36782q12673j114804O0260J273218R58000
$$ -863351 -326662 -176214 -249237 31614 168396 -644277 -1759081 -1698821 -425603 532397
42563E32397j76876m56142J50442M44479K40834L27785N83324O4074r76985j042220
$$ 532397 355521 -100621 49821 494300 735134 1062919 1646243 1710317 733332 -308888
42553c08888J50111Q73589j6545j141725n97262J066819J503364o5635j734954
$$ -308888 -158777 714812 698267 -443458 -1040720 26099 1529463 1463828 -271126
42544b71126j543890K8853J002850N53637k91771l74312J83691N22951K66614
$$ -271126 -1815016 -1786163 -783313 -229676 -521447 -895759 -712068 -189117 77497
42535G7497k92706p77975r47542n87014K26849Q41497O01749k27047o51035k13483
$$ 77497 -215209 -993184 -1940726 -2527740 -2300891 -1459394 -857645 -1084692 -1735727 -1949210
42525a949210M37760M69122j17814o57848o16914K0653P48861P54318k96829j454214
$$ -1949210 -1511450 -1042328 -1160142 -1817990 -2434904 -2414251 -1665390 -911072 -1207901 -2662115
42515b662115j226801M07787J579753Q66072p42095j238794l10184O31080O80608
$$ -2662115 -3888916 -3481129 -1901376 -1035304 -1777399 -3016193 -3326377 -2695297 -2014689
42506b014689K63217j30201n23282o53949m9097Q15052Q27889O1235k01672L26281
$$ -2014689 -1751472 -1881673 -2404955 -3058904 -3108001 -2292949 -1465060 -1403825 -1605497 -1279216
42496a279216L94564m06684o00844O20226J604576P53637o93726n72288O05326
$$ -1279216 -884652 -1291336 -1892180 -1271954 332622 1086259 392533 -179755 425571
42487D25571M73633j228188k124427q43435J121796J840658J315020N81480K7372
$$ 425571 899204 -328984 -2453411 -3296846 -2175050 -334392 980628 1562108 1589480
42478A589480m22248o03993m85863m21981n08553m74392m19753o38330o21472
$$ 1589480 1167232 563239 77376 -344605 -853158 -1327550 -1747303 -2385633 -3007105
42469c007105L95489J707355J614647Q5326q56970j64207O91838K92450n23662
$$ -3007105 -2611616 -904261 710386 795712 -61258 -225465 466373 758823 235161
42460B35161n33787l90735j046430j457447k31531J517758J549267J34307l45319
$$ 235161 -298626 -689361 -1735791 -3193238 -3424769 -1907011 -357744 -223437 -568756
42451e68756O88004J197099O9784j088144p15177K97834L65875k50656k64321
$$ -568756 119248 1316347 1386131 297987 -417190 -119356 246519 -4137 -268458
42442b68458L47483M74731k03797q07491o83593k43026j95347n27806n22156K87702
$$ -268458 79025 553756 349959 -457532 -1141125 -1384151 -1579498 -2107304 -2629460 -2341758
42432b341758J296037J317406J84698o85237r9589J005653P00726j048583k149394
$$ -2341758 -1045721 271685 456383 -228854 -328443 677210 1377936 329353 -1820041
42423a820041j364996K5826L37218j57518j52180M67446P61904M96384L34252
$$ -1820041 -3185037 -3159211 -2821993 -2979511 -3131691 -2664245 -1902341 -1405957 -1071705
42414a071705M95975M86352J66926K4058K34928L77384K52488J80001K38976j3600
$$ -1071705 -575730 -89378 77548 101606 336534 713918 966406 1146407 1385383 1371783
42404A371783o93917j113509o64480K36820O28131K26935l02598k90663J27462
$$ 1371783 677866 -435643 -1100123 -863303 -235172 -8237 -310835 -601498 -474036
42395d74036L06600k7125m67525n16163k32344q4811k69653m78404l85090p3066
$$ -474036 -167436 -194561 -662086 -1178249 -1410593 -1495404 -1765057 -2243461 -2628551 -2701617
42385b701617J72203K66477L16771L51844K69643N739l57056n98869m77909p038
$$ -2701617 -2529414 -2262937 -1946166 -1594322 -1324679 -1318940 -1675996 -2274865 -2752774 -2759812
42375b759812L64741J40210n07976p26116M254J072991J381250O76605k11214
$$ -2759812 -2395071 -2254861 -2762837 -3488953 -3484699 -2411708 -1030458 -353853 -565067
42366e65067m98729l00047j14066M2500M58840R45576R07114K62099l24082l75775
$$ -565067 -1063796 -1363843 -1477909 -1435409 -976569 -30993 876121 1138220 814138 438363
42356D38363k37912m04676p08778o63553j95531M76134J213157J598422Q58240
$$ 438363 200451 -204225 -913003 -1576556 -1772087 -1295953 -82796 1515626 2373866
42347B373866q59942j769951n01371J466576J333147r12205k116136n47280J415767
$$ 2373866 1513924 -256027 -757398 709178 2042325 1130120 -986016 -1533296 -117529
42338a17529Q82111j181601j629553j8049J040053J71379r08017m91514N16061
$$ -117529 764582 -417019 -2046572 -2064621 -1024568 -853189 -1761206 -2252720 -1736659
42329a736659L81372o88888j084514k57008P20444Q26167L34788K15182P51396
$$ -1736659 -1355287 -2044175 -3128689 -3385697 -2665253 -1839086 -1504298 -1289116 -537720
42320e37720J123523N11323o23218j024087n03407k83197r32953j208723o0761
$$ -537720 585803 1097126 473908 -550179 -1053586 -1336783 -2269736 -3478459 -3539220
42311c539220J385087J437925M63289L918Q7068l53683r35542l16021R18604O82399
$$ -3539220 -2154133 -716208 -252919 -249001 -161933 -515616 -1451158 -1767179 -848575 -166176
42301a66176r58149j463847N0975J267314M94686p29123n64945J81759J16105
$$ -166176 -1124325 -2588172 -2537197 -1269883 -775197 -1504320 -2069265 -1887506 -1771401
42292a771401n7715O82017J161327m0113j624492j324732M49600J403572R96206
$$ -1771401 -1829116 -1147099 14228 -25885 -1650377 -2975109 -2525509 -1121937 -125731
42283a25731O30118P38729L32990p02420j266125j018099o06108j5400J195499
$$ -125731 504387 1243116 1576106 873686 -392439 -1410538 -2016646 -2032046 -836547
42274h36547K116640J216625r77031k102539j222590J44609O18782N71396O19411
$$ -836547 1280093 2496718 1519687 -582852 -1805442 -1660833 -1042051 -470655 148756
42265A48756M47888j00046l89327j76539l2196r0711J64335M96769k6378j093024
$$ 148756 596644 496598 107271 -69268 -101464 -192175 -27840 468929 442551 -650473
42255f50473j089448K74612J142640L67872n70203P0245J461130J452606k25271
$$ -650473 -1739921 -1465309 -322669 45203 -525000 -454755 1006375 2458981 2233710
42246B233710j685943j489837k01209O56805L28139o13821j031134n02401K26516
$$ 2233710 547767 -942070 -1143279 -486474 -158335 -772156 -1803290 -2305691 -2079175
42237b079175L39730J28462L22627O42129K36654n76109n01595O07444J333638
$$ -2079175 -1739445 -1610983 -1288356 -646227 -409573 -985682 -1487277 -879833 453805
42228D53805Q30384r1805n47534p34043q08672j73643J114877J634963N18975
$$ 453805 1284189 1192384 644850 -89193 -897865 -1071508 43369 1678332 2197307
42219B197307j032890j365100n39703K49868N23829N59032L51975k14880o75405
$$ 2197307 1164417 -200683 -740386 -490518 33311 592343 944318 729438 54033
42210E4033n00460O4831M30541M23637P4741n84608r74801k53267J172384J622418
$$ 54033 -446427 -381596 48945 472582 547323 -37285 -1012086 -1265353 -92969 1529449
42200A529449N06640o25514n01748j26423q35650j742403j132609N62155J390239
$$ 1529449 2036089 1410575 908827 782404 -53246 -1795649 -2928258 -2366103 -975864
42191i75864R33009N37374P25360N60020k60429p23920l91401k07139p82265j306663
$$ -975864 -42855 494519 1219879 1779899 1519470 795550 404149 197010 -585255 -1891918
42181a891918q47658L92948J629725K293335J969058O57173n77245m08354Q66475
$$ -1891918 -2739576 -2346628 -716903 1576432 3545490 4202663 3625418 3217064 4083539
42172D083539J441892N21959n30228l23601M63961K35646j074145j945627j384025
$$ 4083539 5525431 6047390 5517162 5193561 5657522 5893168 4819023 2873396 1489371
42163A489371m5044P89392O31032j9015m75178n82554o54926q44654q37749l44311
$$ 1489371 1444327 2233719 2864751 2845736 2370558 1788004 1133078 288424 -549325 -893636
42153h93636L71664P82427P08503L03234k81531p80678p30700q9735M08896K15253
$$ -893636 -521972 260455 968958 1272192 990661 209983 -520717 -610452 -201556 13697
42143A3697j11197K02078P06420L26164q19029j477574j160373n95070j02368
$$ 13697 -97500 104578 810998 1137162 318133 -1159441 -2319814 -2914884 -3017252
42134c017252R25932K349713K640664R91507j139824j852638j260840p95886p98586
$$ -3017252 -2091320 258393 2899057 3890564 2750740 898102 -362738 -1158624 -1957210
42125a957210l88427N86010J110288P09645K10235L35889O55383N15918J06638
$$ -1957210 -2345637 -1759627 -649339 60306 270541 606430 1261813 1777731 1884369
42116A884369j09092k72199o21844o89114L0569Q98835O80360o84118j805248
$$ 1884369 1775277 1503078 881234 192120 222689 1121524 1801884 1117766 -687482
42107f87482j618998n82348L24160R32933J503246J708225J049869m5386o26228
$$ -687482 -2306480 -2888828 -2564668 -1631735 -128489 1579736 2629605 2584219 1957991
42098A957991o33588q38773j275750r35622M96303J685592J271821k61161j226286
$$ 1957991 1324403 485630 -790120 -1725742 -1229439 456153 1727974 1466813 240527
42089B40527q29324J72728O57592K81102m60544q03575m21606J86136K61069j31968
$$ 240527 -588797 -416069 241523 522625 62081 -741494 -1163100 -976964 -715895 -847863
42079h47863j43396N07683J013955P95211M34019N23325M78679l87676j337957
$$ -847863 -991259 -483576 530379 1325590 1759609 2282934 2761613 2373937 1035980
42070A035980j135960o7223M73900K60482M71147J411309J643528K25875j450295
$$ 1035980 -99980 -167203 306697 567179 1038326 2449635 4093163 4319038 2868743
42061B868743j322083M34910J468267L38678j480379j444333O16994K015965O78890
$$ 2868743 1546660 1981570 3449837 3788515 2308136 863803 1480797 3496762 4175652
42052D175652j890196k468671n02733J256322Q27445l99884l16505O11687O42814
$$ 4175652 2285456 -183215 -685948 570374 1397819 997935 681430 1293117 1935931
42043A935931r3898j38775M41423K43415p52747j100790n22366k44499n01043
$$ 1935931 1842033 1703258 2144681 2388096 1635349 534559 12193 -232306 -733349
42034g33349j10880R83325J195207R1241o72065k37217M473p84645j011902N03737
$$ -733349 -844229 139096 1334303 1425544 753479 516262 520735 -263910 -1275812 -772075
42024g72075J883796Q18852j580728k169310k69138J652069J586282J33486j065686
$$ -772075 1111721 1930573 349845 -1819465 -2088603 -436534 1149748 1283234 217548
42015B17548j243785n09355O52101J428793J197148L12254k36574O860O58991
$$ 217548 -1026237 -1535592 -883491 545302 1742450 2054704 1818130 1824990 2483981
42006B483981J128339R81722M0725j221978j748717j036922J20068N82413J05963
$$ 2483981 3612320 4594042 4634767 3412789 1664072 627150 747218 1329631 1435594
41997A435594q09962j604478j657943n52734R36086J163041j44186j114524l76236
$$ 1435594 625632 -978846 -2636789 -3189523 -2253437 -1090396 -1234582 -2349106 -2725342
41988b725342P94575N53400m75630l14522J025676J677993J095496O79430J042384
$$ -2725342 -1930767 -1377367 -1852997 -2167519 -1141843 536150 1631646 2311076 3353460
41979C353460R56328k92388j479228j351695m41970L5338q0699k06097j43099
$$ 3353460 4309788 4017400 2538172 1186477 744507 779845 699146 493049 349950
41970C49950n6138L0313Q8433l4633k30836j60759J49926L29530L03054K53626
$$ 349950 293812 324125 412558 377925 147089 -13670 136256 465786 768840 1022466
41960A022466O8044l65412n24790P8162Q31064P76351J85094M5311K45780j20003
$$ 1022466 1090510 725098 200308 278470 1109534 1885885 2070979 2116290 2362070 2242067
41950B242067p91676n63434M45659P67976J35804j15360K93082o8785j391950
$$ 2242067 1450391 886957 1332616 2100592 2236396 2121036 2414118 2345333 953383
41941I53383j580282L02521J928003J129193o07232n50636R85379J537520N81002
$$ 953383 -626899 -324378 1603625 2732818 2125586 1574950 2560329 4097849 4678851
41932D678851k03014k19392n95498j469461j362983J42536J361852R82692j71039
$$ 4678851 4475837 4256445 3660947 2191486 828503 971039 2332891 3315583 3144544
41923C144544o63700l06892K02411L01019k79982j254974j453435o7608J611969
$$ 3144544 2480844 2173952 2376363 2677382 2397400 1142426 -311009 -378617 1233352
41914A233352J350630p52041j958819o25117J563351K169537J146838J6624o06672
$$ 1233352 2583982 1831941 -126878 -751995 811356 2980893 4127731 4144355 3537683
41905C537683r73402q17336J40515J027443Q79241K97663M01453P37250J28706
$$ 3537683 2564281 1746945 1887460 2914903 3794144 4091807 4493260 5230510 5359216
41896E359216q63688n75040P07327P50717j006150k228172j217741M64963N65634
$$ 5359216 4495528 3920488 4627815 5378532 4372382 2144210 926469 1391432 1957066
41887A957066m32399n02048N24342J037036N11110K7084Q7122J9725l07313j82052
$$ 1957066 1524667 1022619 1546961 2583997 3095107 3122191 3209313 3229038 2921725 2739673
41877B739673K27714j50604j060120p48832J045328K046253P81058r63114q83055
$$ 2739673 2967387 2816783 1756663 1007831 2053159 4099412 4880470 3917356 3034301
41868C034301K99094L37843p36965j002943j79578O5444o61082p41530L94121
$$ 3034301 3333395 3671238 2934273 1931330 1751752 1817196 1156114 414584 808705
41859H08705J052942J56767r26049p64267j27943l15641q74650p17289j77599
$$ 808705 1861647 2018414 1092365 328098 200155 -115486 -990136 -1707425 -1885024
41850a885024j56954k80612K77932R84357P77562M2348n3797L86598M45430L46389
$$ -1885024 -2041978 -2322590 -2044658 -1060301 -282739 -240391 -294188 92410 537840 884229
41840H84229R09147J448835N60246j040590j007286Q33488J764486L17442j346205
$$ 884229 1793376 3242211 3802457 2761867 1754581 2588069 4352555 4669997 3323792
41831C323792q79732N54710L37212j329658j862411m25365J008270R16438K59458
$$ 3323792 2444060 2998770 3335982 2006324 143913 -281452 726818 1643256 1902714
41822A902714M59370J115088R07947k94209j385601j512488p50301L04389R07105
$$ 1902714 2362084 3477172 4385119 4090910 2705309 1192821 442520 746909 1654014
41813A654014M84721p10136j482190q88013N64698J496216J330298P43221M44995
$$ 1654014 2138735 1428599 -53591 -941604 -376906 1119310 2449608 3192829 3637824
41804C637824K84126j27017n72052n98055l16173j82648j85918O5871M91837N04949
$$ 3637824 3921950 3794933 3222881 2624826 2308653 2126005 1940087 2005958 2497795 3002744
41794C002744l33l36410o9114K68989P4920k69038l1291N18462L71625o02914
$$ 3002744 3002411 2666001 2596887 2865876 2940796 2671758 2640467 3158929 3530554 2927640
41784B927640j279790q39392J19320N50259L54660J04330r6803n59639j035243
$$ 2927640 1647850 808458 927778 1478037 1832697 1937027 1840224 1280585 245342
41775B45342p80557K46027J099015J121432P96666Q02485Q35032J64694r73116
$$ 245342 -535215 -289188 809827 1931259 2727925 3530410 4365442 4530136 3557020
41766C557020j465904q41362J10259M66974K29554j10270l94259o35124n52041
$$ 3557020 2091116 1249754 1360013 1826987 2056541 1946271 1552012 916888 364847
41757C64847J8430N45793L72555k74648n39963j58945K76886L07807J22666n5442
$$ 364847 383277 929070 1301625 1026977 487014 328069 604955 912762 1035428 979986
41747I79986l26643n42978j46971Q66563J451170P25452o46616j081379m3517
$$ 979986 653343 110365 -36606 829957 2281127 3006579 2359963 1278584 1235067
41738A235067J279923J443293L90974o74325q12401l11176l1511j25801R6369
$$ 1235067 2514990 3958283 4349257 3674932 2862531 2551355 2519844 2394043 2490412
41729B490412R64384J706765J411512L24530n06083o61553o24383p06461o42350
$$ 2490412 3454796 5161561 6573073 6897603 6391520 5729967 5105584 4399123 3756773
41720C756773l82108l13897l61487J75654J344579J993100J233676k45109j107547
$$ 3756773 3374665 3060768 2699281 2874935 4219514 6212614 7446290 7201181 6093634
41711F093634j055329q03210q12679q37203m99040K46581J014876J104684K29236
$$ 6093634 5038305 4235095 3422416 2585213 2086173 2332754 3347630 4452314 4681550
41702D681550o68031k41781J186937J580426L0425j609799j230238N11116J344409
$$ 4681550 4013519 3771738 4958675 6539101 6569526 4959727 3729489 4240605 5585014
41693E585014P48909J84861L46039K78279n79260j327295j088184j19091R82571
$$ 5585014 6333923 6518784 6864823 7143102 6563842 5236547 4148363 4029272 5011843
41684E011843J899127K123043J249859J07629J66878J337327J803606P03430m92935
$$ 5011843 6910970 9034013 10283872 10391501 10558379 11895706 13699312 14402742 13909807
41675A3909807j96472J003720J415488O87803P591L76012J578129K540339K241275
$$ 13909807 13713335 14717055 16132543 16820346 16827937 17203949 18782078 21322417 23563692
41666B3563692P46598m43291J56499K058840L326767L178909K637621K275383
$$ 23563692 24310290 23866999 24023498 26082338 29409105 32588014 35225635 37501018
41658C7501018J271655l13414m11073K093899M897241N045746L092314J992515
$$ 37501018 38772673 38459259 38048186 40142085 45039326 50085072 53177386 55169901
41650E5169901K495204K460811R05342j68837Q82401K499264K212705K90714r21899
$$ 55169901 57665105 60125916 61031258 60862421 61744822 64244086 66456791 66747505 65825606
41641F5825606n79835k37132j154032k480860k805407k234758j885863k059971
$$ 65825606 65245771 65008639 63854607 61373747 58568340 56333582 54447719 52387748
41633E2387748k154439k091706k487817l217456l164012k045769j240260j728979
$$ 52387748 50233309 48141603 45653786 42436330 39272318 37226549 35986289 34257310
41625C4257310k326063j451948J50755L54775j074514k190856j899063j165047
$$ 34257310 31931247 30479299 30630054 30984829 29910315 27719459 25820396 24655349
41617B4655349q12245l06799M44304K56616j100848j802220o67517P73607P03558
$$ 24655349 23843104 23536305 23980609 24237225 23136377 21334157 20666640 21440247 22143805
41608B2143805j09471N8203P90068N17950l76698j41534J073617J187274m33331
$$ 22143805 22034334 22092537 22882605 23400555 23023857 22882323 23955940 25143214 24709883
41599B4709883j956267j919239j002833l37256J18103O79124R31074N26178p8157
$$ 24709883 22753616 20834377 19831544 19494288 19612391 20291515 21222589 21748767 21670610
41590B1670610l47891k70974J43187J013389J919416K027329J185142J12382n39121
$$ 21670610 21322719 21051745 21194932 22208321 24127737 26155066 27340208 27452590 26913469
41581B6913469m80219N77160K367028L429214K553908P87235L37099J465541K343011
$$ 26913469 26433250 27010410 29377438 32806652 35360560 36147795 36484894 37950435 40293446
41572D0293446K167655K227288L203898L703563K718877J557231J682517K236283
$$ 40293446 42461101 44688389 47892287 51595850 54314727 55871958 57554475 59790758
41564E9790758J542301j17331j145765j255461j553274k378453k793454k255341
$$ 59790758 61333059 61215728 60069963 58814502 57261228 54882775 52089321 49833980
41556D9833980j420855j067414j170331j256246j047492o51644m31933n59796
$$ 49833980 48413125 47345711 46175380 44919134 43871642 43219998 42788065 42228269
41548D2228269n86214O4082J094282J663495J904937K937197M823551N841054
$$ 42228269 41642055 41706137 42800419 44463914 46368851 49306048 54129599 59970653
41540E9970653M727765K441603N18568j114051l171109m902305m880199l402725
$$ 59970653 64698418 67140021 67658589 66544538 63373429 58471124 53590925 50188200
41532E0188200k222690k012694j827569j098251m16913n2720O61985J893658K668492
$$ 50188200 47965510 45952816 44125247 43026996 42610083 42557363 43219348 45113006 47781498
41523D7781498K379963J746080J494724J156778R0355j140377j494325j109706
$$ 47781498 50161461 51907541 53402265 54559043 54649398 53509021 52014696 50904990
41515E0904990j196571k327798l600852l684256k324711o74541k24518j359209
$$ 50904990 49708419 47380621 43779769 40095513 37770802 37096261 36871743 35512534
41507C5512534k913253l317646k250196r33737p06528j563653k319059k015662
$$ 35512534 32599281 29281635 27031439 26097702 25391174 23827521 21508462 19492800
41499A9492800q74940J50365M94753M03163K72627l8016q48769j779896j864207
$$ 19492800 18617860 18768225 19262978 19666141 19938768 19900752 19051983 17272087 15407880
41490A5407880p65922O11420J116500N90854k66448q97384j207885j149801o46160
$$ 15407880 14641958 15253378 16369878 16960732 16694284 15796900 14589015 13439214 12793054
41481A2793054M8264M52934M64528M61284O69335P82751M46894j09862k14953
$$ 12793054 12841318 13294252 13758780 14220064 14889399 15672150 16119044 16009182 15794229
41472A5794229N04978J704478K675722K975738K636491K013305J757134K729964
$$ 15794229 16299207 18003685 20679407 23655145 26291636 28304941 30062075 32792039
41464C2792039N252204Q257733R947507R758557Q956572Q589184P676166M584739
$$ 32792039 38044243 46301976 56249483 66008040 74964612 83553796 91229962 95814701
41456I5814701l78203n148619q339982r968301j0021656q298180n931010m955632
$$ 95814701 95436498 90287879 81947897 71979596 61957940 53659760 47728750 42773118
41448D2773118n509665n360076l313310j222184j113321k073549j962575q48459
$$ 42773118 37263453 31903377 28590067 27367883 26254562 24181013 22218438 21369979
41440B1369979m47753j017733j214273o96478n63174j127130j341442p78023l41600
$$ 21369979 20922226 19904493 18690220 17993742 17430568 16303438 14961996 14183973 13842373
41431A3842373n43000o96215l82989k23472n37835n64936K40701J203175J403899
$$ 13842373 13299373 12603158 12220169 11996697 11458862 10893926 11134627 12337802 13741701
41422A3741701P91626j97696j238608j846696j413493r8588J006858J078149L60575
$$ 13741701 14533327 14335631 13097023 11250327 9836834 9738246 10745104 11823253 12183828
41413A2183828m20815p64317m24857L88787P64144J6018j056865j004018O3512
$$ 12183828 11763013 10998696 10573839 10962626 11726770 11742788 10685923 9681905 9745417
41404I745417M88414l68750j152166p76681p7245j28023l58579K31525J093910
$$ 9745417 10233831 9865081 8712915 7936234 7858989 7730966 7372387 7603912 8697822
41395H697822R83282Q2117l16567J43090O21956O64820O35976O04973J30539o35470
$$ 8697822 9681104 9763221 9446654 9589744 10211700 10876520 11512496 12117469 12248008 11612538
41385A1612538p81340M3242J010282J201360O46561l0168m23132n08650m62805
$$ 11612538 10831198 10874440 11884722 13086082 13732643 13702475 13279343 12770693 12307888
41376A2307888n52074q32971q56454j18766J075963J712362J275502M44325K44095
$$ 12307888 11755814 10922843 10066389 9947623 11023586 12735948 14011450 14455775 14699870
41367A4699870Q04164J337747J228481P62873O80909J203618J742943J635444
$$ 14699870 15504034 16841781 18070262 18833135 19514044 20717662 22460605 24096049
41359B4096049R82861N27153P40579J352756J854672K116955K274756K313292
$$ 24096049 25078910 25606063 26346642 27699398 29554070 31671025 33945781 36259073
41351C6259073K166497K086657K467413L228404L746165L639139L418665M021469
$$ 36259073 38425570 40512227 42979640 46208044 49954209 53593348 57012013 61033482
41343F1033482N686826P655904R224109J0776481J3262630J6773314K0412367
$$ 61033482 66720308 74376212 83600321 94376802 107639432 124412746 144825113
41336A44825113K3861386K8300721L5044543M3537936N1104120N4115322M8996534
$$ 144825113 168686499 196987220 232031763 275569699 326673819 380789141 429785675
41329D29785675L3481211R054274j7670233l8018137m7221523m7124032m2799594
$$ 429785675 463266886 472321160 454650927 416632790 369411267 322287235 279487641
41322B79487641l7536727l1731100k5313764j9361425j5102817j2493823j0462740
$$ 279487641 241950914 210219814 184906050 165544625 150441808 137947985 127485245
41315A27485245q290441o349651n413399n416125n297007m335771l228981l186423
$$ 127485245 119194804 112845153 107431754 102015629 96718622 92382851 89153870 85967447
41307H5967447m186503m994261m884030m343186l883180l259197k351669j769812
$$ 85967447 81780944 76786683 71902653 67559467 63676287 60417090 58065421 56295609
41299E6295609j849583j929343j442241r66132j287032k061968k371799k108728
$$ 56295609 54446026 52516683 51074442 50108310 48821278 46759310 44387511 42278783
41291D2278783j874108j879504j816100j485306q27984K10915J124242Q39820
$$ 42278783 40404675 38525171 36709071 35223765 34395781 34606696 35730938 36570758
41283C6570758p50914j994503j470207j39281M4575p96767o71061J026524K444683
$$ 36570758 35819844 33825341 32355134 32215853 32260428 31463661 30792600 31819124 34263807
41274C4263807K007620N08415l47613r9430O52635J387607J705788J258726M93506
$$ 34263807 36271427 36779842 36432229 36332799 36985434 38373041 40078829 41337555 41831061
41265D1831061M85776J257296J407861L33350n14132J32193J145320P60115n01954
$$ 41831061 42316837 43574133 44981994 45315344 44801212 44933405 46078725 46838840 46336886
41256D6336886p52550M7505J16568j014106j753618j220463n29794n74646o23886
$$ 46336886 45584336 45631841 45748409 44734303 42980685 41760222 41230428 40655782 40031896
41247D0031896j93700l16565j488163k125856r01540Q05707Q37721m33917r43717
$$ 40031896 39838196 39521631 38033468 35907612 35006072 35811779 36649500 36215583 35271866
41238C5271866l55784k75061j291208k168252k168724k031821k211424k102463
$$ 35271866 34916082 34641021 33349813 31181561 29012837 26981016 24769592 22667129
41230B2667129j545499j243969j144211l22450Q83154P20523j078217k378682
$$ 22667129 21121630 19877661 18733450 18411000 19294154 20014677 18936460 16557778
41222A6557778j832580q45837q69287r43227O2774Q66087k4682j230050n25835
$$ 16557778 14725198 13879361 13010074 12066847 12129621 12995708 12971026 11740976 11215141
41213A1215141J291334J629197L36472m69504k88620n97765j429785j060551M85609
$$ 11215141 12506475 14135672 14472144 14002640 13714020 13116255 11686470 10625919 11111528
41204A1111528J019179M6845l08209O44959O34087j376085k768084j380751Q52066
$$ 11111528 12130707 12177552 11869343 12514302 13148389 11772304 9004220 7623469 8475535
41195H475535J102703L8633m7769N09807j95198j644054j507646K33404J070922
$$ 8475535 9578238 9616871 9569102 10078909 9883711 8239657 6732011 6965415 8036337
41186H036337l1069j263897j030871L2997P10732Q86914Q99733P55664N66205
$$ 8036337 8005268 6741371 5710500 5743497 6454229 7341143 8240876 8996540 9562745
41177I562745O12635P34910O70873Q47613J645691K224111J533874J69307m28363
$$ 9562745 10175380 10910290 11581163 12428776 14074467 16298578 17832452 18001759 17573396
41168A7573396l15441p28352j573925j358691J08059J026306K77574j010009j369508
$$ 17573396 17257955 16529603 14955678 13596987 13705046 14731352 15008926 13998917 12629409
41159A2629409r24829n37311k96919K30820J104102J936646K120918J136343m86754
$$ 12629409 11704580 11167269 10870350 11101170 12205272 14141918 16262836 17399179 16912425
41150A6912425r23680P84449K740006K309613N0939q52715O94765K222282J726293
$$ 16912425 15988745 16773194 19513200 21822813 21873752 21021037 21715802 23938084 25664377
41141B5664377M74710L51363Q58855O83595K42456N31121R64470M63338n17602
$$ 25664377 26139087 26490450 27349305 28032900 28275356 28806477 29770947 30234285 29716683
41132B9716683r70246j179859j725406j852747q66125J4597o16716j801939j748804
$$ 29716683 28746437 27566578 25841172 23988425 23122300 23136897 22520181 20718242 18969438
41123A8969438r78961j320565k423357k175572m17850O68477J26165o00603n44568
$$ 18969438 17990477 16669912 14246555 12070983 11653133 12321610 12447775 11847172 11302604
41114A1302604n29023q25522k48753J194463J363524o28134k350804j396605J052071
$$ 11302604 10773581 9948059 9699306 10893769 12257293 11629159 9278355 7881750 8933821
41105H933821K147221J381267L79426j55254p97291j317447p14533P13495J424183
$$ 8933821 11081042 12462309 12841735 12686481 11889190 10571743 9857210 10570705 11994888
41096A1994888R20536J97763k19216q62215j665748j597276n58894N0515m72628
$$ 11994888 12915424 13113187 12893971 12031756 10366008 8768732 8209838 8260353 7787725
41087G787725r15510j70762Q89661Q62618M9021k29926J98191M07364J63706J21314
$$ 7787725 6872215 6701453 7591114 8453732 8502753 8272827 8471018 8878382 9042088 9163402
41077I163402L30048J7810r33440j588598j427737j087799j125996j064690l60913
$$ 9163402 9493450 9511260 8577820 6989222 5561485 4473686 3347690 2283000 1922087
41068A922087N08951P48801M19576R8424j53912n96752r06307m59108N05162R31739
$$ 1922087 2431038 3179839 3599415 3697839 3543927 2947175 2040868 1581760 2086922 3018661
41058C018661M13042j46518K21075J140905J330531K93342r76815j191910l49285
$$ 3018661 3431703 3285185 3506260 4647165 5977696 6271038 5294223 4102313 3753028
41049C753028L24745J3314o59691o35399L6766M53688L85087M28589N64929o9957
$$ 3753028 4077773 4091087 3431396 2795997 2832763 3286451 3671538 4100127 4665056 4595099
41039D595099j377627j680732r2994J666361J435181k33986r70327j65278N29190
$$ 4595099 3217472 1536740 1443746 3110107 4545288 4311302 3340975 3175697 3704887
41030C704887K98488L65748J378146J860030O46856r46174j078374j40603K43934
$$ 3704887 4003375 4369123 5747269 7607299 8254155 7307981 6229607 6089004 6332938
41021F332938r0991j09216K17765q668o77890p76926l07023j85260k55673N37006
$$ 6332938 6241947 6132731 6350496 6341828 5663938 4887012 4579989 4394729 4139056 4676062
41011D676062J740939J417553o60015k018830j005446O26523L95103j185012j666564
$$ 4676062 6417001 7834554 7174539 5155709 4150263 4776786 5171889 3986877 2320313
41002B320313m46183P95421R60038O05188K12934m42522r15265k09774J082734
$$ 2320313 1874130 2669551 3629589 4234777 4447711 4005189 3089924 2880150 3962884
40993C962884Q82168j077695k099480l36698K015135J636815r67024k172699n63994
$$ 3962884 4845052 3767357 1667877 1331179 3346314 4983129 4016105 1843406 1279412
40984A279412J292975R63395n81634j133232n73753j71036j4787O91618J545974
$$ 1279412 2572387 3535782 2954148 1820916 1247163 1076127 1061340 1752958 3298932
40975C298932J277785k7789q93492o97821k78425j42276J74543N63956J0504j360727
$$ 3298932 4576717 4548928 3655436 2957615 2679190 2536914 2711457 3275413 3285917 1925190
40965A925190j648684R6321J941848J525793n81157j808457j247203l72559k67169
$$ 1925190 276506 372827 2314675 3840468 3259311 1450854 203651 -168908 -436077
40956d36077k10983M76600J003509M78901n59558j015738p17291j30093N52469
$$ -436077 -647060 -170460 833049 1311950 752392 -263346 -980637 -1110730 -558261
40947e58261J091816Q06796l67873j099567k56416J148605J085579n42090j637019
$$ -558261 533555 1340351 972478 -127089 -383505 765100 1850679 1308589 -328430
40938c28430q74780N76600R81483L67945q6277j0598N6169n2696K852J46158o6558
$$ -328430 -1203210 -626610 354873 722818 636541 625943 682112 629416 632268 778426 711868
40927G11868n15339o08375l27363k49909m35769k35420N54386J234707J254674
$$ 711868 196529 -411846 -739209 -989118 -1424887 -1660307 -1105921 128786 1383460
40918A383460R18305O49403L27966j57442m26159k62561j49120n42953j123526
$$ 1383460 2301765 2951168 3279134 3121692 2695533 2432972 2283852 1740899 617373
40909F17373j280998q45441P5018J259820J902174R73787j078477k029422n46494
$$ 617373 -663625 -1509066 -1434048 -174228 1727946 2701733 1623256 -406166 -952660
40900i52660J658494J901061J51840j220857j032523m99139o47437p10701j2750
$$ -952660 705834 2606895 2758735 1537878 505355 6216 -641221 -1351922 -1364672
40891a364672M60123k32788j112592o85516P23994J588238J470300J175251J009873
$$ -1364672 -904549 -1137337 -2249929 -2935445 -2211451 -623213 847087 2022338 3032211
40882C032211M42784n22391j004743n39041L01404Q15834Q78478N65246r7932
$$ 3032211 3474995 2952604 1947861 1408820 1710224 2526058 3404536 3969782 3871850
40873C871850p69507q90229m26306M3217J51575J01776R2981K1380r6010o9841
$$ 3871850 3102343 2212114 1785808 1829025 1980600 2082376 2175357 2196737 2100727 2030886
40863B030886j11782p04841j544727j429936J01079J655017J469762k23982j343968
$$ 2030886 1919104 1214263 -330464 -1760400 -1659321 -4304 1465458 1241476 -102492
40854a02492o21008Q00838R83451k51834j270021q85086L35106J247668J604230
$$ -102492 -723500 77338 1060789 808955 -461066 -1346152 -1011046 236622 1840852
40845A840852J612633Q74254r31486k569306k031815O92833K947408K458903J41346
$$ 1840852 3453485 4327739 3396253 826947 -1204868 -512035 2435373 4894276 5035622
40836E035622j285076p87247K48913M63704J36072N9279J49325p7157m80726n56065
$$ 5035622 3750546 2963299 3212212 3675916 3811988 3871267 4020592 3943435 3462709 2906644
40826B906644k63160K2293R3678j7248k67676m83298l01425L26914Q23259O27116
$$ 2906644 2643484 2665777 2759455 2742207 2474531 1991233 1689808 2016722 2839981 3467097
40816C467097k5677m30071l83144l20920n16392o98913o37700n87828p65000p41082
$$ 3467097 3441420 3011349 2628205 2307285 1790893 1091980 454280 -133548 -898548 -1639630
40806a639630L1402J147087J381675K38939j154151j305483k30905O84932O31396
$$ -1639630 -1608228 -461141 920534 1159473 5322 -1300161 -1531066 -846134 -214738
40797b14738K45000K67354L38110j17214n82136j38957R14500J311856O27502
$$ -214738 30262 297616 635726 518512 -63624 -202581 711919 2023775 2651277
40788B651277k74808p13309r56235j174556q08283L00463J112353P03025k81402
$$ 2651277 2376469 1663160 706925 -467631 -1275914 -975451 136902 839927 558525
40779E58525n16308O7460L20169l09261j044776j002181k69441M98811Q96264
$$ 558525 42217 109677 429846 120585 -924191 -1926372 -2195813 -1697002 -800738
40770h00738Q84406O24384M51952O01811Q03407N96140J19702j4402K10027L8238
$$ -800738 83668 708052 1160004 1761815 2565222 3161362 3281064 3266662 3476689 3514927
40760C514927p72985j288279p13570K52213L41244l65781n51263L10249J145326
$$ 3514927 2741942 1453663 740093 992306 1333550 967769 416506 726755 1872081
40751A872081Q94965J3802l31340K9959J81128m60991j342537j483616n73969
$$ 1872081 2767046 2780848 2449508 2479467 2660595 2199604 857067 -626549 -1200518
40742a200518P60574J564467J378517N87344o2535k76950l35729m17124k85045
$$ -1200518 -439944 1124523 2503040 3090384 3027849 2750899 2415170 1998046 1713001
40733A713001J09777K71037p8906l42734J06562P42740M78148o25625j255798
$$ 1713001 1822778 2093815 2014909 1672175 1778737 2521477 2999625 2374000 1118202
40724A118202o94440K01773L65301J6479O3062O01051Q72465M43433l19914q36916
$$ 1118202 423762 625535 990836 1007315 1070377 1671428 2543893 2987326 2667412 1830496
40714A830496q01779k30924M56750N97892O5529l54001r209M79645L4227j045773
$$ 1830496 1028717 797793 1254543 1852435 1917964 1563963 1554754 2034399 2068626 1022853
40704A022853j189593K05761J713887J711163M49484n40681n45921j97792j61062
$$ 1022853 -166740 39021 1752908 3464071 3913555 3372874 2826953 2629161 2468099
40695B468099k82928j83427M0972K2436l39792p39190o92593N432Q29856Q24710
$$ 2468099 2185171 2001744 2042716 2065152 1725360 986170 293577 299009 1128865 1953575
40685A953575j73640r63036l98146Q56262J069580k5501p56906m1216R71002P62940
$$ 1953575 1779935 816899 418753 1275015 2344595 2319094 1562188 1520972 2491974 3254914
40675C254914k16984n18238j36968k47399q86820q43029N2431M56896j41103m87585
$$ 3254914 3037930 2519692 2382724 2135325 1248505 405476 457907 914803 773700 286115
40665B86115J35134M96616l25083r15537L42614K274478K301754K89357j290152
$$ 286115 421249 917865 592782 -322755 19859 2294337 4596091 4885448 3595296
40656C595296j034394k36529l55505r07530q47774m04466k86604k48088K60895
$$ 3595296 2560902 2324373 1968868 1061338 213564 -190902 -477506 -725594 -464699
40647d64699Q26332P10476K49476M56934J468623K338069K304218J526114N84611
$$ -464699 361633 1072109 1321585 1778519 3247142 5585211 7889429 9415543 10000154
40638A0000154j57698o36894q76867p85326j90678P20915J216903Q44043K75930
$$ 10000154 9842456 9205562 8328695 7543369 7352691 8073606 9290509 10134552 10410482
40629A0410482M64482J025740O78970n53912j102627l50228L00497j23575m10216
$$ 10410482 10874964 11900704 12579674 12025762 10923135 10572907 10873404 10749829 10339613
40620A0339613N35131J275566L3192j883614j674500M14337J253439j92893j268350
$$ 10339613 10874744 12150310 12183502 10299888 8625388 9039725 10293164 10100271 8831921
40611H831921j44388J140630K48190j413754j108013M79302L33854j682959k326619
$$ 8831921 8687533 9828163 10076353 8662599 7554586 8033888 8367742 6684783 4358164
40602D358164j99754J815654R34752j332962j652758J96748J491897Q48775l26567
$$ 4358164 4158410 5974064 6908816 5575854 3923096 4119844 5611741 6460516 6133949
40593F133949o56870n95959p63584n74218L42855R62669M29535m08390l77201
$$ 6133949 5477079 4881120 4117536 3543318 3886173 4848842 5278377 4869987 4492786
40584D492786J37906J20535j89331Q371K23179n64008j681171j382641K91237
$$ 4492786 4630692 4751227 4561896 4570267 4793446 4229438 2548267 1165626 1456863
40575A456863J333474P95377k0992P32J78331j99183m05629J38804N11249k2937
$$ 1456863 2790337 3585714 3564722 3565454 3743785 3544602 3138973 3277777 3789026 3766089
40565C766089m90111J5086M90802j78392r34719k51759R72589P77221l11426K5904
$$ 3766089 3275978 3291064 3781866 3603474 2668755 2416996 3389585 4166806 3855380 3881284
40555C881284J729536J928695n27080k858898k235283K17572J231786p8889j558257
$$ 3881284 5610820 7539515 7012435 4153537 1918254 2135826 3367612 3288723 1730466
40546A730466j360954j25851M42046q2971n93845j28451Q02655Q72851j88386
$$ 1730466 369512 243661 685707 602736 8891 -119560 683095 1555946 1367560
40537A367560j008254l34236J156552J684630P25764m92633q30343n03032k83670
$$ 1367560 359306 25070 1181622 2866252 3592016 3099383 2269040 1766008 1482338
40528A482338l88943n65438n82271k83462L12228P65230N85631o3826n47260n91731
$$ 1482338 1093395 527957 -54314 -337776 -25548 739682 1325313 1261487 714227 122496
40518A22496l73997N3989P00350J159033R96097M61392N3993l10615q17168r12456
$$ 122496 -251501 -197512 502838 1661871 2657968 3119360 3173353 2862738 2045570 1133114
40508A133114j31700O74526L52532o40074q69418j84599L57805N27715Q78324
$$ 1133114 1001414 1675940 2028472 1388398 518980 334381 692186 1219901 2098225
40499B098225Q86128m41451j974009j228947J588957L127072J635157n57374q90969
$$ 2098225 2984353 2542902 568893 -660054 928903 4055975 5691132 5133758 4242789
40490D242789k11236m31825r91195l21481R36946R92465m6289p57270j002972
$$ 4242789 4031553 3599728 2608533 2287052 3223998 4216463 4170174 3412904 2409932
40481B409932j444549j444402q4672J472488J318700k3902m07035L43167L68524
$$ 2409932 965383 -479019 -563691 908797 2227497 2203595 1796560 2139727 2508251
40472B508251p98660j531491j054075m51754k76845L39957J482440J686377L46520
$$ 2508251 1709591 178100 -875975 -1327729 -1604574 -1264617 217823 1904200 2250720
40463B250720j052894j069633p5945Q00927R90654K49699j252499k210189j297032
$$ 2250720 1197826 128193 52248 853175 1843829 2093528 841029 -1369160 -2666192
40454b666192O08239J219000K50436j75287Q44555J441818K22861j296298j140346
$$ -2666192 -2057953 -838953 -588517 -763804 80751 1522569 1745430 449132 -691214
40445f91214J89496R96803R80156P77274L40060m55261p63075k5404P58381N39754
$$ -691214 -501718 495085 1475241 2252515 2592575 2137314 1374239 1348835 2107216 2646970
40435B646970o9658p0983J01073l65857q89303m86950L90782O73656M52807M18702
$$ 2646970 2577312 2506329 2607402 2241545 1352242 865292 1256074 1929730 2382537 2801239
40425B801239M67805L52604N85912J141059O54195j211459k181639n07340J824100
$$ 2801239 3269044 3621648 4207560 5348619 6002814 4791355 2609716 2102376 3926476
40416C926476J837731J91801k71253M59259p0000j791914j855933J31787R78585
$$ 3926476 5764207 5956008 5684755 6144014 6074014 4282100 2426167 2557954 3536539
40407C536539o10174j596415J61894K045279R88390j450215j794361j31412P71117
$$ 3536539 2926365 1329950 1491844 3537123 4525513 3075298 1280937 1149525 1920642
40398A920642K85671J65988P90554P20923j47544k04369Q25944J270818M72841
$$ 1920642 2206313 2372301 3162855 3883778 3736234 3531865 4357809 5628627 6101468
40389F101468j46644L01310P66197L69130q7502J76957L91730l52313j431497
$$ 6101468 5954824 6256134 7022331 7391461 7303959 7480916 7872646 7520333 6088836
40380F088836j640971r27661j64568J32334P3691n3330N6683M81577O84913Q1820
$$ 6088836 4447865 3520204 3355636 3487970 3561661 3508331 3565014 4046591 4731504 4813324
40370D813324q38852r26689j23282L95337J90501K21959Q48231P99246n96926
$$ 4813324 3974472 3047783 2924501 3319838 3510339 3732298 4580529 5379775 4782849
40361D782849j661613o65848J185441J296427k72837p85534Q48156K198976R93569
$$ 4782849 3121236 2455388 3640829 4937256 4664419 3878885 4727041 6926017 7919586
40352G919586j319790j644112K34016J464328L66753j312969j166668N00091J454081
$$ 7919586 6599796 4955684 5189700 6654028 7020781 5707812 4541144 5041235 6495316
40343F495316P89287k33673m14956j11053p9974j26225K43774O90468N92053K13747
$$ 6495316 7284603 7050930 6635974 6524921 6444947 6318722 6562496 7252964 7845017 8058764
40333H058764K95419P59078Q69913N78339O11015J097391J198913N22505o8232
$$ 8058764 8354183 9113261 9983174 10561513 11172528 12269919 13468832 13991337 13923105
40324A3923105K82932J102616J355092J036194J063637J740516K275762K072983
$$ 13923105 14206037 15308653 16663745 17699939 18763576 20504092 22779854 24852837
40316B4852837J739612K236001L412054M138393L930931L698900M423341N684719
$$ 24852837 26592449 28828450 32240504 36378897 40309828 44008728 48432069 54116788
40308E4116788O285300N948699N337848M529373K845632M76649j254700j941314
$$ 54116788 60402088 66350787 71688635 76218008 79063640 79540289 78285589 76344275
40300G6344275k829558m449088n241855m242187l412039m807360o702937n732605
$$ 76344275 73514717 69065629 63823774 59581587 56169548 51362188 44659251 38926646
40292C8926646k342157n05909j704683k952557k028430r42642j960849l443945
$$ 38926646 36584489 36078580 34373897 31421340 29392910 28450268 26489419 23045474
40284B3045474k757149q93550o35818j673885j303458P16073J705866N84962n36204
$$ 23045474 20288325 19394775 18758957 17085072 15781614 16497687 18203553 18788515 18252311
40275A8252311o1755O73465l7800j530875k055087j261996q9138P33854R72045
$$ 18252311 18190556 18864021 18826221 17295346 15240259 13978263 13889125 14622979 15595024
40266A5595024N51756j42942l20811J71338M94835J05546k51402M60634J946565
$$ 15595024 16146780 16003838 15683027 15854365 16349200 16454746 16203344 16663978 18610543
40257A8610543K632543J431487p98158j873345o89151J244955J524346J02477
$$ 18610543 21243086 22674573 21876415 20003070 19313919 20558874 22083220 22185697
40249B2185697n49467R36658K739678K665822J456308J338869K459220L080038
$$ 22185697 21636230 22572888 25312566 27978388 29434696 30773565 33232785 36312823
40241C6312823K663528K347113K629365K938411L459902N066377P248056Q340537
$$ 36312823 38976351 41323464 43952829 46891240 50351142 55417519 62665575 71006112
40233G1006112Q106521P968493Q413741Q371966P473026O566415N532005L033717
$$ 71006112 79112633 87081126 95494867 103866833 111339859 117906274 123438279 126471996
40225A26471996q48286m145139n918953p217215q373277q136469o584136n934978
$$ 126471996 125623710 121478571 115559618 108342403 99969126 91832657 85248521 79313543
40217G9313543o878041p006449m892120k868504l291391m656150m347472k991271
$$ 79313543 72435502 65429053 60536933 57668429 54377038 49720888 45373416 42382145
40209D2382145k802931l394464k730483j047605l30805o29216k68673O71997M04278
$$ 42382145 39579214 36184750 33454267 32406662 32075857 31446641 31177968 31849965 32254243
40200C2254243j074713j644315n34226O42376P57390N33423N97350N92802P22724
$$ 32254243 31179530 29535215 29000989 29643365 30400755 30934178 31531528 32124330 32847054
40191C2847054J798904L176646L020038J391780P44288K316403M250832M592091
$$ 32847054 34645958 37822604 40842642 42234422 42978710 45295113 49545945 54138036
40183E4138036M153928M774998O288522P048916O518599N635963N034276M251900
$$ 54138036 58291964 63066962 69355484 76404400 82922999 88558962 93593238 97845138
40175I7845138K675101M22917j770454l200576l789041m087442m484765m653720
$$ 97845138 100520239 100943156 99172702 95972126 92183085 88095643 83610878 78957158
40167G8957158m249739l740609l718005l742717k944647j586618q72110j201382
$$ 78957158 74707419 70966810 67248805 63506088 60561441 58974823 58102713 56901331
40159E6901331j705824j550688o90814O12020J940643K452504J599857J20261
$$ 56901331 55195507 53644819 52954005 53566025 55506668 57959172 59559029 59679290
40151E9679290p38719q26427q16688p28096j94413J36041o78354j818042j433268
$$ 59679290 58940571 58114144 57297456 56569360 56374947 56510988 55832634 54014592 52581324
40142E2581324K70450Q33071q23620k608651k307972p10232j82586j305837k480298
$$ 52581324 52851774 53684845 52861225 50252574 47944602 47234370 47051784 45745947 43265649
40133D3265649k279365r36083K90987M50338k83866q29292m73201J97363K25499
$$ 43265649 40986284 40050201 40341188 40791526 40507660 39678368 39205167 39402530 39628029
40124C9628029k16700k75475j959j08214l73413L8123P27308M37567n51629n21592
$$ 39628029 39411329 39135854 39133895 39025681 38652268 38690391 39417699 39855266 39303637 38782045
40114C8782045P24433J244089J50552q26242k13218Q88842R41338N43939J030767
$$ 38782045 39506478 40750567 40901119 40074877 39861659 40750501 41691839 42235778 43266545
40105D3266545K004786K200719J680120J400356J543604J815977K399616L149589
$$ 43266545 45271331 47472050 49152170 50552526 52096130 53912107 56311723 59461312
40097E9461312L021976J880042J581897L430594N786023O328810N617834O034963
$$ 59461312 62483288 64363330 65945227 69375821 75161844 81490654 87108488 93143451
40089I3143451Q010298R834902J0739012J1521777J2219440J1752318J0184274
$$ 93143451 101153749 110988651 121727663 133249440 145468880 157221198 167405472
40082A67405472Q914904Q064061N884212J571994l252413o711700q608299r414580
$$ 167405472 176320376 184384437 190268649 191840643 188588230 181876530 173268231 163853651
40074A63853651r084236p926078p145960p297999p320741o176791m449214l332845
$$ 163853651 154769415 146843337 139697377 132399378 125078637 118901846 114452632 111119787
40066A11119787k998261k941783l079221l473184l704449l472024l182803l110213
$$ 111119787 108121526 105179743 102100522 98627338 94922889 91450865 88268062 85157849
40058H5157849k692040j584667o88082j021011k103405k582563k113615j524880
$$ 85157849 82465809 80881142 80193060 79172049 77068644 74486081 72372466 70847586
40050G0847586j342832j233759q64579l73838K9184J36111m83156j870694k936585
$$ 70847586 69504754 68270995 67406416 67032578 67061762 67197873 66714717 64844023 61907438
40041F1907438k419268p50423J50203o50048j865219j847109p24454J69201K52074
$$ 61907438 59488170 58737747 58887950 58237902 56372683 54525574 53801120 53970321 54222395
40032E4222395K4982r7578j82238j84161O063l1014p76645j675079j607016o94458
$$ 54222395 54247377 54149799 53967561 53783400 53789463 53758449 52981804 51306725 49699709 49005251
40022D9005251m50250j583257k784801k567831j368222o91974q55636q99308m45656
$$ 49005251 48555001 46971744 44186943 41619112 40250890 39558916 38703280 37803972 37358316
40013C7358316k88244r97952k036010k561920k328007j539060n44557J15320M2247
$$ 37358316 37070072 36072120 34036110 31474190 29146183 27607123 27062566 27177886 27220133
40004B7220133m09434m66074m8136J06260l79310r45284j041480r64980j233392
$$ 27220133 26810699 26344625 26296489 26402749 26023439 25078155 24036675 23071695 21838303
39995B1838303j592514j258420n1935J100121R60977o40703k278107k182028k80686
$$ 21838303 20245789 18987369 18935434 20035555 20996532 20355829 18077722 15895694 15615008
39986A5615008J520958J551292K55176q00199j038331q74269k78466J040225K225853
$$ 15615008 17135966 18687258 18942434 18142235 17103904 16229635 15951169 16991394 19217247
39977A9217247J825951K9861j243308r48620r4351K04365K18461L35592o7673
$$ 19217247 21043198 21073059 19829751 18881131 18786780 18991145 19209606 19545198 19477525
39968A9477525j255435j986710j196153J73925M96320j38259l15737M46642J319443
$$ 19477525 18222090 16235380 15039227 15213152 15709472 15571213 15255476 15702118 17021561
39959A7021561J733583J900801J802968R81370l99096j282563r41443J22712Q08709
$$ 17021561 18755144 20655945 22458913 23440283 23041187 21758624 20817181 20939893 21748602
39950B1748602O18870N6043n9760L71470N25985k15253j199191j288509n81395
$$ 21748602 22367472 22423515 22363755 22735225 23261210 23045957 21846766 20558257 19976862
39941A9976862k84187p43697q81049n6222Q15568P90957L32495K57019L68803
$$ 19976862 19692675 18948978 18067929 18011707 18827275 19618232 19950727 20207746 20576549
39932B0576549K38189L01003R50160J479596J264214J100101J895831K848174
$$ 20576549 20814738 21115741 22065901 23545497 24809711 25909812 27805643 30653817
39924C0653817K609244J660813J696063K968738M106156M435575M585512M617572
$$ 30653817 33263061 34923874 36619937 39588675 43694831 48130406 52715918 57333490
39916E7333490L525243J222239o73630r97587o91692j277199k662901l579833
$$ 57333490 60858733 62080972 61407342 60409755 59718063 58440864 55777963 52198130
39908E2198130l543999l238406l163773k934832k148576j290602j253960k083529
$$ 52198130 48654131 45415725 42251952 39317120 37168544 35877942 34623982 32540453
39900C2540453k688982k096203p04090J91272M179o19779q74468o36931j30293
$$ 32540453 29851471 27755268 27051178 27242450 27246629 26626850 25752382 25115451 24985158
39891B4985158L97072M21716m60977j541002j488780l58700J52753p76313j688679
$$ 24985158 25382230 25803946 25342969 23801967 22313187 21954487 22107240 21330927 19642248
39882A9642248j134521n7964k86151j602514k173131j355298k68451J91100K01180
$$ 19642248 18507727 18449763 18163612 16561098 14387967 13032669 12764218 12955318 13156498
39873A3156498m4419o18508r89009l78108P64984J004524m1504j094030j020034
$$ 13156498 13112079 12493571 11504562 11126454 11891438 12895962 12854458 11760428 10740394
39864A0740394k17530K14018j33060p93459j079885o97301m6182J74985p7950
$$ 10740394 10522864 10736882 10603822 9810363 8730478 8033177 7986995 8161980 8084030
39855H084030j00312L58618N92389K17263o2761J61861L0748r57074j551419o07167
$$ 8084030 7983718 8342336 8934725 9151988 9089227 9251088 9281836 8324762 6773343 6166176
39845F166176P44855O89607l95226p44745j54493J64054J27723P00489J531983
$$ 6166176 6911031 7600638 7205412 6460667 6306174 6470228 6597951 7298440 8830423
39836H830423J219864p6339p62223n79763o75705q63522K34708J940017J658452
$$ 8830423 10050287 9973948 9211725 8631962 7956257 7092735 7327443 9267460 10925912
39827A0925912p63252k067809n05026J361728Q36078p13964m76667J177632J683759
$$ 10925912 10162660 8094851 7589825 8951553 9787631 9073667 8597000 9774632 11458391
39818A1458391N28246l99125n0445O83419Q96776O93646L45746o9825k96751k46491
$$ 11458391 11986637 11587512 11537067 12220486 13117262 13810908 14156654 14086829 13790078 13543587
39808A3543587l56913p54171p82118k46122j13373q96713j474549q16592K60288
$$ 13543587 13186674 12432503 11650385 11404263 11290890 10394177 8919628 8103036 8363324
39799H363324N31272M02303P95254J066291O0912j493875j781039p05273J06350
$$ 8363324 8894596 9296899 10092153 11158444 11219356 9725481 7944442 7239169 7345519
39790G345519l9199j74660L20113P50470M55496k72425q81193j075783o28812
$$ 7345519 7306320 7131660 7451773 8202243 8657739 8385314 7504121 6428338 5799526
39781E799526K81407P33693J59134n80297m22223J06144j59343p83300l26905
$$ 5799526 6080933 6814626 6973760 6393463 5971240 6077384 5918041 5134741 4807836
39772D807836J028758J503036N31451m10113k04030N39793J031340J383028J462504
$$ 4807836 5836594 7339630 7871081 7460968 7256938 7796731 8828071 10211099 11673603
39763A1673603M73878j389813k506938k047177j119329p15357j64159J097477
$$ 11673603 12147481 10757668 8250730 6203553 5084224 4368867 4204708 5302185
39755E302185J887067J116946j06815j64874L98907J8358r18400o68840O37168
$$ 5302185 7189252 8306198 8199383 8034509 8433416 8451774 7533374 6864534 7501702
39746G501702R52690k48182r84367l9009J037998N21117p44482q70568J25581
$$ 7501702 8454392 8206210 7221843 7182834 8220832 8741949 7997467 7126899 7252480
39737G252480P16586L63667j70874n27472j032130j436332j001309K4437M25093
$$ 7252480 7969066 8332733 8161859 7634387 6602257 5165925 4164616 4189053 4614146
39728D614146k01754q89509q29765l48732l1861Q4698R0060q0618j95886Q0210
$$ 4614146 4412392 3522883 2693118 2344386 2312525 2397223 2487283 2406665 2210779 2290989
39718B290989L74391M2084m82952j15655R04949J087482J79450k50031N08225
$$ 2290989 2665380 2707464 2224512 2108857 3013806 4101288 4280738 4030707 4538932
39709D538932J043332M50822J32149J198337K029509P82262j218750j351424Q1958
$$ 4538932 5582264 6033086 6165235 7363572 9393081 10175343 8956593 7605169 7687127
39700G687127M67315p90556j566478o91076N08952P85420N44298K59445l54947
$$ 7687127 8154442 7363886 5797408 5106332 5615284 6400704 6945002 7204447 6849500
39691F849500r41082m78664O82328R46386K18181J57838J004178Q36628q42321
$$ 6849500 5908418 5429754 6112082 7058468 7276649 7434487 8438665 9275293 8432972
39682H432972j598908O8569J913803J291137p68196j417701l46812M60355K48405
$$ 8432972 6834064 6902633 8816436 10107573 9339377 7921676 7574864 8035219 8283624
39673H283624L5610J76809o0345n93197m47467K67212K43970q47170j709957j344700
$$ 8283624 8319234 8496043 8435698 7842501 7395034 7662246 7906216 7059046 5349089 4004389
39663D004389k71890N58048R20847R50747N67667j96446q55200q62399j65258
$$ 4004389 3732499 4290547 5211394 6162141 6729808 6533362 5678162 4815763 4650505
39654D650505O89175R18275K20880p50828j030415n34923o2666n2910j47840q3801
$$ 4650505 5339680 6257955 6478835 5728007 4697592 4162669 4100003 4047093 3899253 3815452
39644C815452k1197J67099P40947J031511M4196j478265j421919M51144J586212
$$ 3815452 3794255 3961354 4702301 5733812 5778008 4299743 2877824 3328968 4915180
39635D915180K92528j572050j386527L81695J314212Q25744L45720L76755q7843
$$ 4915180 5207708 3635658 2249131 2630826 3945038 4770782 5116502 5493257 5405414
39626E405414j196736j534351l24117J274052J705786Q13527l58987q18969l95094
$$ 5405414 4208678 2674327 2350210 3624262 5330048 6143575 5784588 4965619 4570525
39617D570525L05644O25240O30887Q16620J083190Q71662L64774L30866N87111
$$ 4570525 4876169 5501409 6132296 6948916 8032106 8903768 9268542 9599408 10186519
39608A0186519J74467o21955m03837O07710L92781j242926j640686L29817J746807
$$ 10186519 10360986 9739031 9335194 9942904 10335685 9092759 7452073 7781890 9528697
39599I528697J00154k384642k219374k33270K34391q95390q40172O89462J037465
$$ 9528697 9628851 7244209 5024835 4791565 5025956 4130566 3290394 3979856 5017321
39590E017321m57645j328807m27930L72187q6878l81736L48859O52142l15902
$$ 5017321 4559676 3230869 2802939 3175126 3088248 2706512 3055371 3707513 3391611
39581C391611r88000j67005Q52818N84675l43357o77529m65720k04052J95125
$$ 3391611 2403611 2236606 3089424 3674099 3330742 2653213 2187493 1983441 2178566
39572B178566N08981J5856r25396r27114J00183O87049M43649N87021J175673
$$ 2178566 2687547 2703403 1778007 850893 951076 1638125 2081774 2668795 3844468
39563C844468N94946j172383j757519l56096O02542l41440r38618P18298K342177
$$ 3844468 4439414 3267031 1509512 1153416 1755958 1414518 475900 1194198 3536375
39554C536375J019033j643283j800478N49528J742154K71947j306708p45981Q08584
$$ 3536375 4555408 2912125 1111647 1661175 3403329 3675276 2368568 1622587 2431171
39545B431171J175972K39214o13412o30782j20372L78088M78589J734q08938j345176
$$ 2431171 3607143 3846357 3232945 2602163 2481791 2859879 3338468 3340202 2531264 1186088
39535A186088j164416m38362J18053q0950o28449l28436J078084J973810R00729
$$ 1186088 21672 -416690 -298637 -379587 -1008036 -1336472 -258388 1715422 2616151
39526B616151r69172j208729K43035J095631M98434J50692Q93237J073412k60812
$$ 2616151 1646979 438250 681285 1776916 2275350 2426042 3319279 4392691 4131879
39517D131879j319155p06842l8735r76355j960127q16575J226759J369512k06967
$$ 4131879 2812724 2105882 2067147 1090792 -869335 -1685910 -459151 910361 703394
39508G03394r23336j43872L52547r2266j76792N45268Q68188L49359M0401L41628
$$ 703394 -219942 -363814 -11267 -103533 -280325 264943 1133131 1482490 1522891 1864519
39498A864519L26089l40143p83011o01412l40180p6192O15661J170751N19808
$$ 1864519 2190608 1850465 1067454 466042 125862 49670 665331 1836082 2355890
39489B355890p12895n84506J152057K388071J591380l68194j835693k122475j233350
$$ 2355890 1642995 1058489 2210546 4598617 6189997 5821803 3986110 1863635 630285
39480F30285L92843J427726P14336p69775q23793O91843J501444M23152r45228
$$ 630285 1023128 2450854 3165190 2395415 1571622 2263465 3764909 4188061 3242833
39471C242833r63624k40788L5645J05225N19300P09234K01356j89627J39038K88509
$$ 3242833 2279209 2038421 2074066 2179291 2698591 3407825 3609181 3419554 3558592 3847101
39461C847101m07075p92930J65553J149820L40367j378121j420658N56577J997037
$$ 3847101 3440026 2647096 2812649 3962469 4302836 2924715 1504057 2060634 4057671
39452D057671J070135r68659j837991j197784m19056k26705O6187R30706J390775
$$ 4057671 5127806 4159147 2321156 1123372 704316 477611 543798 1474504 2865279
39443B865279L43001j327564j359357O66507K166192R72392j282993j367657O22859
$$ 2865279 3208280 1880716 521359 1187866 3354058 4326450 3043457 1675800 2298659
39434B298659J380735l14031j576084r1046K111005J941732P8691m91595O30596
$$ 2298659 3679394 3365363 1789279 1698233 3809238 5750970 5829661 5338066 5968662
39425E968662J061772j82047j439608j516117j207447j085125l26544J177014
$$ 5968662 7030434 6848387 5408779 3892662 2685215 1600090 1273546 2450560
39417B450560J749132L95154j337227j471956k95332N64457O87219Q26404R81495
$$ 2450560 4199692 4594846 3257619 1785663 1490331 2054788 2742007 3568411 4549906
39408D549906K76386j243281k139303j343271M71407J690765J430721J51145j006312
$$ 4549906 4826292 3583011 1443708 100437 571844 2262609 3693330 3844475 2838163
39399B838163j236365o26446J11815M42552M53134M71867M91578K31152l43970
$$ 2838163 1601798 975352 1087167 1529719 1982853 2454720 2946298 3177450 2833480
39390B833480q52691r07637n42682j26400J13804L11676N61973N21645r3868o58022
$$ 2833480 1980789 1073152 530470 404070 517874 829550 1391523 1913168 1819300 1161278
39380A161278j10818J315368J803043L17810j545552j505552J04611P88379l65300
$$ 1161278 1050460 2365828 4168871 4486681 2941129 1435577 1540188 2328567 1963267
39371A963267j457542r44723O5561J9911m11433J80061J103295N76018j049199
$$ 1963267 505725 -438998 -373437 -353526 -764959 -584898 518397 1094415 45216
39362D5216j497645l1516J526097J632775Q67654K49804l70954j174006j250713
$$ 45216 -1452429 -1483945 42152 1674927 2542581 2792385 2421431 1247425 -3288
39353c288l2697J296988J251278J58908m61895j18872K98302P3946n38014r98035
$$ -3288 -35985 1261003 2512281 2671189 2209294 2090422 2388724 2462670 1924656 926621
39343I26621j080591p58377j10026N93908J024608R59975L22966n31517o84363
$$ 926621 -153970 -912347 -1022373 -428465 596143 1556118 1879084 1347567 663204
39334F63204L44059J445004R86197o93569j348258o7800J188107N06951j083366
$$ 663204 1007263 2452267 3438464 2744895 1396637 1328837 2516944 3023895 1940529
39325A940529j344076k15236N51411L51656J88323N34714P52779N72310L89921
$$ 1940529 596453 381217 932628 1284284 1472607 2007321 2760100 3332410 3722331
39316C722331J50029m43917p83427j39079O37085J04479j220439j424825l24259
$$ 3722331 3872360 3428443 2645016 2505937 3143022 3247501 2027062 602237 277978
39307B77978K86831j89830k03174R71820J710776P19725p91199j035062j35912
$$ 277978 564809 374979 171805 1143625 2854401 3574126 2782927 1747865 1611953
39298A611953O53636Q50646O44854J22284l81898k90704J27244k0370m74511k8380
$$ 1611953 2265589 3116235 3761089 3883373 3501475 3210771 3338015 3317645 2843134 2814754
39288B814754R77933O18847j257443k153138p87182P55636N45046j79886J77804
$$ 2814754 3792687 4411534 3154091 1000953 213771 969407 1514453 1334567 1512371
39279A512371L98677r34934j995833m85224J923001J857228k19557r12703K98686
$$ 1512371 1911048 976114 -1019719 -1504943 418058 2275286 2055729 1143026 1441712
39270A441712N52651r73525j555099J41470J640381Q83238n40019m61971L81577
$$ 1441712 1994363 1020838 -534261 -392791 1247590 2130828 1590809 1128838 1510415
39261A510415K34330n26118m56835L15118O50688M33592K57053N7787m01564n96704
$$ 1510415 1744745 1218627 761792 1076910 1727598 2161190 2418243 2476030 2074466 1477762
39251A477762j47629K27682j02635m61285k0187P34078R00351O42724N32524K52269
$$ 1477762 1330133 1557815 1455180 993895 973708 1707786 2608137 3250861 3783385 4035654
39241D035654o97285j640224j437354k01924Q32430R06681K91492m47151q92748
$$ 4035654 3338369 1698145 260791 58867 891297 1797978 2089470 1642319 749571
39232G49571p42570o7488N44876N83998J36613m09173p39433n81962L5496M25936
$$ 749571 7001 -60487 484389 1068387 1205000 795827 56394 -525568 -490072 -64136
39222f4136K4389m60892Q9515J099935P39310j033341j822649l07520J513949
$$ -64136 -39747 -500639 -411124 688811 1428121 394780 -1427869 -1735389 -221440
39213b21440J287669j15017j84234J164899J649320L72903r63573r39509l74142
$$ -221440 1066229 951212 766978 1931877 3581197 3954100 2990527 2051018 1676876
39204A676876n76499j227093j122502j10397P80323P97688L07101J70497O57534
$$ 1676876 1100377 -126716 -1249218 -1359615 -579292 218396 525497 695994 1353528
39195A353528J164203J040968M81652J94378L01555K42198j69414m51974m65906
$$ 1353528 2517731 3558699 4040351 4234729 4536284 4778482 4609068 4157094 3691188
39186C691188p02751j118700q12977L98358J220998O79167l65235o22893l05435
$$ 3691188 2988437 1869737 1056760 1455118 2676116 3355283 2990048 2367155 2061720
39177B061720l22301m85371q3097M69153K37188m60616n58583j33577r0763k96574
$$ 2061720 1739419 1254048 1170951 1640104 1877292 1416676 858093 724516 633753 337179
39167C37179J30791Q46432N78577n16155q12558J26970Q26563L79921k65491k75131
$$ 337179 467970 1314402 1892979 1376824 564266 691236 1517799 1897720 1632229 1357098
39157A357098l03934q60156j005597J725J165870J221978M95622k2973l73309
$$ 1357098 1053164 193008 -812589 -810864 355006 1576984 2072606 2049633 1676324
39148A676324r70377j218299l81353P84126Q44747j83068r14403o19632Q4380
$$ 1676324 705947 -512352 -893705 -109579 735168 552100 -362303 -981935 -897555
39139h97555M73462N14262M15093L06089L45513M11404o0703j133136j683512
$$ -897555 -424093 90169 505262 811351 1156864 1568268 1507565 374429 -1309083
39130a309083p39674Q31406J246855L23360k93035L96292J370514J225002R2934
$$ -1309083 -2048757 -1217351 29504 352864 59829 456121 1826635 3051637 3144571
39121C144571q03836q13253l52954j29571l59015o07888k87422M80651P13903
$$ 3144571 2340735 1527482 1174528 1044957 685942 78054 -209368 271283 985186
39112I85186j63025j201482j009520J90293P78819J47370m74357r0422N53230
$$ 985186 822161 -379321 -1388841 -1198548 -419729 -272359 -746716 -837138 -283908
39103b83908M39919K4757K36355O62106K40614p47242r49702j02984N37961J38736
$$ -283908 156011 180768 417123 1079229 1319843 572601 -377101 -480085 57876 196612
39093A96612n91602o17780Q6844Q71224J241569R46016N020q90939p62028L48946
$$ 196612 -394990 -1012770 -925926 -54702 1186867 2132883 2137903 1246964 484936 833882
39083H33882J125307O42528l40403m83900K51536P03635K21622o12884r81563
$$ 833882 1959189 2601717 2261314 1777414 2028950 2732585 2954207 2341323 1359760
39074A359760p88591m62868l60519n22296n95677K3779J417160K470135J776718
$$ 1359760 571169 108301 -252218 -774514 -1370191 -1346412 70748 2540883 4317601
39065D317601m09438j937314j242271N31867R78872k89073j201089l42788R68755
$$ 4317601 3908163 1970849 728578 1260445 2239317 1950244 749155 406367 1375122
39056A375122P17705q44652j757463j252681l85625Q8899O09442J189732P73117
$$ 1375122 2092827 1248175 -509288 -1761969 -2147594 -2058695 -1449253 -259521 513596
39047E13596q13420j834722r28191Q03671J449575R85920O61186O08529N2571
$$ 513596 -299824 -2134546 -3062737 -2259066 -809491 176429 837615 1446144 1498715
39038A498715o91141n92499m9582m13579j327935r23199R03864J860093P96255
$$ 1498715 807574 215075 165493 -248086 -1576021 -2499220 -1595356 264737 1060992
39029A060992m75177j90602P17378O13742j47623m24340m82279r15123q74857
$$ 1060992 585815 395213 1112591 1726333 1578710 1154370 672091 -243032 -1117889
39020a117889L34771J221272K07045j304811q07680J075429J357446m74635j626761
$$ -1117889 -783118 438154 645199 -659612 -1467292 -391863 965583 490948 -1135813
39011a135813m97544J077802J146267M37844L65003N63277J71566l11213k38312
$$ -1135813 -1633357 -555555 590712 1028556 1393559 1956836 2128402 1817189 1578877
39002A578877l38164j251570j871523r61525O34737J191160O44539K14553K35520
$$ 1578877 1240713 -10857 -1882380 -2843905 -2209168 -1018008 -373469 -158916 76604
38993G6604J41572M4296N25379J176618J030855K58173j33179r0964m00756r15112
$$ 76604 218176 262472 787851 1964469 2995324 3253497 3120318 3029354 2628598 1713486
38983A713486o56508K26049M20489k71961m46193M51814R71178O0126r48329l10670
$$ 1713486 1056978 1283027 1703516 1431555 985362 1437176 2408354 2468480 1520151 1209481
38973A209481J245307J425705k63183j796642j453209N8000Q56603L05425n92483
$$ 1209481 2454788 3880493 3617310 1820668 367459 425459 1282062 1587487 995004
38964I95004p31492j21251L97311K35325l05281m34075J41061P99282P57865N9659
$$ 995004 263512 142261 539572 774897 469616 35541 176602 975884 1733749 1793408
38954A793408n70374p64170q15312p96506j33565J282418K129744R50084j554928
$$ 1793408 1223034 458864 -356448 -1152954 -1286519 -4101 2125643 3075727 1520799
38945A520799k724560j080630J640457K584494J311079n2286j2998M62321j02257
$$ 1520799 -1203761 -2284391 -643934 1940560 3251639 3199353 3186355 3648676 3546419
38936C546419j224799j201229K53677J455217R77870n77480j515560j103472r9214
$$ 3546419 2321620 1120391 1374068 2829285 3807155 3229675 1714115 610643 511429
38927E11429M57506L38794l4549l30346m99659m07254K36644J303493J887608
$$ 511429 968935 1307729 1273180 942834 443175 35921 272565 1576058 3463666
38918C463666J075263p78675k033018j493297Q4020Q40578J52575o43695k11881
$$ 3463666 4538929 3760254 1727236 233939 317959 1158537 1311112 667417 455536
38909D55536Q74613J039823P8173n75035l8910P62308O06132l10744j014165j229283
$$ 455536 1330149 2369972 2448145 1873110 1834200 2596508 3202640 2891896 1877731 648448
38899F48448j128523l80762J115346K069072J121058p62935j110542N08693J685013
$$ 648448 -480075 -860837 254509 2323581 3444639 2681704 1571162 2079855 3764868
38890C764868O99033j028038j279001k09157M69782K39799j02182k30167l94020
$$ 3764868 4463901 3435863 2156862 1947705 2417487 2657286 2555104 2324937 1930917
38881A930917l05316L76103Q93926L89632l97407j67005O10525L52403q50974
$$ 1930917 1625601 2001704 2895630 3285262 2887855 2720850 3331375 3683778 2832804
38872B832804j230066k51237N81535K82200k79720k79473k84801p92275j074626
$$ 2832804 1602738 1351501 1933036 2215236 1935516 1656043 1371242 578967 -495659
38863d95659n23167K21199M15457K86127K11258Q9193J33381Q39363J546214P75460
$$ -495659 -1018826 -797627 -382170 -96043 115215 204408 337789 1177152 2723366 3498826
38853C498826j166498j893701m41984J001745N15092m81892J81546J531306J024449
$$ 3498826 2332328 438627 -3357 998388 1513480 1031588 1213134 2744440 3768889
38844C768889j028697j742488j55635J467968J271678J97257j41256R7057j30076
$$ 3768889 2740192 997704 842069 2310037 3581715 3778972 3637716 3734773 3604697
38835C604697q47467j265646j040779m24445K89298Q55435J036991Q45083N14487
$$ 3604697 2757230 1491584 450805 26360 315658 1171093 2208084 3053167 3567654
38826C567654J73628j23415k28922k21378n00139r53732o52536O88083J628389
$$ 3567654 3741282 3617867 3388945 3167567 2667428 1713696 1061160 1749243 3377632
38817C377632P61639r40283j223611J59685J104798L36428r07572j031244k75170
$$ 3377632 4139271 3198988 1975377 2135062 3239860 3576288 2668716 1637472 1362302
38808A362302J97413J01106j22984k68207k43776J66531O65221M52046m10445
$$ 1362302 1559715 1660821 1537837 1269630 1025854 1192385 1857606 2309652 1899207
38799A899207o76013J88914R04647K88313p90228p60753J78705N47711K837m00683
$$ 1899207 1223194 1412108 2316755 2605068 1814840 1054087 1232792 1780503 1783340 1382657
38789A382657j19665L47063P73970J393480J666915O38740j096166j603520n12219
$$ 1382657 1262992 1610055 2384025 3777505 5444420 6083160 4986994 3383474 2871255
38780B871255J41987q78588j796187n81522J555548J797109J7608j163729n06337
$$ 2871255 3013242 2134654 338467 -243055 1312493 3109602 3127210 1963481 1457144
38771A457144L45882M1000l68262K39460Q08728N3374r70674m18198J186854J585384
$$ 1457144 1803026 1844026 1475764 1715224 2523952 2577326 1606652 1188454 2375308 3960692
38761C960692K06974j116028r31937J23969P36445N31409j50310q76457j081477
$$ 3960692 4167666 3051638 2119701 2243670 2980115 3511524 3361214 2484757 1403280
38752A403280m11613N41689P36630R7520m51886m11678j32973J78360O59097Q87172
$$ 1403280 991667 1533356 2269986 2367506 1915620 1503942 1370969 1549329 2208426 3095598
38742C095598J61721r99520j050817L45759J575855J256604J8552o50404l56533
$$ 3095598 3257319 2257799 1206982 1552741 3128596 4385200 4403752 3753348 3396815
38733C396815J68772K10333l83309j161749j255536l08104P14348O13655k11028
$$ 3396815 3565587 3775920 3392611 2230862 975326 667222 1381570 1995225 1784197
38724A784197l35350L45132N32507n4470j62425N72776P60885k85586j193132
$$ 1784197 1448847 1793979 2326486 2272016 2109591 2682367 3443252 3157666 1964534
38715A964534p46744L08584Q07124P76213M61969l93279j230454p08738P70331
$$ 1964534 1217790 1526374 2333498 3109711 3571680 3178401 1947947 1239209 2009540
38706B009540R41038n37739r36464R80289K267779M34895k095752j703856N97295
$$ 2009540 2950578 2412839 1476375 2456664 4724443 5159338 3063586 1359730 1957025
38697A957025J122669l84474r92044N9704O50515J10337N0292P50136O41419k77049
$$ 1957025 3079694 2695220 1703176 1762880 2413395 2523732 2574024 3324160 3965579 3688530
38687C688530k42433O55406L70876j082500j311911N3912N55606m88611n83920
$$ 3688530 3446097 4101503 4472379 3389879 2077968 2131880 2687486 2198875 1614955
38678A614955J242816K299364P78801j208701j451316j050725j457054j372056
$$ 1614955 2857771 5157135 5935936 4727235 3275919 2225194 768140 -603916
38670f03916L68867J720155O17476j102434n08690J531161J870328J81016j051025
$$ -603916 -235049 1485106 2102582 1000148 491458 2022619 3892947 4073963 3022938
38661C022938q42763n65002p57358l39440P43092R21149k76523j159768m02122
$$ 3022938 2180175 1615173 857815 518375 1261467 2182616 1906093 746325 344203
38652C44203J019120J295343J66091q99566m94974J021893J683787K53657j718674
$$ 344203 1363323 2658666 2824757 1925191 1430217 2452110 4135897 4389554 2670880
38643B670880j462633J095013K759371J366989j220642j992856r48283k57793
$$ 2670880 1208247 2303260 5062631 6429620 5208978 3216122 2267839 2010046
$$ [...]
##END NTUPLES=NMR SPECTRUM
##END=
