##TITLE=31Pdec_LR-685A-OC1
 CDcl3, 24 sc
 30.7.2019
##JCAMPDX= 6.0         $$ Bruker NMR JCAMP-DX V2.0
##DATA TYPE= NMR SPECTRUM
##DATA CLASS= NTUPLES
##ORIGIN= UXNMR, Bruker Analytische Messtechnik GmbH
##OWNER= root
$$ XWIN-NMR		Version 3.5
$$ Tue Jul 30 15:03:58 2019 Russian Standard Time (UT+4h)  she@DPX200
##.OBSERVE FREQUENCY= 81.013821
##.OBSERVE NUCLEUS= ^31P
##.ACQUISITION MODE= SIMULTANEOUS
##.ACQUISITION SCHEME= undefined
##.AVERAGES= 24
##.DIGITISER RES= 17
##SPECTROMETER/DATA SYSTEM= spect
##.PULSE SEQUENCE= zgpg30
##.SOLVENT NAME= CDCl3
##.SHIFT REFERENCE= (INTERNAL, CDCl3, 0, 182.463)
##AUDIT TRAIL= $$ (NUMBER, WHEN, WHO, WHERE, WHAT)
$$ ##TITLE= Audit trail, XWIN-NMR		Version 3.5
$$ ##JCAMPDX= 5.01
$$ ##ORIGIN= Bruker BioSpin GmbH
$$ ##OWNER= she
$$ F:/spectra/data/she/nmr/P31/1/pdata/1/auditp.txt
$$ ##AUDIT TRAIL=  $$ (NUMBER, WHEN, WHO, WHERE, WHAT)
(   1,<2019-07-30 15:03:12.45 +0400>,<she>,<DPX200>,
      <created by zg, POWCHK disabled, PULCHK disabled
       configuration hash MD5:
       00 E9 B6 7A A2 85 ED C7 34 08 36 98 17 FE 4E 26
       data hash MD5: 32K
       05 2D 55 3B E9 7B 57 14 8A C0 81 83 DF DF B0 C8>)
(   2,<2019-07-30 15:03:15.01 +0400>,<she>,<DPX200>,
      <Start of raw data processing
       efp BC_mod = 2 LB = 1 FT_mod = 6 PKNL = 1 PHC0 = -407.4433 PHC1 = 101.2 SI = 64K 
       data hash MD5: 64K
       F2 07 E5 82 59 AC A1 8D D0 C1 46 5B 0D 2D 22 CD>)
(   3,<2019-07-30 15:03:27.75 +0400>,<she>,<DPX200>,
      <pk PHC0 = 12.90828 PHC1 = 0 
       data hash MD5: 64K
       E3 F2 5F AA 39 9B 8B B3 36 1D 81 4A 45 9D 0F D4>)
(   4,<2019-07-30 15:03:35.85 +0400>,<she>,<DPX200>,
      <abs ABSG = 5 
       data hash MD5: 64K
       4C 54 AC 04 A5 D0 35 C8 CD A1 86 2B 14 95 6E D2>)
$$ ##END=
$$ 
$$ hash MD5
$$ 42 B0 A3 AB 6F 6F 70 1B 88 C4 B4 75 7F 39 DB 35
##$RELAX= 
##$RELAX= 
##$RELAX= 
##$RELAX= 
##$RELAX= 
##$RELAX= 
##$RELAX= 
##$RELAX= 
$$ Bruker specific parameters
$$ --------------------------
##$DU= <F:/spectra>
##$EXPNO= 1
##$NAME= <P31>
##$PROCNO= 1
##$TYPE= <nmr>
##$USER= <she>
##$AMP= (0..31)
100 100 100 100 100 100 100 100 100 100 100 100 100 100 100 100 100 100 
100 100 100 100 100 100 100 100 100 100 100 100 100 100 
##$AQSEQ= 0
##$AQ_mod= 1
##$AUNM= <au_zg>
##$AUTOPOS= <>
##$BF1= 81.014009
##$BF2= 200.13
##$BF3= 200.13
##$BF4= 200.13
##$BF5= 200.13
##$BF6= 200.13
##$BF7= 200.13
##$BF8= 200.13
##$BYTORDA= 1
##$CFDGTYP= 0
##$CFRGTYP= 5
##$CHEMSTR= <none>
##$CNST= (0..31)
1 1 145 1 1 1 1 1 1 1 1 1 1 1 1 1 1 1 1 1 1 1 1 1 1 1 1 1 1 1 1 1 
##$CPDPRG= <waltz16>
##$CPDPRG1= <>
##$CPDPRG2= <waltz16>
##$CPDPRG3= <>
##$CPDPRG4= <mlev>
##$CPDPRG5= <mlev>
##$CPDPRG6= <mlev>
##$CPDPRG7= <mlev>
##$CPDPRG8= <mlev>
##$CPDPRGB= <>
##$CPDPRGT= <>
##$D= (0..31)
0 1 0 0 0 0 0 0 0 0 0 0.03 2e-05 3e-06 0 0 0 0 0 0 0 0 0 0 0 0 0 0 0 0 
0 0 
##$DATE= 1564484591
##$DBL= (0..7)
120 120 120 11 120 120 24 19 
##$DBP= (0..7)
150 150 150 150 150 150 150 150 
##$DBP07= 0
##$DBPNAM0= <>
##$DBPNAM1= <>
##$DBPNAM2= <>
$$ [...]
##$SUBNAM3= <"">
##$SUBNAM4= <"">
##$SUBNAM5= <"">
##$SUBNAM6= <"">
##$SUBNAM7= <"">
##$SUBNAM8= <"">
##$SUBNAM9= <"">
##$SW= 369.568048894756
##$SWIBOX= (0..15)
0 1 3 0 0 0 0 0 0 0 0 0 0 0 0 0 
##$SW_h= 29940.119760479
##$TD= 32768
##$TD0= 1
##$TE= 0
##$TE2= 300
##$TE3= 300
##$TEG= 300
##$TL= (0..7)
0 120 53 12 22 120 120 120 
##$TP= (0..7)
150 150 150 150 150 150 150 150 
##$TP07= 0
##$TPNAME0= <>
##$TPNAME1= <>
##$TPNAME2= <>
##$TPNAME3= <>
##$TPNAME4= <>
##$TPNAME5= <>
##$TPNAME6= <>
##$TPNAME7= <>
##$TPOAL= (0..7)
0.5 0.5 0.5 0.5 0.5 0.5 0.5 0.5 
##$TPOFFS= (0..7)
0 0 0 0 0 0 0 0 
##$TUNHIN= 0
##$TUNHOUT= 0
##$TUNXOUT= 0
##$USERA1= <user>
##$USERA2= <user>
##$USERA3= <user>
##$USERA4= <user>
##$USERA5= <user>
##$V9= 5
##$VALIST= <valist>
##$VCLIST= <CCCCCCCCCCCCCCC>
##$VD= 0
##$VDLIST= <DDDDDDDDDDDDDDD>
##$VPLIST= <PPPPPPPPPPPPPPP>
##$VTLIST= <TTTTTTTTTTTTTTT>
##$WBST= 1024
##$WBSW= 4
##$XGAIN= (0..3)
0 0 0 0 
##$XL= 0
##$YL= 0
##$YMAX_a= 27951
##$YMIN_a= -29115
##$ZGOPTNS= <>
##$ZL1= 120
##$ZL2= 120
##$ZL3= 120
##$ZL4= 120
##$ABSF1= 182.463
##$ABSF2= -187.1042
##$ABSG= 5
##$ABSL= 3
##$ALPHA= 0
##$AQORDER= 0
##$ASSFAC= 0
##$ASSFACI= 0
##$ASSFACX= 0
##$ASSWID= 0
##$AUNMP= <proc_1d>
##$AZFE= 0.1
##$AZFW= 0.5
##$BCFW= 0
##$BC_mod= 2
##$BYTORDP= 0
##$COROFFS= 0
##$CY= -3
##$DATMOD= 1
##$DC= 0
##$DFILT= <>
##$DTYPP= 0
##$F1P= 0
##$F2P= 0
##$FCOR= 1
##$FTSIZE= 65536
##$FT_mod= 6
##$GAMMA= 0
##$GB= 0
##$INTBC= 1
##$INTSCL= 5.30512e-09
##$ISEN= 30
##$LB= 1
##$LEV0= 0
##$LPBIN= 0
##$MAXI= 10000
##$MC2= 0
##$MEAN= 0
##$ME_mod= 0
##$MI= 50
##$NCOEF= 0
##$NC_proc= -6
##$NLEV= 6
##$NOISF1= 182.463
##$NOISF2= 159.3651
##$NSP= 0
##$NTH_PI= 0
##$NZP= 0
##$OFFSET= 182.463
##$PC= 4
##$PHC0= -394.535
##$PHC1= 101.2
##$PH_mod= 1
##$PKNL= yes
##$PPARMOD= 0
##$PSCAL= 0
##$PSIGN= 0
##$REVERSE= no
##$SF= 81.0140089999434
##$SI= 65536
##$SIGF1= 159.3651
##$SIGF2= -187.1042
##$SINO= 113.3802
##$SIOLD= 16384
##$SREGLST= <1H.CDCl3>
##$SSB= 0
##$STSI= 65536
##$STSR= 0
##$SW_p= 29940.119760479
##$SYMM= 0
##$S_DEV= 0
##$TDeff= 32768
##$TDoff= 0
##$TI= <>
##$TILT= no
##$TM1= 0
##$TM2= 0
##$TOPLEV= 0
##$USERP1= <user>
##$USERP2= <user>
##$USERP3= <user>
##$USERP4= <user>
##$USERP5= <user>
##$WDW= 1
##$XDIM= 65536
##$YMAX_p= 415448000
##$YMIN_p= -11977061
$$ End of Bruker specific parameters
$$ ---------------------------------
##NTUPLES= NMR SPECTRUM
##VAR_NAME=  FREQUENCY,     SPECTRUM/REAL,   SPECTRUM/IMAG
##SYMBOL=    X,             R,               I
##VAR_TYPE=  INDEPENDENT,   DEPENDENT,       DEPENDENT
##VAR_FORM=  AFFN,          ASDF,            ASDF
##VAR_DIM=   65536,         65536,           65536
##UNITS=     HZ,            ARBITRARY UNITS, ARBITRARY UNITS
##FACTOR=    0.456856943014862, 1,           1
##FIRST=     14782.0589164792, 0,            0
##LAST=      -15158.0608439998, 0,           0
##MIN=       -15158.0608439998, -11977061,   0
##MAX=       14782.0589164792, 415448000,    0
$$ Real data points
##PAGE= N=1
##DATA TABLE= (X++(R..R)), XYDATA
$$ [...]
47988 1633483 2117158 1834473 238835 -825716 118836 1935004 2452846 1136724 -820585
47979 -820585 -2166447 -2414235 -1700949 -739976 -512937 -1299022 -2263201 -2432453 -1738095
47970 -1738095 -773503 38477 702515 1499761 2840326 4794641 6553941 6930024 5699511
47961 5699511 3949095 2862423 2719412 3218548 3969715 4331111 3609941 1959616 384059
47952 384059 -576610 -1316091 -1835452 -1105822 1212986 3373349 3303693 1356644 -80981
47943 -80981 404126 1918069 2973153 3215132 3029620 2565526 1933380 1711550 2402341
47934 2402341 3535718 3905700 2825990 915448 -512190 -797585 -470729 -283901 -65066
47925 -65066 816197 2010436 2336340 1721279 1701408 3007313 3837703 2166362 -920489
47916 -920489 -2183250 -524148 1588872 1477700 -659583 -2780623 -3573650 -2932706 -1174187
47907 -1174187 839017 1637780 585585 -1086300 -1776026 -1544228 -1575265 -2182808 -2689598
47898 -2689598 -2952283 -3516787 -4207860 -3961166 -2442844 -734093 73078 102746 80511
47889 80511 241918 322713 82811 -515805 -1209406 -1383726 -708841 123836 87989 -613199
47879 -613199 -624561 566487 1726973 1585086 502354 -384961 -869687 -1464122 -2089333
47870 -2089333 -2221550 -2127416 -2706623 -3924926 -4456345 -3392945 -1652297 -1069177 -2289467
47861 -2289467 -4012514 -4433312 -3263878 -2015989 -2100961 -3072444 -3446994 -2987583 -2894051
47852 -2894051 -3414770 -2837546 -90466 2800989 2658000 -797801 -4478273 -5526413 -3946670
47843 -3946670 -1584402 -6757 247796 -282617 -143317 1638807 3874707 4191256 2128186
47834 2128186 -222122 -1292448 -1994761 -3449423 -4552378 -3698569 -1696317 -757452 -1195002
47825 -1195002 -1295143 -267138 810843 1170216 1466871 2168189 2568287 2180534 1646392
47816 1646392 1423570 908341 -148114 -529484 905852 3296592 4505253 3390129 645975
47807 645975 -2059535 -3104424 -1774715 966884 3020168 3214163 2377232 1770530 1315334
47798 1315334 346291 -753382 -1070452 -726773 -361363 531575 2845266 5427647 5555714
47789 5555714 2616779 -543892 -1177581 -787 518250 -70501 -211720 546713 824908
47780 824908 9001 -576356 8048 559372 -310253 -1678574 -1527508 59861 719989
47771 719989 -966786 -3556919 -4676307 -3744020 -1887403 16649 1982100 3837287
47763 3837287 4753707 4277458 3087936 2165685 1617887 905215 -6096 -448489 -171768
47754 -171768 -22843 -935176 -2474752 -3074658 -1895655 71628 1144769 832499 89259
47745 89259 -81670 352361 843315 1041281 929194 631747 384202 359629 299793 -303966
47735 -303966 -1386952 -2075617 -1673224 -569834 241526 299889 -54126 -252630 83452
47726 83452 993891 1932290 1960155 800438 -526815 -810771 -240118 -105588 -943611 -1859739
47716 -1859739 -1921090 -1389769 -1121006 -1387892 -1868719 -2332561 -2696158 -2642673 -1847977 -660129
47706 -660129 -67552 -680227 -1900928 -2451173 -1836811 -985822 -1074118 -1999877 -2735275 -3068973
47696 -3068973 -3822681 -4939405 -4783300 -2516030 16745 504091 -510988 -641005 393229
47687 393229 364498 -1552829 -3169735 -2811993 -2068012 -3074004 -4884356 -4923225 -2934088
47678 -2934088 -1033764 -370675 -87051 484929 812979 665654 701513 1031692 843525
47669 843525 46995 -250400 344558 551170 -669093 -2398484 -3047810 -2509148 -1976704
47660 -1976704 -2241804 -3143607 -4219469 -4904580 -4390811 -2309967 390088 2013578 1788190
47651 1788190 565443 -244001 -87035 498197 771571 621309 467115 525812 465216 -124291
47641 -124291 -1179192 -2264054 -2966817 -3015508 -2393157 -1649274 -1631046 -2418725 -2988102 -2541033
47631 -2541033 -1694369 -1576150 -2210245 -2773969 -3068986 -3534251 -3977177 -3631321 -2605278
47622 -2605278 -2017886 -2388296 -3006587 -3217310 -3221031 -3223895 -2878554 -2035374 -1091416 -235049
47612 -235049 670859 1251190 939168 440162 1322397 3485849 4619465 3173382 438917
47603 438917 -1464990 -2269607 -2857203 -3214002 -2794647 -2020019 -1713728 -1657443 -1182835 -544906
47593 -544906 -249728 219506 1342187 1947252 620607 -1653739 -2284908 -527913 1636570
47584 1636570 2217133 1239557 -41810 -484336 440582 2079099 2636122 1245036 -366722
47575 -366722 -123516 909637 -226205 -3581545 -5618073 -4192893 -1477067 -430968
47567 -430968 -843106 -890956 -607314 -1264865 -2502021 -2586482 -1165486 246357 464582
47558 464582 -146062 -570634 -167696 952006 1695062 700624 -1767618 -3423940 -2640766
47549 -2640766 -724776 -88245 -899053 -1347479 -859761 -1005906 -2873544 -5193095 -5826050
47540 -5826050 -4169793 -1550636 148766 -7460 -1355547 -2370938 -2349421 -2010835 -2035530
47531 -2035530 -1801484 -528200 1059407 1562486 972070 433764 152900 -876279 -2856360
47522 -2856360 -4328508 -3841386 -1545372 1197180 3046342 3449687 2912929 2458824 2232963
47513 2232963 1196715 -910609 -2259793 -1200241 924685 1355943 -89877 -1047090
47505 -1047090 -578102 -354965 -1323221 -2050545 -1579997 -1230080 -1900095 -2071225 -559032
47496 -559032 985510 782604 169215 1234345 2721909 1660212 -1628650 -3595081 -2639218
47487 -2639218 -1038735 -995601 -1617773 -1178694 -154658 -274505 -1840123 -3478734 -3853069
47478 -3853069 -2637153 -415482 1620048 2373414 1815455 932197 575247 885040 1774298
47469 1774298 3127612 4421519 4947145 4513847 3327742 1493594 -475015 -1227056 -96542
47460 -96542 1334823 952003 -794307 -1511679 -607513 -18725 -714248 -1098883 -84807
47451 -84807 772705 15514 -1002335 -369681 1103786 1320533 374943 58329 697870
47442 697870 1017938 707109 690816 1034582 897724 529973 992878 1765041 1022086 -1237055
47432 -1237055 -2674211 -1993686 -681321 -386954 -638832 -456513 -363471 -1146506 -2043215
47423 -2043215 -1882404 -960280 -151254 873332 2728194 4329427 3887234 1805850 684026
47414 684026 1924529 3811550 3799506 1766761 -24722 102358 1247023 1256836 -426095
47405 -426095 -2040126 -1865810 -501240 116891 -571400 -1388900 -1658106 -2059493 -2750515
47396 -2750515 -2477379 -813449 272067 -1093036 -3606540 -4265298 -2499008 -744058
47388 -744058 -797934 -1635712 -1538522 -677243 -374264 -849929 -1043982 -362512 416441 142549
47378 142549 -1230143 -2351780 -1713519 728323 3335923 4436318 3905290 2748796 1598166
47369 1598166 418634 -590007 -875178 -433094 67104 285346 585254 1241333 2058129
47360 2058129 2967438 4142721 5197734 5130252 3579958 1507547 163219 -104360 272008
47351 272008 738644 828151 362180 -195381 -188042 220259 247676 -134512 -125114 248072 -237829
47340 -237829 -1858444 -2768268 -1307170 1514457 3397033 3925987 4605761 5995023 6657445
47331 6657445 5322741 2660446 322786 -810025 -994986 -1025437 -1560907 -2394109 -2368946
47322 -2368946 -859590 814917 704240 -950366 -1723040 -382405 1254948 886916 -1105726
47313 -1105726 -2434998 -2038446 -944698 -383459 -449415 -646822 -592464 -20725 958911
47304 958911 1432709 372985 -1979323 -4107479 -4795741 -4095998 -2662832 -992918 345748
47295 345748 589152 -434502 -1850023 -2655102 -2806779 -2955784 -3430035 -3975773 -4282753
47286 -4282753 -4314178 -4264913 -4503187 -5257141 -5972030 -5380071 -2861209 470305 2720040
47277 2720040 3176223 2684837 2211599 1917489 1753452 1942848 2358709 2241009 1228929
47268 1228929 75010 -376122 -372055 -615944 -976603 -869992 -570280 -876744 -1503698 -1166707
47258 -1166707 361236 1575387 1325569 439854 267657 541528 16910 -1308902 -2130338
47249 -2130338 -1936047 -1728576 -2264404 -2831521 -2509631 -1684019 -1321629 -1331392 -768374 475296
47239 475296 1264711 782995 -352025 -1070614 -1328548 -1819937 -2537499 -2637650 -1919152
47230 -1919152 -1411824 -1775420 -1905051 -335320 2263629 3460969 2289962 715002 957570
47221 957570 2438387 2743064 1051413 -943847 -1497891 -699045 522039 1945736 3711023
47212 3711023 5191394 5282107 3706435 1444596 -141095 -391477 223630 560700 -62242
47203 -62242 -1052479 -1213764 -310693 600340 628152 134901 -127398 -270640 -793865 -1244305
47193 -1244305 -434614 1847479 4179348 4995177 4274660 3285283 2889905 2660539 1816183
47184 1816183 611901 227347 1216045 2674212 3406541 3386472 3234603 2635842 622291
47175 622291 -2337490 -3987287 -2963307 -784275 38678 -866939 -1907269 -2334443 -3078744
47166 -3078744 -4511654 -5092108 -3321363 -119221 1943987 1555626 -47202 -709399 334818
47157 334818 2007708 2891107 2769852 2539900 2852220 3392569 3681288 4000218 4940741
47148 4940741 6350357 7387476 7479581 6648158 5112643 3324206 2229733 2551032 3692302
47139 3692302 4248941 3793480 3246028 3177921 2778648 1182343 -953348 -2026296 -1253222
47130 -1253222 772421 2939669 4455877 5070583 4993007 4571255 3931583 3116964 2409773
47121 2409773 1920435 1041728 -667266 -2061646 -1333536 1150518 2564706 1302804 -509446
47112 -509446 185760 3120732 5152146 4347121 1647459 -1202961 -3246105 -3734431 -2187868
47103 -2187868 224749 1109039 -425502 -2754322 -4083495 -4340563 -4032242 -2978989 -1443029
47094 -1443029 -934702 -2169438 -3340618 -2327242 68082 1034808 -387301 -2286636
47086 -2286636 -2811002 -2285622 -1868574 -1670536 -1169619 -464519 -76725 -8237 180943 554904
47076 554904 604286 -184062 -1781215 -3520610 -4502655 -4338124 -3518778 -2836455 -2567845
47067 -2567845 -2542023 -2702997 -2993154 -2924327 -2125574 -1281035 -1530672 -2705293 -3164846 -1925726
47057 -1925726 -101286 489550 -482214 -1796776 -2305911 -1794524 -608838 634690 1069827
47048 1069827 219890 -1168013 -1561434 -206196 2106838 3957818 4592834 4188369 3291913
47039 3291913 2373909 1763767 1677146 2143674 2861026 3171807 2466817 893305 -468514
47030 -468514 -512790 748043 2204557 2834602 2558050 1862521 1041610 197660 -241051
47021 -241051 388185 2106688 3808173 4100811 2742645 954539 76346 123264 48030
47012 48030 -689170 -1425154 -1382312 -826738 -534746 -494254 -1869 955748 1340954 490169
47002 490169 -842476 -1522612 -1576352 -1840893 -2390656 -2382848 -1558060 -786446 -606980 -204939
46992 -204939 1246468 2918771 3211356 2067602 1175128 1728116 3138624 4304602 4959411
46983 4959411 5067860 4018334 1606304 -852388 -1710700 -1055896 -424644 -588110 -846830
46974 -846830 -612989 -399811 -767579 -1357077 -1627352 -1737797 -2010981 -2155148 -1684856 -639486
46964 -639486 610503 1719019 2095175 1069921 -970646 -2381505 -2096756 -1033951 -678647
46955 -678647 -953125 -795909 -300286 -538814 -1328856 -1092893 496421 1519990 567523
46946 567523 -954881 -795964 828343 1686957 922477 122980 711643 1892113 2051684
46937 2051684 1088922 234152 148491 326047 244263 141432 462831 1196326 2003394 2534402
46927 2534402 2420126 1433562 -51071 -1166869 -1455432 -1333350 -1364517 -1479301 -1351472
46918 -1351472 -1146934 -1284186 -1717487 -2118151 -2539990 -3122865 -3302694 -2315888 -570086
46909 -570086 567191 673263 848901 1797223 2459340 1601703 -83670 -764736 68130
46900 68130 1193843 1542625 1241792 717680 -35657 -903860 -1315816 -978465 -319220 204424
46890 204424 702216 1412597 2131735 2405921 1982910 958308 -153803 -527598 225073
46881 225073 1380810 1816257 1435517 1149658 1372023 1480990 1061313 650321 685976 666953
46871 666953 126350 -421410 -482561 -804273 -2337182 -4332383 -4820573 -3114973 -752405
46862 -752405 354078 -199045 -1621940 -3223958 -4668476 -5478909 -5176440 -3945506 -2647454
46853 -2647454 -2022778 -2095176 -2352004 -2258055 -1603080 -667770 -124132 -399296 -946939 -620612
46843 -620612 768720 1748414 914129 -861031 -1191729 567091 2217888 1750341 204210
46834 204210 22365 1396202 2166345 1186526 -152144 -174768 932490 1939340 2255090
46825 2255090 2064881 1825960 2203969 3441920 4324324 3107303 150291 -1874939 -1399700
46816 -1399700 -96354 -312672 -1827786 -2840836 -2900127 -2760760 -2256915 -730301 792953
46807 792953 343688 -1840692 -3143735 -2123296 -265739 567884 588812 896380 1446094
46798 1446094 1574217 1406648 1326792 811954 -814415 -2897352 -3961698 -3545867 -2506490
46789 -2506490 -1588731 -687160 337911 998721 784674 -69819 -875551 -1289676 -1406104
46780 -1406104 -1189816 -390685 782219 1447785 1068095 330668 266758 693844 509323
46771 509323 -505538 -1426539 -1966998 -2989985 -4535673 -4982037 -3460325 -1622757 -1285458
46762 -1285458 -1590841 -624821 1179273 1797374 1172054 1158896 1950977 1541655 -655130
46753 -655130 -2538606 -2777237 -2839281 -4044975 -5077476 -4439453 -3292843 -3458406 -4144369
46744 -4144369 -3268671 -1101322 8933 -752226 -1620135 -993591 585809 1568184 1189961
46735 1189961 -211862 -1738059 -2534686 -2437089 -1989706 -1543571 -864439 -6556 347903
46726 347903 89285 148937 848348 954347 -384620 -1919810 -2068369 -1378020 -1428842 -2091150
46716 -2091150 -1901348 -702865 128412 -74758 -695113 -1402396 -2428438 -3245015 -2826202
46707 -2826202 -1451629 -589187 -807011 -1383666 -1986939 -2901776 -3490563 -2495267 -306440
46698 -306440 1083109 995433 943533 1837809 2404288 1546541 376306 393437 1156186 1317832
46688 1317832 762458 177150 -489952 -1620340 -2742025 -3148324 -3087084 -3139501 -3082525 -2557836
46678 -2557836 -2173997 -2614521 -3181741 -2616079 -1122214 -358380 -1447937 -3856339 -6048498
46669 -6048498 -6546973 -4775573 -1723661 618400 1327636 1593905 2842544 4483993 4786775
46660 4786775 3510252 2127121 1494018 909121 -90680 -455451 878302 3080934 4166286
46651 4166286 3433964 2262703 2260819 3270489 3759608 2931151 1656887 1069299 1020575
46642 1020575 696036 185057 305593 1049296 1445753 1095533 613474 296710 -311228
46633 -311228 -1065203 -881134 421350 1300458 633672 -481464 -344570 899913 1809780
46624 1809780 1844647 1562798 1208630 569743 -112178 -393782 -500080 -838163 -1122134 -1109369
46614 -1109369 -1495992 -2660942 -3281207 -2026755 -103371 8289 -1821954 -3231543 -2985958
46605 -2985958 -2401754 -2598384 -2712481 -1967424 -1364363 -1721213 -1789533 -238534 1786297
46596 1786297 2210581 1356045 1500491 3294586 4755262 4292513 2936681 2553125 3070705
46587 3070705 2781408 860303 -1659571 -3436747 -4283986 -4620654 -4248077 -2585243 37870
46578 37870 2204646 2805377 2036989 770074 -465287 -1513809 -2296302 -3033185 -4156510
46569 -4156510 -5354389 -5357986 -3557000 -1266485 -321380 -799564 -1272295 -991986 -502988
46560 -502988 -174646 422063 1396028 2068470 2083099 1954010 2080655 2153890 1934628 1715214
46550 1715214 1617247 1294134 655647 -18336 -948097 -2735741 -4936057 -5888691 -4678834
46541 -4678834 -2373535 -676276 -178737 -466704 -996576 -1221415 -765916 -156020 -514184
46532 -514184 -1927653 -3066126 -3003789 -2311488 -1685503 -844733 245097 488385 -620210
46523 -620210 -1648575 -1239393 -426577 -1085015 -2842579 -3581979 -2654257 -1587240 -1639047
46514 -1639047 -2494963 -3508472 -4474857 -4901150 -4158889 -2755892 -1968537 -1873558 -1287000
46505 -1287000 -32383 456297 -523118 -1685132 -1817728 -1566297 -1974183 -2630296 -2694292
46496 -2694292 -2590212 -3023997 -3204041 -1921368 31603 447860 -1216396 -3051041 -3332011
46487 -3332011 -2434434 -1538133 -849176 -81868 349720 -153282 -1174913 -1651742 -1189267
46478 -1189267 -175868 1111438 2550232 3499541 3232203 2237016 2003712 3000124 3781435
46469 3781435 2854972 741239 -702681 -578858 327649 876446 751984 380533 399348
46460 399348 1156266 2112193 1964315 163224 -1923830 -2383014 -1200877 -193886 -425613
46451 -425613 -998585 -791213 -98878 140043 -320962 -1216291 -2325746 -3116540 -2784266
46442 -2784266 -1476137 -588758 -1006609 -1895199 -2022744 -1272184 7478 1870681 3754372
46433 3754372 3907628 1604674 -1006976 -1194136 826862 2505481 2539477 1785735 993843
46424 993843 -52033 -1096089 -1373724 -1293083 -1999129 -2949175 -2295948 -274837 409959
46415 409959 -1249609 -2606528 -1392889 566757 137126 -2253955 -3332459 -1782775
46407 -1782775 397610 1234489 994748 659497 306982 -109664 50916 1082426 2077758
46398 2077758 2083588 1473181 1315426 1771098 1942169 1268357 410360 451349 1515333 2581024
46388 2581024 2712596 2098653 1554139 1274797 648160 -715283 -2298657 -3146276 -2658003
46379 -2658003 -980842 947678 1942464 1797121 1716641 2658076 3570018 2642566 269343
46370 269343 -971936 175246 1895392 2051691 1078280 678341 955937 706427 -170406
46361 -170406 -457608 340787 1335725 1708770 1554610 1111635 208376 -1249637 -2890532
46352 -2890532 -4070404 -4151570 -2989519 -1535562 -1205946 -2030798 -2394932 -1472781 -673762
46343 -673762 -1311337 -2162547 -1391474 80959 -296321 -2551399 -3910862 -2994257 -1641812
46334 -1641812 -1682181 -2274102 -1808267 -478912 633448 1503011 2505025 2972643 2089583
46325 2089583 507354 -355048 -87557 767033 1849867 2854473 2949711 1746122 420362
46316 420362 475513 1571424 1920907 848972 -302933 -85391 1279180 2435892 2476792
46307 2476792 1558989 440682 -223311 -387684 -640266 -1560082 -2981540 -4065369 -4136300
46298 -4136300 -3308822 -2238360 -1329152 -313435 1193455 2755241 3274040 2488195 1727009
46289 1727009 2331024 3713688 4126678 3200294 2345379 2413071 2428077 1325161 -315896
46280 -315896 -1193706 -1014000 -456291 -235438 -889519 -2526518 -4029243 -3669753 -1520174
46271 -1520174 -56784 -1078052 -3142573 -3590420 -2056763 -161797 1358188 2958886
46263 2958886 4234462 4074171 3031408 3171116 4923935 6154545 5211691 3036469 1195871
46254 1195871 -409625 -2448929 -4176878 -4265855 -2885313 -1457702 -720026 -221326 530562
46245 530562 1459873 2293871 2716287 2334609 1214761 244537 285517 1122801 1821318 1902942
46235 1902942 1621651 1330699 1177442 1243658 1429651 1318927 608956 -448132 -1329581
46226 -1329581 -1668419 -1132772 531983 2750619 3940471 2937604 389355 -1968437
46218 -1968437 -3165816 -3414635 -3049009 -2127235 -1061858 -539833 -516043 -211590 488786
46209 488786 537367 -743888 -2357471 -2704168 -1576287 -260469 161687 -196167 -740956
46200 -740956 -1276534 -1811089 -2073386 -1753835 -987839 -171439 576944 1395052 2193136 2588012
46190 2588012 2371788 1729856 917458 25545 -799416 -1178322 -762924 406915 1837124
46181 1837124 2743208 2457111 1120242 -85076 -35182 868919 1075660 41214 -878399
46172 -878399 -404641 607034 219465 -1878071 -3921766 -4293674 -3119336 -1526045 -281860
46163 -281860 526806 1180984 1954462 2600307 2347580 1048811 -29957 416614 1870712
46154 1870712 2790012 3016840 3699732 4797044 4764135 3343731 2482942 3248148 3844409
46145 3844409 2416921 80675 -942837 -792950 -1133904 -1876600 -1519647 -372313 -554958
46136 -554958 -2462311 -3838801 -3164648 -1709235 -1185711 -1341793 -1119415 -525591 1467
46127 1467 663139 1355809 956334 -924072 -2597961 -2433788 -1479701 -2047936 -4120650
46118 -4120650 -5190963 -3831016 -1566338 -511075 -563429 3640 1994687 4421073 5873135
46109 5873135 5859110 4735380 3033164 1263403 37136 -205953 270756 592881 154297
46100 154297 -803053 -1666597 -2142777 -2136654 -1447607 -275987 358854 -307995 -1419208 -1309896
46090 -1309896 182600 1399418 1245494 707546 1260505 2767081 3915501 4007929 3316168
46081 3316168 2210200 966332 129987 143845 754376 1434562 2085897 2684398 2718263
46072 2718263 1860842 839926 668241 1230344 1590415 1508142 1557241 1749577 1232785 -271883
46062 -271883 -1708679 -1978059 -1388208 -1208452 -2054584 -3197123 -3456439 -2559415 -1482063
46053 -1482063 -1330512 -1954763 -2083588 -979249 583987 1361814 1107769 462167 -86366
46044 -86366 -406738 -327745 123955 350348 -144164 -894248 -1050088 -625948 -416533 -835612
46034 -835612 -1547290 -2025466 -1790342 -482015 1433211 2432284 1422406 -869902 -2959668
46025 -2959668 -4468515 -5639410 -5708159 -3746287 -941943 198967 -649461 -1048586 528096
46016 528096 2495652 2817908 1976915 1643915 1852769 1420295 271435 -589852 -1015042
46007 -1015042 -1849095 -3162463 -3847622 -3261246 -2156418 -1586150 -1633224 -1634163 -1229249 -794347
45997 -794347 -853061 -1255134 -1290399 -830487 -817601 -1917746 -3193396 -3243959 -2321649 -1842854
45987 -1842854 -1950258 -1408611 -136867 272340 -723949 -1502469 -992176 -439098 -1003004
45978 -1003004 -1593287 -917352 146240 312069 350751 1432415 2498276 1920428 560056
45969 560056 332432 706216 -289246 -2220556 -2690425 -1405438 -516248 -752270 -499909
45960 -499909 762937 1340328 478356 -386287 -557663 -1277622 -2768491 -3074012 -1447768
45951 -1447768 -93870 -694319 -1819093 -1765975 -1377947 -1743866 -1609518 162227 1711789
45942 1711789 874512 -896945 -571018 1613035 2600105 1222668 -660286 -1525063 -1781017
45933 -1781017 -1862056 -1339546 -385881 26720 -174962 -50214 566641 860965 665286 554131
45923 554131 358835 -530982 -1374474 -628716 1439736 2643939 1803473 11080 -1397859
45914 -1397859 -2332729 -2941494 -2922696 -2486083 -2416879 -2632411 -2216215 -1289535 -1079012 -1605815
45904 -1605815 -1275691 391848 1596033 1000891 -131562 2723 1050262 1431184 792099
45895 792099 -75028 -890249 -1911793 -2873908 -3232219 -3056587 -2612760 -1556285 385014
45886 385014 2349822 3018202 2140451 636202 -543164 -1011700 -772250 -90741 638496
45877 638496 1209316 1508281 1186311 157851 -706776 -538493 -81101 -816832 -2346342
45868 -2346342 -2624484 -1382758 -1003737 -2752378 -4491790 -4061001 -2743609 -2799531 -3334919
45859 -3334919 -1841878 1182083 2629312 1573655 303524 219779 -8025 -1196279 -1615160
45850 -1615160 108098 2444469 3233317 2641017 1942736 992932 -906933 -2829612 -3272250
45841 -3272250 -2717017 -2831710 -3402871 -2452534 313424 2483661 2287497 1021021 740691
45832 740691 1094880 372828 -1208654 -1564878 -69731 1411772 1557075 1630116 3030261
45823 3030261 4431386 3563794 1024205 -191672 1036093 2581263 2581582 1973406 2284081
45814 2284081 2955134 2658901 1765968 1510568 1753665 1549312 1123704 1310817 1694786
45805 1694786 1366375 933767 1526307 2254308 1257736 -782989 -1022279 1168281 3017502
45796 3017502 2574986 1416477 1597597 2341516 1798923 176582 -1151210 -2182747 -3586369
45787 -3586369 -4529967 -3654322 -1671828 -741130 -1436949 -2283932 -2179668 -1445747 -526535
45778 -526535 525245 1143226 574626 -605039 -892257 -84983 420788 -95212 -712042
45769 -712042 -710214 -776892 -1549036 -2377992 -2565901 -2642415 -3280184 -3895012 -3519306 -2381443
45759 -2381443 -1477415 -1072559 -693695 -242317 -102169 -334364 -600515 -719742 -632237 -109234
45749 -109234 799847 1396933 1190643 718982 620800 356481 -910841 -2431259 -2416702 -692610
45739 -692610 738819 437342 -562163 -601590 -13193 -440507 -2137521 -3457327 -3030855
45730 -3030855 -1271434 488224 1427440 1537906 1225566 903916 526674 -466159 -2190285
45721 -2190285 -3564224 -3491181 -2695254 -3052968 -4767284 -5644968 -4032792 -1218185 317169
45712 317169 84449 -418289 -248973 98770 173632 295926 573281 569501 363221 724402
45702 724402 1715800 2213063 1459770 150336 -733635 -1270009 -1923020 -2295005 -1647086
45693 -1647086 -286641 628902 617347 296566 144689 -345820 -1760952 -3447337 -3871656
45684 -3871656 -2554286 -1101680 -1507897 -3455464 -4385870 -2849820 -676651 -541340 -2223052
45675 -2223052 -3164367 -2454590 -1958825 -2966944 -4026854 -3457563 -2141140 -1945475 -2647182
45666 -2647182 -2484496 -1054709 353454 1005414 1407410 1748395 1383633 168390 -1081082
45657 -1081082 -1767081 -2006107 -1829724 -1123645 -483625 -759713 -1448366 -945223 1071119
45648 1071119 2834834 2786874 1481781 361235 -260800 -887601 -1380050 -1156762 -541655
45639 -541655 -704807 -2099728 -3700444 -4042952 -2697653 -636367 667748 515048 -537820
45630 -537820 -1444051 -1705336 -1407991 -615017 556479 1394147 1070807 -114292 -830293
45621 -830293 -435330 159107 -175369 -1261758 -2004035 -1776455 -900417 -173771 -346745
45612 -346745 -1554809 -2832131 -2761175 -1128481 652546 1359396 1524618 2332729 3554489
45603 3554489 3810256 2766487 1798179 2061123 2877001 2749350 1395579 -114354 -1068775
45594 -1068775 -1966519 -3231593 -3908604 -2754766 -474803 514162 -805742 -2357679 -1612748
45585 -1612748 885965 2295196 1443081 100592 -14205 464284 220545 -447378 -524141
45576 -524141 -372246 -1217904 -3008764 -4303362 -4194696 -3119416 -1770265 -336048 982690
45567 982690 1599324 1044465 -539687 -2390097 -3310532 -2314403 229836 2448524 2803662
45558 2803662 1875209 1442152 1977740 2138763 888353 -914193 -1583806 -678431 526170
45549 526170 414101 -1369422 -3570999 -4523769 -3773880 -2405981 -1692823 -1765571 -1798362
45540 -1798362 -1034820 662253 2708026 3841318 2983576 681394 -993538 -734384 497476
45531 497476 1059608 831347 686227 673711 324158 122951 800789 1477919 583418 -1344259
45521 -1344259 -1958659 -632057 523882 -1556 -921905 -611139 199451 -30200 -911364
45512 -911364 -978842 -278055 -29964 -319154 -157075 422396 328131 -468999 -665332 168945
45502 168945 825577 484651 -61816 -30281 -76748 -995220 -2105267 -2260323 -1682312 -1332305
45492 -1332305 -918816 770649 3403824 4622990 2908216 -170923 -1715993 -933219
45484 -933219 386984 590347 31897 -109107 239837 132727 -908233 -2248331 -2794060
45475 -2794060 -1866068 273751 2379445 3117654 2459828 1722865 1767448 1845028 959705
45466 959705 -443205 -1326592 -1914368 -3070616 -4111767 -3159715 -36275 2964023 3946442
45457 3946442 3539550 3218198 2957412 1888215 236075 -885434 -1051802 -636214 216260
45448 216260 1528453 2694099 2850185 1969938 817396 35234 -124657 290477 532339
45439 532339 -613086 -3110028 -4885881 -4136027 -1908209 -803439 -1397532 -1785874 -786707
45430 -786707 367742 216194 -785886 -1389223 -1456910 -1433113 -918233 680003 2540504
45421 2540504 2982764 1672717 60793 -665262 -1009605 -1945111 -3058659 -2937689 -1273025
45412 -1273025 411546 558423 -597334 -1741005 -2508277 -3594924 -4819933 -4567109 -2034331
45403 -2034331 1060537 2329832 1682997 1085706 1676528 2619075 2896533 2756028 2836119
45394 2836119 3016374 2826795 2206350 1321374 367385 -16698 998443 3167505 4936480
45385 4936480 5142834 4285627 3504187 3100452 2882064 3130418 4006256 4473948 3226364
45376 3226364 730357 -868918 -268694 1469450 2392748 1917742 982198 456081 272347
45367 272347 119070 153076 473984 334029 -1201968 -3587116 -4652788 -2968572 90981
45358 90981 1705157 1007000 -26576 552930 2079201 2461447 1137048 -397056 -750438
45349 -750438 -199208 64059 -595398 -1779836 -2457513 -1656472 641716 3046577 3763529
45340 3763529 2457192 714102 244811 989015 1537428 1168407 680529 1031355 1865483
45331 1865483 2000743 1062839 -49801 -342351 208847 881369 964535 136496 -1300912
45322 -1300912 -2287601 -1807457 -292029 517082 -238382 -1295456 -1168890 -405305 -490231
45313 -490231 -1185286 -942800 162124 210456 -1252307 -1923332 -61752 2714622 3631523
45304 3631523 2386381 753111 -347853 -1331688 -2166377 -2232734 -1775985 -1607813 -1451135
45295 -1451135 -448892 724008 382281 -1208490 -1635570 27105 1515776 729812 -995171
45286 -995171 -875944 1226522 2812531 2355060 915099 88871 61666 192339 228229
45277 228229 224193 81546 -167983 -130103 386227 937510 990124 624348 384699 667669
45267 667669 1489043 2558939 3294375 3057004 1815728 448042 -50670 335383 712544
45258 712544 494389 117872 326558 1126785 1844444 1971843 1518639 710563 -118050 -435817
45248 -435817 8678 559454 231694 -885750 -1625560 -1509219 -1542995 -2478169 -3209787 -2177004
45238 -2177004 158318 1676680 1331317 90914 -972359 -2007709 -3224461 -3814157
45230 -3814157 -3081559 -1730122 -918421 -626044 7085 1135147 2036953 2288227 2161808
45221 2161808 1922207 1573698 1347597 1646655 2322919 2654059 2280885 1682651 1500733
45212 1500733 1787572 2125953 2149582 1735067 943971 -7111 -851620 -1456594 -1794236 -1724150
45202 -1724150 -1009140 329772 1749122 2386872 1667189 -125602 -1908510 -2719639 -2666906
45193 -2666906 -2680339 -3251472 -3858827 -3846089 -3298419 -2570720 -1494861 137842 1577114
45184 1577114 1555838 -125359 -2194223 -3315894 -3275339 -2531845 -1360523 -11834 831333
45175 831333 588596 -309325 -709048 -72011 909502 1175010 395608 -964615 -2256639
45166 -2256639 -2903083 -2349307 -428313 2120149 4037537 4698563 4419193 3431676 1386518
45157 1386518 -1386782 -2935881 -1491082 1857700 3859376 2992496 1265316 1278603 2811121
45148 2811121 3657250 2852739 1369302 129688 -837685 -1343514 -975291 -439656 -1239406
45139 -1239406 -3260327 -4162640 -2231266 1265554 3619194 3648750 2058260 -210235 -2506474
45130 -2506474 -3865836 -3460530 -1784969 -321286 75238 -379369 -1405522 -2965607 -4421304
45121 -4421304 -4539051 -2888849 -541727 1044860 1299108 506944 -728144 -1615324 -1476093
45112 -1476093 -476240 374449 340492 -374726 -1352937 -2646993 -4207548 -5285382 -5178343
45103 -5178343 -4162806 -2962918 -1704312 -217172 1011886 1272557 904456 979389 1535192
45094 1535192 1305053 -270145 -1841686 -1869949 -792853 -372009 -1233121 -2212551 -2174405
45085 -2174405 -1387760 -697731 -199634 547082 1452608 1851416 1510115 1066437 1178908
45076 1178908 1518642 985057 -946148 -3240978 -4013609 -2469587 29869 1260478 488741
45067 488741 -955281 -1569732 -1435243 -1514437 -1814888 -1345625 113090 1329486 1229695
45058 1229695 339040 -165328 -249676 -879416 -2329324 -3703279 -4257436 -4249632 -4152815 -3909528
45048 -3909528 -3480619 -3300939 -3415984 -2835928 -752291 1994832 3745974 4147296 4312116
45039 4312116 4842629 4966272 4048380 2753569 1930374 1312472 311832 -616019 -523732
45030 -523732 505361 1432223 1619384 1166164 173747 -1219256 -2216289 -2002236 -1070143
45021 -1070143 -675639 -788559 3268 2034852 3493743 2855525 1216957 830102 2056543
45012 2056543 3244533 3238733 2484019 1622821 470372 -1113332 -2425915 -2728782 -2246914
45003 -2246914 -1754028 -1509814 -1079409 -30223 1482829 2728156 2929904 2016678 894795
44994 894795 721814 1816674 3411335 4375403 3996956 2334977 285730 -821708 -242402
44985 -242402 1474902 3053416 3609994 2938711 1169163 -1114011 -2729675 -2839377 -1972504
44976 -1972504 -1225991 -590924 739430 2394851 2744417 1406471 357990 1387654 3503201
44967 3503201 4222170 2795865 839659 157599 1177625 3256642 5231438 5704856 4056144
44958 4056144 1434308 -215227 -322686 -18833 -202037 -407961 -23677 463935 246722
44949 246722 -474524 -806977 -446159 131702 566605 958331 1253870 928491 -355171
44940 -355171 -2045115 -3073461 -2985500 -2395887 -2102793 -2025271 -1502582 -504912 227765 447977
44930 447977 920048 2110756 3183570 3177350 2507468 2184952 2101545 1503341 869625 1602255
44920 1602255 3599749 4800223 3843859 1844198 661524 572215 622404 313277 -146155
44911 -146155 -542359 -632499 -58247 843884 889664 -335113 -1495220 -1266606 -283618 32409
44901 32409 -125182 575662 2088095 2829547 2192618 1474456 1790713 2528689 2573716 1890249
44891 1890249 1127253 580250 246826 157565 64055 -517437 -1483414 -2072106 -2002500 -1880607
44881 -1880607 -2069735 -2063152 -1476833 -718775 -112885 581634 1063290 117792 -2508048 -4901916
44871 -4901916 -5104047 -3722720 -2886060 -3065810 -2697803 -924345 1058343 1881125 1777312
44862 1777312 1699326 1752838 1460875 924766 784727 1266778 1948292 2407039 2652257 2893234
44852 2893234 3127666 3016585 2169234 630152 -1007636 -2150691 -2716891 -2839015 -2318747
44843 -2318747 -943289 673304 1201687 -112724 -2546610 -4538224 -5134413 -4718769 -4385344
44834 -4385344 -4644598 -4838708 -4004358 -2128479 -20704 1938923 3919651 5241527 4271836
44825 4271836 864944 -2235001 -2210362 129501 1390717 224819 -1203841 -798002 644487
44816 644487 1350743 1422997 1986963 2745691 2437785 1233200 757424 1663843 2718911
44807 2718911 2622902 1547196 462398 -89254 -65184 489159 1361199 2078233 2314602
44798 2314602 2228554 2233007 2569941 3098836 3346269 2924658 2130292 1834458 2402556 3064868
44788 3064868 2929888 2333550 2427100 3514963 4590498 4620209 3582820 2079162 630702
44779 630702 -340484 -514572 -130399 60059 -207995 -176401 873274 2300862 2585054
44770 2585054 1168109 -800133 -1797867 -1491977 -589567 357703 1260138 1818026 1558982
44761 1558982 868769 1039888 2534352 3906640 3489956 1695292 395634 245119 100743
44752 100743 -693012 -1045394 96584 2017257 3309873 3685566 3642878 3208864 2209860
44743 2209860 1141443 558682 86891 -837744 -1752032 -1884045 -1601292 -1821550 -2363880
44734 -2363880 -2328171 -1885874 -2132361 -3106849 -3461195 -2382406 -554979 1073472 2269520
44725 2269520 2984386 3058642 2791845 2705967 2533794 1659720 730331 1311671 3460967 5150919
44715 5150919 4861214 3394279 2298903 1836585 1537788 1538928 2081764 2541345 2167322
44706 2167322 1210196 377386 -185839 -540291 -363850 345941 748686 342264 -62999
44697 -62999 396202 1123145 1009115 324750 351317 1368983 2171822 1592235 -246518 -2095262
44687 -2095262 -2546514 -1290465 166730 -208305 -2435921 -4278014 -4226187 -3391733 -3270704
44678 -3270704 -3151956 -1638829 436279 1055231 448176 912956 3065464 4680229 3941967
44669 3941967 1819952 258087 -327416 -637121 -884888 -807891 -478660 -157488 134417
44660 134417 325165 202734 65089 729608 2374000 3995702 4487208 3717546 2286847
44651 2286847 898983 258932 777239 1873745 2199063 1055124 -808577 -2093933 -2226275
44642 -2226275 -1598124 -1069447 -1360622 -2439316 -3416211 -3445328 -2575262 -1266636 412420
44633 412420 2245193 3104100 2079369 120517 -891707 -615011 -251040 -136128 787714
44624 787714 2708204 4077494 3873531 3104163 3047854 3388895 3147362 2223216 979107
44615 979107 -558839 -2055022 -2519704 -1649606 -532645 -140747 -210670 -411600 -1215572
44606 -1215572 -2546000 -3061954 -2166349 -1333677 -1901273 -2897086 -2807661 -2184620 -2430939
44597 -2430939 -3110917 -2796186 -1802627 -1629674 -2129110 -1736007 -396786 213379 -405037
44588 -405037 -824530 -320804 -60052 -949440 -2231573 -3005883 -3443344 -3756627 -3600300
44579 -3600300 -3186378 -3311534 -3549207 -2254712 629692 2609112 1818310 -403298 -1562807
44570 -1562807 -1183390 -325934 660876 1934448 2714815 2213596 1464120 2100432 3551872
44561 3551872 3625722 2017824 1012513 1974122 3186565 2505128 590974 -261678 374102
44552 374102 702115 -265834 -1183690 -533720 1047066 1704360 882002 -288588 -812499
44543 -812499 -851048 -839541 -722867 -506007 -601521 -963008 -677860 709460 2075069 1929381
44533 1929381 391470 -1087378 -1759564 -2204572 -2875280 -3183688 -2481148 -1131665 -89946
44524 -89946 108754 -370866 -962840 -1096131 -716342 -476650 -934634 -1615950 -1531587 -603586
44514 -603586 215467 329341 161495 256840 591931 1042892 1648954 2062518 1656333 639651
44504 639651 139360 562497 771267 -323993 -2091288 -2971764 -2395258 -1051358 302425
44495 302425 1427064 2253700 2714302 2834519 2567509 1823998 986198 793487 1209609
44486 1209609 1135211 14640 -1008098 -615505 543044 538882 -1184308 -3112022 -3693002
44477 -3693002 -2930497 -1743218 -855791 -735585 -1625544 -2996224 -3678416 -3179283 -2331621
44468 -2331621 -2064038 -2063817 -1383574 -5628 1055563 1178025 883519 921247 1195819 1073048
44458 1073048 442336 -79478 -10843 388699 567156 378890 28162 -379533 -729510 -490590
44448 -490590 892353 2985149 4365321 4172414 3335077 3619626 5457929 7265435 7163582
44439 7163582 5048022 2595072 1349076 1241927 1152636 493333 -297906 -696855 -791663
44430 -791663 -780771 -419782 501635 1581877 2292808 2668829 2882661 2520720 1072023
44421 1072023 -1126406 -3235414 -4906011 -6011369 -5781429 -3525234 -141685 2497633
44413 2497633 3802198 4651017 5178885 4258195 1921490 367604 1125636 2681715 2595061
44404 2595061 890375 -403595 -260015 659119 1751538 2926064 3466334 2387521 220568
44395 220568 -1142349 -772782 429328 1427306 2173033 2651777 2297522 1131759 294305
44386 294305 558410 1219929 1275581 895723 883017 1379252 2035926 2911703 4162774 5102723
44376 5102723 4593574 2486459 -39932 -1752833 -2429259 -2457756 -1958217 -844165 464691
44367 464691 1103415 835527 578409 1296702 2658376 3534223 3680114 3870176 4181423
44358 4181423 3467422 1331660 -564360 -458684 1036988 1881682 1487106 1014780 1065240
44349 1065240 961300 576028 974479 2436582 3465345 2950730 2091433 2747481 4658512
44340 4658512 5786173 5106614 3672734 2827056 2573820 2177090 1489693 965457 768664
44331 768664 621997 503729 777333 1291861 999780 -705117 -2555544 -2472854 -325113
44322 -325113 1541100 1218503 -390545 -1172753 -784976 -500042 -672401 -246225 1105342
44313 1105342 2060849 1454263 -222565 -1698595 -2356625 -2330592 -2014859 -1870292 -2049311
44304 -2049311 -2098265 -1742729 -1741929 -2874485 -4360996 -4768579 -4277217 -4176297 -4132272 -2360653
44294 -2360653 902488 2740816 1724692 303906 1107975 2981415 3152734 1716773
44286 1716773 1135694 2234491 3520440 4049738 4266158 4076201 2730528 923955 544424
44277 544424 1710083 2300877 1262564 246063 807513 1879603 1559369 5314 -1096299
44268 -1096299 -1038931 -490595 82995 898936 1862345 2311206 2001913 1585580 1776760 2414281
44258 2414281 2610066 1781995 425654 -333283 -45283 569190 765780 908902 1720674
44249 1720674 2786133 2887515 1820454 812420 906440 1837485 2717823 2901148 1972501
44240 1972501 -5752 -1830145 -1869234 -67663 1742817 2136024 1625865 1231341 840070
44231 840070 180461 169368 1532016 2852605 2087248 -101751 -650160 1702100 4359001
44222 4359001 4162045 1423863 -747056 -410822 1389507 2568353 2378210 1531272 923783
44213 923783 816771 815680 266168 -1009583 -2157743 -1934133 -235092 1484781 1828752
44204 1828752 1100202 681750 1079270 1480341 1271608 1003830 1388852 2092687 2231436
44195 2231436 1668183 1128425 1164938 1549397 1680565 1243011 477240 -9135 174405 670466
44185 670466 672723 -99646 -1029727 -1286821 -435516 1631074 4512737 6788109 6802713 4759741
44175 4759741 3029017 3294604 4296037 3768129 1778179 254840 -364263 -1704368 -4301496
44166 -4301496 -6077001 -5092852 -2270695 -77693 402296 -116701 -711496 -974403 -752693
44157 -752693 -317827 -395568 -1124641 -1494206 -730967 336158 356167 -625379 -1520446 -2034217
44147 -2034217 -2746148 -3530401 -3425026 -2327372 -1443246 -1520077 -1779249 -1254700 -201524
44138 -201524 589137 1009862 1257938 947832 -271857 -1588188 -1694298 -586948 354164
44129 354164 272498 -170473 -110472 162235 -78872 -595597 -477736 444302 1393454 1767426
44119 1767426 1615560 1021715 -29441 -987843 -931793 135784 1041745 982910 446821
44110 446821 54740 -452363 -1198576 -1253438 -74879 986039 300763 -1401588 -1835128
44101 -1835128 -437306 1046516 1375711 1185077 1040026 234950 -1377949 -2223455 -1199236
44092 -1199236 364207 577409 -292485 -718927 -615776 -1142412 -2240601 -2396039 -999931
44083 -999931 730290 1568074 1680490 1806136 2165362 2640067 3121096 3278782 2755830
44074 2755830 1869213 1379104 1361389 1112862 401405 -47910 316720 991991 1067125 187229
44064 187229 -1360691 -2886773 -3439306 -2473071 -681048 567085 903807 1276701 2262964
44055 2262964 3076148 2904203 2296327 2251369 2590985 2340062 1367478 560491 469433 771302
44045 771302 1151490 1810581 2818739 3653409 3716185 2886918 1454959 19522 -494729
44036 -494729 496580 2205816 2855908 1710284 146493 -41000 1065765 1867738 1605309
44027 1605309 1114351 1093433 975405 250150 -236544 487573 1687671 1729321 480734
44018 480734 -512173 -344535 171307 159937 14052 274098 424137 -30119 -239889 792976
44008 792976 2275977 2460533 1273444 540433 1317501 2466524 2556350 1953643 1985084
43999 1985084 2803626 3293283 2846964 2135629 1907672 1852059 1212096 179939 6509
43990 6509 1456969 3478386 3982171 2173533 -321164 -1125324 323418 2460216 3695540
43981 3695540 3966999 3940367 3606625 2564891 1260807 819848 1451362 1922099 1175015
43972 1175015 -168612 -737157 -476303 -678013 -1767783 -2233345 -616365 2187141 3807072
43963 3807072 3298688 1913366 943434 193586 -863550 -1731487 -1784842 -1642428 -2304478
43954 -2304478 -3299302 -3050301 -1188719 645470 742276 -711008 -2096835 -2303515 -1664035
43945 -1664035 -1139646 -1023403 -679676 452999 1881179 2476458 1846585 774718 190206
43936 190206 318076 1017578 2081204 2718418 1770962 -581851 -2147532 -1040467 1764147
43927 1764147 3502211 2993194 1601444 957759 1244709 2004434 3153181 4463985 5116345
43918 5116345 4608240 3505428 2705599 2473482 2607578 3006799 3648840 4399127 5071545
43909 5071545 5341448 4707138 3179223 1872273 2014712 3355359 4476461 4670601 4417518
43900 4417518 4011804 3133142 2080991 1923958 2766703 3235678 2476946 1380326 965343
43891 965343 874887 486862 168070 170458 -379104 -1809474 -2432297 -706430 1922360 2506504
43881 2506504 624411 -1174857 -1023395 178975 765352 542467 185440 -169182 -663922
43872 -663922 -952296 -616197 182035 1058210 1887428 2472125 2339378 1427545 518555 453090
43862 453090 1208683 2145870 2879915 3515802 4174257 4609707 4364453 3313992 2055429
43853 2055429 1482705 1768938 2117250 1863863 1380274 1329187 1513241 1303024 864484 927677
43843 927677 1450653 1598711 1126143 693336 588438 230880 -643503 -1343325 -1337364 -1067584
43833 -1067584 -959534 -495515 834810 2322703 2791871 2218969 1701183 1988520 2832784
43824 2832784 3666396 4156909 4105255 3532828 3000189 3208995 4066723 4673432 4529441 4303564
43814 4303564 4959881 6378718 7383359 7158919 6122755 5085411 4032917 2506595
43806 2506595 1090651 1393938 3842622 6335821 6352226 4117930 2300986 2430986 3134284
43797 3134284 2574757 1148586 461359 768474 1196612 1864681 3633660 5645868 5376538
43788 5376538 2179076 -1005049 -1062170 1362803 3163064 3210931 3300560 4680611 5949029
43779 5949029 5367607 3549221 2386768 2360419 2474110 2332824 2678360 3787954 4643084
43770 4643084 4184169 2673656 1400718 1389733 2541282 3760764 3941827 3027327 1890114
43761 1890114 1058157 245863 -419303 276559 2980014 6212019 7878095 7815029 7277327
43752 7277327 6404631 4277706 1433413 -57155 368428 862194 239954 -259332 336036
43743 336036 440343 -1636352 -4509421 -5280968 -3358777 -663588 1229654 2138400 2064380
43734 2064380 1058782 87975 159904 660979 188269 -1144228 -1854201 -1342625 -356873
43725 -356873 581027 1489697 1830965 887054 -770862 -1835015 -2146563 -2362611 -2142982
43716 -2142982 -778378 660026 303934 -1314158 -1722887 -539028 -145792 -1520718 -2380720
43707 -2380720 -955802 1145271 1785166 1638399 2422372 3700045 3854700 2872689 1940334
43698 1940334 1433977 1335727 2412618 4799764 6516618 5743548 3759084 3270097 4449800
43689 4449800 5032096 3968317 2547649 1853978 1370413 511051 -265116 -312516 561038
43680 561038 2398158 4760330 6274839 5941300 4666993 4036496 3963246 3317571 2450797
43671 2450797 2859751 4328954 4748920 3273322 1538024 1042984 1276589 1275512 1202106
43662 1202106 1343564 1168450 503035 282624 1068645 2014690 2219860 1890117 1321966
43653 1321966 142142 -1404035 -1851468 -543206 968046 1022390 336709 808934 2622163
43644 2622163 4198114 4590495 4343203 4105744 3776040 3129564 2296497 1507148 999550
43635 999550 991167 1182554 777425 -292769 -822735 14057 1122310 847206 -601928
43626 -601928 -1503314 -1098240 -145793 938242 2726067 5092985 6515229 5997826 4551440
43617 4551440 3744759 3671899 3383318 2569210 1575722 210262 -2033827 -4459042 -5173922
43608 -5173922 -3287590 -332957 1276542 861933 -150838 -303345 280615 612936 459757
43599 459757 519706 1212911 2081405 2579918 2804664 2992353 2805793 1822297 534012 75329
43589 75329 815838 1892103 2432314 2609203 2968630 3300039 3022623 2393074 2263499 2559814
43579 2559814 2185215 1002573 764611 2877283 5916494 6899472 4970098 2352331 1324644
43570 1324644 1697895 2032627 1991510 2170827 2453007 2085951 1188660 831025 1477185 2371750
43560 2371750 2669991 2341169 1766328 1204844 889667 1011000 1396700 1709866 1985353
43551 1985353 2400769 2634174 2266843 1793881 2216774 3414444 3985268 3213587 2246094
43542 2246094 2593736 4196276 5787271 6649081 7119048 7604388 7931928 7750800 7066228
43533 7066228 6260076 5829047 6072596 6820528 7471458 7392796 6295322 4390890 2432306
43524 2432306 1384352 1560829 2169561 2252449 1980648 2309868 3365488 4074287 3663162
43515 3663162 2663617 2002616 1886478 2125600 2826822 4033768 5158241 5451593 4774006
43506 4774006 3483909 1969503 668259 16014 -111556 -400023 -1055101 -1320152 -572997
43497 -572997 716223 1799036 2807435 4248017 5822693 6726275 6866205 6871789 7013525
43488 7013525 6937318 6405928 5571094 4601651 3754260 3656149 4668955 6020548 6481838
43479 6481838 6007900 5776679 6334156 6684431 5855875 4601151 4559444 5967118 7182958
43470 7182958 6768696 5319674 4584357 5120839 5736966 5408385 4754448 4826879 5176495
43461 5176495 4431451 2630664 1546911 2312886 3985940 5116113 5590612 6029388 6387639
43452 6387639 6380495 6601749 7864051 9697961 10705636 10361325 9491856 8997808 8969817
43443 8969817 9091401 9185028 9376207 10316526 13052680 18024431 24458189 31365156 38500920
43434 38500920 45225222 49038745 47152837 39942512 31379266 25220618 21682806 18550834
43426 18550834 14634944 11022832 9206484 8989961 8678924 7096160 4982948 4047125
43418 4047125 4737697 5688038 5702661 5418032 6086889 7377205 7679949 6392673 4576832
43409 4576832 3267003 2401128 1732710 1591858 2163250 2947575 3549654 4258794 5300238
43400 5300238 6178661 6307226 5736453 4808317 3637795 2379401 1488491 1267079 1558734
43391 1558734 2192110 3214606 4363299 4889646 4426040 3674821 3779584 5126427 6884172
43382 6884172 7522539 5923289 2533653 -567948 -1362658 203653 2402286 3648447
43374 3648447 3634946 2840692 1931186 1634282 2145317 2524999 1738220 409893 337244 2005678
43364 2005678 3904219 4702859 4675293 4378043 3551412 2393903 2389415 4287786 6304828
43355 6304828 6041776 3630236 1407407 814151 1126805 1177978 900533 862779 1292695
43346 1292695 1983304 2647977 3180455 3778355 4625564 5321136 5228751 4702260 5054840 6632960
43336 6632960 7872213 7282628 5574545 4641929 5112590 6187067 7303033 8483515 9391426
43327 9391426 9525973 9203777 9018344 8593789 7335724 6118426 6428326 7827575 8206755
43318 8206755 6930687 5816349 6287360 7388648 7638572 7169533 6712991 5923267 4345695
43309 4345695 2978501 3068217 3972215 4017039 3242604 3517950 5689805 8139708 8797597
43300 8797597 7529776 5860955 5100487 5439514 6371792 7253858 7595312 7318371 6740014
43291 6740014 6054589 4976813 3209025 1166952 -137028 -30602 1222280 2824729
43283 2824729 4192910 5153795 5666572 5704163 5402495 5067600 4959006 5171428 5674322
43274 5674322 6306199 6812178 7072746 7170013 7059822 6522012 5818660 5899483 7132572 8197094
43264 8197094 7448932 5382396 4342115 5419070 7088972 7643061 7451281 7645765 7980950
43255 7980950 7665682 7272396 7904107 9123927 9679025 9828486 10841772 12409455 12868902
43246 12868902 12139787 11995449 12879126 12981447 11523898 10448794 11215927 12224681 11645191
43237 11645191 10903326 12538799 15782748 17374333 16437499 15478776 16127675 16781461 15709791
43228 15709791 14139353 14387392 16392314 18046263 18244693 17852644 17911441 18458480 19269807
43219 19269807 20465307 21913050 23001240 23642825 24871399 27724171 31858796 35965734
43211 35965734 39441549 42987861 47475511 52885096 58705585 64798161 71239203 77558450
43203 77558450 82727906 85826195 86267428 83629482 78025704 70689038 63430285 57224405
43195 57224405 51797948 46663196 41882162 37683088 34147662 31583818 30340850 29793433
43187 29793433 28427216 25642959 22674788 20918514 20146349 19327631 18371232 17753211 17098452
43178 17098452 15773078 14569864 14974863 16618935 17299799 16121132 14880505 15327309
43170 15327309 16530792 16390578 14749331 13444832 13788759 15412239 17327925 18790298
43162 18790298 19194637 18435595 17536504 17811208 19165567 20213861 20248080 19971276 19975662
43153 19975662 19798876 19223659 19323080 21065411 23670870 25605494 26709414 28040099 29868973
43144 29868973 31237416 31624791 31779641 32509568 33731835 35228094 37362770 40396316
43136 40396316 43886514 47482794 51656580 56941476 63070113 69634320 77053177 86082228
43128 86082228 96916985 109757756 125829460 146700082 172739009 203298036 238237794
43121 238237794 277833797 320553386 361674874 394645414 413657567 415448000 400155645
43114 400155645 371409165 335097582 297120993 261650364 230653033 204154708 181061189
43107 181061189 160616100 143257468 129634104 119222564 110847836 104117277 99027557
43100 99027557 94595919 89795880 85846915 85269661 88010116 90841425 91796536 92845612
43092 92845612 96412387 101539685 106058752 110635915 117310193 125061548 130558076 133255062
43084 133255062 136092233 140371828 143441644 143073909 141132183 140615603 141383781 141465937 140972701
43075 140972701 141779447 144106758 146233441 147510519 149094360 151209456 151909471 149615141
43067 149615141 145366294 141395616 138431038 135492806 131787565 127787557 124534347 122524615
43059 122524615 121410632 120627242 120326304 121591447 125375900 131127371 136658670 139291844
43051 139291844 136946741 128728680 115647510 101013235 88985778 81695160 77924333
43044 77924333 75033269 71831615 69176124 68356849 69793526 73135160 77704835 82634008
43036 82634008 87223238 91445089 95621790 99502058 102314795 103950094 105203543 106171750
43028 106171750 105116112 99978772 90848016 80075260 70118262 62148277 56507218 53093441
43020 53093441 50883994 48378372 45375118 43412306 43604403 44885508 45363670 44606905
43012 44606905 43405236 42009039 40139537 38345947 37658551 37907919 37996344 37907270 38623169
43003 38623169 39678984 38877904 35500008 31965690 30815558 31526494 32032191 32025036 32522573
42994 32522573 33083739 32146299 30064318 29196949 30356155 31484331 30964736 30219034 31389727
42985 31389727 33918698 35365426 34849799 33795967 33470607 33458144 32819683 31473117 29948392
42976 29948392 28616819 27571271 26666973 25388943 23228172 20532039 18607942 18632371
42968 18632371 20496519 22709532 23372019 21609886 18504419 16357852 16448906 17627638
42960 17627638 17697686 16037243 14151312 13710855 14879428 16673463 18094482 18583637 18140500
42951 18140500 17481235 17557181 18567864 19909136 21185965 22491255 23514684 23501913 22684890
42942 22684890 22602584 23998956 25356482 24801124 22768608 21295105 21051620 20717616 19326794
42933 19326794 17634638 16713455 16536106 16614172 16951377 17584705 18015354 17912280 17787151
42924 17787151 18194407 18653739 18077503 16127662 13704231 12151703 12099549 12862107 13039097
42915 13039097 12133025 11386702 12278175 14354467 15677200 15496393 15086213 15458549 15811636
42906 15811636 15310031 15014851 16425959 18920461 20367866 19972255 18928885 18358444 18138341
42897 18138341 17958548 18039309 18253822 17781183 16467517 15707519 17030856 20121929 22971982
42888 22971982 24004580 23610543 23381745 23972400 24133753 22331486 19142478 17101673 17734388
42879 17734388 19656682 20486149 19878363 19432912 20020905 20697919 20404086 19447579 18822139
42870 18822139 18954660 19588029 20214852 20240520 19283079 17636359 16028601 14825052 13913895
42861 13913895 13272095 12959860 12635286 11949353 11511920 12516498 15035116 17409636 17762501
42852 17762501 15704430 12470047 9940201 9543594 11333592 13837656 15267863 14976691
42844 14976691 13456515 11407953 9596576 9042807 9997779 10921032 9928426 7309809 5183115
42835 5183115 4578747 4492899 4061187 3781539 3915398 3553289 2364475 1670632 2500840
42826 2500840 3912171 4513774 4419445 4392967 4310308 3953399 4174327 5562470 6827252
42817 6827252 6262784 4246660 2694463 2545719 3281540 4331657 5297719 5250468 3583993
42808 3583993 1389502 383201 649972 1015469 1381972 2818564 5243633 6894108 6600944
42799 6600944 5091554 3547262 2260390 1267237 978114 1389701 1621768 961623 -237697
42790 -237697 -1096416 -1061745 -50425 1583655 3083328 3901004 4250680 4452219 4083485
42781 4083485 2740773 1303107 1199125 2518156 4049066 5063499 5739336 5938560 5139025
42772 5139025 3740376 2894648 2728230 2198968 1051557 406309 972858 2154377 3358607
42763 3358607 4658902 5715462 5781770 5410059 6262253 8301237 9113368 7334289 4929248
42754 4929248 4431175 5539076 6401673 6882189 8156322 9823863 9953152 8115435 6354951
42745 6354951 6583808 8350600 9736797 9612700 8619431 8380162 9799819 11880990 12564030
42736 12564030 11067834 8819889 7671926 8004809 9118109 10406705 11256432 10837132
42728 10837132 9171077 7556636 6837692 6227728 5008307 4110765 4379132 4566695 3272503
42719 3272503 1865615 2773828 5284405 5981080 3621490 753701 -290794 -343191 -1083034
42710 -1083034 -2167741 -2413578 -2012574 -1682288 -954636 810560 2692922 3298495 2879859
42701 2879859 2709711 2936816 2761850 2330271 2667284 3797174 4588735 4617290 4601413 4649423
42691 4649423 3673403 1318732 -874265 -1358755 -719771 -681703 -1514709 -1783560 -630316
42682 -630316 983341 1756722 1779413 2007435 2603987 2726762 1827666 372825 -805615
42673 -805615 -1231425 -774981 350198 1313253 1114158 -204340 -1369273 -1417452 -822869
42664 -822869 -449012 -72626 999754 2284299 2438389 1306238 379347 729253 1473920
42655 1473920 1015409 -831220 -2660168 -3079868 -1934588 -157456 1112629 1341364 811940
42646 811940 41566 -893928 -2064265 -2806169 -1940262 698512 3536961 4725260 4070422
42637 4070422 2969323 2601085 2772563 2566443 1599734 391990 -250946 29758 946974
42628 946974 1912723 2548985 2974210 3666646 4928770 6322760 6799037 5781544 4077054
42619 4077054 3110679 3113070 2857423 1683919 881202 1981421 4237137 5208376 3859494
42610 3859494 1736781 752730 1053809 1681094 2184637 2606668 2651476 2013007 1222581
42601 1222581 1201841 1997687 2667759 2486654 1768584 1402783 1869047 2759780 3175239 2693833
42591 2693833 1925971 1762877 2081828 1795993 403720 -1184316 -1802983 -1416095 -782091
42582 -782091 -273047 293248 1054234 2041417 3357335 4652649 4779919 2968790 297890
42573 297890 -1011784 -44217 1843123 2824520 2673685 2522170 3083025 3836829 3936804
42564 3936804 3391550 3071920 3644158 4723702 5272290 4797288 3880692 3434357 3796797
42555 3796797 4785643 6136369 7331093 7429924 6020000 4287575 4067909 5412621 6088831
42546 6088831 4356622 1556471 711647 2693909 5046145 5012000 2660786 229008 -798273
42537 -798273 -780318 -489873 44542 1036169 2382223 4075298 6264199 8350564 8914008
42528 8914008 7325687 4738187 2665511 1305765 218286 -192537 683081 2085888
42520 2085888 2653441 2561768 3083459 3968718 3402631 1201212 -147706 1012472 2811354
42511 2811354 2510919 508659 -480257 541289 1918807 2245958 1968099 1737849 1195060
42502 1195060 261361 32021 1119302 2161359 1399254 -694435 -1701543 -329937 1832400
42493 1832400 2285771 814935 -276273 687419 2434316 2630368 1410988 1216483 2914569
42484 2914569 4238342 3357446 2062248 3101698 5543015 5718240 2697138 -135568
42476 -135568 179464 2442424 3803367 3839340 3976794 4294446 3500007 1726461 963500
42467 963500 2201100 3883502 4060543 2903685 2073698 2256051 2426551 1531367 13725
42458 13725 -831396 -641153 -400757 -927859 -1652419 -1549321 -794931 -490723 -883368 -1060240
42448 -1060240 -639360 -457729 -914677 -867607 721972 2996934 4393080 4909205 5631738
42439 5631738 6437721 6064707 4620894 4075609 5376901 6652245 5612370 2704058 357600
42430 357600 -305547 -346477 -645762 -365886 1491235 4120048 5564968 4904899 2965981
42421 2965981 1092828 -34019 -409501 -258674 183645 827857 1768316 2862831 3375322
42412 3375322 2617811 1022238 -88150 -70504 306325 56578 -754821 -1463621 -1842989
42403 -1842989 -1892711 -1154211 687131 2736504 3540085 2899108 2110593 2254679 3113354
42394 3113354 3954607 4455359 4523012 4063173 3325243 2732305 2087296 855287 -429889
42385 -429889 -208130 1908311 4019137 4061967 2335818 881372 950824 2149476 3569048
42376 3569048 4589932 4798187 4150345 3141687 2137819 971990 -84996 172630 2135219
42367 2135219 3925549 3463373 1526681 693578 1331716 1056326 -1226445 -3193421 -2439827
42358 -2439827 22749 1501786 1514569 1845776 3410072 5096572 5674359 5232775 4545963
42349 4545963 4195939 4459939 5112385 5332608 4675538 3973609 4295303 5188570 5108780 3588262
42339 3588262 1824275 959625 852513 772452 317546 -596194 -1713251 -2215146 -1485022
42330 -1485022 -235411 188130 -285150 -542697 -430281 -1089305 -2559746 -2937356 -1167264
42321 -1167264 973837 1359270 638001 872309 2018635 2118709 674683 -540198 -353624
42312 -353624 188439 -220969 -1223148 -1663505 -1126358 121958 1590483 2340922 1505418
42303 1505418 -239482 -878060 425273 2111007 2431641 1720907 1299266 1197486 523644
42294 523644 -553869 -857460 -84885 793207 1110495 1260464 1642795 1885095 1502226
42285 1502226 636479 -158575 -400625 131001 1188769 2011988 1966614 1252647 623113
42276 623113 532640 883166 1277127 1127880 65574 -1157336 -854775 1505282 3938131
42267 3938131 3915094 1472821 -855867 -1094771 392659 2053836 2717557 1931089 106658
42258 106658 -1379983 -1435861 -770818 -900520 -1587900 -966834 1417882 3556875 3725797
42249 3725797 2492830 1027176 -643867 -2258516 -2154491 367171 2885608 2509140
42241 2509140 -74910 -1581233 -729002 582973 678685 190600 183989 412213 436932 724246
42231 724246 1475303 1755546 970835 95794 242061 892513 766102 -204379 -917193 -691870
42221 -691870 226056 1406072 2445507 2657719 1632545 186573 -199387 795927 1798587
42212 1798587 1447235 90532 -760822 -347582 621464 1135350 1097417 1070348 1360775 1952380
42202 1952380 2963692 4294481 4932852 3735233 1212129 -589682 -628981 -195318 -773796
42193 -773796 -1738210 -1588203 -523362 92551 245166 1035382 2078935 1645026 -119173
42184 -119173 -684776 974561 2447602 1635637 228895 934489 2924692 3193154 1624955
42175 1624955 1255898 3267132 5062250 4494353 3118816 3330508 4506620 4449676 3261044
42166 3261044 3092469 4532201 5735962 5363156 4287313 3785201 3738846 3479063 3043060
42157 3043060 2632064 1932827 995135 789732 1715326 2424678 1612499 402585 1203759
42148 1203759 4226032 6898558 7226514 6130358 5565762 5685602 5168512 3469910 1308608
42139 1308608 -626981 -2077499 -2521460 -1481688 312815 1280705 890938 257238 455478
42130 455478 1190644 1666890 1888224 2288192 2671527 2451823 1732082 1361895 1861670 2799518
42120 2799518 3338508 3083510 2298720 1476603 783333 -69271 -1367807 -2900089 -4072678
42111 -4072678 -4417784 -3777171 -2248785 -432153 515274 -127152 -1531759 -2056010 -1344699
42102 -1344699 -802859 -1490260 -2503115 -2369421 -1360297 -1159618 -2356002 -3420427 -2547182
42093 -2547182 166845 2755913 3237814 1276141 -1605781 -3253428 -2638741 -690060
42085 -690060 675909 422554 -752052 -1350778 -652705 725115 1710288 2001985 2201478
42076 2201478 2732102 3079177 2533990 1365534 533823 351149 322910 413285 1343357 3087403
42066 3087403 4168679 3463404 1950207 1478461 2275307 2988910 3016645 3331297 4655119
42057 4655119 6049107 6070747 4638999 3041442 2414107 2686289 2841929 1978500 307573
42048 307573 -819015 -219840 1695749 3226543 3226039 2213066 1462040 1469394 1676203 1377291
42038 1377291 490221 -458510 -806169 -221016 1116692 2685981 3896768 4256081 3637321
42029 3637321 2635582 2263345 2771976 3052673 1921991 -91491 -1099574 -211425 1245732
42020 1245732 1332194 -254536 -2095903 -2806120 -2219392 -1004413 218036 1179313 1812787
42011 1812787 2185016 2541025 3129585 3779205 3784075 2590309 694178 -552449 -340463
42002 -340463 702141 1351736 1177850 655173 304119 397286 1203503 2645025 3827006
41993 3827006 3869224 3267989 3399339 4401334 4661176 3036269 613383 -675942 -501855
41984 -501855 -79463 -27440 421708 1831068 3269761 3413118 2463699 2039282 2969034
41975 2969034 3948954 3108767 639542 -1119740 -499910 1524061 2867909 3019868 3053988
41966 3053988 3465373 3434213 2302404 506820 -1217744 -2440619 -2617704 -1346926 529619
41957 529619 1363205 831017 363154 785972 1024821 189172 -569377 169583 1659301
41948 1659301 2123576 1468713 945128 728310 -53704 -1134382 -1149386 -65614 474718
41939 474718 -262139 -1021229 -716988 54165 446784 655184 827986 326497 -729765
41930 -729765 -703480 1252556 3360433 3371440 1610254 140071 -298685 -568922 -907660
41921 -907660 -614824 83807 80996 -313487 684190 3194587 4573011 2984474 406835
41912 406835 -4586 1502885 1793143 -259277 -1939695 -629241 2488093 4266233 3856221
41903 3856221 3138705 3370294 3519169 2434020 921211 481591 1070643 1539630 1744012
41894 1744012 2641565 4270976 5149124 4289400 2684139 1912365 2089858 2228248 2078430
41885 2078430 2359798 3187682 3444555 2186145 -28509 -1713216 -1957194 -978987 454026
41876 454026 1704348 2520652 3014500 3436060 3839044 3992553 3679259 2994075 2304178
41867 2304178 1983529 2127351 2378317 2168406 1446779 1067808 1970960 3900549 5459519
41858 5459519 5676468 5068081 4844325 5501051 6591946 7467580 7707522 7136355 6023116
41849 6023116 5099605 4799684 4581259 3571442 1828337 395539 110965 888564 2130432
41840 2130432 3247356 3794254 3777828 3889072 4711845 5618749 5314722 3734637 2477169
41831 2477169 2835215 4177128 4896364 4297715 2901219 1507334 684456 673190 1108796
41822 1108796 1277368 1166858 1603568 2770822 3527870 3102507 2444361 2605943 2735020
41813 2735020 1418881 -620209 -1234139 -82073 939535 668906 -34992 -463148 -1325985
41804 -1325985 -2837501 -3470648 -2063602 232132 1491230 1395687 911140 749061 1330139
41795 1330139 3032805 5132940 5724408 4194076 2567576 2740718 3673377 3391406 2521638
41786 2521638 3110384 4596275 4086482 911366 -1980133 -2076755 -361225 823390 855894
41777 855894 375789 -495123 -1764853 -2538683 -1942794 -409109 1091026 2354406 3445659
41768 3445659 3724823 2639252 957340 20927 69409 303276 343088 654382 1612977
41759 1612977 2945345 4117152 4731430 4570718 3659673 2295283 882269 -137008 -344892
41750 -344892 149590 440262 -109910 -618322 347688 2429783 3537000 2713728 1384502
41741 1384502 902816 544738 -660193 -1655548 -932622 632600 820810 -444035 -981202
41732 -981202 88933 883325 -340886 -2556373 -3388628 -2054919 213577 1949207 2611809
41723 2611809 2365010 1641564 1025493 1055117 1820530 2654493 2342292 173118 -2858170
41714 -2858170 -4469116 -3456090 -1272255 -369931 -1259164 -2276576 -2140360 -1443413 -1338029
41705 -1338029 -1942347 -2628557 -2941931 -2584283 -1302629 441768 1322803 515142 -1129482
41696 -1129482 -2005788 -1654155 -1081460 -1274123 -2025331 -2398501 -1936388 -1120943 -764995
41687 -764995 -1197116 -2095562 -2884022 -3013046 -2037113 -11857 2058516 2845296 2156073
41678 2156073 1143518 593223 -166730 -1817837 -3383302 -3375638 -2124339 -1359431 -1580350
41669 -1580350 -1559412 -751942 -399261 -1363519 -2389493 -1831734 -119249 899800 536118
41660 536118 -145076 -162319 105584 -249697 -1265532 -1966934 -1497564 -213275 559690
41651 559690 47315 -1010836 -1449502 -1363644 -1736879 -2533101 -2485617 -1110361 404484
41642 404484 982998 1109239 1596997 2026648 1550232 409942 -516612 -1005243 -1202169
41633 -1202169 -767105 420720 1291385 731111 -662090 -1333636 -989210 -656379 -775811
41624 -775811 -797500 -663298 -1044941 -1814941 -1850034 -877298 -60163 -62673 64293 1118762
41614 1118762 2126396 1733723 319600 -677934 -1013652 -1741672 -3124819 -3817885 -2663474
41605 -2663474 -454886 808251 165741 -1296834 -1692892 -292944 1904338 3385736
41597 3385736 3543560 2753198 1487862 -28600 -1361892 -1785602 -1018453 361753 1584893
41588 1584893 2453307 3093700 3294380 2716864 1773277 1639543 2911014 4516615 4639474
41579 4639474 2891424 954571 540445 1235332 1283319 217575 -619684 -406312 -155825
41570 -155825 -801482 -1369357 -620673 448572 -213615 -2305496 -3097418 -1225714 1376742
41561 1376742 2366866 2251773 3249858 5758635 7624986 6943258 4392512 2347374 2226734
41552 2226734 3220361 3621739 3047026 2783455 3799343 5196248 5417549 4395886 3338284
41543 3338284 2747826 2129287 1585783 1963239 3014446 3204983 2167349 1658354 2903987
41534 2903987 4532253 4623082 3464325 2516453 1776386 274018 -1515675 -2055473 -1405017
41525 -1405017 -1332517 -2500725 -3496130 -3223579 -2534135 -2644654 -3343306 -3712771 -3572166
41516 -3572166 -3264846 -2781254 -1929218 -884955 -3737 524910 570339 123665 -424089
41507 -424089 -695121 -954007 -1469319 -1460048 -21286 1894591 2148464 531600 -621166
41498 -621166 182285 1479892 1505827 1104565 1950922 3287169 3010870 1308386 487601
41489 487601 1234235 1681669 716571 -302201 -178662 2907 -1049398 -2412186 -2456485
41480 -2456485 -1516426 -1060980 -1047747 -212552 1396271 2339045 2323116 2683450 3750415
41471 3750415 3814135 1954588 186773 918288 3254976 3962724 1922188 -414548 -501117
41462 -501117 1136408 2269670 2180262 1960244 2208820 2107705 1013419 -315965 -761617
41453 -761617 -385993 -214616 -786466 -1501514 -1365103 -72987 1594604 2339589 1557022
41444 1557022 204560 144324 2170132 4821572 5655804 3780383 755410 -1124056 -1060509
41435 -1060509 -62188 559694 451850 42970 -273298 -388144 -201874 375176 1087243
41426 1087243 1395894 1087984 576907 383448 508932 550064 264577 -237988 -740932 -1096849
41416 -1096849 -1263256 -1378243 -1631854 -1834747 -1422394 -296652 675313 654444 105295
41407 105295 239285 1203452 1811223 1368066 778985 1227637 2564474 3785858 4449767
41398 4449767 4690528 4348760 3216086 1946837 1585004 2083637 2289657 1602277 665863
41389 665863 57670 -696231 -2085158 -3392191 -3500647 -2559699 -1848253 -1961110 -1989426
41380 -1989426 -844921 1155138 2501497 2107663 383281 -1247464 -1650825 -778471 615562
41371 615562 1798551 2510773 2755697 2469636 1622788 542980 -159816 -128546 410565
41362 410565 961147 1245765 1189369 598099 -690400 -2254746 -3188542 -3095988 -2579616 -2244392
41352 -2244392 -1635835 -7760 2026563 2734294 1504378 -149882 -507507 238354 647210
41343 647210 181490 -425767 -625039 -628961 -467774 350763 1777130 2714119 2253809 930218
41333 930218 126193 447003 1132587 1039766 -37039 -1085501 -976030 137722 864521
41324 864521 305668 -743345 -961728 -450538 -523141 -1673965 -2847414 -2896826 -1791573
41315 -1791573 -188262 1155049 1338893 7667 -1421425 -626961 2610364 5543006
41307 5543006 5737369 4020195 2746610 2318155 1406096 -91697 -726886 -238329 -361201
41298 -361201 -2133693 -4164334 -4621286 -3599458 -2384800 -1432417 -341330 832343 1503511
41289 1503511 1578298 1585115 1827459 2068557 2007614 1560962 728895 -419475 -1655861 -2681550
41279 -2681550 -3185267 -2820925 -1571878 -251514 -35427 -1145044 -2493271 -2978456 -2605759
41270 -2605759 -1974892 -1302884 -499004 363658 1260100 2354339 3290013 2973365 959671
41261 959671 -1431291 -2429059 -1957793 -1403221 -1438867 -1343749 -609341 71798 -18745 -482744
41251 -482744 -609423 -599017 -1090772 -1854599 -1879356 -817253 341247 358349 -791955 -1903914
41241 -1903914 -1941984 -1111545 -275152 387465 1441135 2844124 3454052 2522433 941171
41232 941171 44615 -252816 -871733 -1520756 -942385 589493 834794 -1428140 -4423251
41223 -4423251 -5630412 -4915093 -3965374 -3464725 -2600882 -1095544 57746 150113 -341900
41214 -341900 -788200 -1141020 -1256832 -719292 51049 -323954 -2287013 -4206140 -4128105
41205 -4128105 -2086049 240601 1614072 1999674 1706675 957957 245735 92616 331455
41196 331455 341159 -66106 -741127 -1929093 -3816403 -5449796 -5488567 -4295242 -3776317
41187 -3776317 -4471917 -4362760 -1846695 1373484 2168416 87054 -2323284 -3146067 -3122081
41178 -3122081 -3680442 -4706830 -5141409 -4500674 -2851387 -320730 2347888 3630447 2773099
41169 2773099 979947 74996 458455 1264450 1902583 2327714 2342017 1951674 2044536 3287436
41159 3287436 4591379 4279614 2753833 2177901 3165176 3739511 2475037 809546 811738
41150 811738 2158506 3093576 3238792 3402536 3325688 1945579 -166795 -893580 399093
41141 399093 1834508 1763763 752782 -170901 -1513245 -3954161 -6230496 -6329423 -4313218
41132 -4313218 -2184736 -1044463 -51980 1519520 2765757 2500697 1124898 219758 701479
41123 701479 2010790 2913610 2735760 1978917 1822719 2712940 3525266 2782983 751018
41114 751018 -600901 -107626 1076220 1196635 269410 -365235 -280900 -375338 -1082505 -1486022
41104 -1486022 -647353 1100933 2682831 3419277 3200221 2143857 625636 -752476 -1654508
41095 -1654508 -2195484 -2462671 -2351713 -2081227 -2185333 -2594402 -2424920 -1244067 115655
41086 115655 650646 421546 -53990 -846237 -1934052 -2164283 -428450 2311550 3699972
41077 3699972 2797807 823808 -976539 -2464485 -3160894 -1675866 2088648 5649621
41069 5649621 6515493 5138724 3784552 3337893 3021052 2610764 2727023 2944220 1840022
41060 1840022 -478795 -1845116 -1009767 467744 521966 -597851 -1276143 -1195224 -1260487
41051 -1260487 -1470793 -817320 630687 1262910 84344 -1932104 -3252263 -3499418 -3127360
41042 -3127360 -2350965 -1269332 -341905 212347 1035746 2724477 4605339 5357579 4708727
41033 4708727 3600816 2755029 2082751 1579748 1636038 2078106 2080955 1719771 2430181 4799211
41023 4799211 6910270 6509307 4262538 2930296 3317812 3211084 1095542 -1162891 -1004801
41014 -1004801 920773 1720162 492937 -693844 -260369 562228 -185435 -2262845 -3645988
41005 -3645988 -3072716 -1056425 1149427 2551257 2611041 1452222 48508 -417432 357497
40996 357497 1606042 2423008 2628705 2653923 2753368 2481529 1116429 -1248729 -3323985
40987 -3323985 -3895326 -3395558 -3402807 -4383504 -4918191 -3811964 -2054078 -1558276 -2482002
40978 -2482002 -3136907 -2497622 -1456821 -1218494 -1626317 -1839968 -1830511 -2224798 -3043521 -3531020
40968 -3531020 -3236833 -2554519 -2030746 -1684021 -1266507 -776165 -316282 283032 1131253
40959 1131253 1521901 183179 -3100311 -6388445 -6992933 -4333007 -806042 679131
40951 679131 -392465 -2224057 -3166227 -3143475 -2802379 -2419938 -2107373 -2227239 -2871176
40942 -2871176 -3359037 -2907840 -1570518 -32604 1223575 1999501 1957726 967944 -118320
40933 -118320 31626 1471912 2374878 969233 -2133908 -4351551 -4011982 -2131927 -899086
40924 -899086 -1002423 -1301289 -880131 -284056 -303753 -508564 58214 1157007 1366911 -123372
40914 -123372 -2507225 -4281204 -4539943 -3262028 -1089719 783163 1119109 -366941 -2674897
40905 -2674897 -4417569 -4861407 -4112391 -2822868 -1883391 -1830901 -2290562 -2490899 -2422999
40896 -2422999 -2709534 -3154024 -2586615 -800145 580325 316602 -362176 567081 2849988
40887 2849988 4354043 4214466 3553313 2932745 1356872 -1262545 -2691833 -1126232 1895879
40878 1895879 3141007 1603592 -825097 -2157600 -2110491 -1251658 -95180 570420 -76385
40869 -76385 -1608634 -2379782 -1568292 -321993 -90559 -601179 -480300 608562 1553695
40860 1553695 1427672 546886 -305501 -933835 -1580090 -2199180 -2376431 -1829602 -707394
40851 -707394 527186 1342740 1402865 786863 -112032 -1016350 -1933077 -2726451 -2790965 -1625666
40841 -1625666 267381 1580677 1570359 867724 594208 1003032 1475513 1596731 1532081
40832 1532081 1327385 598777 -724227 -1905648 -2149548 -1524784 -731629 -239396 -88213
40823 -88213 -254601 -654197 -922859 -750108 -392878 -351484 -554944 -414122 247311 869104
40813 869104 945175 647367 401827 260109 5606 -423461 -912499 -1332797 -1499408 -1232564
40803 -1232564 -688756 -345449 -404888 -517538 -388786 -306895 -634804 -1076351 -1028164 -531536
40793 -531536 -247121 -440235 -627476 -483165 -512037 -1284885 -2315656 -2380852 -1066035 522419
40783 522419 954026 140519 -624584 -275966 804824 1377730 807051 -405265 -1311470
40774 -1311470 -1299968 -320217 1106188 2011796 1649531 278231 -1086148 -1843348 -2249756
40765 -2249756 -2535836 -2334921 -1520240 -900094 -1201498 -1833246 -1713889 -1053927 -1038348 -1697054
40755 -1697054 -1568502 -55545 1306030 1052499 143298 535140 2042405 2504858 1117317
40746 1117317 -321263 -175876 710909 743675 286036 844356 2207384 2472907 1095467
40737 1095467 15590 929158 2872137 3676109 2824943 1556740 747093 97626 -730438
40728 -730438 -1415939 -1527157 -840005 892318 3482835 5586346 5623406 3782273 1999173
40719 1999173 1455499 1223471 130940 -1180626 -1268846 -202655 539566 198368 -560370
40710 -560370 -1093568 -1711542 -2777529 -3774488 -3822988 -2701861 -1047189 196579 527667
40701 527667 501746 1467906 4026255 6756985 7322633 5147023 2297014 1233108 2198276
40692 2198276 3339929 3018640 1386241 -192814 -710452 -290012 361168 908245 1524321
40683 1524321 2139260 2078083 864258 -919339 -2106080 -2160485 -1480694 -716682 -358187
40674 -358187 -750527 -1717393 -2235686 -1371743 326770 1214097 550581 -681141 -1247306
40665 -1247306 -1108693 -949939 -1021117 -1021847 -599445 485796 2140005 3483880 3294000 1480795
40655 1480795 -392368 -668692 644220 2062181 2216342 1031883 -213458 86273 2099040
40646 2099040 3786336 2909889 -61923 -2359754 -2528840 -1954512 -2053615 -1960480 -558319
40637 -558319 977367 849436 -413439 -1085935 -1371200 -2660633 -4182965 -3492568 -603471
40628 -603471 1336813 435961 -1500110 -2162701 -1937461 -2204095 -2545869 -1836367 -701798
40619 -701798 -676982 -1692628 -2315274 -1935327 -1046476 101578 1449731 2197052 1668403
40610 1668403 817666 1071700 1810144 967154 -1589383 -3302282 -2402238 -421504 81688
40601 81688 -936116 -1382032 -334693 805335 672876 -44036 189096 1415489 2269191
40592 2269191 2196238 2306208 3487734 4716547 4346670 2569520 1228518 1176085 1212214
40583 1212214 133736 -1453404 -2269815 -2291225 -2370239 -2600554 -2354279 -1655994 -1266480
40574 -1266480 -1383126 -1347858 -840457 -429046 -608971 -1040760 -1128252 -782271 -214506 581817
40564 581817 1673142 2687218 2890397 1918810 362505 -590796 -335313 433356 594197
40555 594197 170041 371707 1838029 3527061 3868238 2512088 462208 -1007821 -1078574
40546 -1078574 359367 2505777 4141303 4807570 4940698 4528283 2790743 18861 -1606440
40537 -1606440 -541946 1715928 2487932 1455054 408656 5404 -883811 -2568929 -3705308
40528 -3705308 -3668300 -3622559 -4339176 -4850622 -4302961 -3369963 -2660643 -1446164 612861
40519 612861 2064812 1694481 653680 724171 1496459 1276333 74881 -435347 318964
40510 318964 1123647 1164495 1111725 1651111 2436800 2980997 3316751 3283318 2306221 495959
40500 495959 -970696 -1204109 -645498 -249611 -275942 -445903 -791486 -1722931 -3383407
40491 -3383407 -5234482 -6249095 -5641025 -3770093 -2196707 -2242622 -3426745 -3901227 -2599418
40482 -2599418 -407462 1061695 1396644 1676730 2985103 4954411 5982800 4997303 2791440
40473 2791440 1085416 291260 -825249 -2789577 -3916606 -2473859 360145 1443823
40465 1443823 -403071 -3039740 -3980799 -3231429 -2344222 -1924599 -1332347 -224591 834171
40456 834171 1231316 1003911 659635 721259 1315472 1890383 1597439 326251 -869508
40447 -869508 -747845 836741 2776783 3589782 2429630 -177448 -2288304 -1866617 1187386
40438 1187386 4632620 6173785 6165386 7645921 13547598 23747395 34460135 40488517
40430 40488517 38847069 30960212 21330004 13846578 9462418 7075579 5524116 4187210
40422 4187210 2678872 1099056 205747 419854 960454 798212 81511 -358627 -544879
40413 -544879 -1173328 -2085135 -2333692 -1913131 -1948577 -2696127 -2809841 -1454670 121628
40404 121628 276053 -772018 -1691892 -2262370 -3258186 -4484303 -4606072 -3122731 -1132994
40395 -1132994 210584 814154 839514 57333 -1314144 -2221787 -2119862 -1844934 -2224507
40386 -2224507 -2605328 -1896227 -474789 264072 -17283 -324041 -117656 -3586 -298762
40377 -298762 -224626 706696 1474471 730831 -1286423 -2963184 -3263916 -2672884 -2135073
40368 -2135073 -1789420 -1188220 -422897 -359890 -1446391 -2684233 -2540603 -973318 298313
40359 298313 26175 -948390 -1187319 -866215 -1033780 -1272407 -93717 2289648 3707299
40350 3707299 3163375 2216183 2268480 2517917 2046141 1967363 3446713 5197606 5413580
40341 5413580 4964152 5843317 7218861 6270912 2980905 803635 1732608 3603269 3624807
40332 3624807 2064948 765398 152146 -334047 -503439 -104854 -20 -850102 -1743297
40323 -1743297 -1791335 -1845512 -2768113 -3287092 -1867654 254948 492924 -1167880 -2311826
40314 -2311826 -2017204 -1890472 -2819465 -3366357 -2315388 -547355 741715 1689954 2449025
40305 2449025 2154251 673572 -348475 148300 769291 -45768 -1348408 -1485866 -1299606
40296 -1299606 -2747619 -4951421 -4744715 -1514576 1461339 1640156 595420 1022984 2489820
40287 2489820 2578977 967605 -376682 -699206 -1445511 -3201355 -3987680 -1980449 1544266
40278 1544266 3531015 2666447 299000 -1607940 -2124280 -1232967 523938 1995684 2053162
40269 2053162 770446 -567591 -873664 -178046 884604 1754126 1926768 1127724 -20839
40260 -20839 -264350 682685 1418241 587082 -1065266 -1392475 395663 2625830 3181355
40251 3181355 1923040 456957 -145959 -544757 -1814484 -3617191 -4452992 -3630802 -2156609
40242 -2156609 -1331488 -1209846 -1070388 -730026 -409806 205738 1450417 2361487 1430374
40233 1430374 -970806 -2418855 -1497876 238323 401883 -1188266 -2834615 -3503690 -3617539
40224 -3617539 -3735380 -3817321 -3744139 -3556040 -3238713 -2998444 -3363251 -4183299 -4141275 -2409202
40214 -2409202 -216344 658093 482693 932117 2092379 2218129 839219 -51439 1017151
40205 1017151 2587434 2374319 587634 -554059 -106302 395636 -867986 -3664023 -5951100
40196 -5951100 -6027079 -4189925 -2287258 -1622056 -1629729 -1082078 -140371 -107420 -1218343 -2112528
40186 -2112528 -1973361 -1806970 -2726726 -4187015 -5075845 -5536799 -6272539 -6762035 -5842605
40177 -5842605 -3836170 -2444947 -2299065 -2067216 -606507 1205846 1766664 1152184 1037660
40168 1037660 2274251 3636026 3560716 2438874 2075839 2883328 2897127 468758 -2956848
40159 -2956848 -4168168 -2063027 1202200 3045277 3042369 2317326 1807952 1938970 2816923
40150 2816923 3746613 3437105 1601699 -447484 -1587420 -2279951 -3239438 -3817644 -3052931
40141 -3052931 -1475434 -427208 -244758 -515606 -1394462 -2976278 -3969005 -3009154 -1111673
40132 -1111673 -724498 -2148058 -2967841 -1654608 222342 424606 -908553 -1981220 -1988815
40123 -1988815 -1597997 -1378054 -1119538 -672825 -493409 -1045178 -2021730 -2436848 -1673213
40114 -1673213 -490299 -485672 -2064101 -3551650 -3288741 -2068641 -2034225 -3345150 -3815617
40105 -3815617 -2345599 -824054 -1399001 -3261079 -3773076 -2084321 -4492 612973 34974
40096 34974 -137925 887383 2275704 2733424 2160610 1730244 2119458 2309219 1066531
40087 1066531 -785735 -1030577 865062 2885781 3265802 2619942 2307704 2138427 1192436
40078 1192436 -126273 -599573 -224294 -72137 -341052 -140713 666199 846992 -505404
40069 -505404 -2639474 -3980901 -3700857 -2231758 -762282 -326632 -886519 -1259423 -368851
40060 -368851 1524289 3221034 3921726 3647277 2719272 1569184 812335 742532 906394
40051 906394 810912 725449 1054980 1374738 1054545 434968 237163 126692 -810715 -2334702
40041 -2334702 -3252936 -3374814 -3710744 -4501518 -4692214 -3869871 -3084395 -2977114 -2702766
40032 -2702766 -1758359 -1322792 -2336337 -3540883 -3155793 -1582584 -605320 -520443 -34437
40023 -34437 1201833 1948312 1481764 548458 -257949 -1396059 -2913957 -3613973 -2740490
40014 -2740490 -1297495 -500025 75272 1397517 2791276 2536426 520422 -1317399 -1571865
40005 -1571865 -1096450 -1436346 -2515074 -2912209 -2072111 -1236833 -1914578 -3884940 -5165675
39996 -5165675 -4081069 -1189372 1245938 1845969 1608616 2230702 3508567 3626888 1987648
39987 1987648 229206 -251154 -390656 -1752568 -3662742 -3796553 -1416029 1619416 3327337
39978 3327337 3680700 3732318 3934116 4117053 4211362 4112573 3444251 2223676 1302419 1470684
39968 1470684 2463654 3344017 3475798 2753684 1451317 299589 64854 500287 383243
39959 383243 -821667 -2095560 -2326673 -1743839 -1030636 -52325 1267569 1788729 609025
39950 609025 -960936 -877422 441925 592641 -964964 -1865235 -474916 1604367 2093851
39941 2093851 1332829 1177385 1852983 2043826 1562739 1753460 3024470 3814730 2806893
39932 2806893 965378 370809 1601859 3184465 3532288 2723678 2083114 2384795 2999468
39923 2999468 2908130 2059320 1244109 899998 697506 275986 -301208 -943552 -1700812 -2307095
39913 -2307095 -2218643 -1417992 -582847 -167711 45941 229765 164878 29588 568375 1745300
39903 1745300 2126776 639955 -1701217 -2987124 -2915351 -2850002 -3484950 -3700802 -2099117
39894 -2099117 1166743 4545365 6731447 8081374 10621514 16229213 24073024 30131997
39886 30131997 30305169 24300971 15908572 9394239 6203980 5021955 3969295 2273536
39878 2273536 483448 -342052 153016 1042475 1026797 -100822 -1366938 -1945881 -1880142
39869 -1880142 -1361671 -142307 1826032 3736622 4531259 3925249 2477610 962310 14149
39860 14149 -43967 365223 46825 -1820749 -4404925 -5705196 -4666227 -2374746 -681440
39851 -681440 26900 917788 2604824 3970103 3729436 2402819 1662745 2064513 2597930
39842 2597930 2429562 1832885 1219457 594003 370136 1254337 2613502 2541260 694566
39833 694566 -468937 1129293 4107336 5635764 5356041 4946871 4698637 3470268 1891485
39824 1891485 2410889 5363544 7824813 7719747 6682399 7240216 9295216 11304472 13102920
39815 13102920 15258436 16916595 16716984 15182305 14001154 13333891 11918038 9685053
39807 9685053 8173768 8046699 8013822 6855304 5122081 4064752 3830291 3474314 2266078
39798 2266078 484081 -863843 -945200 142719 1592336 2820098 3668500 3701665 2418130
39789 2418130 630537 253857 1680584 2738601 1803888 647574 1964492 4882544
39781 4882544 5656680 2887384 -612390 -1891527 -1422022 -1293250 -1759405 -1381720 389152
39772 389152 2413199 3360785 2990457 2036651 1335951 941972 112134 -1399899 -2438487
39763 -2438487 -1895466 -741784 -1003206 -2657582 -3479515 -2500094 -1523461 -2065323 -2790250
39754 -2790250 -1784827 158516 730465 -274348 -756607 448044 2040072 2224073 815762
39745 815762 -943039 -1714749 -1044433 258140 731799 -146719 -1256659 -1318823 -540369
39736 -540369 78153 458256 1274063 2435325 2997238 2493706 1339994 97009 -667112
39727 -667112 -141976 1821811 3772523 4018915 2976045 2806792 4534660 6782365 7649860
39718 7649860 6618251 4269952 1424082 -843364 -1438910 -347858 1121823 1703571
39710 1703571 1277831 469076 -86274 75219 845981 1109783 -229677 -2418856 -3212874
39701 -3212874 -1673977 477082 1102992 268659 -361520 20380 647627 554185 -314795
39692 -314795 -1283682 -1590839 -950014 107400 663901 507588 423984 1044524 1866657 1920478
39682 1920478 1053436 30379 -427134 -282732 -26632 -184410 -881971 -1759089 -2392191
39673 -2392191 -2677419 -2600612 -2044050 -1341611 -1457119 -2641642 -3407143 -2222602 -1193
39664 -1193 755944 -631295 -2279452 -2737355 -2702889 -3000195 -2956150 -2071190 -1388617 -1593079
39654 -1593079 -1473301 -131339 880679 -176885 -2166529 -2716455 -1906719 -1678978 -2278141
39645 -2278141 -2147976 -1130092 -824230 -1506082 -1551806 -630194 -735939 -2857206 -4992138
39636 -4992138 -5000316 -3514439 -2422456 -2059497 -1610525 -1053982 -937759 -994981 -543425 194871
39626 194871 434611 177994 247227 1178663 2672411 3791154 3441190 1420694 -700778
39617 -700778 -805609 1155009 2907712 2825114 1819085 1434569 1559372 1349839 1085827
39608 1085827 1390566 1583670 692052 -497931 -294921 1258063 2407482 2316019 1889426
39599 1889426 1717044 907053 -1248276 -3666132 -4516530 -3347561 -1524769 -779586 -1610336
39590 -1610336 -2971074 -3478663 -2946938 -2402367 -2489587 -2605359 -2099674 -1475299 -1490621 -1772245
39580 -1772245 -1429190 -514040 321088 1159935 2459291 3672885 3745762 2922164 2552278
39571 2552278 2977690 3122768 2478283 1931412 2057643 2089915 1456323 1010415 1550350 2101319
39561 2101319 1066601 -1364777 -3255165 -3350330 -2452150 -2058472 -2314293 -1914580 22184
39552 22184 2515832 3689983 3092719 2246762 2470973 3043829 2505476 1081777 343094
39543 343094 640979 488556 -1161385 -3397334 -4683749 -4583719 -3546669 -2033349 -560166
39534 -560166 298721 685937 1450950 2725003 3371114 2614096 1387215 1142779 1957042
39525 1957042 2695713 2520399 1397589 -357544 -2142730 -3058507 -2682189 -1632931 -810560
39516 -810560 -482869 -611186 -1365539 -2556636 -3280197 -3096660 -2912006 -3553322 -4075901
39507 -4075901 -2935208 -556374 879393 402082 -484547 -79624 1211680 1750819 1042567
39498 1042567 197191 258720 927641 1113241 252003 -1261976 -2742525 -3799722 -4088728
39489 -4088728 -3056393 -705460 1603453 2155472 924528 -351363 -486576 -132046 -194014
39480 -194014 -341485 -188029 -629895 -2315968 -3756146 -3057577 -1092091 -640265 -2288960
39471 -2288960 -3491242 -2329286 -35175 1320234 1701867 2165024 2622423 2416514 2082016
39462 2082016 2600225 3463507 3348188 2463403 2369948 3335411 3669971 2289588 428913
39453 428913 -138086 513986 943572 507761 -105011 -232859 -80798 -92340 -235128 -196896
39443 -196896 135044 610561 949307 810124 21113 -1091349 -1837063 -1807597 -1233454 -602083
39433 -602083 -167242 -4422 -247176 -886089 -1425524 -1089756 549285 3224612 6124754
39424 6124754 8380614 9907172 12092795 16911153 24287704 30623138 31353783 25528032
39416 25528032 16942111 10250733 6880767 5343427 4264535 3590106 3350044 2939028
39408 2939028 1968665 803976 -86898 -608682 -725026 -423157 -157344 -535893 -1262002
39399 -1262002 -1120513 508506 2653090 3778730 3511716 2876910 2893837 3247287 2543288
39390 2543288 31199 -3025592 -4254623 -2781905 -356580 731153 250257 -387092
39382 -387092 -584945 -1140965 -2348133 -3065119 -2326400 -756854 420962 989413 1528398
39373 1528398 2156004 2289073 1490505 91808 -962079 -865619 132960 757475 248082
39364 248082 -475576 -258701 53857 -1385461 -4003729 -4607420 -1729320 1870397 2875539
39355 2875539 1916623 1999013 3583128 4230399 2980483 1952047 2648061 3357480 2036597
39346 2036597 -115328 -254354 1839058 3409959 2650163 948336 493920 1175001 1220207
39337 1220207 164107 -523939 -389 305039 -1218396 -3484180 -3643662 -963783 1920428
39328 1920428 2388693 1010050 70479 151735 62280 -429216 -56814 1431575 2244710
39319 2244710 995574 -1283441 -2691253 -2887648 -2756989 -2580824 -2000719 -1282462 -1130860
39310 -1130860 -1375622 -1182544 -607774 -582922 -1072372 -689770 1055699 2371849 1359764
39301 1359764 -1101326 -2169567 -674115 1522129 2209220 1550690 1186999 1631444 1967109
39292 1967109 1739384 1588785 1751699 1342913 -102499 -1434929 -1308148 -146063 460654
39283 460654 -17442 -651304 -869952 -1394962 -2876100 -4587610 -5269609 -4698027 -3629662
39274 -3629662 -2518610 -1153497 387932 1213174 552514 -1063437 -2113469 -1731757 -730271
39265 -730271 -629953 -1784435 -2966718 -2984318 -2150513 -1632425 -1738321 -1660483 -865433 121032
39255 121032 576332 474066 90900 -554186 -1202979 -949926 637904 2282908 2094215
39246 2094215 69978 -1678780 -1741656 -1299928 -2181043 -3948424 -4522386 -3411012 -2506085
39237 -2506085 -3210474 -4433810 -4457266 -3402614 -2358566 -1060273 1606774 5072854 7028245
39228 7028245 6301306 4255244 2772946 2205465 1951689 1724768 1325650 287099 -1216328
39219 -1216328 -2025474 -1607666 -1160518 -1970094 -3402630 -3754402 -2524858 -640226 1029361
39210 1029361 2075054 1988370 710239 -501576 -283105 777242 746836 -900249 -2608903
39201 -2608903 -3059512 -2690190 -2459442 -2494999 -2643210 -3111724 -3717890 -3521463 -2145585
39192 -2145585 -707041 -521443 -1412603 -2098209 -1837137 -981266 -199863 187918 215034
39183 215034 31708 -326238 -982408 -1832219 -2228941 -1523487 112409 1854293 3067009
39174 3067009 3471918 2888636 1716863 1309621 2600602 4450841 4729063 3102848 1284508
39165 1284508 347822 -435659 -1555132 -1942499 -782017 912482 1801036 2039226 2355524
39156 2355524 2518714 2096469 1683590 1952458 2407648 2486144 2952394 4644811 6643718
39147 6643718 7316736 6566186 5538083 4836697 4652050 5812647 8657655 11363092 11550313
39138 11550313 9386104 7046308 5307529 3018562 88553 -1595031 -1105111 -149375
39130 -149375 -597933 -2010346 -2807701 -2496434 -1571508 -429840 491927 549608 -85324
39121 -85324 -176887 844006 1816490 1431579 -36388 -1464583 -2361303 -2624869 -1836832
39112 -1836832 -21272 1662787 2222584 2237270 2843137 3917386 4453553 4223264 3835547
39103 3835547 3548467 3254202 3325636 4197566 5255901 5377522 4572868 3993821 4316224
39094 4316224 5189116 6261115 7540792 8565764 8426595 7044580 5443209 4341684
39086 4341684 3422944 2415589 1834552 1927600 1827430 743532 -645479 -1096961 -753014
39077 -753014 -984452 -2205769 -2957539 -1751472 803952 2439044 1655356 -758509 -2688398
39068 -2688398 -2853233 -1841415 -1136210 -1358484 -1662400 -867056 1080731 3057942 4069107
39059 4069107 4160516 3912778 3530746 2900400 2203237 1753823 1246142 -66531 -2130370
39050 -2130370 -3669039 -3530747 -2055944 -566745 196527 538909 924764 1318102 1468709
39041 1468709 1326901 997785 585120 171359 -251624 -829904 -1676266 -2744119 -3939106
39032 -3939106 -5061420 -5558098 -4913948 -3608585 -2966547 -3435732 -3735306 -2613967 -796464
39023 -796464 13427 -421008 -872709 -868580 -1203353 -1973636 -1770754 339647 3180502 4648015
39013 4648015 3798619 1285567 -1413012 -2773146 -2229297 -955773 -772165 -1898081 -2858092
39004 -2858092 -2900620 -2982783 -3691640 -3946520 -3005665 -2135164 -2571981 -3120400 -1779738 1106049
38994 1106049 3384361 4171466 4235151 3637705 1390131 -2207235 -4996193 -5498135 -4430683
38985 -4430683 -3019874 -1347913 713619 2261091 2256416 963729 -428022 -1192199 -1528181
38976 -1528181 -2075125 -3266761 -4654648 -4827243 -2883156 -126947 867935 -624889 -2451070
38967 -2451070 -2383478 -852614 172848 85649 -37683 383614 502241 -365762 -1362045
38958 -1362045 -1089005 468868 1799117 1717147 829167 690806 1731822 2746937 2665567
38949 2665567 1994699 1764665 1711461 712347 -1169935 -2392616 -1922285 -389459 1110781
38940 1110781 2252333 2952544 2740052 1595314 638665 905574 1839172 1958682 827537
38931 827537 -483481 -851360 -323987 199554 33625 -692733 -1304953 -1419623 -1446875 -1953391
38921 -1953391 -2584241 -2269210 -762860 689302 756315 -348528 -1165072 -595713 1186451
38912 1186451 3047038 3651177 2298478 -438699 -3047392 -4333057 -4151995 -2925768
38904 -2925768 -1167132 246659 293499 -960151 -2063946 -1920002 -1143532 -839147 -837460
38895 -837460 -401428 -14715 -766831 -2099704 -1984050 175400 2341340 2393452 739976
38886 739976 -580937 -569266 17935 108073 -560886 -1613250 -2542462 -3018732 -3169567 -3471702
38876 -3471702 -3998291 -4034599 -2950753 -1231426 -32228 164162 -189544 -702653 -1486432
38867 -1486432 -2387871 -2614833 -1728394 -489156 1177 -263405 -347166 138956 532729
38858 532729 313649 22437 438977 1340373 1778476 1441516 1119764 1732381 3284463
38849 3284463 4875363 5467521 4616983 2718098 654923 -834937 -1448393 -1159485 -266385
38840 -266385 342617 -251786 -1655888 -2109023 -628976 1379182 1778403 550672 -384210
38831 -384210 -58404 445083 82347 -608450 -839737 -1022430 -1758465 -2468119 -2267596 -1446893
38821 -1446893 -873788 -561865 -45552 372782 93601 -394546 -1750 1105056 1415581
38812 1415581 123451 -1698216 -2287185 -929124 1577673 3580084 3713600 2034235
38804 2034235 21032 -1002616 -1172139 -1294483 -1397810 -1071845 -713205 -1045370 -1592190
38795 -1592190 -1109601 372745 1401568 1254538 766956 553795 -43776 -1411189 -2463007
38786 -2463007 -2152267 -1139747 -730667 -925199 -778974 -133586 308394 326122 344614 334191
38776 334191 -251085 -1210784 -1294789 307497 2749938 4295988 4051144 2646626 1417250
38767 1417250 1210907 1946176 2973572 3544302 3023777 1236350 -993772 -2112966 -1392055
38758 -1392055 -21869 167656 -970120 -1807309 -1279400 -189824 276088 236641 488895
38749 488895 1018731 1086098 292526 -1228193 -3183394 -4922412 -5442054 -4509019 -3285322
38740 -3285322 -2847595 -2562470 -1125355 1122809 2355001 1800795 723890 429710 537414
38731 537414 -7493 -1113898 -1694304 -1214958 -296420 137785 -181404 -726608 -718478 113032
38721 113032 1177804 1580606 1090899 351762 99858 446320 933684 972757 224228 -1051490
38711 -1051490 -2007263 -2031645 -1574908 -1567907 -1944338 -1554082 56117 1614207 1691876 759187
38701 759187 617552 1907487 3267031 3272822 2276938 1621367 1629564 1323622 42874 -1529626
38691 -1529626 -2239858 -1729279 -415165 1242534 2786954 3423235 2564909 853251 -188759
38682 -188759 69171 594996 262831 -411229 -15236 1502045 2386420 1236135 -1139833
38673 -1139833 -2604301 -2047878 -268656 1336936 2278241 2906046 3332200 3057545 1760989
38664 1760989 -50112 -1572742 -2603126 -3372273 -3642948 -2737025 -709145 1189505 1747121
38655 1747121 1075873 183437 -307979 -428810 -285538 -58362 -379418 -1787482 -3718243
38646 -3718243 -4846629 -4619714 -3719289 -2845043 -1943300 -1045979 -903916 -1945280 -3256010
38637 -3256010 -3588648 -3020549 -2564743 -2292108 -1065400 1515158 3959247 4433484 2864697
38628 2864697 777654 -506387 -701471 29509 1341935 2263116 1629217 -344502 -1659836
38619 -1659836 -550545 2434844 5061736 5814369 4948428 3485151 2188933 1559521 1798557
38610 1798557 2423180 2660820 2519305 2733060 3401358 3575171 2634264 1189169 60552
38601 60552 -734926 -1307789 -1198219 -329974 209190 -457815 -1488935 -1443277 -373232 525367
38591 525367 855335 1084134 1003800 -135918 -1934680 -2972388 -2848778 -2473780 -2094746
38582 -2094746 -874191 1046653 2028608 1431936 773597 1104520 1009493 -1009762 -3590085
38573 -3590085 -4109886 -2436266 -924478 -994558 -1695761 -1707621 -979643 -56066 779699
38564 779699 1286478 1327871 1408944 2109645 2872846 2504236 1038698 -93971 -31325 581378
38554 581378 948932 1215745 1710009 2223298 2616787 3127894 3538388 3123369 2048605
38545 2048605 1643173 2430689 3033370 2138610 536021 -161229 -27426 -458693 -1706197
38536 -1706197 -2466920 -2029885 -1330045 -1410200 -1991526 -2153452 -1564609 -447249 1004748
38527 1004748 2552901 3686996 3969681 3347941 1895016 -299411 -2677043 -4197365
38519 -4197365 -4340236 -3817911 -3745163 -4290870 -4690392 -4478601 -4059144 -3868589 -3536667 -2397036
38509 -2397036 -674557 397876 -74219 -1451497 -2135172 -1352971 29800 664046 266988
38500 266988 -395174 -751253 -981496 -1355281 -1738304 -2055200 -2657443 -3737748 -4743457
38491 -4743457 -4904839 -4159385 -3090504 -2124110 -1303144 -741272 -661332 -868372 -747974
38482 -747974 -45606 780030 1239575 1419987 1537407 1242855 -90372 -2447274 -4902093
38473 -4902093 -6265497 -5834647 -3728567 -847324 1611633 2973613 3431037 3397407 2807538
38464 2807538 1515715 135804 -263785 582442 1785880 2379933 2196252 1524286 601838
38455 601838 -193069 -326385 140151 288254 -573787 -2005336 -3171229 -3917909 -4346951
38446 -4346951 -3940165 -2307128 -499091 -155562 -1208428 -1825172 -1065094 -203614 -626400
38437 -626400 -1714257 -2038364 -1627311 -1482070 -1467751 -513828 1147851 1775527 638893
38428 638893 -832578 -1229070 -1069091 -1369645 -1545971 -423524 1320974 1664014 209190
38419 209190 -1168494 -1194519 -1033309 -2166357 -3769635 -3804947 -2053148 -366261 -11748
38410 -11748 -368970 -564783 -878710 -1721893 -2413020 -2112817 -1283930 -1078971 -1648724 -2126173
38400 -2126173 -2084319 -1928972 -1864429 -1585058 -1233333 -1569269 -2610940 -3012718 -1676880
38391 -1676880 526419 1587698 774379 -595368 -913141 -144310 435564 -20540 -958975
38382 -958975 -1217209 -453793 484250 572621 -319540 -1543479 -2584956 -3457952 -4234742
38373 -4234742 -4634300 -4281573 -3157198 -1665438 -413728 81631 -247924 -903669 -1309169
38364 -1309169 -1419128 -1541411 -1644986 -1361816 -704094 -145656 193021 741413 1497150
38355 1497150 1591989 517214 -764365 -803946 440967 1495850 1149315 -314535 -1755111
38346 -1755111 -2471720 -2602114 -2549595 -2335623 -1638455 -509434 225818 -196371 -1303125
38337 -1303125 -1817507 -1418739 -1089341 -1299996 -1100581 52831 857943 111294 -890829
38328 -890829 64809 2589968 4011183 3235615 1967929 1594207 1293190 334884 -104368
38319 -104368 785152 1268655 -557483 -3440502 -4397273 -2796251 -760164 131768 273090
38310 273090 195904 -402591 -1314937 -1473554 -681829 -81904 -195435 -65735 830911 1378733
38300 1378733 624344 -573027 -975683 -910013 -1329000 -1835540 -1293001 54629 699235
38291 699235 48124 -910026 -1237753 -1073316 -721884 77445 1335710 2147050 1699839
38282 1699839 569232 230455 1301288 2817600 3441321 3014960 2492170 2403946 2040841
$$ [...]
##END NTUPLES=NMR SPECTRUM
##END=
