##TITLE=31Pdec_LR-685A-OC1-H
 D2O, 24 sc
 18.9.2019
##JCAMPDX= 6.0         $$ Bruker NMR JCAMP-DX V2.0
##DATA TYPE= NMR SPECTRUM
##DATA CLASS= NTUPLES
##ORIGIN= UXNMR, Bruker Analytische Messtechnik GmbH
##OWNER= root
$$ XWIN-NMR		Version 3.5
$$ Wed Sep 18 14:19:28 2019 Russian Standard Time (UT+4h)  she@DPX200
##.OBSERVE FREQUENCY= 81.013821
##.OBSERVE NUCLEUS= ^31P
##.ACQUISITION MODE= SIMULTANEOUS
##.ACQUISITION SCHEME= undefined
##.AVERAGES= 24
##.DIGITISER RES= 17
##SPECTROMETER/DATA SYSTEM= spect
##.PULSE SEQUENCE= zgpg30
##.SOLVENT NAME= CDCl3
##.SHIFT REFERENCE= (INTERNAL, CDCl3, 0, 182.463)
##AUDIT TRAIL= $$ (NUMBER, WHEN, WHO, WHERE, WHAT)
$$ ##TITLE= Audit trail, XWIN-NMR		Version 3.5
$$ ##JCAMPDX= 5.01
$$ ##ORIGIN= Bruker BioSpin GmbH
$$ ##OWNER= she
$$ F:/spectra/data/she/nmr/P31/1/pdata/1/auditp.txt
$$ ##AUDIT TRAIL=  $$ (NUMBER, WHEN, WHO, WHERE, WHAT)
(   1,<2019-09-18 14:18:36.34 +0400>,<she>,<DPX200>,
      <created by zg, POWCHK disabled, PULCHK disabled
       configuration hash MD5:
       00 E9 B6 7A A2 85 ED C7 34 08 36 98 17 FE 4E 26
       data hash MD5: 32K
       1C D2 97 50 66 99 52 D9 07 B6 D1 DE 29 9B BD 7F>)
(   2,<2019-09-18 14:18:38.93 +0400>,<she>,<DPX200>,
      <Start of raw data processing
       efp BC_mod = 2 LB = 1 FT_mod = 6 PKNL = 1 PHC0 = -391.3937 PHC1 = 103.8003 SI = 64K 
       data hash MD5: 64K
       5E AB 6B 76 BA 56 3B 01 CD 50 F5 28 06 DA 4E 85>)
(   3,<2019-09-18 14:18:52.40 +0400>,<she>,<DPX200>,
      <pk PHC0 = -25.70385 PHC1 = 0 
       data hash MD5: 64K
       64 39 4F 99 34 E7 45 D8 26 F9 0B F8 2D 95 85 40>)
$$ ##END=
$$ 
$$ hash MD5
$$ F9 50 DF 76 B3 ED AA E4 F7 90 40 7D A6 45 9F A8
##$RELAX= 
##$RELAX= 
##$RELAX= 
##$RELAX= 
##$RELAX= 
##$RELAX= 
##$RELAX= 
##$RELAX= 
$$ Bruker specific parameters
$$ --------------------------
##$DU= <F:/spectra>
##$EXPNO= 1
##$NAME= <P31>
##$PROCNO= 1
##$TYPE= <nmr>
##$USER= <she>
##$AMP= (0..31)
100 100 100 100 100 100 100 100 100 100 100 100 100 100 100 100 100 100 
100 100 100 100 100 100 100 100 100 100 100 100 100 100 
##$AQSEQ= 0
##$AQ_mod= 1
##$AUNM= <au_zg>
##$AUTOPOS= <>
##$BF1= 81.014009
##$BF2= 200.13
##$BF3= 200.13
##$BF4= 200.13
##$BF5= 200.13
##$BF6= 200.13
##$BF7= 200.13
##$BF8= 200.13
##$BYTORDA= 1
##$CFDGTYP= 0
##$CFRGTYP= 5
##$CHEMSTR= <none>
##$CNST= (0..31)
1 1 145 1 1 1 1 1 1 1 1 1 1 1 1 1 1 1 1 1 1 1 1 1 1 1 1 1 1 1 1 1 
##$CPDPRG= <waltz16>
##$CPDPRG1= <>
##$CPDPRG2= <waltz16>
##$CPDPRG3= <>
##$CPDPRG4= <mlev>
##$CPDPRG5= <mlev>
##$CPDPRG6= <mlev>
##$CPDPRG7= <mlev>
##$CPDPRG8= <mlev>
##$CPDPRGB= <>
##$CPDPRGT= <>
##$D= (0..31)
0 1 0 0 0 0 0 0 0 0 0 0.03 2e-05 3e-06 0 0 0 0 0 0 0 0 0 0 0 0 0 0 0 0 
0 0 
##$DATE= 1568801915
##$DBL= (0..7)
120 120 120 11 120 120 24 19 
##$DBP= (0..7)
150 150 150 150 150 150 150 150 
##$DBP07= 0
##$DBPNAM0= <>
##$DBPNAM1= <>
##$DBPNAM2= <>
##$DBPNAM3= <>
##$DBPNAM4= <>
##$DBPNAM5= <>
##$DBPNAM6= <>
##$DBPNAM7= <>
##$DBPOAL= (0..7)
0.5 0.5 0.5 0.5 0.5 0.5 0.5 0.5 
##$DBPOFFS= (0..7)
$$ [...]
##$SUBNAM2= <"">
##$SUBNAM3= <"">
##$SUBNAM4= <"">
##$SUBNAM5= <"">
##$SUBNAM6= <"">
##$SUBNAM7= <"">
##$SUBNAM8= <"">
##$SUBNAM9= <"">
##$SW= 369.568048894756
##$SWIBOX= (0..15)
0 1 3 0 0 0 0 0 0 0 0 0 0 0 0 0 
##$SW_h= 29940.119760479
##$TD= 32768
##$TD0= 1
##$TE= 0
##$TE2= 300
##$TE3= 300
##$TEG= 300
##$TL= (0..7)
0 120 53 12 22 120 120 120 
##$TP= (0..7)
150 150 150 150 150 150 150 150 
##$TP07= 0
##$TPNAME0= <>
##$TPNAME1= <>
##$TPNAME2= <>
##$TPNAME3= <>
##$TPNAME4= <>
##$TPNAME5= <>
##$TPNAME6= <>
##$TPNAME7= <>
##$TPOAL= (0..7)
0.5 0.5 0.5 0.5 0.5 0.5 0.5 0.5 
##$TPOFFS= (0..7)
0 0 0 0 0 0 0 0 
##$TUNHIN= 0
##$TUNHOUT= 0
##$TUNXOUT= 0
##$USERA1= <user>
##$USERA2= <user>
##$USERA3= <user>
##$USERA4= <user>
##$USERA5= <user>
##$V9= 5
##$VALIST= <valist>
##$VCLIST= <CCCCCCCCCCCCCCC>
##$VD= 0
##$VDLIST= <DDDDDDDDDDDDDDD>
##$VPLIST= <PPPPPPPPPPPPPPP>
##$VTLIST= <TTTTTTTTTTTTTTT>
##$WBST= 1024
##$WBSW= 4
##$XGAIN= (0..3)
0 0 0 0 
##$XL= 0
##$YL= 0
##$YMAX_a= 17682
##$YMIN_a= -17251
##$ZGOPTNS= <>
##$ZL1= 120
##$ZL2= 120
##$ZL3= 120
##$ZL4= 120
##$ABSF1= 0
##$ABSF2= 0
##$ABSG= 0
##$ABSL= 0
##$ALPHA= 0
##$AQORDER= 0
##$ASSFAC= 0
##$ASSFACI= 0
##$ASSFACX= 0
##$ASSWID= 0
##$AUNMP= <proc_1d>
##$AZFE= 0.1
##$AZFW= 0.5
##$BCFW= 0
##$BC_mod= 2
##$BYTORDP= 0
##$COROFFS= 0
##$CY= -3
##$DATMOD= 1
##$DC= 0
##$DFILT= <>
##$DTYPP= 0
##$F1P= 0
##$F2P= 0
##$FCOR= 1
##$FTSIZE= 65536
##$FT_mod= 6
##$GAMMA= 0
##$GB= 0
##$INTBC= 1
##$INTSCL= 5.30512e-09
##$ISEN= 30
##$LB= 1
##$LEV0= 0
##$LPBIN= 0
##$MAXI= 10000
##$MC2= 0
##$MEAN= 0
##$ME_mod= 0
##$MI= 50
##$NCOEF= 0
##$NC_proc= -5
##$NLEV= 6
##$NOISF1= 182.463
##$NOISF2= 159.3651
##$NSP= 0
##$NTH_PI= 0
##$NZP= 0
##$OFFSET= 182.463
##$PC= 4
##$PHC0= -417.0976
##$PHC1= 103.8003
##$PH_mod= 1
##$PKNL= yes
##$PPARMOD= 0
##$PSCAL= 0
##$PSIGN= 0
##$REVERSE= no
##$SF= 81.0140089999434
##$SI= 65536
##$SIGF1= 159.3651
##$SIGF2= -187.1042
##$SINO= 113.3802
##$SIOLD= 16384
##$SREGLST= <1H.CDCl3>
##$SSB= 0
##$STSI= 65536
##$STSR= 0
##$SW_p= 29940.119760479
##$SYMM= 0
##$S_DEV= 0
##$TDeff= 32768
##$TDoff= 0
##$TI= <>
##$TILT= no
##$TM1= 0
##$TM2= 0
##$TOPLEV= 0
##$USERP1= <user>
##$USERP2= <user>
##$USERP3= <user>
##$USERP4= <user>
##$USERP5= <user>
##$WDW= 1
##$XDIM= 65536
##$YMAX_p= 417774992
##$YMIN_p= -4761783
$$ End of Bruker specific parameters
$$ ---------------------------------
##NTUPLES= NMR SPECTRUM
##VAR_NAME=  FREQUENCY,     SPECTRUM/REAL,   SPECTRUM/IMAG
##SYMBOL=    X,             R,               I
##VAR_TYPE=  INDEPENDENT,   DEPENDENT,       DEPENDENT
##VAR_FORM=  AFFN,          ASDF,            ASDF
##VAR_DIM=   65536,         65536,           65536
##UNITS=     HZ,            ARBITRARY UNITS, ARBITRARY UNITS
##FACTOR=    0.456856943014862, 1,           1
##FIRST=     14782.0589164792, 0,            0
##LAST=      -15158.0608439998, 0,           0
##MIN=       -15158.0608439998, -4761783,    0
##MAX=       14782.0589164792, 417774992,    0
$$ Real data points
##PAGE= N=1
##DATA TABLE= (X++(R..R)), XYDATA
$$ [...]
42675i64896r39897j71802Q31134J166775O88956J07751q5939j44708l05238k36382
$$ -964896 -1904793 -2076595 -1245461 -78686 610270 718021 632082 487374 182136 -54246
42665e4246K76415P06919M88942q5880l33638k04578j36089j37583J69701O62529
$$ -54246 222169 929088 1418030 1332150 998512 793934 657845 520262 689963 1352492
42655A352492O66712n1980q80150j137974p79980j82627K93209M01862J38957
$$ 1352492 2019204 1967224 1087074 -50900 -830880 -1013507 -720298 -318436 -179479
42646a79479j02197P0825M32083M16386N5746j2484L64551N01885r694n45908
$$ -179479 -281676 -210851 221232 637618 693364 680880 1045431 1547316 1537622 991714
42636I91714l78687K13484M49664K13150n0093k66296o87688j045851o92983K74895
$$ 991714 613027 826511 1276175 1489325 1439232 1172936 485248 -560603 -1253586 -978691
42626i78691Q90684O28728J01367J7031J44992n2629l36000r2253M73540N08385
$$ -978691 -88007 540721 642088 659119 804111 751482 415482 323229 796769 1305154
42616A305154j00462m26737Q1562O69820L26022p64182j473237j165957k63893
$$ 1305154 1204692 777955 859517 1529337 1855359 1091177 -382060 -1548017 -1811910
42607a811910M76177O67402L29031k33025n36107l56025o2602r7940k16676J48489
$$ -1811910 -1335733 -668331 -339300 -572325 -1108432 -1464457 -1527059 -1624999 -1841675 -1693186
42597a693186P90027P91541p3695q10041n50200K41053N60158L22024K32183N18699
$$ -1693186 -903159 -111618 -185313 -995354 -1545554 -1304501 -744343 -422319 -190136 328563
42587C28563O37474K12227m25168p31816m98601J38412P88961R23217L65258l19600
$$ 328563 966037 1178264 753096 21280 -477321 -338909 450052 1373269 1738527 1418927
42577A418927m03765K3036J77448k42162o03712l29200K01292K00434l74880p49181
$$ 1418927 1015162 1038198 1215646 973484 369772 40572 241864 442298 67418 -681763
42567f81763l80266L34978N85402J50969l94754m69999j62731P9495J64770L23015
$$ -681763 -1062029 -727051 -141649 9320 -385434 -855433 -1018164 -938669 -773899 -450884
42557d50884M68396J94952m46387p52436k81506N10547R09566P69894L34090k51798
$$ -450884 17512 212464 -233923 -986359 -1267865 -757318 152248 922142 1256232 1004434
42547A004434p56852p30203j58076K28812k6176k89555J63075Q50543P93355J13127
$$ 1004434 247582 -482621 -640697 -411885 -438061 -727616 -564541 286002 1079357 1192484
42537A192484k35232q6933j56338n62313n93132r6970J94946L5704Q3615N47361
$$ 1192484 957252 870319 713981 151668 -441464 -538434 -343488 -307784 -224169 323192
42527C23192O85462K08523q5050K21514L01047m28593j125575q87244k29090j4466
$$ 323192 1008654 1217177 1132127 1353641 1654688 1226095 100520 -786724 -1015814 -1030280
42517a030280J06359P90417J355807O69336p83064j361641o59464J15688J67422
$$ -1030280 -923921 -133504 1222303 1891639 1108575 -253066 -912530 -796842 -629420
42508f29420K0081J72087K58120K2336p8608J91435L21589J1647k62704j87344
$$ -629420 -609339 -437252 -179132 -156796 -235404 -43969 277620 289267 26563 -160781
42498a60781j98223n07847m58715L33776R88112N14576n82101r40620k87741L39586
$$ -160781 -359004 -866851 -1325566 -991790 -3678 510898 -71203 -1011823 -1299564 -959978
42488i59978K46174j25448k44549l23065n90527n45749K89954J305965J334581
$$ -959978 -713804 -839252 -1083801 -1406866 -1997393 -2543142 -2253188 -947223 387358
42479C87358K03166r37589r96294j39241O15795N86603o3547o52608n14029M74140
$$ 387358 590524 -347065 -1343359 -1482600 -866805 -280202 -343749 -996357 -1510386 -1036246
42469a036246J553186J605709M42205p55578q15319q6566J38675n07366j089167
$$ -1036246 516940 2122649 2564854 1809276 993957 907391 1046066 538700 -550467
42460e50467q56668j37392M79264Q79868R57636L76542n93537r03076j61002N42994
$$ -550467 -1407135 -1544527 -1065263 -185395 772241 1148783 555246 -347830 -508832 34162
42450C4162J60772o79441o59266J41768M21895k83844r87324p95687N506O64499
$$ 34162 194934 -484507 -1143773 -1002005 -580110 -863954 -1851278 -2646965 -2641459 -1976960
42440a976960Q59317N95664j1060n29423m34191J58765N09440K33720k29401l11418
$$ -1976960 -1117643 -521979 -533039 -1062462 -1496653 -1337888 -828448 -594728 -824129 -1135547
42430a135547P916L83888N33655L58081J4768j18182Q1978K01687l6437j32815
$$ -1135547 -1127631 -743743 -210088 147993 162761 44579 126557 328244 291807 158992
42420A58992M17595J017943O59503l99249q35785k61326K53824J0332k65760J40897
$$ 158992 576587 1594530 2254033 1854784 1018999 757673 1011497 1021829 756069 896966
42410H96966O36993L84287k86334n50518m42195m73401m89844k0307O11303O24597
$$ 896966 1533959 1918246 1631912 1081394 639199 165798 -324046 -344353 266950 891547
42400H91547O2548k58305k9508K03011K1058l06332l70442j34575J98791L75498
$$ 891547 954095 695790 666282 869293 890351 584019 213577 79002 277793 653291
42390F53291J60971l44406n70893j35856N08816O13186J68312j74973j07366O8925
$$ 653291 814262 469856 -101037 -236893 271923 885109 1053421 878448 771082 840007
42380H40007J32847K22140L30984J70275k77344n91356n15916k92551k05354k00425
$$ 840007 972854 1194994 1525978 1696253 1418909 827553 311637 19086 -186268 -386693
42370c86693j51257j26628j61812n5076L65305R27203J211215Q90621K3979q31698
$$ -386693 -537950 -664578 -826390 -881466 -516161 411042 1622257 2512878 2536857 1705159
42360A705159r47105j84072O50136N97679l08154j083894j009065l82172N5870
$$ 1705159 758054 573982 1224118 1821797 1513643 429749 -579316 -961488 -905618
42351i05618N0348p2586J7583K89739N10091N57491M86446L22572k4886m71686
$$ -905618 -855270 -927856 -910273 -620534 -110443 447048 933494 1256066 1231180 759494
42341G59494n58335J5732O75311M25909p21112j474396r35287J12303L57154j51762
$$ 759494 201159 216891 892202 1318111 596999 -877397 -1812684 -1700381 -1343227 -1494989
42331a494989l10361J76931M74698J89257J9516M56661R20170P95425M45796M50989
$$ -1494989 -1805350 -1628419 -1153721 -964464 -944948 -488287 431883 1227308 1673104 2124093
42321B124093N28372O5291o97214q64877j48884P27028Q86144J63190q39091j280175
$$ 2124093 2652465 2717756 2020542 1155665 1006781 1733809 2619953 2783143 1944052 663877
42311F63877q07920K3680K90216j60835m80359j2160P64147R68303N55205J43734
$$ 663877 -144043 -120363 169853 9018 -471341 -483501 280646 1248949 1804154 1947888
42301A947888r0893n29593j139088j212539l77688P09459J083984N69206j88653
$$ 1947888 1856995 1327402 188314 -1024225 -1401913 -692454 391530 960736 772083
42292G72083n73967n38363l41591j02950J90505L63989P5179o59929j181785q01778
$$ 772083 198116 -340247 -681838 -784788 -594283 -230294 -155115 -815044 -1996829 -2798607
42282b798607L20504J282313J454785J000983L47500k98552p07938n49575J9725
$$ -2798607 -2478103 -1195790 258995 1259978 1607478 1308926 600988 51413 71138
42273G1138K62183j05387l57089P6571N05540M8294o74029k75782J040795J424839
$$ 71138 333321 227934 -129155 -52584 452956 501250 -172779 -448561 592234 2017073
42263B017073J33674j126169o12846Q44471J050013l74894j562685j108083K19007
$$ 2017073 2150747 1024578 411732 1256203 2306216 1931322 368637 -739446 -520439
42254e20439Q96737O63969L59541M51131N91658M05216Q730k92131l96265m12390
$$ -520439 376298 1040267 1399808 1850939 2442597 2847813 2856543 2564412 2168147 1755757
42244A755757m99746o96586p52031k82119O32298J182969O48649n21232r96633
$$ 1755757 1256011 559425 -192606 -474725 157573 1340542 1989191 1467959 471326
42235D71326j98708Q62772Q66470q4677p12247m09373M4016j30711m74064j31198
$$ 471326 272618 1135390 2001860 1917183 1204936 795563 839579 708868 234804 103606
42225A03606O56675Q58404K51804k78126j59997R8984k9482j36446L19768Q69399
$$ 103606 760281 1618685 1870489 1592363 1432366 1531350 1501868 1365422 1685190 2554589
42215B554589N94444m19736j057765o07673M63451J227868J189080M01192o58214
$$ 2554589 3149033 2729297 1671532 1063859 1527310 2755178 3944258 4345450 3687236
42206C687236j177727o06285N75499J221866R11359L81132K76285J98405m09574
$$ 3687236 2509509 1903224 2478723 3700589 4611948 4993080 5269365 5467770 5058196
42197E058196j084688r30530l7011O12774N61361L29166L82402M88159L51968
$$ 5058196 3973508 3042978 3005967 3618741 4180102 4509268 4891670 5379829 5731797
42188E731797J75212J96465K34716Q5764o8285o94K17840N38218J126818J839809
$$ 5731797 5907009 6103474 6338190 6423954 6355669 6354975 6572815 7111033 8237851 10077660
42178A0077660J988923J194160J10784l15262p2963O8268k35351n52780n16326
$$ 10077660 12066583 13260743 13371527 13056265 12983302 13051570 12816219 12263439 11747113
42169A1747113l14752j99751q6322J20584K57090J83807l2849l75757r09070j405059
$$ 11747113 11432361 11232610 11146288 11266872 11523962 11707769 11674920 11299163 10390093 8985034
42159H985034j402025q62073l19298j16622P214K32599J35415n79373j285671
$$ 8985034 7583009 6720936 6401638 6285016 6292230 6524829 6660244 6080871 4795200
42150D795200j138663l43835N6184l74528r69710r91833m66524J86356O86941
$$ 4795200 3656537 3312702 3368886 2994358 2024648 1032815 566291 752647 1439588
42141A439588P91257L01221m31110n96628p334M57108N7458o61157o79150n4154
$$ 1439588 2230845 2532066 2100956 1504328 1496994 1954102 2011560 1350403 671253 617099
42131F17099K65422k379j34991K69338O35885M45093L1712j64836l52228p19244
$$ 617099 882521 880142 745151 1014489 1650374 2095467 2127179 1962343 1610115 890871
42121H90871p26845O5590R68601R33300P8751n24864m55533k96217l81358k94038
$$ 890871 164026 229616 1198217 2131517 2210268 1685404 1229871 933654 552296 258258
42111B58258J02035J93111k76758n44228m549O81501N20335k96304p29529m32175
$$ 258258 360293 553404 276646 -267582 -272131 409370 929705 633401 -96128 -528303
42101e28303j1273J19235K08424L90514K93831k39599o80279m97910N8245K82322
$$ -528303 -539576 -420341 -211917 178597 472428 232829 -447450 -945360 -887115 -604793
42091f04793n4763m26629k32760L93010O31456j266q29371p14861L30970R60975
$$ -604793 -659556 -1086185 -1318945 -925935 -294479 -295745 -1125116 -1839977 -1509007 -548032
42081e48032L78387l81459L7854J154240J306092K09490o63363m35209J3308j72009
$$ -548032 -169645 -551104 -513250 640990 1947082 2156572 1493209 1058000 1071308 899299
42071H99299l74998J17006N65671m196r40000q73218K8542L36917l08045p60294
$$ 899299 524301 641307 1206978 1202782 262782 -610436 -581894 -244977 -553022 -1313316
42061a313316l72896J14725R2444M2858L55613M80693J01242j2501O41307J097215
$$ -1313316 -1686212 -1571487 -1479043 -1436185 -1080572 -599879 -498637 -511138 130169 1227384
42051A227384L53478p55562n99731P18728J425203O64054m59529p72403n92851
$$ 1227384 1580862 825300 225569 944297 2369500 3033554 2574025 1801622 1208771
42042A208771p01862q80861m59940L80541Q60307P70598N18252K51801k09734
$$ 1208771 506909 -373952 -833892 -453351 406956 1177554 1695806 1947607 1737873
42033A737873o88975p07348k75476P4277J30358K12568M25371M13466J12079K9333
$$ 1737873 1048898 341550 66074 140351 270709 483277 908648 1322114 1434193 1463526
42023A463526L58787M57650j88996r91207r89734k72230J64917r4716l71337o4845
$$ 1463526 1822313 2279963 2090967 1099760 110026 -162204 2713 -92003 -463340 -528185
42013e28185M02499L03721k32539m24182l4822K62405j16065p63885p90796o2792
$$ -528185 -125686 178035 -54504 -478686 -513508 -251103 -367168 -1131053 -1921849 -1984641
42003a984641N58036L77166j56224j03237N48302Q06126J54082n85483l63739
$$ -1984641 -1426605 -1049439 -1205663 -1308900 -760598 45528 199610 -385873 -749612
41994g49612O19612J229119R05346J31280m90860q17563p32294Q688J090338J466623
$$ -749612 -130000 1099119 2004465 2135745 1644885 827322 95028 103716 1194054 2660677
41984B660677M83273j156802k050629j529828j12456J184227J577532Q48245n10453
$$ 2660677 3143950 1987148 -63481 -1593309 -1705765 -521538 1055994 1904239 1393786
41975A393786j509396j453657n76914L23689P72655Q57387P46452M14922r3455
$$ 1393786 -115610 -1569267 -2146181 -1822492 -1049837 -192450 554002 968924 875469
41966H75469m82626m63229p0085L49879M19075N0459m39879o24334m08136l2202
$$ 875469 392843 -70386 -140471 209408 628483 678942 239063 -385271 -793407 -825609
41956h25609L49300P51570R53719N44367l06501o76343o9408O86918N05730l05507
$$ -825609 -476309 275261 1228980 1773347 1466846 790503 721095 1408013 1913743 1608236
41946A608236m38973L97662R59868L23698p30451q98266j99663K50774n3825m77614
$$ 1608236 1169263 1566925 2526793 2850491 2120040 1221774 1022111 1272885 1219060 741446
41936G41446l81543K1563J95545Q4227J3943J04161J30948j02876m68259n92407
$$ 741446 359903 381466 577011 661238 675181 779342 910290 807414 339155 -253252
41926b53252k19223M47964Q07750M44712l29572p35429m18784J32619K51752k3653
$$ -253252 -472475 -24511 783239 1227951 898379 162950 -255834 -123215 128537 104884
41916A04884o1356M04805Q19587N27351l09341q54336n98403J07166N70232N28052
$$ 104884 43528 448333 1267920 1795271 1485930 631594 33191 140357 710589 1238641
41906A238641K52635R3305J15657J23622p7685m06687n04853j58808L10318L58252
$$ 1238641 1491276 1584581 1700238 1823860 1746175 1339488 834635 675827 986145 1344397
41896A344397m6099l59516k63747q0551j21550j20534K04289M63304J62632l25046
$$ 1344397 1298298 938782 675035 594484 472934 352400 556689 1019993 1182625 857579
41886H57579j98471M22336M99167l55303j179280j009588k27335R5238k79386
$$ 857579 659108 1081444 1580611 1225308 46028 -963560 -1190895 -1095657 -1375043
41877a375043o07016l18211L55941Q83864R98091O86659P2653n44547q30218p33292
$$ -1375043 -1982059 -2300270 -1944329 -1060465 -62374 624285 696938 152391 -677827 -1411119
41867a411119m70884j59084K86171P98723J001995O45242O1583j20040K12386
$$ -1411119 -1882003 -2041087 -1754916 -956193 45802 691044 752627 632587 844973
41858H44973L91567k16083j248436j605351q03404L35281P13968L58702K13716
$$ 844973 1236540 1020457 -227979 -1833330 -2636734 -2301453 -1587485 -1228783 -1015067
41849a015067O79868J077484P40216n128l59329j15463K48880K80116n1667m92622
$$ -1015067 -335199 742285 1482501 1477373 1118044 1002581 1251461 1531577 1479910 987288
41839I87288p22985n67923k17069n7165j23022j3325M30143P48687N27958O4741
$$ 987288 264303 -303620 -520689 -577854 -700876 -714201 -284058 464629 992587 1057328
41829A057328r1378M3850P3047j3620J12008L73137K44026m24595j045991r87387
$$ 1057328 965950 1009800 1082847 1069227 1181235 1554372 1798398 1373803 327812 -659575
41819f59575l07839L65506N03859J31671k56865k30865P7895J67084r2312k63856
$$ -659575 -967414 -601908 -98049 33622 -223243 -454108 -376213 -209129 -301441 -565297
41809e65297q1937J14219O2172J34050N98859Q66257L38211l92782k81811M35946
$$ -565297 -647234 -533015 -470843 -336793 262066 1128323 1466534 1073752 791941 1227887
41799A227887M97437l30952p81418r5689P49429N71907k96941p45768n30839j83662
$$ 1227887 1725324 1394372 612954 517265 1266694 1838601 1541660 795892 265053 81391
41789H1391J24050N47664P71813L14488m93640p62646k77483K89099L90991J23576
$$ 81391 205441 753105 1524918 1839406 1345766 583120 305637 594736 985727 1109303
41779A109303k59453o14143o51648j49442M58168M05174k88064o90203k39342
$$ 1109303 849850 235707 -415941 -565383 -107215 297959 9895 -680308 -919650
41770i19650M71003N76507Q7467l34831l65450k33865j41666N466K51165L72990
$$ -919650 -448647 127860 215327 -119504 -484954 -718819 -860485 -855019 -603854 -230864
41760b30864J93147r9678j58136L2614R4503j88646m46111j49147O00629J098148
$$ -230864 -37717 -137395 -295531 -262917 -168414 -357060 -803171 -952318 -351689 746459
41750G46459R04364K78227l48302p99824q77339l28180M83694N85491k79629j010821
$$ 746459 1650823 1929050 1580748 780924 -96415 -424595 59099 644590 364961 -645860
41740f45860o66731N6365j2054m78643k7330J180721J531887N71192k51414n8952
$$ -645860 -1312591 -1256226 -1268280 -1746923 -1774253 -593532 938355 1509547 1258133 1199181
41730A199181N4488q14403j501112o47296Q28662J035551Q9120k25964N76289
$$ 1199181 1253669 439266 -1061846 -1709142 -880480 155071 244191 18227 594516
41721E94516J096353N43353j13345k4852J68592l22475j051361j229574r75924
$$ 594516 1690869 2234222 2120877 2096025 2264617 1942142 890781 -338793 -1314717
41712a314717p39897l46203M20115R93349P96239K83587K37679M74317K64885
$$ -1314717 -2054614 -2400817 -1980702 -987353 -191114 92473 330152 804469 1069354
41703A069354l01089m66698j49257j1550j70948K8146O87497Q89738J14340p81110
$$ 1069354 768265 301567 152310 140760 -30188 -2042 685455 1575193 1689533 908423
41693I08423p58342j18648P3145l17445l99826J75354N62893L1133q21518q32779
$$ 908423 150081 31433 104578 -212867 -612693 -437339 125554 156687 -664831 -1497610
41683a497610Q6119P98769M56748m16309o39338J55515J138110J294348N26834
$$ -1497610 -1411491 -612722 -155974 -572283 -1211621 -1056106 82004 1376352 1903186
41674A903186l46809n38476q4473L05288R0474n28653r10752p08503j60346K69855
$$ 1903186 1556377 1017901 933428 1238716 1329190 800537 -110215 -818718 -979064 -709209
41664g09209L31229P1056k77325m09224j46991L62991P69073Q51816N93113J428
$$ -709209 -377980 -306924 -584249 -993473 -1140464 -777473 -8400 843416 1436529 1437957
41654A437957p78171j204049p17577M20855J176044R20827J13232n10188q24058
$$ 1437957 659786 -544263 -1261840 -840985 335059 1255886 1369118 858930 34872
41645C4872r28930n60629L28278R32024N10241l93849o71237l12652j97116l82580
$$ 34872 -894058 -1454687 -1126409 -194385 315856 -77993 -749230 -1061882 -1258998 -1641578
41635a641578m703R63446J318929N08519m43554o00351m43206o39975o96523k5722
$$ -1641578 -1646281 -682835 636094 1144613 701059 100708 -342498 -982473 -1678996 -1704718
41625a704718O47218L48090m03473l89530K64901L87789j56958k75634M02306
$$ -1704718 -1057500 -709410 -1112883 -1502413 -1237512 -849723 -1006681 -1282315 -880009
41616h80009Q92715N33953j8119J398L54351M87706M19463L16317m2209p25081
$$ -880009 12706 546659 528540 529938 884289 1371995 1791458 2107775 2065566 1340485
41606A340485j181562r47792l78721j23830k24835k24755Q1059M15506M09036
$$ 1340485 158923 -788869 -1167590 -1291420 -1516255 -1741010 -1659951 -1244445 -835409
41597h35409J525m24881l17225L89897J002719Q67378K79984K8319K00588K19068
$$ -835409 -833884 -1258765 -1575990 -1186093 -183374 684004 963988 992307 1192895 1411963
41587A411963l9299j02155O4296p5200n05004n09721j6895P2707n31459p83649
$$ 1411963 1372664 1270509 1334805 1259605 754601 244880 227985 300692 -230767 -1014416
41577a014416J1360Q97930P32007k369j02481L63513L87728j15091k44302K26689
$$ -1014416 -1003056 -105126 626881 624512 522031 885544 1273272 1158181 913879 1140568
41567A140568M99648J60392k58833l39349l41186m22039k43518K56492M89073
$$ 1140568 1640216 1800608 1541775 1202426 861240 439201 195683 452175 941248
41558I41248N5310o05667p79407k95372M07899O94857K06346o72397r45397j40541
$$ 941248 996558 390891 -388516 -683888 -275989 418868 625214 -47183 -992580 -1133121
41548a133121Q87025R75913K61956j37620J06875K19968j44023l16097K7698J54656
$$ -1133121 -246096 729817 991773 854153 961028 1180996 1036973 720876 748574 903230
41538I03230l71446p12342o5771R08857J039464L84724q3538r2235j85848m62619
$$ 903230 531784 -180558 -246329 662528 1701992 2086716 2003178 1910943 1725095 1262476
41528A262476m02151m657K9293m62785o88588j77914L92095K72785j66228j24303
$$ 1262476 860325 855668 884961 422176 -266412 -444326 -52231 220554 54326 -69977
41518f9977K43645R3991o02375q30057m7393R09044R55317J86431m71863n93275
$$ -69977 173668 267659 -334716 -1164773 -1212166 -303122 652195 838626 366763 -226512
41508b26512m56923j95283L33217Q15361N95562k10150o17863k30313J07831k67173
$$ -226512 -683435 -878718 -545501 269860 865422 655272 37409 -192904 -85073 -352246
41498c52246o66069k12150O04355P09421K07837J4651J02348l28969j010908o64922
$$ -352246 -1018315 -1230465 -626110 83311 291148 305799 408147 79178 -931730 -1596652
41488a596652P28917J416822M36287p85019n31050O95015J137901M31205k28235
$$ -1596652 -867735 549087 985374 200355 -330695 364320 1502221 1933426 1705191
41479A705191j37220J27222l4694l88916m76560k37402J57882M91482M78451R5856
$$ 1705191 1567971 1695193 1660499 1271583 795023 557621 715503 1206985 1685436 1781292
41469A781292j73104J1708J66148l49394j176192j312671n67216K04767L69690
$$ 1781292 1608188 1619896 1786044 1436650 260458 -1052213 -1619429 -1414662 -1044972
41460a044972J71671j5807k24079l85415j01449O36106J112535P54478j01327
$$ -1044972 -873301 -889108 -1113187 -1498602 -1600051 -963945 148590 903068 801741
41451H01741o71508n96682r0210M02653M81352J06774k22934m1284L12879J08154
$$ 801741 130233 -466449 -556659 -154006 327346 434120 211186 169902 482781 590935
41441E90935n44223p18959j77632J65449j99003m21055K04926P55866J8835j311441
$$ 590935 46712 -672247 -849879 -684430 -883433 -1304488 -1099562 -343696 -324861 -1636302
41431a636302j363576J07785J257623Q26783j79852k18650N89083J006987O20346
$$ -1636302 -2999878 -2892093 -1634470 -807687 -987539 -1206189 -617106 389881 1010227
41422A010227P5085j86355l21528l59042o5568L83641M30405O886l06402j89163
$$ 1010227 1085312 898957 577429 218387 152819 536460 966865 973751 667349 478186
41412D78186j96m9354r5612P4072J51668j39466m71579m05068p5212J41648L07642
$$ 478186 477990 428636 333024 407096 558764 419298 -52281 -457349 -532561 -390913 -83271
41401h3271O67693R75105P53593J23178l04367l45656m09846o75655p63921m25842
$$ -83271 584422 1559527 2313120 2436298 2131931 1786275 1376429 700774 -63147 -488989
41391d88989L7647L13726N07368P21608O90041K05217m61533r15057j076259r76281
$$ -488989 -451342 -137616 369752 1091360 1781401 1986618 1525085 610028 -466231 -1442512
41381a442512n19747J74750N99924M84165K56078M07187P16105O64559L42448
$$ -1442512 -1962259 -1787509 -1187585 -703420 -447342 -40155 675950 1340509 1682957
41372A682957K60578M00089J88619n00553j000006p52072n6662L93446L59211
$$ 1682957 1943535 2343624 2532243 2031690 1031684 279612 222950 616396 975607
41363I75607J09992j21736l79025p12393r28390p30984r5166N94512R06871Q45954
$$ 975607 1085599 963863 584838 -127555 -1055945 -1786929 -1882095 -1287583 -380712 465242
41353D65242P63625P73449N97645J63810p0404K09216N08384J04264q48447j398966
$$ 465242 1228867 2002316 2599961 2763771 2693367 2902583 3410967 3515231 2666784 1267818
41343A267818j032790k68251J55594K02503L17571N87582N58107q4807r26505
$$ 1267818 235028 -33223 122371 324874 642445 1230027 1788134 1703327 776822
41334G76822j165142n73063J43110K34871l8048J80502Q98106J066552J90227
$$ 776822 -388320 -961383 -818273 -583402 -621450 -440948 457158 1523710 1713937
41325A713937p10681n03885L70786O34719J12127k78422k55135n05216j118034
$$ 1713937 1003256 499371 870157 1504876 1617003 1338581 1083446 578230 -539804
41316e39804j083977M2550J137101J010815P4123m18804j63019J23129K2897j49265
$$ -539804 -1623781 -1581231 -444130 566685 640808 222004 58985 182114 205011 55746
41306E5746j27770q2800j60762k33084j90472o6114J43726M10940M74494J06698
$$ 55746 -72024 -154824 -315586 -548670 -739142 -805256 -661530 -250590 223904 330602
41296C30602m24640n39963n5715N80589Q24257N78335J57470j00036r6318N8666
$$ 330602 -94038 -634001 -689716 -109127 715130 1293465 1450935 1350899 1254581 1313247
41286A313247K47306M30546M97121J97590n34995j299491j571785j281385p24674
$$ 1313247 1560553 1991099 2488220 2685810 2150815 851324 -720461 -2001846 -2726520
41277b726520m1242P30165J187589Q74067J42545o2479M43021P31534J80083n60662
$$ -2726520 -2767762 -2037597 -850008 24059 166604 104125 547146 1278680 1458763 898101
41267H98101o28124k44806j42417k72627n2499M54572N94732K40691m4363K8294
$$ 898101 269977 25171 -117246 -389873 -442372 12200 606932 847623 803260 831554
41257H31554J33458L5145p1580m5070k2597m4972J5433P8297p6223l12945k50740
$$ 831554 965012 1000157 928577 883507 860910 815938 831371 909668 833445 520500 269760
41246B69760P0131J78282o9743k65584j35797O5758N8049l1524L0457K17248M03378
$$ 269760 339891 518173 448430 182846 47049 112807 170856 139332 169789 387037 790415
41235G90415N84351P23129O14334J07869o17721j076401p96242J73162J004500
$$ 790415 1374766 2097895 2712229 2820098 2202377 1125976 329734 502896 1507396
41226A507396P56697m25646j256212q98338o6705J24191j82470r3526L04256N6731
$$ 1507396 2264093 1838447 582235 -316103 -382808 -258617 -441087 -534613 -230357 -173626
41216a73626q54850j214907m14655O44819J008061Q97109Q29624N63641j90205
$$ -173626 -1028476 -2243383 -2658038 -2013219 -1005158 -108049 721575 1285216 1095011
41207A095011q34166o61625k4504K05891n0053j72441M7515K20261J32122j4140
$$ 1095011 260845 -400780 -425284 -219393 -269446 -441887 -394372 -174111 -41989 -56129
41197e6129p7302j25679j46020l4214J94864M76156P76700Q88979N12151j80565
$$ -56129 -133431 -259110 -405130 -439344 -244480 231676 1008376 1897355 2409506 2228941
41187B228941n26237k87053n8074l27522p12032o72061l86101k50522r7196L15846
$$ 2228941 1702704 1415651 1357577 1030055 318023 -354038 -740139 -990661 -1087857 -772011
41177g72011N72607K19190l46191m75691l00251k48075q3050M80063P44181k5552
$$ -772011 -199404 19786 -326405 -802096 -1102347 -1350422 -1433472 -953409 -209228 -234780
41167b34780j003918p15285N78646J066211J23174q22715o05978J33594M20998
$$ -234780 -1238698 -1953983 -1375337 -309126 -185952 -1008667 -1614645 -1481051 -1060053
41158a060053M22793N16377K66515n17410q63141n6104R46847Q52564L7340j68193
$$ -1060053 -637260 -120883 145632 -371778 -1234919 -1291023 -344176 508388 545728 377535
41148C77535L50581M95423j22929o58552m68792O7882L26406J37582l73185q88571
$$ 377535 728116 1223539 1100610 442058 -26734 41148 367554 505136 131951 -756620
41138g56620q55097q4002O76566N44269k23536n81808k11629K39417L77578M95539
$$ -756620 -1611717 -1695719 -1019153 -474884 -698420 -1280228 -1491857 -1252440 -874862 -379323
41128c79323O73423M81889j24905n40518m83286m01408n29031l78605L25928R43235
$$ -379323 294100 775989 651084 110566 -372720 -774128 -1303159 -1681764 -1355836 -412601
41118d12601P35815j13637p94400p70302p9128P91757J083461L93030o27900q46705
$$ -412601 323214 209577 -584823 -1355125 -1434253 -642496 440965 833995 206095 -640610
41108f40610j64171L26984Q494m01039j96271J32825o2074k82110K44848J036866
$$ -640610 -804781 -477797 -469303 -870342 -1066613 -933788 -995862 -1277972 -1033124 3742
41098C742R73538P5790n75621n26555l36645l06597m9706M62622N72903O8566
$$ 3742 977280 1053070 477449 -49106 -385751 -692348 -742054 -279432 293471 362037
41088C62037l18984o4676K81924m0252q50748j301006r16716O0376J038356J439486
$$ 362037 43053 -21623 260301 220049 -630699 -1931705 -2848421 -2788045 -1749689 -310203
41078c10203J021821J57902m45642m88542k63076m9370K06087M66580M18647J9988
$$ -310203 711618 869520 423878 -64664 -327740 -377110 -171023 295557 714204 734192
41068G34192k49104o3153K11685N6562m30689o92634m35702R6925M15478J94528
$$ 734192 485088 421935 633620 690182 259493 -433141 -868843 -771918 -356440 -161912
41058a61912l77811o09189l3309Q33869J007790M05500j1215K59320M47586k01937
$$ -161912 -539723 -1148912 -1182221 -348352 659438 1064938 1053723 1313043 1760629 1558692
41048A558692j090815j081609j61902O46195P71609N64747L89028J51813j58699
$$ 1558692 467877 -613732 -775634 -129439 642170 1206917 1595945 1747758 1589059
41039A589059k43336k2306J69991J04792o6878j43477n9043K61538P76858J087440
$$ 1589059 1345723 1323417 1493408 1598200 1531322 1387845 1328802 1590340 2367198 3454638
41029C454638Q19211K14732j79746l33051o13343r49834q97546n52702n03642
$$ 3454638 4273849 4488581 4308835 3975784 3362441 2412607 1515061 962359 458717
41020D58717p11224m30678M01085P63050J58779m04854K0201O73971K56984q34636
$$ 458717 -252507 -683185 -282100 480950 639729 234875 255076 929047 1186031 351395
41010C51395r38968L05576J309363Q06921m80035j105096q12418l36385k5425
$$ 351395 -587573 -281997 1027366 1834287 1354252 249156 -563262 -899647 -925072
41001i25072L19110O05502M61810L1058r4030J78729L05356Q5312J4467L19597
$$ -925072 -605962 -460 461350 492408 398378 577107 882463 967775 982242 1301839
40991A301839L91835k10223q03802m82837L81570N67589j05637m36476K35903
$$ 1301839 1693674 1483451 679649 196812 578382 1145971 1040334 603858 839761
40982H39761Q46014J77620j159358j493783n03692M02633K29008k93735p2148
$$ 839761 1685775 1863395 704037 -789746 -1293438 -890805 -661797 -955532 -1027680
40973a027680O56067Q68529L99738K9289J22015J36431l51130q89207q01383j28049
$$ -1027680 -371613 496916 896654 925943 1047958 1184389 833259 -55948 -857331 -985380
40963i85380M92565O31978L97844Q4362j59736k89876k41847N207L10139M39855
$$ -985380 -492815 139163 537007 621369 461633 171757 -70090 -64883 245256 685111
40953F85111L12406J19781J09810K45954K22029j17644n19854o18429l75286p3279
$$ 685111 997517 1117298 1227108 1473062 1695091 1577447 1057593 439164 63878 -9401
40943i401K5232j50129n05421p54350n24666J71846P05539N12138n4278j22644
$$ -9401 15831 -134298 -639719 -1394069 -1918735 -1746889 -1041350 -529212 -583490 -706134
40933g06134L95115O33838J86798j36075L95022J110740R12321O6585k22759J28397
$$ -706134 -311019 322819 509617 373542 768564 1879304 2791625 2858210 2635451 2763848
40923B763848r0803j214864j830307q76424O13640R97505L15101k06733k35753
$$ 2763848 2673045 1458181 -372126 -1248550 -634910 362595 677696 470963 235210
40914B35210m03679o68284k58096O86286R72667K19754n22685n01872k82851m03622
$$ 235210 -168469 -836753 -1094849 -408563 564104 783858 261173 -240699 -523550 -927172
40904i27172l30067L42041Q26537M15045j74479J7302M52709l5215j160203j469309
$$ -927172 -1257239 -915198 -88661 326384 151905 169207 621916 586701 -573502 -2042811
40894b042811n36494N07756O80840J93272l06115m54722m7952P82996J182402
$$ -2042811 -2579305 -2071549 -1390709 -1197437 -1503552 -1958274 -2006226 -1223230 -40828
40885d0828M21021p72630r05922N7260M89497m19124j336859q22895M65477Q15584
$$ -40828 380193 -392437 -1298359 -1241099 -751602 -1170726 -2507585 -3330480 -2865003 -2049419
40875b049419k097n67835J8989R83607J107164L01117m79974n15730p0847J51072
$$ -2049419 -2051516 -2619351 -2600362 -1616755 -509591 -208474 -688448 -1204178 -1275025 -1123953
40865a123953K0545Q0915N69433Q52639L17836n64899q00242k83094J71341J41848
$$ -1123953 -1103408 -1022493 -453060 399579 717415 152516 -647726 -930820 -759479 -617631
40855f17631L9492J63916K57342J93082K05065K14265j37973n73860l68714K61624
$$ -617631 -578139 -414223 -156881 36201 241266 455531 317558 -256302 -625016 -363392
40845c63392K16076n77594p21273L75404J227695N04232p62094p60407K72443
$$ -363392 -147316 -724910 -1446183 -1070779 156916 661148 -100946 -861353 -588910
40836e88910O12565j31141o37378j93660L56378K31406j93950l37708k75481k00500
$$ -588910 23655 -107486 -744864 -938524 -582146 -350740 -544690 -882398 -1157879 -1358379
40826a358379L6905M25098N74388L28620j2319k29074l47095k66464R5594L58189
$$ -1358379 -1321474 -896376 -321988 6632 -5687 -234761 -581856 -848320 -752726 -394537
40816c94537J29979k04380j7107L91225K15692l16693j02585R42663J463533O47243
$$ -394537 -264558 -468938 -486045 -94820 120872 -195821 -298406 644257 2107790 2755033
40806B755033n54311q84901m60792j78743k81001m10221m91375o60809o92104
$$ 2755033 2200722 1315821 855029 676286 395285 -14936 -506311 -1167120 -1859224
40797a859224k80840L26811O18191N23379L10889O322n18909j002777q91801o9202
$$ -1859224 -2140064 -1813253 -1195062 -671683 -360794 -354472 -873381 -1876158 -2767959 -2837161
40787b837161Q59479J159307P31674J82164Q1014K53368Q6224m54511o69735k72485
$$ -2837161 -1977682 -818375 -86701 95463 176477 429845 516069 61558 -608177 -880662
40777h80662K8126k61453l69203M99746J450103R11356q08079j635957o76163
$$ -880662 -852536 -1113989 -1483192 -983446 466657 1378013 569934 -1066023 -1742186
40768a742186N79495O02001j04119k19025L52840Q03124Q53027P15818L18262
$$ -1742186 -1162691 -560690 -664809 -883834 -530994 272130 1125157 1840975 2159237
40759B159237l56156o97027k51917L85992M13374P5027J20809M14885J27913q79922
$$ 2159237 1803081 1106054 854137 1240129 1653503 1728530 1849339 2264224 2392137 1512215
40749A512215j788010j854467j043920J97411J171756J217707M18936k59059j29961
$$ 1512215 -275795 -2130262 -3174182 -2976771 -1805015 -587308 -168372 -427431 -557392
40740e57392L14651K91067k8588K3052L86995M79219K67744J80433K05100L5274
$$ -557392 -242741 48326 19738 42790 429785 909004 1176748 1357181 1562281 1597555
40730A597555j25817J23053M68411K58289l83998p92328q92147j050345j014248
$$ 1597555 1471738 1594791 2063202 2321491 1937493 1145165 253018 -797327 -1811575
40721a811575k37666P94084Q92951j1277o45990k87539L32805M11022J84004J31016
$$ -1811575 -2049241 -1255157 -362206 -373483 -1019473 -1307012 -974207 -563185 -379181 -248165
40711b48165J36606O6480K17376N50958L84545m57411j026470n53318L66580O82678
$$ -248165 -111559 -45079 172297 723255 1107800 650389 -376081 -929399 -562819 119859
40701A19859L35991j7940j54869k77867l04482k9696K73468J81160j64376l15965
$$ 119859 455850 437910 283041 5174 -299308 -329004 -55536 125624 -38752 -354717
40691c54717k50716k06504p5176L44969P24930N65494L1900k82709l02135m26152
$$ -354717 -605433 -811937 -887113 -542144 182786 748280 780180 497471 195336 -230816
40681b30816o18079l76507K68190N63217J63573k61023k9122M97159M70262j55636
$$ -230816 -848895 -1225402 -957212 -393995 -230422 -491445 -520567 -23408 446854 291218
40671B91218n68019k87972J85055J49532k88947m01170R4650N98263M42912j84007
$$ 291218 -276801 -564773 -379718 -230186 -519133 -920303 -825653 -227390 215522 31515
40661C1515n25095l33403j65538m55678p84874m90363K96850P93584O90928N28772
$$ 31515 -493580 -826983 -992521 -1448199 -2233073 -2723436 -2426586 -1633002 -942074 -413302
40651d13302P33168Q40511J95865q94579j391408r05829j87450K0879j0147L53612
$$ -413302 319866 1160377 1356242 461663 -929745 -1835574 -2023024 -2002145 -2012292 -1658680
40641a658680R44380J033704N27891J02974J20676K02151N5016n8747J2050n5909
$$ -1658680 -714300 319404 847295 950269 1070945 1273096 1328112 1269365 1281415 1225506
40631A225506l33289l11041J50992L27569j96947o23807j61763N17469K41339
$$ 1225506 892217 581176 732168 1059737 862790 238983 77220 594689 836028
40622H36028o95899q82167N2386R86758J085308O89245K10880m98288j204705
$$ 836028 140129 -742038 -689652 297106 1382414 2071659 2282539 1784251 579546
40613E79546j028232J32842R99709N96016l54735n92744r5841K62125J77890L0041
$$ 579546 -448686 -315844 683865 1279881 925146 332402 236561 498686 676576 706617
40603G06617k1563p8660K7133M19709O20920J77105m21478l54639J96869L01380
$$ 706617 685054 606394 633527 1053236 1674156 1851261 1429783 1075144 1272013 1573393
40593A573393k25159n84340l62571j39486m02754p16832m84487R7209M15205L58037
$$ 1573393 1348234 763894 401323 261837 -140917 -857749 -1342236 -1245027 -829822 -471785
40583d71785K91068L40958K32475j73758n65537n28615m2178M89821O57964M17436
$$ -471785 -180717 160241 392716 218958 -346579 -875194 -917372 -427551 230413 647849
40573F47849K4932k90193m59428m49797k53065l9165m4980j89264p8066M13650
$$ 647849 672781 382588 -76840 -526637 -779702 -818867 -863847 -1053111 -1131177 -717527
40563g17527Q31597O82847R7178l31884k51634J32301L50917J24141l67079n72557
$$ -717527 114070 796917 894095 562211 310577 442878 793795 917936 550857 -21700
40553b1700j44354N12093N99581l543m76995j78256M15743M00922k34400o24678
$$ -21700 -166054 346039 945620 942077 465082 286826 702569 1103491 869091 244413
40543B44413k76801L14529M28579K7715l40010k85423L2399K14176J52599J19715
$$ 244413 -32388 282141 710720 738435 398425 113002 145401 359577 512176 631891
40533F31891K82879L45051l4692n86947o74330k27200J06517o5892l25092j90312
$$ 631891 914770 1259821 1225129 638182 -36148 -263348 -156831 -222723 -547815 -738127
40523g38127J11825J11378r7668p0234K43381M83285M44812K44672O7661L7697
$$ -738127 -626302 -514924 -612592 -682826 -439445 43840 488652 733324 800985 838682
40513H38682J33677N0249m79137j031342p41201M54471J461818J399757O65416
$$ 838682 972359 1022608 543471 -487871 -1229072 -774601 687217 2086974 2752390
40504B752390P6391k77185n61397m03095L62307Q18757J17884r65755r98658j09531
$$ 2752390 2828781 2551596 1990199 1587104 1949411 2768168 2886052 1920297 921639 812108
40494H12108K34409m03214q31193k35198O57050Q56329L34180m75277j244471
$$ 812108 1046517 643303 -187890 -423088 233962 1090291 1424471 949194 -295277
40485b95277j404264m33994R77606J274501J76313p21540k46778O79121O59993
$$ -295277 -1699541 -2133535 -1155929 118572 294885 -426655 -673433 5688 665681
40476F65681l4259k22386J60387K08396k81751o28418n13819k41780J17154P68269
$$ 665681 631422 409036 569423 777819 496068 -132350 -646169 -887949 -770795 -2526
40466b526J416173J401428O68834j58694o46535p97903n86214m2142K85126j74648
$$ -2526 1413647 2815075 3483909 3325215 2678680 1880777 1294563 1252421 1537547 1362899
40456A362899j006956j132100k79370O07107O47674M0053m72969n60411l90561
$$ 1362899 355943 -776157 -1055527 -448420 199254 239307 -233662 -794073 -1184634
40447a184634j90855n6923K7386J62633L80729N31613N30083N85626Q55240J013625
$$ -1184634 -1375489 -1432412 -1405026 -1242393 -861664 -330051 200032 785658 1640898 2654523
40437B654523O17078j67720o66104n44538j51793J5858j61764m50432n17874k20454
$$ 2654523 3271601 3103881 2437777 1893239 1741446 1757304 1595540 1145108 627234 406780
40427D06780J41335O3753m00760n19991L5701M83910L1696p46715o23990M11017
$$ 406780 548115 611868 211108 -308883 -273182 210728 242424 -504291 -1128281 -717264
40417g17264J120666Q64751L15148J08989k9836l69161m90654k07285j74032p56892
$$ -717264 403402 1268153 1583301 1692290 1662454 1293293 802639 595354 421322 -335570
40407c35570j137874n12698M91206O66723L9285k92995R6895M95014L44363O655
$$ -335570 -1473444 -1986142 -1494936 -828213 -788928 -1081923 -985028 -490014 -145651 -138996
40397a38996j3063J87469K59521J30622r3977l07938k89477J54002P42496Q48228
$$ -138996 -152059 35410 294931 425553 331576 23638 -265839 -111837 630659 1478887
40387A478887K89384l55041m53509n9044K73760J78947k03083m33408j72818M92805
$$ 1478887 1768271 1413230 959721 900677 1174437 1353384 1150301 716893 544075 1036880
40377A036880J068630J129424P66385L77234R3504k73947p34607r47426o96736
$$ 1036880 2105510 3234934 4001319 4378553 4472057 4198110 3463503 2516077 1819341
40368A819341k61764j09224l40830n82553m10196J18350M05722j905o71603o63255
$$ 1819341 1557577 1448353 1107523 524970 114774 233124 638846 636941 -34662 -697917
40358f97917J40936O75960J78295n69064l31670O86588J183131P84005L99182
$$ -697917 -556981 118979 297274 -271790 -603460 83128 1266259 2050264 2449446
40349B449446M47371J98268o03737r22408j69493N07344p5608j148976j155867
$$ 2449446 2896817 3095085 2491348 1568940 1399447 1906791 1831183 682207 -473660
40340d73660j89098L43317P8202J1351M94601O23874j5232n07800j51361M06529
$$ -473660 -662758 -319441 -241239 -229888 264713 888587 873355 365555 214194 620723
40330F20723L28625j24312k69001j38918j20867j01564J96854M96945L46476r3500
$$ 620723 949348 825036 556035 417117 296250 194686 391540 888485 1234961 1141461
40320A141461k78921o8269K20680L14435J54377j90842m84374m63921k06098L808
$$ 1141461 862540 794271 1014951 1329386 1483763 1292921 808547 344626 138528 142336
40310A42336K02860N77842P62210J82790p29446p67274J97155P75393J56197o12837
$$ 142336 345196 923038 1685248 1868038 1138592 371318 568473 1343866 1500063 887226
40300H87226m16911Q6240k36049r01895o66932K61430O23777K80429J94408M73006
$$ 887226 470315 556555 320506 -581389 -1248321 -986891 -363114 -82685 111723 584729
40290E84729K51253m68696o64723j63759R0893q2231K24453J013807R82902j34877
$$ 584729 835982 367286 -297437 -461196 -370303 -452534 -228081 785726 1768628 1633751
40280A633751p30891R8482R23157L15706p86462p25689J90945N23248K06777K23598
$$ 1633751 902860 1001342 1924499 2240205 1453743 728054 918999 1442247 1649024 1872622
40270A872622M43087j06157j092344j083448J9546O88213K61929q1555N06554
$$ 1872622 2315709 2209552 1117208 33760 53306 741519 1003448 921893 1428447
40261A428447J072818N33479n15073q33207m32953k13889l29039j46610M16177
$$ 1428447 2501265 3034744 2519671 1686464 1253511 1039622 710583 563973 980150
40252I80150O32008J02002o65598r91915p67563l03372Q9471K04100J3397j63623
$$ 980150 1612158 1714160 1048562 56647 -710916 -1014288 -924817 -720717 -707320 -870943
40242h70943J15795Q06616J238335Q62795k3268o13871n72885l08883k26499j45035
$$ -870943 -755148 51468 1289803 2152598 2129330 1515459 942574 633691 407192 262157
40232B62157K34663O28432M60075k23894o71170l99745J66710K77992k27052q25854
$$ 262157 496820 1125252 1585327 1361433 690263 290518 457228 735220 508168 -317686
40222c17686r20369l47999N22548J051035Q73770L05763j7641N6381R4251j45277
$$ -317686 -1238055 -1586054 -1063506 -12471 861299 1167062 1149421 1205802 1300053 1154776
40212A154776l02590m3770L50109L97637P1195l55001p78966j137219j085852
$$ 1154776 852186 808416 1158525 1556162 1627357 1272356 493390 -643829 -1729681
40203a729681l79242N43127Q78572M16811k02128k51551L20156R30041R78008
$$ -1729681 -2108923 -1565796 -687224 -270413 -472541 -724092 -403936 526105 1504113
40194A504113M04537k75810n25699l43218j05897L6549K09239K73125j52286r13178
$$ 1504113 1908650 1632840 1107141 763923 658026 694575 903814 1176939 1024653 111475
40184A11475j202250o29057J48833L75966K53865M05013P37727O47914J05679
$$ 111475 -1090775 -1719832 -1570999 -1195033 -941168 -536155 201572 849486 955165
40175I55165k88119k85647k80683n22183o86783m41592M5962L87974M47016L51589
$$ 955165 667046 381399 100716 -421467 -1108250 -1549842 -1503880 -1115906 -668890 -317301
40165c17301K53896J99623J41282M5165j5838J5334K304j83998l18751p3420L79172
$$ -317301 -63405 136218 277500 322665 306827 322161 324465 140467 -178284 -251704 127468
40154A27468N24134L19723K17449K75708O3843l43045k63346K85796K91898n73834
$$ 127468 651602 971325 1188774 1464482 1528325 1185280 921934 1207730 1499628 925794
40144I25794j135628n22829L25463J97772l84105k17757L80910K28143m32701
$$ 925794 -209834 -732663 -407200 -209428 -593533 -811290 -430380 -202237 -634938
40135f34938k53426P68831J124945K65461n61120l48329L78379P80749P71698
$$ -634938 -888364 -119533 1005412 1270873 709753 361424 739803 1520552 2292250
40126B292250L99086m43687j231775j104617l71961k74589q27587n97322P21564
$$ 2292250 2691336 2247649 1015874 -88743 -460704 -735293 -1562880 -2160202 -1438638
40117a438638J382490L31451r12441o22864M17708L95976m89912n27074N87331
$$ -1438638 -56148 275303 -637138 -1260002 -842294 -446318 -936230 -1463304 -875973
40108h75973J355944R22799J42154k7053K20225K76151N9801j93133l37625k36276
$$ -875973 479971 1402770 1544924 1517871 1738096 2014247 2074048 1880915 1543290 1307014
40098A307014J60926N15276L81284j56188n74747o12617m40293k31216k6450N1301
$$ 1307014 1467940 1983216 2364500 2208312 1633565 1020948 580655 349439 322989 374290
40088C74290j00914k87246j99150J58415M81472N13256K22593j69282k66280O3731
$$ 374290 273376 -13870 -213020 -54605 426867 940123 1162716 993434 727154 790885
40078G90885L03931j23446q21889p27759L01572J067644O74169k38216n36750
$$ 790885 1094816 971370 149481 -578278 -276706 790938 1465107 1226891 690141
40069F90141j24309L21594M77177M16096N8224n81198r74506o65320L3543N01012
$$ 690141 565832 887426 1364603 1780699 1838923 1257725 283219 -382101 -348558 152454
40059A52454N70081L44335j70516o94629o06196R9402M90612N1449m37616j95432
$$ 152454 722535 1066870 896354 201725 -404471 -305069 185543 236992 -200624 -396056
40049c96056K52995R4597k95490j32990K52248N7130m02964k06490M83039P16102
$$ -396056 -143061 -48464 -343954 -476944 -224696 -167566 -570530 -777020 -293981 422121
40039D22121M40867L85045M79079r421q07951p29472L60311J144014P49900k55682
$$ 422121 862988 1248033 1727112 1717691 909740 180268 540579 1684593 2434493 2178811
40029B178811j061308j494693j383416l76694J050871J594868P69535l54233n96079
$$ 2178811 1117503 -377190 -1760606 -2137300 -1086429 508439 1277974 923741 327662
40020C27662l5883N03531N56570J82363k85116l56867J21038N10813J42454n26372
$$ 327662 291779 795310 1351880 1534243 1249127 892260 1013298 1524111 1666565 1140193
40010A140193m54466L09644O19847M787p15827p97377m11504J00811O41636P85222
$$ 1140193 685727 995371 1615218 1620005 904178 106801 -304703 -203892 437744 1222966
40000A222966M4770r90070j072079j83562L63172O5755q8124L87031N25589j72702
$$ 1222966 1267736 277666 -794413 -977975 -614803 -549048 -637172 -250141 275448 102746
39990A02746n73743J46649R20878N68876j90531j09612L55159k1252q99368q84966
$$ 102746 -470997 -324348 596530 1165406 974875 865263 1220422 1199170 299802 -585164
39980e85164O5407N77775R5541m59260l75635o5523J281O3529L53368N37076L10634
$$ -585164 -519757 58018 153559 -305701 -681336 -746859 -745578 -682049 -328681 208395 519029
39969E19029p5171k25782j20176j2352p8009k13966p6588M95704J028699Q27501
$$ 519029 443858 218076 97900 85548 7539 -206427 -283015 212689 1241388 2068889
39959B068889P765n04554k79093O2069n769q8241J81710L00350j40820m83273
$$ 2068889 2076654 1572100 1293007 1355076 1349307 1261066 1442776 1743126 1602306 1119033
39949A119033l6730O00069L84424n20354j052231p97557j92114M03154P94464
$$ 1119033 1082303 1682372 2066796 1546442 494211 -303346 -495460 -92306 702158
39940G02158N81701k20892o67480j35205M42733p3715r95119p41797N25127J069661
$$ 702158 1283859 1062967 395487 260282 703015 629300 -365819 -1107616 -582489 487172
39930D87172L76084j66001K47954N74160m7925o89702k20007P79854R81143L29854
$$ 487172 863256 697255 945209 1519369 1471444 781742 561735 1341589 2322732 2652586
39920B652586j37643L3504L44147L63587K02560O2534k1407m9604j12717m26116
$$ 2652586 2514943 2548447 2892594 3256181 3458741 3521275 3499868 3450264 3337547 2911431
39910B911431r52049j212502q42275j27860L27191K98509M9345p0913P9073L75859
$$ 2911431 1959382 746880 -95395 -223255 103936 402445 451790 380877 459950 835809
39900H35809N27477L80664J45220P2041j0412m17335r01694q00829l4645O03405
$$ 835809 1363286 1743950 1889170 1961211 1950799 1533464 631770 -169059 -203704 399701
39890C99701M47841j85244m77049j11789N10106Q33460O64537K76141J45259M48205
$$ 399701 847542 662298 185249 73460 583566 1417026 2081563 2357704 2502963 2951168
39880B951168P83628O03746q3029p03483q12406n10313j67212j9493n7285o9883
$$ 2951168 3734796 4338542 4255513 3552030 2739624 2229311 2062099 2042606 1985321 1915438
39870A915438J62444N18289N39778O0662m16029l56182N0060K53190K02269K45859
$$ 1915438 2077882 2596171 3135949 3196611 2780582 2424400 2474460 2727650 2929919 3175778
39860C175778L89295L33451J42388J79424M17038M65570K50257J8812k34824o42350
$$ 3175778 3565073 3898524 4040912 4220336 4637374 5102944 5353201 5372013 5137189 4494839
39850D494839q59575m21432L16681M72196m2504l58637M2897P11294J075116J056308
$$ 4494839 3635264 3213832 3530513 4002709 3960205 3601568 3644465 4355759 5430875 6487183
39840F487183O73826l5278m76203J05606J321507J768385R83549K65061Q29915
$$ 6487183 7161009 7125731 6649528 6755134 8076641 9845026 10828575 11093636 11923551
39831A1923551K053546K458204J816652J280550J711555K764510L641433M154847
$$ 11923551 13977097 16435301 18251953 19532503 21244058 24008568 27650001 31804848
39823C1804848M829244O139905P905517R753422J2150652J6202126K2094795K9000755
$$ 31804848 36634092 42773997 50679514 60432936 72583588 88785714 110880509 139881264
39815A39881264L7414633M9329121O2778168O7266592N0164819J0940395l3660081
$$ 139881264 177295897 226625018 289403186 356669778 406834597 417774992 384114911
39808C84114911o2369475o6998066n5794008m1664917l1036800k3626727j7910433
$$ 384114911 321745436 254747370 198953362 157288445 126251645 102624918 84714485
39801H4714485j3577157j0482550q129796o344215n243590m570132l826457l009534
$$ 84714485 71137328 60654778 52524982 46180767 40937177 36367045 32540588 29531054
39793B9531054k626169k919908l405098l306583k431319j474282j211397j439220
$$ 29531054 26904885 23984977 20579879 17273296 14841977 13367695 12156298 10717078
39785A0717078j234144l88796J63245k11855q03530o96645k12270k31566o82996
$$ 10717078 9482934 9094138 9257383 9045528 8241998 7545353 7333083 7101517 6418521
39776F418521q34309o46924o23627o26113j39790M67256L11633m10471n81870
$$ 6418521 5584212 4937288 4313661 3687548 3547758 4015014 4326647 3916176 3334306
39767C334306j7664K70460p6784j41387N21753R37188L18415n84299p00926k34465
$$ 3334306 3316642 3587102 3510318 3368931 3890684 4827872 5146287 4561988 3861062 3626597
39757C626597l3452j54657j00337O8488j13185n62089p35462m97261j82425O2229
$$ 3626597 3593145 3438488 3338151 3406639 3293454 2731365 1995903 1498642 1316217 1378446
39747A378446L81387P32122P98622L80377l98113j149622j365862p96454J43249
$$ 1378446 1759833 2491955 3290577 3670954 3272841 2123219 757357 -39097 104152
39738A04152O83487N64681K07787k9311j88847k08058J63607O64139N48719k27584
$$ 104152 787639 1352320 1560107 1530796 1341949 1133891 1297498 1961637 2510356 2282772
39728B282772o44816k5100R18098J114832N65890k88k85604m26618l76231j29577
$$ 2282772 1637956 1612856 2530954 3645786 4211676 4211388 3925784 3499166 3122935 2993358
39718B993358j01175m33748m19571M58634J403011J321051N92174N63265J463571
$$ 2993358 2892183 2458435 2038864 2497498 3900509 5221560 5813734 6376999 7840570
39709G840570K162175K068078J932762K445702L280231M033723M916263N714469
$$ 7840570 10002745 12070823 14003585 16449287 19729518 23763241 28679504 34393973
39701C4393973N074147J950171k625977o159044p024588n690273l799064k569806
$$ 34393973 39468120 41418291 38792314 32633270 25608682 19918409 16119345 13549539
39693A3549539k077989j709975j127201o88979q17339j214974j222145q34805
$$ 13549539 11471550 9761575 8634374 7945395 7128056 5913082 4690937 3856132
39685C856132o72371q72112q16928k30512K73106J94816m4138J11188M35835M80742
$$ 3856132 3183761 2311649 1494721 1264209 1537315 1732131 1687993 1799181 2235016 2715758
39675B715758M16109N28068M43298k04071p83614m30640M53663O10742k04585
$$ 2715758 3131867 3659935 4103233 3899162 3115548 2684908 3138571 3749313 3544728
39666C544728r05503p72007l37349k23388j69209J79650M19841J05758l35919
$$ 3544728 2639225 1867218 1529869 1306481 1137272 1316922 1736763 1842521 1506602
39657A506602k35130J93526J55572m86509r83989p03470J30434P41686N98634
$$ 1506602 1271472 1464998 1620570 1134061 150072 -553398 -422964 318722 917356
39648I17356m7692l24363L26121J306210J406283L43999q18227j077073o25286
$$ 917356 869664 545301 871422 2177632 3583915 3927914 3109687 2032614 1407328
39639A407328j43671K50455O15255M89114l94426j211006r83821p5488L93412
$$ 1407328 1263657 1514112 2129367 2618481 2224055 1013049 29228 -46260 347152
39630C47152K96395L63112N21602k1638r44702q12427N35061J299509L69154r00069
$$ 347152 643547 1006659 1528261 1506623 561921 -250506 284555 1584064 1953218 1053149
39620A053149q09393J29799L50691j29617j07436M06671K26944o86914r41470
$$ 1053149 243756 373555 724246 594629 487193 893864 1120808 433894 -507576
39611e07576q1291N54249K8296p09815m92050K32138M14768K45944N74476J116674
$$ -507576 -588867 -34618 -6322 -716137 -1208187 -976049 -561281 -315337 259139 1375813
39601A375813P56907m90172j221755o42191L27500M86161Q318j08734L26183N57395
$$ 1375813 2132720 1642548 420793 -221398 106102 592263 600581 491847 818030 1375425
39591A375425K05455j73324n1461K71146K57570o757r5074j5626p0914j61685
$$ 1375425 1580880 1407556 1356095 1627241 1884811 1878054 1782980 1767354 1696440 1534755
39581A534755N9360M18776L71485l0881j37575J57478J65134l45915n98813j15761
$$ 1534755 1594115 2012891 2384376 2353495 2215920 2373398 2538532 2192617 1593804 1478043
39571A478043L52066N2345m43730k21619L51627K57495l77743n14157q812K43206
$$ 1478043 1830109 1882454 1438724 1217105 1568732 1826227 1448484 934327 925515 1168721
39561A168721l1856j43461O8787j20164p79113q82403n5297O01805K67293k63716
$$ 1168721 1136865 993404 1062191 942027 162914 -719489 -774786 -172981 94312 -169404
39551a69404N28N84631M67622k06391n64724m82087m15590l15992R4389M12292
$$ -169404 -168876 415755 883377 676986 112262 -369825 -785415 -1101407 -1007018 -594726
39541e94726J32657k38602J17251Q33560Q61152K59577Q5979N19195N47524k47897
$$ -594726 -462069 -700671 -583420 250140 1111292 1370869 1456848 1976043 2523567 2275670
39531B275670r90634j010709p66012p09889m48371K48884O75825K94601k78924
$$ 2275670 1285036 274327 -491685 -1201574 -1649945 -1401061 -725236 -430635 -709559
39522g09559k96252q6718k59171m04420K26648J204692J346835N21316j71536
$$ -709559 -1005811 -1092529 -1351700 -1756120 -1529472 -324780 1022055 1543371 1371835
39513A371835j17510L9838l12168o96443l99084L18237O07264K79420l5299J25559
$$ 1371835 1254325 1294163 981995 285552 -113532 204705 811969 1091389 1056090 1181649
39503A181649M97932N99934L57419J7592k78651n59914p61717o78663k61657J94757
$$ 1181649 1679581 2279515 2636934 2654526 2375875 1815961 1054244 375581 113924 308681
39493C08681L05919r48m28552o09305l82663J24180N16635L26291n04298j286595
$$ 308681 614600 613652 185100 -424205 -806868 -682688 -166053 160238 -344060 -1630655
39483a630655j096938J42760J361275J447725N11842l38148l99187p9467p9365
$$ -1630655 -2727593 -2584833 -1223558 224167 736009 397861 -1326 -80793 -160158
39474a60158l59937l54184N3601L31025J42859j08713J06263O20236P79072L57394
$$ -160158 -520095 -874279 -820678 -489653 -346794 -455507 -349244 270992 1050064 1407458
39464A407458j66010k71634M4213M61615P03279N55820o7435q12096j009431m88309
$$ 1407458 1241448 969814 1014027 1475642 2178921 2734741 2667306 1855210 845779 357470
39454C57470P9195R3235o7269L04263R49800Q88266j8791o91149l80680K53670
$$ 357470 436665 529900 462631 766894 1716694 2604960 2586169 1895020 1514340 1768010
39444A768010K41916k14673k08304L36263N55657L3101n89304o06021j76490R8857
$$ 1768010 2009926 1795253 1586949 1923212 2478869 2511970 1922666 1316645 1140155 1239012
39434A239012N2657k2277L5902L6521k19812n88740o41188j03178P27060J137546
$$ 1239012 1291669 1269392 1305294 1341815 1122003 533263 -107925 -211103 515957 1653503
39424A653503P52308M10l82274j62653L62853R26601J402349J501387R58089M3306
$$ 1653503 2405811 2406221 2023947 1861294 2224147 3150748 4553097 6054484 7012573 7055879
39414G055879o73662j099083j511226j678166r85542K85515Q29592R4257p41411
$$ 7055879 6382217 5283134 3771908 2093742 1108200 1393715 2223307 2317564 1576153
39405A576153m52187L84077L90322l56023n15401K60713P81312K64779n18479
$$ 1576153 1123966 1508043 1898365 1542342 1026941 1287654 2068966 2333745 1815266
39396A815266n86174j04613K58602L97774M16326l637r94686j801489j556568
$$ 1815266 1229092 1124479 1383081 1780855 2197181 2193544 1198858 -602631 -2159199
39387b159199m64828M81522P17741M52121R6662m8641J95181O21272O30805K1561
$$ -2159199 -2624027 -2142505 -1424764 -972643 -875981 -924622 -729441 -108169 522636 544197
39377E44197n28005l48614J77545J65319m26636p62844l52528M03652Q85511Q68895
$$ 544197 16192 -332422 -154877 10442 -416194 -1179038 -1531566 -1127914 -242403 626492
39367F26492M67288k2827k44775j64716j58928l22510j21342O26572R65011L6447
$$ 626492 1093780 1070953 826178 661462 502534 180024 58682 685254 1650265 1686712
39357A686712j236724j032944P39920K019456J222660q01421k042464j654268
$$ 1686712 449988 -582956 156964 2176420 3399080 2597659 555195 -1099073
39349a099073l66189O94513R04641L76358j43837L9292O96636R83295P63871Q07641
$$ -1099073 -1465262 -770749 133892 510250 366413 405705 1102341 2085636 2849507 3657148
39339C657148J331910J359986K31576j140460j466000q58912l86430l41061j25927
$$ 3657148 4989058 6349044 6580620 5440160 3974160 3115248 2728818 2387757 2261830
39330B261830L60852M27157j86083p67064o66859j49421J73807J99559J77639
$$ 2261830 2622682 3049839 2863756 2096692 1429833 1280412 1454219 1653778 1831417
39321A831417Q4903l10663q47720r29297l19297L07872Q2758p85656j039510k8970
$$ 1831417 1916320 1605657 757937 -171360 -490657 -182785 -100027 -885683 -1925193 -1954163
39311a954163J232724J354997M66772j29240M9894K15491r6694l00801n0572J7789
$$ -1954163 -721439 633558 1100330 971090 1020984 1236475 1139781 838980 788408 806197
39301H06197m57343o99581r9197N93677M23142k35024m00904p3029Q9724J02407
$$ 806197 348854 -350727 -449924 143753 566895 331871 -69033 -142062 -52338 50069
39291E0069M16827P51019M42580k40617l83469N7319J93764k98188p28896n84367
$$ 50069 466896 1217915 1660495 1419878 1036409 1093728 1287492 989304 260408 -323959
39281c23959j79010Q0011K23238L09458K23193N0085L5749J15307N9372J770J88734
$$ -323959 -502969 -422958 -199720 109738 332931 383016 418765 534072 593444 595214 783948
39270G83948L75557J97504o8358O9318L49401J46957l58867m34130r6954p8067
$$ 783948 1159505 1357009 1288651 1357969 1707370 1854327 1495460 1061330 964376 886309
39260H86309m82618o11464k15181J60364K23807K76309L58171J34510k14763j14553
$$ 886309 403691 -207773 -422954 -262590 -38783 237526 595697 730207 515444 400891
39250D00891K22544n7837q70054j049400k07701N75415M85370J28220K32323L96039
$$ 400891 623435 565598 -304456 -1353856 -1561557 -986142 -500772 -372552 -140229 255810
39240B55810L8540m05080k27463L66681P10418O84383N18808J99570k20505l00299
$$ 255810 294350 -110730 -338193 28488 738906 1423289 1942097 2141667 1921162 1620863
39230A620863J41668N86832N48840J69471l14001r31218j369191r23461L17953
$$ 1620863 1762531 2349363 2898203 3067674 2753673 1822455 453264 -470197 -152244
39221a52244J140770P84518K6386o6012L63648N33826L20318P4006k01004n97988
$$ -152244 988526 1773044 1799430 1733418 2097066 2630892 2951210 3025216 2824212 2226224
39211B226224p73462m48895K7256K21508J66913n9598n20758p66717p0521J119522
$$ 2226224 1452762 1003867 1031123 1252631 1419544 1359946 839188 72471 1950 1121472
39201A121472J240843n7644j033952l89596P24828O53832j47010j93161M04837
$$ 1121472 2362315 2304671 1270719 881123 1605951 2259783 2112773 1919612 2324449
39192B324449L70976l85079q03072o30439n12755m30463J97176J036831J120048
$$ 2324449 2695425 2310346 1507274 876835 364080 -66383 130793 1167624 2287672
39183B287672M71372l2982k12806n27338p94412m96325j6405k0471o3007N34165
$$ 2287672 2759044 2726062 2513256 1985918 1191506 695181 678776 658305 595298 1129463
39173A129463J023252L93660m28097J69384J487610J341531l14398j290687p22414
$$ 1129463 2152715 2546375 2118278 2287662 3775272 5116803 4802405 3511718 2789304
39164B789304P6949M74036J223189K001068J526297P13004K088934N218334O887309
$$ 2789304 2866253 3340289 4563478 6564546 8090843 8803847 10892781 16111115 22998424
39155B2998424P239122J0556711J6802958J7686310O810025r591049j8577167
$$ 22998424 30237546 40794257 57597215 75283525 82093550 72502501 53925334
39148E3925334j5866219r072945n915529n789117m704003k527507j539302j632618
$$ 53925334 38059115 28986170 23070641 17281524 12577521 10050014 8510712 6878094
39140F878094j050634O1839J90831n84881q40018k95134J00553M7979M7453P8628
$$ 6878094 5827460 5889299 6080130 5495249 4655231 4360097 4460650 4508629 4556082 4634710
39130D634710l27341r89282j267553j031077n09886K58573R63926P94683k97241
$$ 4634710 4307369 3318087 2050534 1019457 509571 768144 1732070 2526753 2229512
39121B229512r60224k62043P19362N03404m33692n63190R9683K35700k68961j52800
$$ 2229512 1269288 1007245 1726607 2230011 1796319 1233129 1332812 1568512 1299551 1146751
39111A146751P50039R47400j98131j236628q44979K44232O23675K83550R6463
$$ 1146751 1896790 2844190 2646059 1409431 564452 808684 1432359 1715909 1812372
39102A812372J80449L3875l16981m40622l46509k74818p6977L32012M12567j65602
$$ 1812372 1992821 2026696 1709715 1269093 922584 647766 570789 902801 1315368 1149766
39092A149766o31170j18892Q42210J015992L51136o6982J57963K67452j73508
$$ 1149766 518596 399704 1241914 2257906 2609042 2542060 2700023 2967475 2793967
39083B793967n93729n33971l33211k93294j57759J45901J82894j20974j95002
$$ 2793967 2200238 1666267 1333056 1039762 882003 1027904 1210798 1089824 894822
39074H94822J29664K09551k55517n96098l27335j5633k55307o18759m46008N1367
$$ 894822 1024486 1234037 978520 382422 55087 39454 -215853 -834612 -1280620 -1229253
39064a229253L05512L48498M43382M06894J15399M1968M57852P48626L70927j90558
$$ -1229253 -923741 -575243 -131861 275033 390432 432400 890252 1638878 2009805 1819247
39054A819247k84446j46884j56447R7744Q82190J335586P28909j17705j07354
$$ 1819247 1534801 1387917 1231470 1329214 2211404 3546990 4275899 4158194 4050840
39045D050840K78677J5652l92270K46939J559488K204554K156216K297142K486467
$$ 4050840 4329517 4345169 3952899 4199838 5759326 7963880 10120096 12417238 14903705
39036A4903705K601321M643581J0103843J5137765J2766097J748186j0258001
$$ 14903705 17505026 22148607 32252450 47390215 60156312 61904498 51646497
39029E1646497j4923175j1958284p116700m240690k796384j574869q02539o18280
$$ 51646497 36723322 24765038 17648338 13407648 10611264 9036395 8233856 7615576
39021G615576m69738m31369j034734j692962j202989J52276Q08584K67626m48301
$$ 7615576 7145838 6714469 5679735 3986773 2783784 2936060 3744644 4012270 3563969
39012C563969o96718q81893j122628q79319j51052L45371L63849K77447R8536
$$ 3563969 2867251 1985358 862730 -16589 -167641 177730 541579 819026 917562
39003I17562l62029n63415N7938O64193j5451j401568j606610l40102O77722M86515
$$ 917562 555533 -7882 50056 714249 698798 -702770 -2309380 -2649482 -1971760 -1485245
38993a485245N7259J88927K83446J3518K26988J119652J345832K31812p93077
$$ -1485245 -1427986 -1239059 -955613 -942095 -715107 404545 1750377 1982189 1189112
38984A189112m20782L92288J29554p47419p72504J4651M07509J87178R5585J24823
$$ 1189112 768330 1160618 1290172 542753 -229751 -215100 192409 379587 475172 599995
38974E99995l40484r14898n48558N16313Q37139N5752n07605P054P35333O45646
$$ 599995 259511 -655387 -1203945 -687632 149507 205259 -302346 -295292 440041 1085687
38964A085687J07081J6757L00776K55519k06584n45317m99159k87284j18522o7172
$$ 1085687 1192768 1209525 1510301 1765820 1559236 1013919 514760 227476 108954 41782
38954D1782k46192n98429o89893j95378N51678R54131R41984Q54834O82254J10527
$$ 41782 -204410 -802839 -1492732 -1688110 -1136432 -182301 759683 1614517 2296771 2407298
38944B407298o27686p41224p4853L94392j33801j041755j179141n81960k39213
$$ 2407298 1779612 1038388 963535 1357927 1224126 182371 -996770 -1578730 -1817943
38935a817943k81420K70210J576258K147719Q96824r88672j509749n90360Q7648
$$ -1817943 -2099363 -1829153 -252895 1894824 2791648 1802976 293227 -297133 -209485
38926b09485k69775o57488k22854L88975L46524O6847L19333P33647L85172n39685
$$ -209485 -479260 -1136748 -1359602 -970627 -624103 -557256 -237923 495724 880896 341211
38916C41211q41080p3124P75596O61932j74580p06145m95080l8981J04277M030
$$ 341211 -499869 -572993 202603 864535 689955 -16190 -511270 -550251 -445974 -441944
38906d41944J6116J38370R2262q7449k1942L45721N20772J96116j88112r4294
$$ -441944 -425828 -287458 -195196 -282645 -304587 41134 561906 758022 569910 475616
38896D75616K18573P8411m60504n82191O3987P47820O09949k02301p59546n14890
$$ 475616 694189 772600 312096 -270095 -206108 541712 1151661 949360 189814 -325076
38886c25076J12473L38246M139k22445K46322R98042J056964K80699l36425j14270
$$ -325076 -212603 125643 129782 -92663 153659 1151701 2208665 2489364 2152939 2038669
38876B038669K71118r6293q24404q11545o5367K71499k61344p68651m70585J63774
$$ 2038669 2309787 2213494 1389090 577545 512178 783677 522333 -246318 -716903 -553129
38866e53129K91508n2576j85425K12631Q01798J013478N25267m04908j007714
$$ -553129 -261621 -314197 -499622 -286991 514807 1528285 2053552 1648644 640930
38857F40930p85182j77141N9528j9230K10797O75134N86634j56932o20549k55059
$$ 640930 -144252 -321393 -261865 -281095 -70298 604836 1191470 1034538 413989 158930
38847A58930L00051L24914K6018j27539k17317l77937k74572K01296M13943o1580
$$ 158930 458981 783895 809913 682374 465057 87120 -187452 13844 427787 366207
38837C66207n60397k23248O70449J056677M96279m22519q84666n66001K18833
$$ 366207 -194190 -417438 253011 1309688 1805967 1383448 498782 -67219 151614
38828A51614P30714M53921k47985n30282k26267K8731n1606j6426K81426K88923
$$ 151614 882328 1336249 1088264 557982 331715 360446 308840 292414 573840 862763
38818H62763j23204k31771J83664K05047o04459j085893k00664J088302J078923
$$ 862763 739559 507788 691452 896499 292040 -793853 -994517 93785 1172708
38809A172708j74389j092228r02843l15030l1771P5012K60887M76376P25620R95626
$$ 1172708 998319 -93909 -996752 -1311782 -1343553 -1268541 -1007654 -531278 194342 1189968
38799A189968Q71881M1648r29462j134895n33033J10802K99196J30006j58765
$$ 1189968 2061849 2103497 1174035 39140 -493893 -383091 -83895 46111 -112654
38790a12654k70716J42672Q50136R32317Q0112o75778m64303K5102j52047l92990
$$ -112654 -383370 -240698 609438 1541755 1621867 946089 481786 506888 354841 -38149
38780c8149L25343J256951Q17776o53635j205055l54053K96618j29140n00906
$$ -38149 287194 1544145 2361921 1708286 503231 149178 445796 316656 -184250
38771a84250N3658N86880J19231o49100o49970j69296j5941k5953L63755Q51996
$$ -184250 -130592 456288 575519 -73581 -723551 -892847 -908788 -934741 -570986 281010
38761B81010P55000J92836j86713k24330j90178j32934K7346J40429J02779J06514
$$ 281010 1036010 1228846 1042133 817803 627625 494691 522037 662466 765245 871759
38751H71759K31911K68985K15397L28266M39379O322q35005j144471n29374K53337
$$ 871759 1103670 1372655 1588052 1916318 2355697 2362019 1527014 382543 -146831 106506
38741A06506N13287N32113P07168P20305K40334l53047o11508o54392o19333l01680
$$ 106506 619793 1151906 1859074 2579379 2819713 2466666 1855158 1200766 581433 279753
38731B79753J28044m188o79619q92473k51391K52589n8039k92686M21153J243523
$$ 279753 407797 403609 -276010 -1168483 -1419874 -1167285 -1225324 -1518010 -1096857 146666
38721A46666R54685O2451n2905N26845N03722l39606p87884k31300M19432K16053
$$ 146666 1101351 1163802 1110897 1637742 2141464 1801858 1013974 782674 1202106 1418159
38711A418159n39836r07019m52255M81986J128858Q61762j49756r84475j059346
$$ 1418159 878323 -28696 -480951 1035 1129893 1991655 1841899 857424 -201922
38702b01922p81300o37407k96164N88635J346542J141352L60600p157K0043k94187
$$ -201922 -983222 -1620629 -1916793 -1328158 18384 1159736 1520336 1513179 1533222 1239035
38692A239035p99972n71105L86914R13726M03497m39052q07246o94128l49934
$$ 1239035 439063 -132042 254872 1168598 1572095 1133043 325797 -368331 -718265
38683g18265J31102M28505J88269j71276J44841Q81173Q22184l09072j182328
$$ -718265 -587163 -158658 29611 -141665 3176 884349 1706533 1397461 215133
38674B15133o96013N03313J059602O70808N9336k13628j71499n4808j02145m11329
$$ 215133 -480880 22433 1082035 1752843 1812179 1598551 1427052 1372244 1270099 858770
38664H58770o83137m78190N7865K59262m7074k58168m2870P9234k87452n79091
$$ 858770 175633 -302557 -244692 14570 -32504 -290672 -333542 -254308 -541760 -1120851
38654a120851j26808O61665P59500p7897j027204j223075n89744K90479P79201
$$ -1120851 -1247659 -585994 173506 95609 -931595 -2154670 -2744414 -2453935 -1674734
38645a674734O79232L26712J38795R1332r7382l48122k81627Q4885L18544L68267
$$ -1674734 -995502 -668790 -529995 -438663 -536045 -884167 -1165794 -1080909 -762365 -394098
38635c94098O60470J133206R83680r4801j134447j053902p9658P09739Q23957
$$ -394098 266372 1399578 2383258 2288457 1154010 100108 20450 730189 1554146
38626A554146N66382J44374n11913j100100r60200M1286J167335J537134Q87120
$$ 1554146 2120528 2264902 1752989 652889 -307311 -266025 901310 2438444 3325564
38617C325564l67593j438609j575585o56679N33328R81120M83577k77899o52787
$$ 3325564 2957971 1519362 -56223 -712902 -179574 801546 1285123 1007224 354437
38608C54437n81493k33322L36840Q95642Q90163J05636p73292q18268p6336L98044
$$ 354437 -227056 -460378 -123538 772104 1662267 1767903 994611 176343 100007 498051
38598D98051n1396p16174m49177O97557J437457R34950j50784o83823n15696k74958
$$ 498051 446655 -269519 -718696 -21139 1416318 2351268 2200484 1516661 1000965 726007
38588G26007j22184L34217R15974P04020n64367j709367j430577M603J105427
$$ 726007 603823 938040 1854014 2558034 1993667 284300 -1146277 -1141674 -36247
38579c6247R90629J88224l66668m28343k87180q2712K40953N41858N47080L08831
$$ -36247 954382 1142606 775938 347595 60415 -22297 218656 760514 1307594 1616425
38569A616425J79575K30222R8487l42070n76032j83191L27757J28434n75472o71678
$$ 1616425 1796000 2026222 2124709 1782639 1206607 1023416 1351173 1479607 904135 232457
38559B32457J57894P89491K86939o40941o92241J15527O63957N43761M76562R63132
$$ 232457 390351 1179842 1466781 825840 133599 249126 913083 1456844 1933406 2896538
38549B896538J659274K284916L033627L647215L107712R65405j705648l359774
$$ 2896538 4555812 6840728 9874355 13521570 16629282 17594687 15889039 12529265
38541A2529265l519266k756181j702924p37995k18820k65062m54579l10503m511
$$ 12529265 9009999 6253818 4550894 3812899 3594079 3329017 2874438 2563935 2559424
38532B559424j14584p54001j351228j313433o53426O2548K93552Q8079J1637L57060
$$ 2559424 2444840 1690839 339611 -973822 -1627248 -1564700 -1271148 -1183069 -1171432 -814372
38522h14372O57458M09331J2224K27513Q04744O60170l82651j130009p78497o5908
$$ -814372 -156914 252417 264641 492154 1296898 1957068 1574417 444408 -334089 -399997
38512c99997N5062j29016P8055M03900K31881j10338J9416K17192k79604r40983
$$ -399997 -344935 -473951 -395896 8004 239885 129547 148963 366155 86551 -854432
38502h54432n65649N72347Q77501n7952p54376j85029P24559P51235J76753r1210
$$ -854432 -1420081 -847734 29767 -28185 -782561 -967590 -243031 508204 684957 593747
38492E93747o8056j80609j13487N22918J011373L86786q72919j334073o47794
$$ 593747 525691 345082 231595 754513 1765886 2152672 1279753 -54320 -702114
38483g02114J31882K53227O3657l9796k31842m65325j88445N88688R29963L42865
$$ -702114 -570232 -317005 -253348 -293144 -524986 -990311 -1178756 -590068 339895 682760
38473F82760l55684k95285J31144J04609j82956l4094L25378R1092n66838o10533
$$ 682760 327076 31791 162935 267544 84588 50494 375872 466964 -99874 -710407
38463g10407J33144O12155K32701k76024j90349R1063m6098l33956k53462l912
$$ -710407 -577263 34892 267593 -8431 -198780 -107717 -153815 -487771 -741233 -745145
38453g45145K7857J10240N53504Q34478L45889m53985p04818n42393o64452q48740
$$ -745145 -717288 -607048 -53544 780934 1126823 672838 -31980 -574373 -1238825 -2087565
38443b087565k83284P33368R24602R4881l95243K76999J139630R89367J08263
$$ -2087565 -2370849 -1637481 -712879 -617998 -1013241 -736242 403388 1392755 1501018
38434A501018m21696k41283K67259P30833P86846O1347j076751j452043n88051
$$ 1501018 1079322 838039 1105298 1836131 2622977 2684324 1607573 155530 -432521
38425d32521M20742L97448k84252n32605k70623j48857j37394K22913N61556J43874
$$ -432521 -11779 385669 101417 -431188 -701811 -850668 -988062 -765149 -203593 -59719
38415e9719n81918m30410M83974P30234j06102o58578m049Q28438N89193j76750
$$ -59719 -641637 -1072047 -588073 142161 36059 -622519 -626568 201870 791063 614313
38405F14313j60416N04588N51351k72568q30433m50318J18450K5406l94098l07119
$$ 614313 453897 958485 1509836 1237268 406835 -43483 74967 100373 -293725 -600844
38395f00844K79162O04903K98787k18411m19398k53556Q819J21072m1732l95376
$$ -600844 -321682 283221 582008 363597 -55801 -309357 -300538 -179466 -221198 -616574
38385f16574n63143k25123L30299M17198p4261m05079p6304L38183J01755l88329
$$ -616574 -1179717 -1404840 -1074541 -657343 -731604 -1136683 -1212987 -874804 -773049 -1161378
38375a161378j57911O82516R53925K36619m48511k43903L00018K92005p7964r1044
$$ -1161378 -1319289 -636773 317152 553771 105260 -138643 161375 453380 375416 284372
38365B84372J97855K15493k3318p3791k6251l06199o81198m87634J64277M11242
$$ 284372 482227 697720 674402 600611 574360 268161 -413037 -900671 -736394 -325152
38355c25152J8735j90564L65570J075281R70252J9314q94520j040971n37985o8029
$$ -325152 -306417 -496981 -131411 943870 1914122 1933436 1038916 -2055 -540040 -608069
38345f08069q2167l25156k21542L04053P13014O46889L50561O0229m05837r74213
$$ -608069 -690236 -1015392 -1236934 -932881 -219867 427022 777583 837812 431975 -542238
38335e42238r20065R0217J118257J045945J43847m34538l72993k93156l79043
$$ -542238 -1462303 -1372086 -253829 792116 935963 501425 128432 -164724 -543767
38326e43767j68528K79670K80306k03721l54052J15463M63742K14390j01430K1462
$$ -543767 -712295 -432625 -152319 -356040 -710092 -594629 -130887 83503 -17927 3535
38316C535K48378J68048O124K7303K1157r0641P2059N25007N73110j02228p68292
$$ 3535 251913 419961 426085 453388 474545 383904 455963 980970 1554080 1451852 683560
38305F83560p11448k73950j30105k04052p9143J01037k4602k22086l309N00223
$$ 683560 -27888 -301838 -431943 -635995 -715138 -614101 -638703 -860789 -864098 -363875
38295c63875P11546M65510J17028m0027l729J15581J65938M5827p5131N9564K85742
$$ -363875 347671 813181 930209 890182 886453 1002034 1167972 1213799 1138668 1198232 1483974
38284A483974J74318k20978m10249l62304n34547q31239n45701K86788O02683
$$ 1483974 1658292 1437314 1027065 664761 130214 -701025 -1246726 -959938 -357255
38275c57255j5697n16046n4122O04231M14374k00373j87378L37281M82382J85000
$$ -357255 -372952 -888998 -943120 -338889 75485 -124888 -312266 25015 507397 692397
38265F92397M3577j1993m71415r39554n14810N80192J092032N74732p6754j35080
$$ 692397 735974 723981 252566 -686988 -1201798 -621606 470426 1045158 968404 833324
38255H33324L7767p7079k43713K8743O59392J035990O25617m53223j271893q87205
$$ 833324 871091 794012 550299 579042 1238434 2274424 2900041 2446818 1174925 287720
38245B87720L42989Q75438J9957r46297o49643K57363K24759o16739p50901J11523
$$ 287720 630709 1506147 1526104 579807 -69836 187527 412286 -204453 -955354 -843831
38235h43831N76785q2325q30555o14473K23594Q26924R06961M66982m08543j062753
$$ -843831 -267046 -349371 -1179926 -1794399 -1570805 -743881 163080 630062 221519 -841234
38225h41234p02455K97710P01493L20029K40488P73158Q00392j29616p62240k56434
$$ -841234 -1543689 -1245979 -544486 -224457 16031 789189 1589581 1459965 697725 441291
38215D41291K66193l09418j014750m30175P24096O34896o10852j150594l03647
$$ 441291 707484 398066 -616684 -1046859 -322763 312133 -298719 -1449313 -1752960
38206a752960N55918L40530k71868k85678J13407L09534M09771P18246Q25275
$$ -1752960 -1197042 -856512 -1128380 -1414058 -1300651 -991117 -581346 136900 962175
38197I62175K17139o22090o90950L9818N04191J02735m08619j32710M72740K43795
$$ 962175 1179314 557224 -133726 -93908 410283 513018 104399 -28311 444429 688224
38187F88224p39419j028289P530J041852P15131l12160n32425m0537p7221n15310
$$ 688224 -51195 -1079484 -1071954 -30102 685029 372869 -159556 -200093 -277314 -792624
38177g92624P6952J615676J971451K08046j631600j423980j7678M01297k71070
$$ -792624 -715672 900004 2871455 3079501 1447901 23921 6243 407540 136470
38168A36470l85784M35174Q40481K28675l34889m6226M41589L32391r5914k38850
$$ 136470 -249314 185860 1026341 1255016 920127 873901 1315490 1647881 1551967 1313117
38158A313117j49533j63175k76042l98702o30794q98216q41652l62516J85021
$$ 1313117 1163584 1000409 724367 325665 -305129 -1203345 -2044997 -2407513 -2222492
38149b222492N22196O84222O44663K69344k33823l85602r6975K52495M57657O34321
$$ -2222492 -1700296 -1016074 -371411 -102067 -335890 -721492 -818467 -565972 -108315 526006
38139E26006O80443K78260l96515o42708k00194L10970K31936l01999o54353m59582
$$ 526006 1206449 1484709 1088194 445486 245292 556262 788198 486199 -168154 -627736
38129f27736J16308O10656O50992L37770J78483L62777L65359k27934q11228m55377
$$ -627736 -511428 99228 750220 1087990 1266473 1629250 1994609 1766675 955447 500070
38119E00070O31068J229806P41367j91192q02756j029138r72781m99025J92590
$$ 500070 1131138 2360944 3102311 2911119 2108363 1079225 106444 -392581 -199991
38110a99991M24329Q234l18657M6004O77274Q07735L56788k30109o56861p85894
$$ -199991 224338 232572 -86085 -40081 637193 1444928 1801716 1571607 914746 128852
38100A28852m55589J81283N29448K38118l12504n59154l98394n033M72229P15203
$$ 128852 -326737 -145454 383994 622112 309608 -249546 -647940 -652973 -180744 534459
38090E34459L36056m30707p54624l51142R2146J04326K01368P60734J013429K14163
$$ 534459 870515 439808 -314816 -665958 -573812 -469486 -268118 492616 1506045 1720208
38080A720208q59628q48580J10846N62840q3387q13314o65903k1925K18829p4769
$$ 1720208 860580 12000 122846 685686 602299 -211015 -876918 -898843 -680014 -754783
38070g54783l41251j99469J95980M44253L49792K02276M77115J032284R87606
$$ -754783 -1096034 -1295503 -1099523 -655270 -305478 -103202 373913 1406197 2393803
38061B393803p5532j213624j228746l89635m6475o18910j085074o40086K47481
$$ 2393803 2318271 1104647 -124099 -513734 -560209 -1179119 -2264193 -2904279 -2656798
38052b656798Q20897J046081J085496O96316j18356o00316j86357N47613O28108
$$ -2656798 -1835901 -789820 295676 991992 873636 273320 86963 634576 1262684
38043A262684l2373p29244r42489o19596Q4464P21202O49882j04579n71700j54759
$$ 1262684 1230311 501067 -441422 -1061018 -976554 -255352 394530 289951 -281749 -436508
38033d36508L32908p5345p53374l30683R65468J394864L43443p03181m81875J86696
$$ -436508 -103600 -178945 -932319 -1263002 -297534 1097330 1440773 737592 255717 442413
38023D42413o9338r03744r10124Q7603Q55737O78860J63234P843Q8050N6958m0096
$$ 442413 373075 -530669 -1440793 -1353190 -497453 181407 344641 352484 440534 497492 457396
38012D57396j12674k75306m37176k79978R9926J92484m2194m8551K64571K30100
$$ 457396 344722 69416 -367760 -647738 -547812 -355328 -397522 -446073 -181502 48598
38002D8598l22512m97904J92351P28890Q1067r49650q04325L46518P97509m0236
$$ 48598 -273914 -771818 -579467 149423 230490 -719160 -1523485 -1176967 -379458 -419694
37992d19694q26311m99362K48272M12085K24735K91596L17244j34466m80688L975
$$ -419694 -1246005 -1745367 -1497095 -1085010 -860275 -568679 -251435 -385901 -866589 -862614
37982h62614P58122O68691j67579o84078n68856m49141m84462j41508N21280O73876
$$ -862614 -104492 564199 396620 -287458 -856314 -1305455 -1789917 -1931425 -1410145 -736269
37972g36269J35573k35898P487K24483l3848k17199P4249K51920q4712j84151
$$ -736269 -600696 -836594 -829107 -604624 -638472 -855671 -781422 -529502 -614214 -798365
37962g98365N53792J218458O57776n44879q38723q9220L66651m214k14742L38905
$$ -798365 -244573 973885 1631661 1086782 248059 158839 525490 521276 306534 645439
37952F45439P76296K72170n45727p03340m21153m40247n31405L4257Q94115Q50859
$$ 645439 1421735 1693905 1148178 444838 23685 -416562 -947967 -913710 -19595 831264
37942H31264k05216q94733l10617O64071P07192o5987n05601k31226M6755p2988
$$ 831264 626048 -268685 -579302 84769 791961 725974 220373 -10853 35902 -37086
37932c7086o6413L89230O31384O1182o99668o31117O9349K51148l56381p14843
$$ -37086 -103499 285731 917115 978297 278629 -352488 -283139 -31991 -388372 -1103215
37922a103215k09255L03883p1277o97671l70525O81028J052948L26260l35296
$$ -1103215 -1312470 -1008587 -1079864 -1777535 -2148060 -1467032 -414084 -87824 -423120
37913d23120n2285M81954K38475n32090q04435l27814K53052N18283O11261N60564
$$ -423120 -475405 6549 245024 -287066 -1091501 -1419315 -1166263 -647980 -36719 523845
37903E23845J44966m38686n46208k2193M53900L37127J3960J42509N83525N95863
$$ 523845 668811 230125 -316083 -338276 115624 452751 466711 609220 1192745 1788608
37893A788608n8798q06918j089529r53267o45912j38635N67876J029593P86617
$$ 1788608 1729810 922892 -166637 -1119904 -1765816 -1904451 -1336575 -306982 479635
37884D79635Q1259l62014k81682j14651k07964l36328k30841m4411P5868L40073
$$ 479635 560894 198880 -82802 -197453 -405417 -741745 -972586 -1016997 -941129 -601056
37874f01056P21936N70182m06440j209475o63186P12977J156730J39291q81353
$$ -601056 120880 691062 284622 -924853 -1588039 -875062 281668 420959 -460394
37865d60394o70147Q6531J76347j51206J25381Q42542Q68187K8093o03352m28140
$$ -460394 -1130541 -1044010 -867663 -1018869 -893488 -50946 817241 845334 241982 -186158
37855a86158p4915j22876k00215J41260N51746M82818L1095l27607l62801r0870
$$ -186158 -261073 -383949 -584164 -442904 108842 591660 622755 295148 -67653 -158523
37845a58523L53028N78788K41488l02688l28253M5883j24514r65413j234565k10307
$$ -158523 194505 773293 1014781 712093 383840 429723 305209 -660204 -1894769 -2105076
37835b105076Q84488N34472p24043j053788p2294O89271J99245o59942o43676
$$ -2105076 -1220588 -686116 -1410159 -2463947 -2536241 -1846970 -1647725 -2307667 -2951343
37826b951343M6765L56168N2351j16486L15625Q74699Q49375K40692k08986J04421
$$ -2951343 -2904578 -2548410 -2496059 -2612545 -2296920 -1422221 -572846 -332154 -541140 -436719
37816d36719Q66574J165312O49850r357j13122O0867j77163p29048r03037o44400
$$ -436719 429855 1595167 2245017 2235660 2122538 2183405 2006242 1277194 374157 -270243
37806b70243o04772q92094p45121J90786J145166J295351Q37416M34282K34261
$$ -270243 -875015 -1767109 -2512230 -2321444 -1176278 119073 956489 1390771 1625032
37797A625032L8853j09050j32415k43345m76550m01194Q8144K65418l62905j024787
$$ 1625032 1663885 1554835 1422420 1179075 702525 301331 389475 654893 291988 -732799
37787g32799o82429L25282P42692L02615k0196K91431N55280J89346l27833l57887
$$ -732799 -1415228 -1089946 -347254 -44639 -64835 226596 781876 971222 643389 285502
37777B85502j04695q2199k59423l68833m88744o74854n28294J68758Q06127O77076
$$ 285502 180807 98608 -160815 -529648 -1018392 -1693246 -2221540 -2052782 -1246655 -569579
37767e69579N6070j99500Q7691L17939J77150Q102O0730R4275q6242k92446l61659
$$ -569579 -513509 -713009 -625318 -307379 -130229 -122127 -61397 32878 -53364 -345810 -707469
37756g07469l93780l94547j83322J53204K33291K7176j2862K60639L75983J04329
$$ -707469 -1101249 -1495796 -1679118 -1525914 -1292623 -1265447 -1278309 -1017670 -641687 -537358
37746e37358l309M71146R37295O15304j87498n27014l03936k83245o64723p16720
$$ -537358 -540667 -69521 867774 1483078 1295580 768566 464630 181385 -483338 -1200058
37736a200058r6844M76036L70932Q870M3129K94128K36386l5986j25517j35344
$$ -1200058 -1296902 -820866 -449934 -441064 -397935 -103807 132579 96593 -28924 -164268
37726a64268l18860l49858J09641M59676r0831r79121p77463N93790J445625O59030
$$ -164268 -483128 -832986 -723345 -263669 -354500 -1333621 -2111084 -1517294 -71669 587361
37716E87361p06393r78199j43092M83162K78782j09882k5964L42101M48264O8994
$$ 587361 -119032 -1097231 -1240323 -757161 -478379 -588261 -614225 -272124 176140 245134
37706B45134n87411j003030o55887L51636J125851R37858J62233k80596j82601
$$ 245134 -342277 -1345307 -2001194 -1649558 -523707 414151 576384 295788 113187
37697A13187o4985j30842m9097K18594K43855n1450k00686l7440L6257j19672
$$ 113187 48202 -82640 -131737 86857 330712 279262 78576 41136 77393 -42279
37687d2279j01107J52522O5866m72602o09415J50865R24295O72307j88457m57888
$$ -42279 -143386 9136 75002 -397600 -1007015 -856150 68145 740452 551995 94107
37677I4107R530K83502l8231l48264j58651L10688P49320J021663P82613j41099
$$ 94107 103637 387139 348908 644 -158007 152681 902001 1923664 2706277 2565178
37667B565178r17808m66442P05637P78218p06269j850215j053083O13881J028811
$$ 2565178 1647370 1180928 1886565 2664783 1958514 108299 -944784 -330903 697908
37658F97908L9290p36986n20841m8545J44490L85741O61848L57655m03403o10539
$$ 697908 737198 212 -520629 -569174 -424684 -38943 622905 980560 577157 -33382
37648c3382q2001P1121o23644j011860k13901P87481P11839M5306N2537N37585
$$ -33382 -115383 -44262 -667906 -1679766 -1893667 -1106186 -394347 -349041 -296504 241081
37638B41081K83873o90069j060647l74939L20085K93442J11573L20664M57925
$$ 241081 524954 -165115 -1225762 -1600701 -1280616 -987174 -875601 -554937 -97012
37629i7012P7769l00347p9983L72557L67631k3828k41807j28603P1294K12163
$$ -97012 -19243 -319590 -399573 -27016 340615 316787 74980 -53623 17671 229834
37619B29834K34683L5626k29458j54176K28435L02096j69146n54185l43334L3634
$$ 229834 464517 500143 270685 116509 344944 647040 477894 -76291 -419625 -385991
37609c85991m388k53202l02316l64095o38683n21867M46539J388836J138450J34791
$$ -385991 -390379 -643581 -945897 -1309992 -1948675 -2470542 -2024003 -635167 503283 638074
37599F38074j51685M50199O14690j74943p38423k04508N57810M37054j80082k91506
$$ 638074 486389 936588 1551278 1376335 637912 433404 991214 1428268 1248186 956680
37589I56680l748j02645m54609j55346Q66653J539375J082097q3586j032057j287820
$$ 956680 952932 850287 395678 240332 1106985 2646360 3728457 3644871 2612814 1324994
37579A324994r18146k43518L12393M64049L20117J59790j1749l49482o87351o31363
$$ 1324994 406848 163330 475723 939772 1259889 1419679 1407930 1058448 371097 -260266
37569b60266j73749K24169K67289J60247J95234L82197O27188R10270J109162
$$ -260266 -434015 -209846 57443 217690 412924 795121 1422309 2332579 3441741
37560C441741J001438O61248N04226O50464N75612j97557j283940j786531j392108
$$ 3441741 4443179 5104427 5608653 6259117 6834729 6637172 5353232 3566701 2174593
37551B174593o69104k52162j74636j42685n3364K6237J00580J80255J84648J41608
$$ 2174593 1505489 1253327 1078691 936006 882642 908879 1009459 1189714 1374362 1515970
37541A515970K31444L80045J58076n11005r22503m93524K05638J63081m68893
$$ 1515970 1747414 2127459 2285535 1774530 852027 358503 564141 727222 258329
37532B58329n25154K79622P93114K74362l60363l5595P23783P17911L0795l07588
$$ 258329 -266825 12797 805911 1080273 719910 684315 1408098 2126009 2156804 1849216
37522A849216j61605l01410p44150o24917J43628N61102K32112k5696K54313L88172
$$ 1849216 1687611 1386201 642051 17134 160762 721864 953976 928280 1182593 1570765
37512A570765m2332l06686R4174M01704m3186n49764l19910R6833j33585n42511
$$ 1570765 1528433 1221747 1315921 1717625 1674439 1124675 804765 901598 768013 225502
37502B25502k63238K60484L6653n96612n03312K42462N59881L02449K60249L89033
$$ 225502 -37736 222748 259401 -337211 -840523 -598061 -38180 264269 524518 913551
37492I13551q1167p49915l19169R00222R24029p01838j776397p43009Q54948Q74649
$$ 913551 832384 82469 -236700 663522 1587551 885713 -890684 -1633693 -778745 95904
37482I5904j31245j76386P73152R79590k3670q10552n28701m5514k21276o06262
$$ 95904 -35341 -211727 561425 1541015 1517345 706793 178092 132578 -88698 -694960
37472f94960m53411J42521O82277R48991Q50736L73844j3677K85765R99705J179226
$$ -694960 -1148371 -1005850 -323573 625418 1476154 1849998 1836321 2122086 3121791 4301017
37462D301017O25350J81926K76018K03858n52155j263191j026827j72425K89646
$$ 4301017 4926367 5108293 5384311 5588169 5036014 3772823 2745996 2573571 2863217
37453B863217J08827j79100k83612l47758l37525q9766J14129j88479p69572q33976
$$ 2863217 2972044 2792944 2509332 2161574 1824049 1734283 1848412 1659933 890361 56385
37443E6385j83331L81435J24475o29151r33004l84194M91605R06061N92794o9842
$$ 56385 -126946 254489 378964 -250187 -1183191 -1567385 -1075780 -169719 423075 353233
37433C53233n31550n50976k44270J71028N04835N47855K04749k33893k54976K26848
$$ 353233 -178317 -729293 -973563 -802535 -297700 250155 454904 221011 -33965 192883
37423A92883O19273L32494m38972r01451n73196K05172O44150K77344n48440r04811
$$ 192883 812156 1144650 705678 -195773 -768969 -563797 80353 357697 -190743 -1095554
37413a095554k22558R21285J295005M64019o63315j031268o86881l44156j92796
$$ -1095554 -1318112 -396827 898178 1362197 698882 -332386 -1019267 -1363423 -1556219
37404a556219Q7457M20204L70711O4407J34508N75107N57860k27832r00188o40396
$$ -1556219 -1468762 -1048558 -677847 -613440 -478932 96175 654035 426203 -473985 -1114381
37394a114381O9628K01743l17318o71512m49035n7391R8193J25927K30047L55723
$$ -1114381 -1044753 -843010 -1160328 -1831840 -2280875 -2338266 -2240073 -2114146 -1884099 -1528376
37384a528376M22824M83236M88128K59222j56010m09486k87760K1013K16251K19806
$$ -1528376 -1105552 -622316 -134188 125034 -30976 -440462 -728222 -707209 -490958 -271152
37374b71152J20916P333l0829Q0106K50056K49451k159k88143l36433j27190J14765
$$ -271152 -150236 -142903 -173732 -93626 156430 405881 403722 115579 -220854 -348044 -233279
37363b33279J79361P7698J2697J41285L72282M87652M63398M71702M92921K29695
$$ -233279 -53918 23780 36477 177762 550044 1037696 1501094 1972796 2465717 2695412
37353B695412l47822o76135k59426N11955P48882K70992j52324M8219M18486K25297
$$ 2695412 2347590 1671455 1412029 1923984 2672866 2943858 2791534 2839753 3258239 3483536
37343C483536l92718o25442k12186J74282o0900n55531n43699k305L21704L2910
$$ 3483536 3090818 2465376 2253190 2427472 2366572 1811041 1267342 1265037 1586741 1619651
37333A619651l56242k83686l1718j89589n58073l88435L17586O20417M4507o21357
$$ 1619651 1263409 979723 948005 758416 200343 -188092 129494 749911 794418 173061
37323A73061m50192L20711P52294N00193j8707l86216m43188j22134L04627J56990
$$ 173061 -277131 43580 795874 1296067 1277360 891144 447956 325822 630449 787439
37313G87439p25151j346796p35217N52225J105033O12554K796k20545m41961o72219
$$ 787439 62288 -1284508 -2019725 -1467500 -362467 250087 252883 32338 -409623 -1081842
37303a081842l06417M74344N33506l39828p96996n8562O89164K01766p36505o08613
$$ -1081842 -1388259 -913915 -380409 -720237 -1517233 -1575795 -886631 -684865 -1421370 -2029983
37293b029983L78498P98204L90215K04494N74325O51384J02000k82205o5895P9298
$$ -2029983 -1651485 -853281 -463066 -258572 315753 967137 1069137 786932 721037 800335
37283H00335l24933o45363k31767M50446N66509J83111J7605K62824L70515n3668
$$ 800335 475402 -169961 -401728 48718 615227 798338 815943 1078767 1449282 1395614
37273A395614o43337p05899q1972O04370O59958J78210j67408j80041l59189q01074
$$ 1395614 752277 46378 -35594 568776 1228734 1406944 1239536 1059495 700306 -100768
37263a00768p08258K99168J136782N93029p74667j316444o15109J81648L08572
$$ -100768 -809026 -509858 626924 1219953 445286 -871158 -1486267 -1304619 -996047
37254i96047K56473M59690M86760P0795k29137l6362J71014K0530o8746J91851
$$ -996047 -739574 -279884 206876 277671 48534 12172 183186 203716 134970 326821
37244C26821K88885j16981m36167j67679J81003N5762j02646K32623N25075J01422
$$ 326821 615706 498725 62558 -105121 75882 131644 28998 261621 786696 888118
37234H88118m51767j66090N02322K37700r23108j473424p22256K31835L02265
$$ 888118 436351 270261 772583 1010283 87175 -1386249 -2108505 -1876670 -1574405
37225a574405o7195N4194N23085N88278K89862L29256P62321Q03347P4768p04950
$$ -1574405 -1641600 -1587406 -1064321 -476043 -186181 143075 905396 1708743 1783511 1078561
37215A078561o64611M6564M91172J55613n06156p31721k86751M43247Q77764O31853
$$ 1078561 413950 460514 951686 1107299 601143 -130578 -417329 25918 903682 1535535
37205A535535j80873q53097o78546R3609L73294k85744q95557m45153M54940M38027
$$ 1535535 1354662 501565 -176981 -83372 289922 4178 -891379 -1336532 -881592 -443565
37195d43565m14257o20919L24863J094530O14186k96807l03196M56643Q64607
$$ -443565 -857822 -1478741 -1153878 -59348 554838 258031 -45165 411478 1276085
37186A276085N89019K13018M7766r2026j71966K3494K53535P1414l47065l72055
$$ 1276085 1865104 2078122 2125888 2033862 1861896 1885390 2138925 2210339 1863274 1491219
37176A491219J02919M91742L24549k75812q64852j018599n73715R7311L11886
$$ 1491219 1594138 2085880 2410429 2134617 1269765 251166 -322549 -225238 86648
37167H6648o3259l61199j12543K29234Q2599l10823l82678j43978J09274M35820
$$ 86648 23389 -337810 -450353 -221119 -138520 -449343 -832021 -975999 -866725 -430905
37157d30905Q31815P87939J38724k94283P3007L96952l19277j375797j298342
$$ -430905 400910 1188849 1327573 1033290 1106297 1503249 1183972 -191825 -1490167
37148a490167k13743L48385q8648l86641J33516O68277M31417j87279m89797l82834
$$ -1490167 -1703910 -1355525 -1444173 -1830814 -1697298 -1029021 -597604 -784883 -1274680 -1657514
37138a657514j3779M82506O14215j3327p07152l55425P63115J205858O04553J15794
$$ -1657514 -1671293 -1188787 -574572 -587899 -1295051 -1650476 -887361 318497 923050 1038844
37128A038844K71816J25100p76047j309002o84625J45175J61442p5751K56458
$$ 1038844 1310660 1435760 659713 -649289 -1333914 -1188739 -1027297 -1103048 -846590
37119h46590O11808K00224l95637k27558L58546N27506M94862P70264P80686j13496
$$ -846590 -234782 -34558 -430195 -657753 -299207 228299 723161 1493425 2274111 2160615
37109B160615j038476p94046N7346J21287l90614j58770O78128O20986n26372
$$ 2160615 1122139 328093 385439 506726 116112 -42658 635470 1256456 730084
37100G30084j217919o99240j361Q3939J25637M78716M13344k71980m43747M47152
$$ 730084 -487835 -1187075 -1188436 -1104497 -978860 -500144 -86800 -358780 -802527 -355375
37090c55375J142879N69363k84897p477P98425M96084q00022j320204m34499M25330
$$ -355375 787504 1356867 1071970 1064493 1862918 2359002 1558980 238776 -195723 229607
37080B29607N3229p98062p67540Q3927O10597L70103J9176O7649K03930P6341
$$ 229607 282836 -515226 -1282766 -1198839 -588242 -218139 -198963 -131314 72616 148957
37070A48957m7986J20581K35285r3913m62735k40464K62425J73575m14492m46149
$$ 148957 100971 221552 456837 362924 -99811 -340275 -77850 95725 -318767 -764916
37060g64916K77814N40929l23136j114471n52387N93849O30579m01165q37934
$$ -764916 -487102 53827 -269309 -1383780 -1936167 -1342318 -711739 -1112904 -1950838
37051a950838m118R12963Q29396J80561j06517R9299M30705O96884P53247M39395
$$ -1950838 -1954956 -1041993 -212597 -32036 -138553 -39254 391451 1088335 1841582 2280977
37041B280977J7850l1535J21324j84963q83206j081079m77444J47321K38617J96519
$$ 2280977 2298827 2267292 2388616 2203653 1320447 239368 -238076 -90755 147862 344381
37031C44381L26270J98643l11557m98067j11837j6335o09387p92623K28860J225446
$$ 344381 670651 869294 557737 59670 -52167 -68502 -677889 -1470512 -1241652 -16206
37021a6206O31079q52988j181499p1571P62928M76477K06805Q17405J338675O84791
$$ -16206 614873 -238115 -1419614 -1491185 -728257 -251780 -44975 772430 2111105 2795896
37011B795896m34250o06383J11491M29654j47914p45908n85079m2901P2788l34254
$$ 2795896 2361646 1755263 1866754 2296408 2148494 1402586 817507 774606 847394 513140
37001E13140o76291n41058j09013K22729L01752J95397o2397m31668o37601l21540
$$ 513140 -163151 -704209 -813222 -590493 -288741 -93344 -155741 -587409 -1225010 -1546550
36991a546550M32315R78743P70821J4494n49654m45372J12377N06873L28950j91571
$$ -1546550 -1114235 -135492 635329 649823 100169 -345203 -232826 274047 602997 411426
36981D11426l29844L22823J157801J070364j36501j357254j546205r66898n30523
$$ 411426 81582 404405 1562206 2632570 2496069 1138815 -407390 -1374288 -1904811
36972a904811l71467P0885P73512R39024K69869m19763l03926L38983O21110K79777
$$ -1904811 -2276278 -2205393 -1431881 -492857 -222988 -642751 -946677 -607694 13416 293193
36962B93193j03718J9395M76418O08574M6547p86425j033686m14051L02874K06028
$$ 293193 189475 208870 685288 1293862 1340409 553984 -479702 -893753 -590879 -384851
36952c84851m96372p19073o9524N51540K93041l79144m23725K25783O84607N09003
$$ -384851 -881223 -1600296 -1669820 -1118280 -825239 -1204383 -1628108 -1402325 -717718 -208715
$$ [...]
##END NTUPLES=NMR SPECTRUM
##END=
