##TITLE=31Pdec_LR-685A-OC1-AK
 D2O, 8 sc
 24.9.2019
##JCAMPDX= 6.0         $$ Bruker NMR JCAMP-DX V2.0
##DATA TYPE= NMR SPECTRUM
##DATA CLASS= NTUPLES
##ORIGIN= UXNMR, Bruker Analytische Messtechnik GmbH
##OWNER= root
$$ XWIN-NMR		Version 3.5
$$ Tue Sep 24 14:15:38 2019 Russian Standard Time (UT+4h)  she@DPX200
##.OBSERVE FREQUENCY= 81.013821
##.OBSERVE NUCLEUS= ^31P
##.ACQUISITION MODE= SIMULTANEOUS
##.ACQUISITION SCHEME= undefined
##.AVERAGES= 24
##.DIGITISER RES= 17
##SPECTROMETER/DATA SYSTEM= spect
##.PULSE SEQUENCE= zgpg30
##.SOLVENT NAME= D2O
##.SHIFT REFERENCE= (INTERNAL, D2O, 0, 182.463)
##AUDIT TRAIL= $$ (NUMBER, WHEN, WHO, WHERE, WHAT)
$$ ##TITLE= Audit trail, XWIN-NMR		Version 3.5
$$ ##JCAMPDX= 5.01
$$ ##ORIGIN= Bruker BioSpin GmbH
$$ ##OWNER= she
$$ F:/spectra/data/she/nmr/P31/1/pdata/1/auditp.txt
$$ ##AUDIT TRAIL=  $$ (NUMBER, WHEN, WHO, WHERE, WHAT)
(   1,<2019-09-24 14:14:30.46 +0400>,<she>,<DPX200>,
      <created by zg, POWCHK disabled, PULCHK disabled
       configuration hash MD5:
       00 E9 B6 7A A2 85 ED C7 34 08 36 98 17 FE 4E 26
       data hash MD5: 32K
       80 6F 82 17 56 F2 A2 93 8D 78 94 66 17 8A D3 C3>)
(   2,<2019-09-24 14:14:32.89 +0400>,<she>,<DPX200>,
      <Start of raw data processing
       efp BC_mod = 2 LB = 1 FT_mod = 6 PKNL = 1 PHC0 = -263.5303 PHC1 = -257.5995 SI = 64K 
       data hash MD5: 64K
       B7 33 E2 76 31 3D 6E 94 54 FA 1F FE 8C B4 81 D9>)
(   3,<2019-09-24 14:15:00.82 +0400>,<she>,<DPX200>,
      <pk PHC0 = 60.339 PHC1 = -131.8 
       data hash MD5: 64K
       A7 5E 45 9A 00 17 F2 52 C2 35 51 5F 70 AB BD 52>)
(   4,<2019-09-24 14:15:03.60 +0400>,<she>,<DPX200>,
      <abs ABSG = 5 
       data hash MD5: 64K
       DA BA CB 4E B4 31 C0 1D F1 DC C2 B9 25 A0 2D 60>)
$$ ##END=
$$ 
$$ hash MD5
$$ 57 F4 B4 B3 2D 40 AF 22 BB 8A 12 E9 4D C1 BD 64
##$RELAX= 
##$RELAX= 
##$RELAX= 
##$RELAX= 
##$RELAX= 
##$RELAX= 
##$RELAX= 
##$RELAX= 
$$ Bruker specific parameters
$$ --------------------------
##$DU= <F:/spectra>
##$EXPNO= 1
##$NAME= <P31>
##$PROCNO= 1
##$TYPE= <nmr>
##$USER= <she>
##$AMP= (0..31)
100 100 100 100 100 100 100 100 100 100 100 100 100 100 100 100 100 100 
100 100 100 100 100 100 100 100 100 100 100 100 100 100 
##$AQSEQ= 0
##$AQ_mod= 1
##$AUNM= <au_zg>
##$AUTOPOS= <>
##$BF1= 81.014009
##$BF2= 200.13
##$BF3= 200.13
##$BF4= 200.13
##$BF5= 200.13
##$BF6= 200.13
##$BF7= 200.13
##$BF8= 200.13
##$BYTORDA= 1
##$CFDGTYP= 0
##$CFRGTYP= 5
##$CHEMSTR= <none>
##$CNST= (0..31)
1 1 145 1 1 1 1 1 1 1 1 1 1 1 1 1 1 1 1 1 1 1 1 1 1 1 1 1 1 1 1 1 
##$CPDPRG= <waltz16>
##$CPDPRG1= <>
##$CPDPRG2= <waltz16>
##$CPDPRG3= <>
##$CPDPRG4= <mlev>
##$CPDPRG5= <mlev>
##$CPDPRG6= <mlev>
##$CPDPRG7= <mlev>
##$CPDPRG8= <mlev>
##$CPDPRGB= <>
##$CPDPRGT= <>
##$D= (0..31)
0 1 0 0 0 0 0 0 0 0 0 0.03 2e-05 3e-06 0 0 0 0 0 0 0 0 0 0 0 0 0 0 0 0 
0 0 
##$DATE= 1569320069
##$DBL= (0..7)
120 120 120 11 120 120 24 19 
##$DBP= (0..7)
150 150 150 150 150 150 150 150 
##$DBP07= 0
##$DBPNAM0= <>
##$DBPNAM1= <>
##$DBPNAM2= <>
$$ [...]
##$SUBNAM3= <"">
##$SUBNAM4= <"">
##$SUBNAM5= <"">
##$SUBNAM6= <"">
##$SUBNAM7= <"">
##$SUBNAM8= <"">
##$SUBNAM9= <"">
##$SW= 369.568048894756
##$SWIBOX= (0..15)
0 1 3 0 0 0 0 0 0 0 0 0 0 0 0 0 
##$SW_h= 29940.119760479
##$TD= 32768
##$TD0= 1
##$TE= 0
##$TE2= 300
##$TE3= 300
##$TEG= 300
##$TL= (0..7)
0 120 53 12 22 120 120 120 
##$TP= (0..7)
150 150 150 150 150 150 150 150 
##$TP07= 0
##$TPNAME0= <>
##$TPNAME1= <>
##$TPNAME2= <>
##$TPNAME3= <>
##$TPNAME4= <>
##$TPNAME5= <>
##$TPNAME6= <>
##$TPNAME7= <>
##$TPOAL= (0..7)
0.5 0.5 0.5 0.5 0.5 0.5 0.5 0.5 
##$TPOFFS= (0..7)
0 0 0 0 0 0 0 0 
##$TUNHIN= 0
##$TUNHOUT= 0
##$TUNXOUT= 0
##$USERA1= <user>
##$USERA2= <user>
##$USERA3= <user>
##$USERA4= <user>
##$USERA5= <user>
##$V9= 5
##$VALIST= <valist>
##$VCLIST= <CCCCCCCCCCCCCCC>
##$VD= 0
##$VDLIST= <DDDDDDDDDDDDDDD>
##$VPLIST= <PPPPPPPPPPPPPPP>
##$VTLIST= <TTTTTTTTTTTTTTT>
##$WBST= 1024
##$WBSW= 4
##$XGAIN= (0..3)
0 0 0 0 
##$XL= 0
##$YL= 0
##$YMAX_a= 20124
##$YMIN_a= -21505
##$ZGOPTNS= <>
##$ZL1= 120
##$ZL2= 120
##$ZL3= 120
##$ZL4= 120
##$ABSF1= 182.463
##$ABSF2= -187.1042
##$ABSG= 5
##$ABSL= 3
##$ALPHA= 0
##$AQORDER= 0
##$ASSFAC= 0
##$ASSFACI= 0
##$ASSFACX= 0
##$ASSWID= 0
##$AUNMP= <proc_1d>
##$AZFE= 0.1
##$AZFW= 0.5
##$BCFW= 0
##$BC_mod= 2
##$BYTORDP= 0
##$COROFFS= 0
##$CY= -3
##$DATMOD= 1
##$DC= 0
##$DFILT= <>
##$DTYPP= 0
##$F1P= 0
##$F2P= 0
##$FCOR= 1
##$FTSIZE= 65536
##$FT_mod= 6
##$GAMMA= 0
##$GB= 0
##$INTBC= 1
##$INTSCL= 5.30512e-09
##$ISEN= 30
##$LB= 1
##$LEV0= 0
##$LPBIN= 0
##$MAXI= 10000
##$MC2= 0
##$MEAN= 0
##$ME_mod= 0
##$MI= 50
##$NCOEF= 0
##$NC_proc= -5
##$NLEV= 6
##$NOISF1= 182.463
##$NOISF2= 159.3651
##$NSP= 0
##$NTH_PI= 0
##$NZP= 0
##$OFFSET= 182.463
##$PC= 4
##$PHC0= -203.1913
##$PHC1= -389.3995
##$PH_mod= 1
##$PKNL= yes
##$PPARMOD= 0
##$PSCAL= 0
##$PSIGN= 0
##$REVERSE= no
##$SF= 81.0140089999434
##$SI= 65536
##$SIGF1= 159.3651
##$SIGF2= -187.1042
##$SINO= 113.3802
##$SIOLD= 16384
##$SREGLST= <1H.CDCl3>
##$SSB= 0
##$STSI= 65536
##$STSR= 0
##$SW_p= 29940.119760479
##$SYMM= 0
##$S_DEV= 0
##$TDeff= 32768
##$TDoff= 0
##$TI= <>
##$TILT= no
##$TM1= 0
##$TM2= 0
##$TOPLEV= 0
##$USERP1= <user>
##$USERP2= <user>
##$USERP3= <user>
##$USERP4= <user>
##$USERP5= <user>
##$WDW= 1
##$XDIM= 65536
##$YMAX_p= 487777461
##$YMIN_p= -12299291
$$ End of Bruker specific parameters
$$ ---------------------------------
##NTUPLES= NMR SPECTRUM
##VAR_NAME=  FREQUENCY,     SPECTRUM/REAL,   SPECTRUM/IMAG
##SYMBOL=    X,             R,               I
##VAR_TYPE=  INDEPENDENT,   DEPENDENT,       DEPENDENT
##VAR_FORM=  AFFN,          ASDF,            ASDF
##VAR_DIM=   65536,         65536,           65536
##UNITS=     HZ,            ARBITRARY UNITS, ARBITRARY UNITS
##FACTOR=    0.456856943014862, 1,           1
##FIRST=     14782.0589164792, 0,            0
##LAST=      -15158.0608439998, 0,           0
##MIN=       -15158.0608439998, -12299291,   0
##MAX=       14782.0589164792, 487777461,    0
$$ Real data points
##PAGE= N=1
##DATA TABLE= (X++(R..R)), XYDATA
$$ [...]
42043G38671j028857j11108L25411n7781l47451J71820Q43020O41264k30555o71931
$$ 738671 -290186 -401294 -75883 -133664 -481115 -309295 533725 1174989 944434 272503
42033B72503k88162K72653M43922K91075l8645n09458p40183k48083O20055Q44186
$$ 272503 -15659 256994 700916 991991 953346 443888 -296295 -544378 75677 919863
42023I19863J40398n88757o04350l15555l75599n66831l14499K78196O82078P84857
$$ 919863 1060261 471504 -132846 -448401 -824000 -1390831 -1705330 -1427134 -745056 39801
42013C9801P45642M23243k64458p68181n38523L8224J88352j6723P2784L79062
$$ 39801 785443 1208686 944228 176047 -362476 -324252 -135900 -152623 -79839 299223
42003B99223J83665m52201n57866J40732O25789J57523n68076n82623j23590k3842
$$ 299223 482888 30687 -527179 -386447 239342 396865 -171211 -753834 -877424 -901266
41993i01266k41691o9873M76950N64224r5558o74280l61885N34407J042993P36340
$$ -901266 -1142957 -1212830 -735880 -171656 -267214 -941494 -1303379 -768972 274021 1010361
41983A010361P0223l57688m93208o32484p79946n53366J74584Q52829Q08560J10555
$$ 1010361 1080584 722896 229688 -402796 -1182742 -1736108 -1561524 -708695 99865 210420
41973B10420m85176m36841O9629N05408N43673J93109k58463l93061q8990K13785
$$ 210420 -274756 -711597 -641968 -136560 407113 600222 341759 -51302 -140292 73493
41963G3493M3058l99532n54439m09556m09642n05669j63979N37108P97034M29071
$$ 73493 116551 -282981 -837420 -1246976 -1656618 -2162287 -2326266 -1789158 -992124 -563053
41953e63053K80090P39252Q80673k0426j059755r63517o6050L23531O3832J63451
$$ -563053 -282963 456289 1336962 1316536 256781 -706736 -772786 -449255 -385423 -221972
41943b21972P53392P22009k68059r18502k57888P18608M75593p39052j229231
$$ -221972 531420 1253429 985370 66868 -191020 527588 1003181 264129 -965102
41934i65102k66576R75967J110659K66901l90015l42129j90744n05556r07212
$$ -965102 -1231678 -255711 854948 1121849 731834 389705 198961 -306595 -1213807
41925a213807o88595Q1741O83147Q05723P94223P82563L74757m69441r76232n86832
$$ -1213807 -1902402 -1820661 -1137514 -331791 462432 1244995 1619752 1150311 174079 -412753
41915d12753J21621K45743j48547k97124L8234M35021O57176P78647O18045l3692
$$ -412753 -291132 -45389 -193936 -491060 -452826 -17805 639371 1418018 2036063 2002371
41905B002371o65786m89727K70910M92526k13027r21747q35944l82215k97803
$$ 2002371 1336585 846858 1117768 1610294 1397267 475520 -360424 -742639 -1040442
41896a040442m16835j32683M65694P21254M02640j04604m49573n87263m86324
$$ -1040442 -1457277 -1589960 -1124266 -403012 -372 -104976 -554549 -1141812 -1628136
41887a628136q6017M29372P00681O01088L22771N1193k15672m97893o82407o30795
$$ -1628136 -1714153 -1284781 -584100 16988 339759 390952 175280 -322613 -1005020 -1635815
41877a635815l55080j1159K74269M98430O42400N45007J45821j96524k3531M89747
$$ -1635815 -1990895 -2002054 -1727785 -1229355 -586955 -41948 103873 -92651 -116182 373565
41867C73565O10213J09892l05663p7713K84472M6973m95996n05120J8827L36446
$$ 373565 983778 1093670 788007 710294 994766 1041739 545743 40623 59450 395896
41857C95896K52315K18330K35288j75935q06133p76108k4814L90676p4680o36655
$$ 395896 648211 866541 1101829 925894 119761 -656347 -681161 -290485 -365165 -1001820
41847a001820n31579j00306J12503K83235N85364N57434M9515j56622L94704Q82650
$$ -1001820 -1533399 -1633705 -1521202 -1237967 -652603 -95169 -45654 -202276 192428 1075078
41837A075078N29435p0707r8730k3154n45314r16827p5459J127744Q46537p70831
$$ 1075078 1604513 1533806 1435076 1411922 866608 -50219 -125678 1002066 1848603 1077772
41827A077772j567534o13079N41736M84031n6566J29394O49812M80445j20276
$$ 1077772 -489762 -1102841 -561105 -77074 -133640 -4246 645566 1126011 1005735
41818A005735j80679J83136P053p78384j156792n78939L35480P69380N74713N1757
$$ 1005735 825056 1008192 1015245 236861 -919931 -1498870 -1163390 -394010 180703 232460
41808B32460m49567n73500j77313L66763N42635L77048K75487K38924j05022o34205
$$ 232460 -217107 -790607 -967920 -601157 -58522 318526 594013 832937 727915 93710
41798I3710o44983P3323P45544O46251Q3106k04996j81253l51883p42450q12241
$$ 93710 -551273 -477950 267594 913845 996951 791955 610702 258819 -483631 -1295872
41788a295872l86068L3306M7375j25174j36695Q045K17176N53457Q80241P52585
$$ -1295872 -1681940 -1648634 -1601259 -1726433 -1863128 -1855083 -1637907 -1084450 -204209 548376
41778E48376R0321m71849m10582j08632k31579o20841n16081K47896R61634R79468
$$ 548376 638697 166848 -243734 -352366 -583945 -1204786 -1720867 -1472971 -511337 468131
41768D68131L66371m11775r13312q27668j85062M98144P15438N43547L05945m9840
$$ 468131 834502 422727 -490585 -1318253 -1503315 -1005171 -289733 253814 559759 509919
41758E09919n99777q17912k35346M97585L28921m81252o36080R5019M68724j48425
$$ 509919 -89858 -907770 -1143116 -645531 -316610 -797862 -1433942 -1338923 -870199 -1018624
41748a018624p53319m41680K20644M37161M65974O21139K87751p73958j318356
$$ -1018624 -1771943 -2213623 -1992979 -1555818 -1089844 -468705 -180954 -954912 -2273268
41739b273268l30384J102938J255998L05227k89219k34734l52087n79189j01399
$$ -2273268 -2603652 -1500714 -244716 60511 -228708 -463442 -815529 -1394718 -1496117
41730a496117O94953N01387n38550p68805K76892J060577N40273l44379m93311
$$ -1496117 -801164 -299777 -838327 -1607132 -1330240 -269663 270610 -73769 -567080
41721e67080k73501l61414m60333k40948k39541p04701p30451L08676J495246
$$ -567080 -840581 -1201995 -1662328 -1903276 -2142817 -2847518 -3577969 -3269293 -1774047
41712a774047J674775J078857N56212J53309l64374n28341l1130K55842m45880
$$ -1774047 -99272 979585 1535797 1689106 1324732 796391 765261 1021103 575223
41703E75223j229305p06698P13431J346062P12742r9245m22666o97593j034847
$$ 575223 -654082 -1360780 -647349 698713 1411455 1312210 889544 191951 -842896
41694h42896p25647L14101R92960O36932M5299K00818P90498Q15805O8259p67754
$$ -842896 -1568543 -1254442 -261482 375450 420749 621567 1412065 2227870 2296129 1528375
41684A528375j105142r13626m43006o268J15149o6784j94635k8225K03675J45165
$$ 1528375 423233 -490393 -933399 -939667 -824518 -891302 -1085937 -1114162 -910487 -765322
41674g65322j57074l12443r8237K68883L67891K3936m63535n91872k14222K89512
$$ -765322 -922396 -1234839 -1333076 -1064193 -696302 -672366 -1135901 -1727773 -1941995 -1652483
41664a652483N09415M87614N07452O16985O68176O48329N90708K91845m15453
$$ -1652483 -1143068 -655454 -148002 468983 1137159 1785488 2376196 2668041 2252588
41655B252588j132149j132817k79205O80848R16831L62808l82097p63918p12044
$$ 2252588 1120439 -12378 -291583 389265 1306096 1668904 1286807 522889 -189155
41646a89155n26906n05402o44605o59661l20190K50097O60049O07243J35547l66278
$$ -189155 -716061 -1221463 -1866068 -2525729 -2845919 -2595822 -1935773 -1328530 -1192983 -1559261
41636a559261m23962P2910O36409O46417J45157j50097J84530O43297M48389m15202
$$ -1559261 -1983223 -1910313 -1273904 -627487 -482330 -632427 -447897 195400 643789 228587
41626B28587j197037j248825n51311M67948J257679J367837P51639r1784n16003
$$ 228587 -968450 -2217275 -2768586 -2300638 -1042959 324878 1076517 984733 468730
41617D68730l24504J32950L90308K68984n8240k89205l25540l59123m88708m12213
$$ 468730 144226 277176 667484 936468 878228 589023 263483 -95640 -584348 -996561
41607i96561J24732P09828O76075J13456k42715k14531l96343r07303r48796j67097
$$ -996561 -871829 -162001 514074 627530 384815 170284 -226059 -1133362 -2082158 -2249255
41597b249255N45499M23385Q0221L74616Q51276N54352k39609m88010j62821j10177
$$ -2249255 -1703756 -1280371 -1200150 -825534 25742 580094 340485 -147525 -310346 -420523
41587d20523l53474n3435Q09211J178751N89098k23977o39924q26043q32292l40757
$$ -420523 -773997 -827432 -18221 1160530 1749628 1525651 885727 59684 -772608 -1113365
41577a113365L12915K27938m72383n43268K80189N98167l26637j067144j84683
$$ -1113365 -800450 -572512 -1044895 -1588163 -1307974 -709807 -1036444 -2103588 -2288271
41568b288271J359428J568149L62233n34637k51227L30266K86571j67936m48006
$$ -2288271 -928843 639306 1001539 466902 215675 545941 832512 664576 216570
41559B16570m35894k40729Q2927L44885L33138J72743O4071j77939p03571r97197
$$ 216570 -219324 -460053 -377126 -32241 300897 473640 537711 359772 -343799 -1340996
41549a340996m76776M24950O67950Q0329m42089k77105K32263N66846O88149O77129
$$ -1340996 -1817772 -1392822 -724872 -644543 -1086632 -1363737 -1131474 -564628 123521 800650
41539H00650M54170J17068q0006k56319p33928j213712r58794n8234M05289q7800
$$ 800650 1254820 1371888 1291882 1035563 301635 -912077 -1870871 -1929105 -1523816 -1611616
41529a611616o47204l28968M50967O86664L31650J03463J62960P0554r0007L44561
$$ -1611616 -2258820 -2587788 -2136821 -1450157 -1118507 -1015044 -852084 -781530 -871537 -526976
41519e26976J376271K031196J697346R80475O70083N25576j21305r73171r73209
$$ -526976 849295 2880491 4577837 5558312 6228395 6753971 6632666 5659495 4686286
41510D686286M2781Q18568K65635j052204j684512j182229m38254k38256l45169
$$ 4686286 4729067 5547635 5813270 4761066 3076554 1894325 1456071 1217815 872646
41501H72646k77539j68293k53612j48547N13374J084757N68708p39811j323166
$$ 872646 595107 426814 173202 24655 538029 1622786 2191494 1451683 128517
41492A28517m87155N98773N41884l33389n79900K44683J056003Q51387m6720o44094
$$ 128517 -358638 240135 782019 448630 -131270 113413 1169416 2020803 1974083 1329989
41482A329989n21708k7548L42379L37192r488l76514l70485j3985J93290k6066
$$ 1329989 808281 780733 1123112 1460304 1450816 1074302 703817 689832 883122 857056
41472H57056k47292K8526N15568M96428n1630l77197j46004J5714m05169q47371
$$ 857056 609764 638290 1153858 1650286 1598656 1221459 1075455 1091169 686000 -161371
41462a61371n22290J98686K18198n05658o66178M79242J790538J649951J70316
$$ -161371 -683661 -484975 -266777 -772435 -1438613 -959371 831167 2481118 2651434
41453B651434r67868p42027J33782N32172L56669J14853j69361p23260j125127
$$ 2651434 1683566 941539 1075321 1607493 1964162 2079015 1909654 1186394 61267
41444F1267o89452K64048N60475j08260n89167j1032P64033M35134n93837o95797
$$ 61267 -628185 -364137 196338 88078 -501089 -512121 251912 687046 93209 -602588
41434f02588M69590J348050P91197l22453n81872j21455n1874m77988m52205K62418
$$ -602588 -132998 1215052 2006249 1683796 1101924 980469 928595 450607 -1598 260820
41424B60820P11491K94743l00805k33247K42167L04135j72779n53551m02880L3033
$$ 260820 972311 1267054 966249 733002 975169 1279304 1106525 552974 150094 183127
41414A83127K57711R6273j72639j09433M18535J040261J284045J112767Q00507
$$ 183127 440838 537111 364472 255039 673574 1713835 2997880 4110647 4911154
41405D911154L89075k68102r16021r45682k63585M05910M28046M0888j40107o918
$$ 4911154 5300229 5032127 4116106 3170424 2906839 3312749 3740795 3781683 3641576 3634658
41395C634658J05587O9632L4399j6221k90238p41489r42257n36877K86186Q54922
$$ 3634658 3740245 3809877 3844276 3828055 3537817 2796328 1854071 1317194 1603380 2458302
41385B458302O40018q1735l82592J86975Q41957N10672n70899j040038l43347
$$ 2458302 3098320 3016585 2633993 2820968 3662925 4173597 3602698 2562660 2219313
41376B219313M54232L01317l02720k58468L19830L55634l96376r36635n28762
$$ 2219313 2673545 2974862 2672142 2413674 2733504 3089138 2692762 1756127 1227365
41367A227365K79913M96756m6053o46549o57639j65326J95470L2695k64260l0561
$$ 1227365 1507278 2004034 1957981 1311432 653793 488467 683937 716632 452372 421811
41357D21811O24996Q15770J85050m36456k45869K71998J31288n57588p86467k34458
$$ 421811 1046807 1862577 2047627 1611171 1365302 1637300 1768588 1211000 424533 190075
41347A90075L92315N88704N91544N70091K89145j43656j54256K72119L35620k98138
$$ 190075 582390 1171094 1762638 2332729 2621874 2478218 2323962 2596081 2931701 2633563
41337B633563q02804m32768K69902L11623k56839n75786l84190k57679m90854
$$ 2633563 1830759 1397991 1667893 1979516 1722677 1146891 762701 505022 14168
41328A4168o10949k27859L05023M67527L61606M44210O93728N85402l9840n77789
$$ 14168 -596781 -824640 -519617 -52090 309516 753726 1447454 2032856 1993016 1415227
41318A415227m55403L5570K07710N1310J19983L67937L4039r64810j487324p41716
$$ 1415227 959824 995394 1203104 1254414 1374397 1742334 1776373 811563 -675761 -1417477
41308a417477M14072P28935M43659O82047J397190J387894L23092o84760p82654
$$ -1417477 -1003405 -274470 169189 851236 2248426 3636320 3959412 3274652 2491998
41299B491998l76229p7558J17692J53763l66641j189358j272873l29276N73305
$$ 2491998 2115769 2038211 2155903 2309666 1943025 753667 -519206 -848482 -275177
41290b75177O57499N48344Q85702J024587K81933n72299m74346P4984j74563j082717
$$ -275177 382322 930666 1816368 2840955 3122888 2550589 2076243 2151227 1976664 893947
41280H93947j357634o79911o6607j07953k28260Q6401N03089N92137M35505K33874
$$ 893947 -463687 -1143598 -1210205 -1318158 -1546418 -1460017 -956928 -364791 70714 304588
41270C04588N1006M4063K52955K38661k92527o97936j83023Q01969J055576M24859
$$ 304588 355594 399657 652612 891273 598746 -99190 -282213 519756 1575332 2000191
41260B000191j02317j18961k79622q40859j063174n08452K47612O41971P38864
$$ 2000191 1897874 1778913 1499291 658432 -404742 -913194 -665582 -23611 715253
41251G15253M63442m85137j488633j222536K65328J137174L68031o63857l74709
$$ 715253 1178695 693558 -795075 -2017611 -1752283 -615109 -247078 -910935 -1285644
41242a285644O15803P72730J63924o7095J18873j21117o52920n87787n2416O2511
$$ -1285644 -669841 102889 266813 199718 318591 197474 -455446 -1043233 -1095649 -1033138
41232a033138q9120L90198J118603P32139n78674r15518L41370J391373Q09773
$$ -1033138 -1122258 -732060 386543 1118682 540008 -375510 -34140 1357233 2167006
41223B167006l38156m42363J65332K01744l01433l91236n3323n8301m22107m69651
$$ 2167006 1828850 1386487 1551819 1753563 1452130 1060894 1007571 949270 527163 57512
41213E7512j36770N3521K8534J2697k87099j071216j396871k38334J550573J949989
$$ 57512 -79258 -25737 2797 15494 -271605 -1342821 -2739692 -2978026 -1427453 522536
41203E22536O08826o22316m09876L54884L00098l46401m66058J38892P34819Q37350
$$ 522536 1131362 509046 99170 454054 754152 407751 -58307 80585 815404 1652754
41193A652754M82288j88896q22838q10335r4280M49784J68779l50726k39727K05700
$$ 1652754 2135042 1946146 1123308 312973 218693 668477 837256 486530 246803 452503
41183D52503O3107n71042o37748J95452R75421Q37447Q8207m27539m07709j84596
$$ 452503 515610 -55432 -693180 -497728 477693 1315140 1403347 975808 568099 383503
41173C83503j61363m26308o76959m77954J49575N52551K78532j58687N364M94235
$$ 383503 222140 -204168 -881127 -1359081 -1209506 -656955 -378423 -537110 -531746 -37511
41163c7511L09554o01899j009528j51721J039892J161123J97767o22222n48443
$$ -37511 272043 -329856 -1339384 -1491105 -451213 709910 907677 285455 -262988
41154b62988r0821n1448m10290n01152k1348N27848N13283L6280k35428p8576
$$ -262988 -353809 -405257 -815547 -1316699 -1338047 -810199 -296916 -260636 -496064 -574640
41144e74640j7893l49122m77246J27295Q13073N41009m38358q02094j04432O23822
$$ -574640 -592533 -941655 -1418901 -1291606 -478533 62476 -375882 -1177976 -1282408 -658586
41134f58586N31809R0644K2106J07262j36648l98692j13313N04607Q45138Q88155
$$ -658586 -126777 -36133 -14027 93235 -43413 -442105 -555418 -50811 794327 1682482
41124A682482R60185Q89874K91805n55005r59635p97751m82035j40129L67583
$$ 1682482 2642667 3532541 3824346 3269341 2309706 1511955 1029920 889791 1257374
41115A257374P39438M31123l75617q04410m64386N5831O9859l74890p28439n63076
$$ 1257374 1996812 2427935 2052318 1247908 783522 839353 909212 534322 -194117 -757193
41105g57193J37274R20357J090408M14589m29005n65720j6384M31694L40475j2631
$$ -757193 -619919 300438 1390846 1805435 1376430 810710 794326 1226020 1566495 1553864
41095A553864l32119o44807q43915o04321j2L75124J72130k90908n60471n41253
$$ 1553864 1221745 576938 -266977 -871298 -871310 -496186 -324056 -614964 -1175435 -1716688
41085a716688l08556Q0155M10614M12153J82815O5683L6881k22272n63868l80981
$$ -1716688 -2025244 -1945089 -1534475 -1122322 -939507 -873824 -836943 -1059215 -1623083 -2004064
41075b004064L86785R39653O71620m2509m73574m02409j0272N19450Q92763P53215
$$ -2004064 -1617279 -677626 -6006 -48515 -522089 -924498 -934770 -415320 477443 1230658
41065A230658K46690j4873P7557j03011p03882q02331J56565J119850P69105m11579
$$ 1230658 1477348 1462475 1540032 1437021 733139 -69192 87373 1207223 1976328 1564749
41055A564749p50080R5496O49190j01022j244899j404236o13656J02499L05413
$$ 1564749 814669 910165 1559355 1458333 213434 -1190802 -1804458 -1701959 -1396546
41046a396546L23306K77439m7831m32606k59390M62072Q70568M35118k45190l25960
$$ -1396546 -1073240 -795801 -843632 -1276238 -1535628 -1073556 -202988 232130 -13060 -339020
41036c39020P6607K10914q6036k62853p8697O4068k9172L6514M11189N34536N5718
$$ -339020 -262413 -51499 -137535 -400388 -479085 -415017 -444189 -407675 3514 538050 593768
41025E93768m49544l78275j12750k76951n20488j26011N46663N09977q7715p4570
$$ 593768 144224 -234051 -346801 -623752 -1144240 -1270251 -723588 -213611 -301326 -375896
41015c75896O98495R27090j135q92028o64772p4661k99540q64565m85647O68757
$$ -375896 322599 1249689 1248554 356526 -308246 -382907 -682447 -1547012 -2032659 -1363902
41005a363902J175062N96716L851J34801L99725J05863m40043o06895m02912k13973
$$ -1363902 -188840 407876 411727 546528 946253 1052116 612073 5178 -397734 -611707
40995f11707j58957j63827k25622k46075q057L99263N40518K82249P1299K83317
$$ -611707 -770664 -934491 -1160113 -1406188 -1414245 -1014982 -474464 -192215 -120916 162401
40985A62401O71229P65995N05684J58643j29149m15893p35066r72886q98868l37387
$$ 162401 833630 1599625 2105309 2263952 2134803 1718910 983844 10958 -887910 -1225297
40975a225297M87196Q91104M23653m20290o84520j77914L70343M71159M42552
$$ -1225297 -738101 153003 576656 156366 -528154 -706068 -335725 135434 577986
40966E77986N19616K48674n73797j083775m36607P20661R72197J89325l28422
$$ 577986 1097602 1346276 772479 -311296 -747903 -27242 944955 1134280 805858
40957H05858N9432L65880k79690j051750o90426M02014P02923o7868o03003k04530
$$ 805858 865290 1231170 951480 -100270 -790696 -388682 314241 246373 -356630 -561160
40947e61160J61234l10721p19808N9710J282299J240386j16060j039927n45303
$$ -561160 -399926 -710647 -1430455 -1370745 -88446 1151940 1035880 -4047 -549350
40938e49350L62396M57310j920r7912K11626L13625N7542k12493l36621l45132
$$ -549350 -186954 270356 268436 170524 382150 695775 753317 540824 204203 -140929
40928a40929j43025K10618K95470l3553k50260J3379K64411k0225l99618j76808
$$ -140929 -283954 -73336 222134 188581 -61679 -48300 216111 195886 -203732 -380540
40918c80540L46888L17031k70434o32091m89079k81330j83500P4224M12570M28193
$$ -380540 -33652 283379 12945 -619146 -1108225 -1389555 -1573055 -1498831 -1086261 -658068
40908f58068K42375L39839N54609L04251j25500J94133J092929J183304K2669
$$ -658068 -415693 -75854 478755 783006 657506 851639 1944568 3127872 3150541
40899C150541r82459o74301J08159r100p73078r51042m02082k8314m9448J78253
$$ 3150541 2168082 1493781 1601940 1592840 819762 -131280 -533362 -561676 -611124 -432871
40889d32871O70310N79232k49341p38440j84686N76288L88583m96973q01705m4320
$$ -432871 237439 816671 567330 -171110 -355796 220492 609075 112102 -689603 -733923
40879g33923Q56007Q64754O0596o93814q43601m96117K9255M78773N56523J06970
$$ -733923 122084 986838 1047434 353620 -489981 -986098 -956843 -478070 78453 185423
40869A85423m44277l67962L49860P80176K85259n16772o33225r6219L10335L68922
$$ 185423 -258854 -626816 -276956 503220 788479 271707 -361518 -457737 -147402 221520
40859B21520M83286N79128R2002q10086j107962m16565L75344M11423n4945l69026
$$ 221520 704806 1283934 1375936 565850 -542112 -958677 -583333 -171910 -226855 -595881
40849e95881m02882k36447K40658P92207P22195k3820m51586N6068P39527P17591
$$ -595881 -998763 -1235210 -994552 -202345 519850 496030 44444 100512 840039 1557630
40839A557630L60083L74442L76398l14895j097369q02052L26676Q56018L03173
$$ 1557630 1917713 2292155 2668553 2353658 1256289 454237 780913 1636931 1940104
40830A940104l60256m33655l46940n02649n25157j62773J03286p5177k51204O9284
$$ 1940104 1579848 1146193 799253 296604 -228553 -391326 -288040 -363217 -614421 -545137
40820e45137O43477R05344O75703J72875k39293k04519K19552L50093k69281r33916
$$ -545137 98340 1003684 1679387 1852262 1612969 1408450 1628002 1978095 1708814 774898
40810G74898n92150M68580Q59729J36580o20342n98989l42190m58415n13953o7360
$$ 774898 182748 651328 1511057 1647637 1027295 428306 86116 -372299 -886252 -953612
40800i53612L05471N1384k33672J50822O36691L05024m44168m90236J30102L36768
$$ -953612 -648141 -596757 -830429 -679607 -42916 262108 -182060 -672296 -542194 -205426
40790b05426j30040l26217K60270R00694Q23685K60889j40796k08375j32499n6382
$$ -205426 -335466 -661683 -401413 499281 1322966 1583855 1443059 1234684 1102185 1045803
40780A045803j16212l91688n71116j95934N13380O48666j98764j216213j273572
$$ 1045803 929591 537903 -33213 -229147 284233 932899 734135 -482078 -1755650
40771a755650k48181R23883J301809P46308j38940n94679l37396K19077M34559
$$ -1755650 -2003831 -1079948 221861 968169 829229 234550 -102846 116231 550790
40762E50790J48668k53604m26192l72021j48619K86576P48251P71672K27833l25679
$$ 550790 699458 445854 19662 -352359 -500978 -214402 533849 1305521 1533354 1207675
40752A207675l09914O7147J08532l53119p11381m64249P6272K48978j8068j52719
$$ 1207675 897761 964908 1073440 720321 8940 -455309 -379037 -130059 -148127 -300846
40742c00846J52532L96144m0007q71073j088342k59741Q02362J005779L21272
$$ -300846 -148314 247830 207823 -663250 -1751592 -2011333 -1208971 -203192 118080
40733A18080k76044r9364M70302N88014m681p38117r09627m77916r1692k47002
$$ 118080 -157964 -257328 212974 800988 796307 58190 -851437 -1329353 -1421045 -1668047
40723a668047n29530q4382J059729J702792R78271l28613p08341Q4695Q46170
$$ -1668047 -2197577 -2281959 -1222230 480562 1458833 1130220 421879 506574 1352744
40714A352744O79356k0378n37515q16020r92690q20468k40884J58962K8158j864
$$ 1352744 2032100 2011722 1474207 658187 -334503 -1154971 -1395855 -1236893 -1208735 -1210599
40704a210599O73417J382559J004299k29891r20529m95681J20831Q8655j91061
$$ -1210599 -537182 845377 1849676 1619785 699256 203575 324406 413061 222000
40695B22000k4199L77205L82230K3459j64889m6170K9667j57442m75093o62433
$$ 222000 197801 575006 957236 980695 815806 769636 799303 641861 166768 -495665
40685d95665m53779K26844Q99193Q08352j7390n33618q9895N09726J99893n94554
$$ -495665 -949444 -722600 176593 984945 967555 433937 344042 853768 1053661 459107
40675D59107n51644M01334Q46833Q933j091122j161023l24010M33240O97584O75690
$$ 459107 -92537 308797 1155630 1164563 73441 -1087582 -1411592 -978352 -280768 394922
40665C94922L95180k01893o61310l90414M15258Q96442O09845l0644m04446l41990
$$ 394922 790102 588209 -73101 -463515 -48257 848185 1458030 1427386 1022940 680950
40655F80950j10080o5829l15382n31799k94163K29489L51097o5953j75505N88873
$$ 680950 570870 505041 189659 -342140 -636303 -406814 -55717 -121670 -297175 291698
40645B91698J367508R45956l23920q15969R1327J135738R41940k58795j219401
$$ 291698 1659206 2605162 2281242 1465273 1556600 2692338 3634278 3375483 2156082
40636B156082j262483o70530l2725J93593j52203o79321o59708O0201O89264M91136
$$ 2156082 893599 223069 190344 383937 231734 -447587 -1107295 -1047094 -357830 133306
40626A33306j76812l76812P5704M07005K8327o20008n97535L50708J354103J293117
$$ 133306 -43506 -420318 -344614 62391 90718 -529290 -1126825 -776117 577986 1871103
40616A871103J28520r27183q41252k6179L78988J51002k6520n9248o17140j518785
$$ 1871103 1999623 1072440 231188 205009 583997 734999 708479 649231 32091 -1486694
40606a486694j410580R6023J314792P91318l92121k46894R95056J333136K26624
$$ -1486694 -2897274 -2801251 -1486459 -695141 -1087262 -1334156 -339100 994036 1220660
40597A220660p34249n54600j66333m01232n37853R4932O90261M26634Q140K98191
$$ 1220660 486411 -68189 -234522 -635754 -1173607 -1078675 -388414 38220 46360 344551
40587C44551N76588j61841j074930n88495Q27413J079429k96200j317526n52978
$$ 344551 921139 759298 -315632 -904127 -76714 1002715 706515 -611011 -1163989
40578a163989Q37586J020809N8160o41010m67738M0399M08390N89213M32652j51037
$$ -1163989 -326403 694406 752566 111556 -356182 -315783 92607 681820 1114472 963435
40568I63435o38286m34092J06934R0591m92627o84892p5645N20277L21725k47726
$$ 963435 325149 -108943 -2009 88582 -404045 -1088937 -1164582 -644305 -322580 -570306
40558e70306k62463L49719Q36460P33336K99873p6228l33911n11422n16058l30847
$$ -570306 -832769 -483050 353410 1086746 1386619 1310391 976480 465058 -51000 -381847
40548c81847j90173l29434o45165p37214l09768M57308R58465P27223J3017m18980
$$ -381847 -572020 -901454 -1546619 -2283833 -2593601 -2136293 -1177828 -450605 -437588 -856568
40538h56568k27100L7763k54589p66157n39272N88048J563511J436812N65373
$$ -856568 -1083668 -1045905 -1300494 -2066651 -2605923 -2017875 -454364 982448 1547821
40529A547821j2384l0348j08197n14989o43863m8963O34220M46357m85806r99530
$$ 1547821 1535437 1505089 1396892 881903 238040 189077 823297 1269654 783848 -215682
40519b15682m29129N22667P72486K56848j81882o9714K00371J90727O0040L9839
$$ -215682 -644811 -122144 650342 907190 725308 655594 855965 1046692 1106732 1146571
40509A146571j43252p08993j069939m54711P76553J289867M91048o56027r31945
$$ 1146571 1003319 294326 -775613 -1230324 -453771 836096 1327144 671117 -260828
40500b60828l27542L42270O79485P77861N07793k73711r42882o04140M67380Q84143
$$ -260828 -588370 -246100 433385 1211246 1719039 1445328 502446 -101694 365686 1249829
40490A249829N3732q97735p46852R6190L75717p4130k90259J49128N64713M21756
$$ 1249829 1303561 405826 -341026 -244836 130881 56751 -233508 -84380 480333 902089
40480I02089J05248O2026L8072k58997m41738j14505K39522j03997q23937q06656
$$ 902089 1007337 1069363 1107435 848438 406700 292195 531717 427720 -396217 -1202873
40470a202873K34863J198922J007048L84n83349k18862L75874L01108l99115r19918
$$ -1202873 -968010 230912 1237960 1238344 654995 436133 812007 1113115 714000 -205918
40460b05918p77863l35281j63295k21621m8430L72676M95253J17745j63532J54532
$$ -205918 -983781 -1319062 -1482357 -1703978 -1752408 -1379732 -884479 -766734 -930266 -775734
40450g75734O00901L83963l59336p28420l76831J37792L74521N27156O88433M67344
$$ -775734 -174833 209130 -150206 -878626 -1255457 -1117665 -743144 -215988 472445 939789
40440I39789j97916o17202l48642K6028j89929o89081p07727k11069K82022O25270
$$ 939789 741873 124671 -223971 -197943 -387872 -1076953 -1784680 -1995749 -1713727 -1088457
40430a088457Q96154P13830k21780j129943q66137L44479J042874N75454j39376
$$ -1088457 -192303 521527 299747 -830196 -1696333 -1351854 -308980 266474 127098
40421A27098j96098R4245J20524L7622J69759J89457k65064p46388n71833J53182
$$ 127098 -69000 25245 145769 183391 353150 542607 277543 -468845 -1040678 -887496
40411h87496P19751O88187J31160n60934p70980j58333N84518L03204q22085j104230
$$ -887496 -167745 520442 651602 90668 -680312 -838645 -254127 49077 -773008 -1877238
40401a877238K44294J668029J420960J45751k57664M03581O33338r8136o80310
$$ -1877238 -1632944 35085 1456045 1601796 1344132 1747713 2381051 2282915 1602605
40392A602605m84072k98891o43284p74492j25576O26848P29041M25715J19935
$$ 1602605 1118533 819642 176358 -598134 -723710 -96862 632179 1057894 1177829
40383A177829m02775j095654j124383j94393N98235L00361m16495m30241M2063
$$ 1177829 775054 -320600 -1444983 -1639376 -1041141 -740780 -1157275 -1587516 -1545453
40374a545453J24316O081M73421J175690R76867p1814o61343k80817R9463k31853
$$ -1545453 -1421137 -1415056 -941635 234055 1210922 1139108 477765 196948 296411 64558
40364F4558o34578l60378K35917M65057L85212L35214J27558m49682q90287o09033
$$ 64558 -570020 -930398 -694481 -229424 155788 491002 618560 168878 -721409 -1330442
40354a330442M6453K62813j5611j68707m3230q7503k93339K0018R76231J546368
$$ -1330442 -1283989 -1021176 -1036787 -1205494 -1248724 -1336227 -1629566 -1609548 -633317 913051
40344I13051Q85285l01545o12980O1582L89798m16582j393878j175433R8841J022177
$$ 913051 1798336 1496791 883811 945393 1335191 918609 -475269 -1650702 -1551861 -529684
40334e29684P83550k8170m68868l27242L9080L28910M11523K46971K2768N4031
$$ -529684 253866 225696 -243172 -570414 -531334 -202424 209099 456070 478838 532869
40324E32869L08826L69638P0712k37074k97737l38446m97765l94397K05983P44925
$$ 532869 841695 1211333 1282045 1044971 747234 408788 -88977 -483374 -277391 467534
40314D67534N54651j20148m86294l83038l47094n74228o04911j68149L53602N35820
$$ 467534 1022185 902037 415743 32705 -314389 -888617 -1493528 -1661677 -1308075 -772255
40304g72255M28422K25858o1172l29777k58856J94159N50599M33459J37471J87539
$$ -772255 -343833 -117975 -179147 -508924 -767780 -573621 -23022 410437 547908 735447
40294G35447N24589N45386o5193q58527j096623n76466J55840M57628L36074K93805
$$ 735447 1260036 1805422 1740229 881702 -214921 -791387 -635547 -177919 158155 451960
40284D51960M37468K19521o05914j259081q56024J89163N46831j86894r09857
$$ 451960 889428 1108949 503035 -756046 -1612070 -1422907 -876076 -1062970 -1972827
40275a972827n93269L62576Q89528P09901L34843O8629j88309l53991j47221L36519
$$ -1972827 -2566096 -2203520 -1313992 -604091 -269248 -200619 -388928 -742919 -890140 -553621
40265e53621O25975N08633K04581q0373k98052k82257J18572N80278N46640O6210
$$ -553621 72354 580987 785568 705195 407143 124886 243458 823736 1370376 1436586
40255A436586j95638J8276J54146j84430n18596l06606R6122N6054j72678J45662
$$ 1436586 1240948 1259224 1413370 1228940 710344 403738 499860 555914 383236 528898
40245E28898Q23129Q23319r2104q38059n89409L5409N8782l81037n40037m43611
$$ 528898 1352027 2175346 2083242 1245183 655774 691183 749965 368928 -171109 -614720
40235f14720o48844r60414n83447M51671J157609J068522P68160O34504J93970
$$ -614720 -1263564 -2223978 -2807425 -2355754 -1198145 -129623 638537 1273041 1467011
40226A467011p03984j161259n52033L05058L19978k08848k56122J23057j8346
$$ 1467011 763027 -398232 -950265 -645207 -325229 -534077 -790199 -667142 -685488
40217f85488p07479q21562R9123J016409Q82124M7891m13153j39181L55782N04277
$$ -685488 -1392967 -2214529 -2115406 -1098997 -216873 -168982 -582135 -721316 -365534 138743
40207A38743J63733m32729q37186p35747l40227j32425j28221J22608O54426Q37956
$$ 138743 302476 -130253 -967439 -1703186 -2043413 -2175838 -2304059 -2181451 -1527025 -689069
40197f89069L77405o0376K11188P87231P08320j19833p60291n20134J97961N10281
$$ -689069 -311664 -372040 -160852 626379 1334699 1214866 454575 -65559 132402 642683
40187F42683J22475m78866p16617n40013l13282k35682q8332L45442Q18398Q71228
$$ 642683 765158 286292 -430325 -970338 -1283620 -1519302 -1607634 -1262192 -443794 427434
40177D27434M66857L3980j27634j42617k19973l75888n69070p40192o27763K3559
$$ 427434 894291 928271 800637 658020 438047 62159 -506911 -1247103 -1874866 -1851307
40167a851307Q99088J207026O29318j78539l67418R9140N36862M24634j06675
$$ -1851307 -952219 254807 884125 705586 338168 437308 974170 1398804 1292129
40158A292129n30259m34509J20721O17604N58440j5328o14178q48288o59075j67902
$$ 1292129 761870 327361 448082 1065686 1624126 1608798 994620 146332 -512743 -680645
40148f80645L05491K51595m21278r21442m61931M52157N72386j74631m83406K32016
$$ -680645 -375154 -123559 -544837 -1466279 -1928210 -1476053 -903667 -1078298 -1561704 -1329688
40138a329688Q12301K18248p55693p80715o9817K29621O7085L53720J077741J156942
$$ -1329688 -517387 -299139 -1054832 -1835547 -1905364 -1675743 -1608658 -1254938 -177197 979745
40128I79745L12296l41896j7624N86161M19603m70660j204899j193812n58096
$$ 979745 1292041 950145 932521 1518682 1938285 1467625 262726 -931086 -1489182
40119a489182J27993K48209k70331o73017j95192Q00237J154408M54475m95961
$$ -1489182 -1361189 -1112980 -1383311 -2056328 -2251520 -1451283 -296875 157600 -338361
40110c38361q84291p46973l77094K37775R33378J126450O48158J82825K81900
$$ -338361 -1222652 -1969625 -2346719 -2108944 -1175566 -49116 599042 781867 1063767
40101A063767N13936K23366l86438o33879m23327j96449q8766J26234L60978J80506
$$ 1063767 1577703 1801069 1414631 780752 357425 160976 72210 198444 559422 739928
40091G39928m66392r93205q25092l3208P59817R52561M62525k27330n64117m70689
$$ 739928 273536 -719669 -1544761 -1577969 -818152 134409 596934 369604 -194513 -665202
40081f65202k23997J23821P48417J396502J330529L17954p98949j047901n31058
$$ -665202 -889199 -765378 -16961 1379541 2710070 3028024 2229075 1181174 650116
40072F50116j36714k56044m03894j24266K95595K77931j82555m59322j28944L80040
$$ 650116 513402 257358 -146536 -270802 24793 302724 120169 -339153 -468097 -88057
40062h8057K91383l58724n77579J72093R32152M53118q33708j198466j09427R09770
$$ -88057 203326 -155398 -732977 -560884 371268 824386 -9322 -1207788 -1317215 -407445
40052d07445N13288n40401o91484R4000N85400L60661K20032O08122R11958N95027
$$ -407445 105843 -434558 -1126042 -1032042 -446642 -85981 134051 742173 1654131 2249158
40042B249158Q181l28349m65968o25954o70467m14522m6119J25408N3206j32926
$$ 2249158 2257339 1928990 1463022 837068 166601 -247921 -294040 -168632 -115426 -248352
40032b48352l17706l61119j48837K10724M85020O23466O90880N78533J65627l09251
$$ -248352 -566058 -927177 -1076014 -865290 -380270 243196 934076 1512609 1678236 1368985
40022A368985m85030m14943l77466k69637J69430N96775L45632m03926o09786
$$ 1368985 883955 469012 91546 -178091 -8661 588114 933746 529820 -79966
40013g9966J27868Q76246P07947k1931m19171m16380n20455o48403k50704N13896
$$ -79966 47902 924148 1632095 1610164 1190993 774613 254158 -394245 -644949 -131053
40003a31053P32527P4998o34824n61634M3856L60016J53206j41777k43008k89665
$$ -131053 601474 676472 41648 -519986 -476130 -116114 37092 -104685 -347693 -637358
39993f37358k85649J08228R17864J419829Q73408m39087j400728j339770o75933
$$ -637358 -923007 -814779 103085 1522914 2396322 1957235 556507 -783263 -1459196
39984a459196j65274q380k2119j97767n24242n74281M3647R11626J151449O03515
$$ -1459196 -1624470 -1632850 -1654969 -1852736 -2376978 -2951259 -2907612 -1995986 -844537 -241022
39974b41022L4876K7107K65286K00061j29932l21513k48835p7964Q8452K23938
$$ -241022 -206146 -179039 86247 286308 156376 -165137 -413972 -491936 -403484 -179546
39964a79546K18315j2692l73430o83016p69203m60253K01445P26688O12933R8209
$$ -179546 38769 26077 -347353 -1030369 -1799572 -2259825 -2058380 -1331692 -718759 -620550
39954f20550m5756L72863O78718M24436P7121J49976L20989O3208m02858n31640
$$ -620550 -666306 -293443 385275 809711 886832 1036808 1357797 1421005 1018147 486507
39944D86507l89981l93857m77236l45262k24520m39528n07054K71643J399466
$$ 486507 96526 -297331 -774567 -1119829 -1344349 -1783877 -2290931 -2019288 -619822
39935f19822J539923M61998n20579m55053k109j42259o04549n13772N6820K47154
$$ -619822 920101 1382099 861520 406467 404358 262099 -342450 -856222 -799402 -552248
39925e52248j40384l51955P3244N45777K49268o87545j219254n70839P60255J392414
$$ -552248 -692632 -1044587 -971343 -425566 -176298 -863843 -2083097 -2653936 -1893681 -501267
39915e01267O18782o30513q43696J33450R14211N24728k77855k39969N14260P83620
$$ -501267 117515 -512998 -1356694 -1223244 -309033 215695 -62160 -302129 212131 995751
39905I95751J63788m10268j14520O25456Q24608K06332o42391j047289q00959
$$ 995751 1159539 749271 634751 1260207 2084815 2291147 1648756 601467 -199492
39896a99492j37603N04785P33628M37003j55388o61651q08834n92537k65964r1705
$$ -199492 -337095 167690 901318 1338321 1182933 521282 -287552 -880089 -1146053 -1237758
39886a237758j5913K64314P67884R89971N01540l63309q16106n75501j16832Q1819
$$ -1237758 -1253671 -989357 -221473 768498 1270038 906729 90623 -484878 -601710 -519891
39876e19891J14104K79834N02519M30459l2101n61675p61450n33400j22411J40224
$$ -519891 -405787 -125953 376566 807025 774924 213249 -548201 -1081601 -1204012 -1063788
39866a063788J51715R7446J56840K22303N6980k96995m66405j81155L56135O32672
$$ -1063788 -912073 -814627 -657787 -435484 -378504 -675499 -1141904 -1323059 -966924 -334252
39856c34252L47419k52998n95424l95909Q870J11474n8617j3583L76745O16457
$$ -334252 13167 -239831 -835255 -1231164 -1222294 -1110820 -1169437 -1183020 -806275 -189818
39846a89818L53502n9776j44342K3798J79874M35492Q34701Q08880n2764j007139
$$ -189818 163684 103908 -40434 -16636 163238 598730 1433431 2242311 2189547 1182408
39836A182408r65830j64187J23763m04310o23948R5806P86563M14566n34447r09648
$$ 1182408 216578 52391 176154 -228156 -852104 -756298 30265 444831 -89616 -999264
39826i99264n32176m9710J98978K56261M1171l17711j71260O90802J299284P69036
$$ -999264 -1531440 -1581150 -1382172 -1125911 -1084740 -1402451 -1573711 -882909 416375 1185411
39816A185411j94157k59201M40464N73970j72433o43981j77579M04225K44375
$$ 1185411 991254 732053 1172517 1746487 1574054 930073 752494 1156719 1401094
39807A401094l04403n03903l17050m3370K86767N46200L15162l36785n91389k4848
$$ 1401094 1096691 592788 275738 232368 519135 1065335 1380497 1043712 452323 427475
39797D27475O60164O68364K18620n1439j44811l93228o10316l84045J27878M22041
$$ 427475 1087639 1756003 1974623 1923184 1778373 1385145 774829 390784 518662 940703
39787I40703L88111K13829j05647n51270p43803m66420j56209k24166l00429J04641
$$ 940703 1328814 1542643 1436996 885726 141923 -324497 -480706 -704872 -1005301 -900660
39777i00660O07699M93135q0261l57924k50743l18955n97225m71965J89083P38369
$$ -900660 -292961 200174 119913 -238011 -488754 -807709 -1404934 -1876899 -1687816 -949447
39767i49447P53970N01879K34498j36993m82372m06344r414J12055j23631j11959
$$ -949447 -195477 306402 540900 403907 -78465 -484809 -494223 -382168 -505799 -617758
39757f17758L12004M87268Q1242k90663j51601K5819k19752m26225j00500K60444
$$ -617758 -305754 181514 262756 -27907 -179508 -153689 -373441 -799666 -900166 -639722
39747f39722N2454j98829L19210J099273R16427j38944o67801j50597L02969j09217
$$ -639722 -587268 -786097 -466887 632386 1548813 1409869 742068 591471 894440 785223
39737G85223n40551Q286R18019Q77215p3432p25849o44226n81264q82700q02169
$$ 785223 244672 252958 1170977 2048192 1974760 1248911 604685 23421 -859279 -1661448
39727a661448Q3296Q89955O93220k2628j68684K39858L13283l6417P9387Q73885
$$ -1661448 -1578152 -688197 5023 -17605 -186289 53569 366852 330435 409822 1283707
39717A283707J282715N64165m80683o60181m7850L73456K11583j06312k92274
$$ 1283707 2566422 3130587 2649904 1989723 1941873 2315329 2526912 2420600 2128326
39708B128326m57355n31564k89584L3140o3656m54037m26894K32540Q62761Q11147
$$ 2128326 1670971 1139407 849823 882963 819307 365270 -61624 170916 1033677 1844824
39698A844824J41633o45541j039597o60097L24751R02241K07352j055305j196598
$$ 1844824 1986457 1340916 301319 -358778 -34027 868214 1075566 20261 -1176337
39689a176337J14113J203249P18743m98694q37255k63334M7068j80426q0810N95364
$$ -1176337 -1062224 141025 859768 361074 -476181 -739515 -692447 -872873 -953683 -358319
39679c58319R34525L84358l38836m04323n6322k1959l45951m78136j81590K23249
$$ -358319 576206 960564 621728 217405 161083 139124 -206827 -684963 -866553 -643304
39669f43304L80796K52306P368j55598j16632N9634J63432Q0584p8304j44557
$$ -643304 -262508 -10202 -2834 -158432 -275064 -215430 -51998 28586 -49718 -194275
39659a94275q2520L6323J38022J68842R9969n0785k45648m42304n28207l44736
$$ -194275 -276795 -240472 -102450 66392 166361 115576 -130072 -572376 -1100583 -1445319
39649a445319R7757N34352P29339P25439O18694K52785n12985j275112j258463
$$ -1445319 -1347562 -813210 -83871 641568 1260262 1513047 1000062 -275050 -1533513
39640a533513k31289J008189J362774O15499l59929o39454k81092o5271l27218
$$ -1533513 -1764802 -756613 606161 1221660 861731 222277 -58815 -124086 -451304
39631d51304n41697k65943O5401j31089m80890j64256O09752P32954n358m29532
$$ -451304 -993001 -1258944 -1193543 -1324632 -1805522 -1969778 -1360026 -627072 -632430 -1061962
39621a061962J54366P58795L25113m78532l71492L52872L25150n45634r00131
$$ -1061962 -907596 -148801 176312 -302220 -673712 -320840 4310 -541324 -1441455
39612a441455k04007M47747K58296n9509K27569N10235L5061n75581k74534O07168
$$ -1441455 -1645462 -1197715 -939419 -998928 -771359 -261124 -226063 -801644 -1076178 -469010
39602d69010Q28374J92390k34446J31326N44388J40079q18465j338941r02833
$$ -469010 359364 551754 317308 448634 993022 1133101 314636 -1024305 -1927138
39593a927138N7297O65881M61388j16150j77269M84112R73499M24687p08467j124174
$$ -1927138 -1869841 -1203960 -742572 -858722 -1035991 -551879 421620 846307 137840 -986334
39583i86334l76199N98556Q11634M11951J72023L10599L72668N0665l81320m61386
$$ -986334 -1362533 -763977 47657 459608 631631 942230 1314898 1365563 984243 522857
39573E22857p1425M59366O39198K48202l98368p19810n11532j51887j1631R2420
$$ 522857 451432 910798 1549996 1798198 1399830 680020 168488 16601 4970 97390
39563I7390N02854R51620P29460k60633j127280j013814j59580M85419M78132
$$ 97390 600244 1551864 2281324 2020691 893411 -120403 -279983 205436 683568
39554F83568K00606N1391p0719l03896l79371l5417M20461L89036k46733r09125
$$ 683568 884174 935565 864846 560950 181579 146162 566623 955659 708926 -200199
39544b00199r10012j52431P14216Q71996K32980l47358j06385N04751L75097n50289
$$ -200199 -1110211 -1262642 -548426 323570 556550 209192 102807 607558 982655 432366
39534D32366r94750j98565Q66157Q93464R0263l81263k14788j5422O4640L90571
$$ 432366 -562384 -760949 105208 998672 1088935 707672 492884 477462 542102 932673
39524I32673O83455K29835o32980o95710J28632M69647k75780q91500l94185L13986
$$ 932673 1616128 1845963 1212983 517273 645905 1115552 839772 -51728 -445913 -131927
39514a31927P8917m83788j60515O21614N23589k96772m12271L71231O39739k01597
$$ -131927 -53010 -536798 -697313 -75699 447890 151118 -261153 110078 749817 548220
39504E48220q81875l44240N84349N70716k44692o94521l04437M08882Q87709R08673
$$ 548220 -333655 -677895 -93546 477170 232478 -462043 -766480 -357598 530111 1438784
39494A438784L39779o64639j396532j210639l37810M25115O81172N83749K46000
$$ 1438784 1778563 1113924 -282608 -1493247 -1831057 -1405942 -724770 -141021 104979
39485A04979l28701p84813n94494J37116O35261M79854J58732K56223N43499L83527
$$ 104979 -223722 -1008535 -1603029 -1465913 -830652 -350798 -192066 64157 607656 991183
39475I91183k36229o73537n80764l05943k15964j45081J80197N73972O52336L96166
$$ 991183 754954 81417 -499347 -805290 -1021254 -1166335 -986138 -412166 240170 636336
39465F36336N6345k71184n45206m90384M2247N83912N46236J30814M0424L09653
$$ 636336 692681 421497 -123709 -614093 -571846 12066 558302 689116 729540 1039193
39455A039193K77054j51251k12409L33549N60305j61622r51528o52120L76462
$$ 1039193 1316247 1164996 952587 1286136 1846441 1684819 733291 81171 457633
39446D57633Q04525K65263l95401n86034n46662m72416j44434L82069O31211M79761
$$ 457633 1262158 1527421 1132020 545986 -676 -473092 -617526 -235457 395754 875515
39436H75515L27670L47117K91587J46834J93001L24241J32871k30707j87014J62555
$$ 875515 1203185 1550302 1841889 1988723 2181724 2505965 2638836 2408129 2221115 2383670
39426B383670Q1662m32025m85931J02621K99362l77669q32392j19544Q94193Q29307
$$ 2383670 2465332 2033307 1547376 1649997 1949359 1571690 739298 619754 1513947 2343254
39416B343254r1627n84626l42166q7554J0944M44481R76991O80757m15927j087527
$$ 2343254 2251627 1667001 1324835 1237281 1248225 1692706 2669697 3350454 2934527 1847000
39406A847000p32276k00767k50027l31255K73925J050591R83629J04705o58947
$$ 1847000 1114724 913957 663930 332675 606600 1657191 2640820 2745525 2086578
39397B086578q21148o29654k70479K92324P22134M63797l04795o55647k06587
$$ 2086578 1265430 635776 365297 657621 1379755 1843552 1538757 883110 676523
39388F76523K41980r2168o83665m05258P09723J340053P10944k84185l71657K92321
$$ 676523 918503 826335 142670 -262588 447135 1787188 2498132 2213947 1842290 2134611
39378B134611M57748l03861j001876p52853k6526K09532j7556J43003R17758J451868
$$ 2134611 2592359 2288498 1286622 533769 507243 716775 699219 842222 1759980 3211848
39368C211848R76698j45311q99806q32463l94100j76065k02741j60874n7420k13738
$$ 3211848 4188546 4043235 3143429 2310966 1916866 1740801 1538060 1377186 1319766 1106028
39358A106028n71615n21579J94973Q31022N40374k89944m85325J14732L44838
$$ 1106028 534413 12834 207807 1038829 1579203 1289259 803934 918666 1263504
39349A263504m00382j049653m71492O72713Q87271J12193l56337l9980J35874
$$ 1263504 863122 -186531 -658023 14690 901961 1014154 657817 617837 753711
39340G53711l00119m01622N27135J482073J100335k74682j066033o53888N4374
$$ 753711 453592 51970 579105 2061178 3161513 2886831 1820798 1166910 1221284
39331A221284J78621q9205k03234j06304M8798L09443N82407M51957j48889n66130
$$ 1221284 1399905 1310700 1107466 1001162 1049960 1359403 1941810 2393767 2244878 1678748
39321A678748k93638K08196K35177J3839K76620Q39389O76885l95488j204777
$$ 1678748 1385110 1593306 1828483 1842322 2118942 2958331 3635216 3239728 2034951
39312B034951r26684l23722m26171q07562l75960O15452P97802q5391o22765J48723
$$ 2034951 1108267 784545 358374 -449188 -825148 -209696 588106 502715 -120050 28673
39302B8673J310143J490491P63191J89517J58145K10043J43658K73235O32829
$$ 28673 1338816 2829307 3592498 3782015 3940160 4150203 4293861 4567096 5199925
39293E199925P50341L57763k21102n21155m17903j17192Q0141K4140j37244j97795
$$ 5199925 5950266 6308029 6086927 5565772 5147869 5030677 5110818 5134958 4997714 4799919
39283D799919k87541o20636q21686k32012Q40848J095316P0064r23728o25563
$$ 4799919 4512378 3891742 3070056 2838044 3678892 4774208 4844272 3920544 3294981
39274C294981K94588M11611j54790k02735K54744L9366q40006q61032M55109J481152
$$ 3294981 3589569 4001180 3846390 3643655 3898399 3937765 3097759 2236727 2691836 4172988
39264D172988R08021l17270o45819k11716q0370k41047O5759O29520M86027l37823
$$ 4172988 5081009 4763739 4117920 3906204 3825834 3584787 3650546 4280066 4766093 4428270
39254D428270p16591j39877O32359P94740M00607j31899n29747m79323K31814
$$ 4428270 3711679 3571802 4204161 4998901 5399508 5267609 4737862 4258539 4490353
39245D490353J109360J231411M54089l08934l23448Q5965K63861J93054J94968
$$ 4490353 5599713 6831124 7285213 6976279 6652831 6738796 7002657 7195711 7390679
39236G390679J67834j78674n64654l25565N87933J353754J257199N63868J05018
$$ 7390679 7558513 7379839 6815185 6489620 7077553 8431307 9688506 10252374 10357392
39227A0357392K02057L99852K74403Q8632L58557J007321J387986J171964Q34977
$$ 10357392 10559449 10959301 11233704 11322336 11680893 12688214 14076200 15248164 16083141
39218A6083141J066024J909193K698421K775361K178690J641855J852180K664343
$$ 16083141 17149165 19058358 21756779 24532140 26710830 28352685 30204865 32869208
39210C2869208L289364L457696L960009N475290P284177Q146165Q344430R594648
$$ 32869208 36158572 39616268 43576277 49051567 56335744 64481909 72826339 82420987
39202H2420987J2614568J6152870J9192905K2766213K8305992L5339352M2461664
$$ 82420987 95035555 111188425 130381330 153147543 181453535 216792887 259254551
39195B59254551M9473103N5827208N7013528M5925326K0283745j2503747m0034333
$$ 259254551 308727654 364554862 421568390 467493716 487777461 475273714 435239381
39188D35239381n4427808n6428164n1450513m4072646l6516305k9832047k4434176
$$ 435239381 380811573 324383409 272932896 228860250 192343945 162511898 138077722
39181A38077722j9978632j6050139j2905859j0831008r197472p208990n362842
$$ 138077722 118099090 102048951 89143092 78312084 69114612 61905622 56542780
39174E6542780m905392n657513n728359m076725k157752j875733k788258k876318
$$ 56542780 51637388 45979875 40251516 36174791 34017039 32141306 29353048 26476730
39166B6476730j674828q59222j497071k425480k179047j177811q12550j237586
$$ 26476730 24801902 23942680 22445609 20020129 17841082 16663271 15850721 14613135
39158A4613135j383293p49200J5219K38076j4302l56720n65821n93332n86901
$$ 14613135 13229842 12480642 12495861 12733937 12719635 12362915 11797094 11203762 10616861
39149A0616861q03227j108163q97501m3806N31470k589j054958j336555o57742
$$ 10616861 9813634 8705471 7807970 7764164 8295634 8293045 7238087 5901532 5243790
39140E243790J042P8842M744J27401J64289k5859q4512R9778J27475j17220k23820
$$ 5243790 5244832 5323674 5328418 5455819 5620108 5594249 5509737 5609515 5736990 5619770 5395950
39129E395950j11455k68981p59681q55925j75982N97697P01952L04794k3235j83349
$$ 5395950 5284495 5015514 4255833 3399908 3223926 3821623 4523575 4828369 4805134 4621785
39119D621785l03348k44358J9822Q7642k02154l44057j3253K69522K9678k14107
$$ 4621785 4318437 4074079 4093901 4181543 3979389 3635332 3622079 3891601 3921279 3707172
39109C707172K25312R09114Q03008j45500r31629r23198m80965j16748J33938
$$ 3707172 3932484 4841598 5644606 5499106 4567477 3644279 3163314 3046566 3180504
39100C180504L09115J91211k91044p64682p88952k93962M55299J101504J352916
$$ 3180504 3489619 3680830 3389786 2625104 1836152 1542190 1997489 3098993 4451909
39091D451909J115882N52217m4938l91696k97270J30341L96182J41255k57803
$$ 4451909 5567791 6120008 6075070 5683374 5386104 5516445 5912627 6053882 5796079
39082E796079j77680J51341j29203r66664j143226j44399Q11686N77192p8374
$$ 5796079 5618399 5769740 5640537 4673873 3530647 3386248 4197934 4775126 4696752
39073D696752K51653J222154J264556K03801l79596M36882J739268K484830K923091
$$ 4696752 4948405 6170559 7435115 7638916 7259320 7696202 9435470 11920300 14843391
39064A4843391L483158L420870J741991j079484l319358l812131k933061j882998
$$ 14843391 18326549 21747419 23489410 22409926 19090568 15278437 12345376 10462378
39056A0462378j451783j484788j321696o74317M7244L73597L90594L26557n9168
$$ 10462378 9010595 7525807 6204111 5529794 5577038 5950635 6341229 6667786 6608618
39047F608618r63804j720270j437889l99533J67931k07385p75782r27312q87897
$$ 6608618 5644814 3924544 2486655 2087122 2255053 2047668 1271886 344574 -543323
39038e43323p54096p2911J007166J336994L92978o69533n88559J87909L63178
$$ -543323 -1297419 -1370330 -363164 973830 1366808 697275 108716 296625 659803
39029F59803j78193m43469o9069K73355J62626J6477K15315M92293M64067J77242
$$ 659803 481610 38141 -30928 242427 405053 421530 636845 1129138 1593205 1770447
39019A770447q6986j46977K6556K79309L44483K18342K50925N27114N13446j49612
$$ 1770447 1683461 1536484 1563040 1842349 2186832 2405174 2656099 3183213 3696659 3547047
39009C547047q38102o27660L81171J128464R44041J96051l87419m20056J31053
$$ 3547047 2708945 2081285 2462456 3590920 4534961 4731012 4343593 3923537 4054590
39000D054590R92572J524333J182888K38359m12896l18064K4163j19648p98765
$$ 4054590 5047162 6571495 7754383 7992742 7579846 7261782 7285945 7166297 6367532
38991F367532j344090j113302k25766M33224J38087p14691j002358l90250J98548
$$ 6367532 5023442 3910140 3684374 4117598 4255685 3540994 2538636 2148386 2346934
38982B346934K6349l40121j20829K27094j83534r04490o23799O72793J451751
$$ 2346934 2373283 2033162 1912333 2139427 1955893 1051403 427604 1100397 2552148
38973B552148Q23245l07654p63015o11303n14804n47869m63114m03765n54338
$$ 2552148 3375393 3067739 2304724 1693421 1178617 630748 167634 -236131 -790469
38964g90469n96843k05671L20827M97503L52192K08865J46076R4364J01136J53024
$$ -790469 -1387312 -1592983 -1272156 -774653 -422461 -213596 -67520 26844 127980 281004
38954B81004J34761J92055N75613R16623M44893o98946j270286o28756K57960
$$ 281004 415765 607820 1183433 2100056 2544949 1846003 575717 -53039 204921
38945B04921K83793k01505k36328J13048J43190n1668J60557O13154N65687Q4715
$$ 204921 488714 287209 50881 163929 307119 255451 416008 1029162 1594849 1679564
38935A679564n5446K29244K75677J6512J14602O32738Q38189N82001O04952J086347
$$ 1679564 1624118 1853362 2129039 2145551 2260153 2892891 3731080 4313081 4918033 6004380
38925F004380J160663M58185o2524M34493J421057K036672K432644L182196M129855
$$ 6004380 7165043 7623228 7560704 7995197 9416254 11452926 13885570 17067766 21197621
38916B1197621M721190M758140L965446J666267j950224m957108n503963m158303
$$ 21197621 25918811 30676951 34642397 36308664 34358440 29401332 23897369 19739066
38908A9739066l088379l136154l145392k200845r82332m44277m69843n23019n96201
$$ 19739066 16650687 13514533 10369141 8168296 7185964 6741687 6271844 5748825 5152624
38899E152624p56774o06359M953M06306N2611n19569m99696q8503q7204n36166
$$ 5152624 4395850 3789491 3794444 4200750 4253361 3733792 3234096 3145593 3058389 2522223
38889B522223p12697l68230n3689j32440k75776j66536m4976k35700n95025p22573
$$ 2522223 1809526 1441296 1387607 1255167 979391 812855 767879 532179 -62846 -785419
38879g85419m21509J97640P74639Q35763K82047k42654m393P12966Q03273r7538
$$ -785419 -1206928 -1009288 -234649 601114 883161 640507 636114 1349080 2152353 2054815
38869B054815r31550o07657M91929J058878N55037l37675p84234o42838k64462
$$ 2054815 1123265 515608 1007537 2066415 2621452 2283777 1499543 856705 592243
38860E92243l483R055k4548K59568P75197P91824j21782j204043j284279l73067
$$ 592243 588760 597815 573267 832835 1608032 2399856 2278074 1074031 -210248 -583315
38850e83315L50623K03637k41758l19230k61334m79613o27020j54650O63290J030823
$$ -583315 -232692 -29055 -270813 -590043 -851377 -1330990 -1958010 -2112660 -1449370 -418547
38840d18547P24971K53651O5642J38577K51563K21486m9179m27423n91841m61117
$$ -418547 306424 560075 625717 764294 1015857 1237343 1188164 760741 168900 -292217
38830b92217l06943k14484J06537O22111O86234L6132n25966k49001L00849J06613
$$ -292217 -599160 -813644 -707107 -84996 601238 637370 111404 -137597 163252 269865
38820B69865n57269m72880N47922J327057J110008M40952r4276p42932j578205
$$ 269865 -287404 -760284 -212362 1114695 2224703 2665655 2571379 1828447 250242
38811B50242j764454p58998N64639R76618N23387J81310L10529M08978J86747
$$ 250242 -1514212 -2273210 -1708571 -731953 -208566 -27256 283273 692251 878998
38802H78998k0911P7540L37644N14674M91957J86875l33999p00588o06871k60152
$$ 878998 858087 935627 1273271 1787945 2279902 2466777 2132778 1432190 825319 565167
38792E65167j00116j97748l10510l75703n20707o97729p20939n76143l36870P4092
$$ 565167 465051 267303 -43207 -418910 -939617 -1637346 -2358285 -2934428 -3271298 -3197206
38782c197206O50385J010676P99604K49432j17734k25006l81540n80301m21442
$$ -3197206 -2546821 -1536145 -736541 -487109 -604843 -829849 -1211389 -1791690 -2213132
38773b213132K00796Q21108R68730O84310L53149K44547K78090J36030l16772
$$ -2213132 -2012336 -1191228 -222498 461812 814961 1059508 1337598 1473628 1156856
38764A156856o78167l83821M05445P70016K58985l64182j94422M55029N49608
$$ 1156856 478689 94868 500313 1270329 1529314 1165132 970710 1425739 1975347
38755A975347j16440p55552q44061o38833m18534r6528K44511K32834j27795l41751
$$ 1975347 1858907 1103355 259294 -379539 -798073 -894601 -650090 -417256 -545051 -886802
38745h86802j77831Q2286K87232O08378R23873P70947J71906k37970k08982k41522
$$ -886802 -1064633 -982347 -695115 -86737 837136 1608083 1779989 1542019 1333037 1091515
38735A091515n89960p05066j95898L68170K57614l50621p03673m33338L03286
$$ 1091515 501555 -203511 -399409 -31239 226375 -124246 -827919 -1261257 -957971
38726i57971J158013J573907R73133m28985j441827j159460p0222O26450M54966
$$ -957971 200042 1773949 2747082 2318097 876270 -283190 -353412 273038 728004
38717G28004j04280m40457l13047J67577N76734M87379Q4329N657K66916P5271
$$ 728004 623724 183267 -129780 37797 614531 1101910 1186239 1191896 1458812 1534083
38707A534083p82949j267134o25338K49757J39417n26468l80722O39474J264213
$$ 1534083 751134 -516000 -1141338 -891581 -752164 -1278632 -1659354 -1019880 244333
38698B44333R61742N26436M72730L03607k35437n02021j46567J55333j66248o24730
$$ 244333 1206075 1732511 2205241 2508848 2273411 1771390 1624823 1780156 1613908 989178
38688I89178n31681l4986L36539M84576M91221K00551l32043n49119j57238L33646
$$ 989178 457497 422511 759050 1243626 1734847 1935398 1603355 1054236 896998 1230644
38678A230644L94988K59106L18873L04089k20442r45188j136170o19102J40531
$$ 1230644 1625632 1884738 2203611 2507700 2287258 1342070 205900 -413202 -272671
38669b72671O82248P70713L11840m08872p49983n16651l35493o45908q45412k57102
$$ -272671 409577 1180290 1492130 1083258 333275 -183376 -518869 -1164777 -2010189 -2267291
38659b267291N42913M61217l01082m25841M48819J097316N89834l11970l86513
$$ -2267291 -1724378 -1263161 -1564243 -1990084 -1541265 -443949 145885 -166085 -552598
38650e52598K58762N46523P9172m99639n95077k90751J07380M61810O15400L75773
$$ -552598 -293836 252687 331859 -167780 -762857 -1053608 -946228 -484418 130982 506755
38640E06755j14549m12768l49034j84254o5546J95538N45204M25022l99516j153906
$$ 506755 392206 -20562 -369596 -553850 -619396 -423858 121346 546368 146852 -1007054
38630a007054r07667O0599N39444P5879m37668j73824M27203M58697n7705l51059
$$ -1007054 -1914721 -1854122 -1314678 -1238799 -1676467 -1850291 -1423088 -964391 -1022096 -1373155
38620a373155j16952K47644M51377N68027N36666J66059k94682l08676Q5035K36686
$$ -1373155 -1490107 -1242463 -791086 -223059 313607 479666 184984 -123692 -38657 198029
38610A98029j11193m63067m30822k46835j12362K32283Q39529J148832Q24627
$$ 198029 86836 -376231 -807053 -1053888 -1166250 -933967 -94438 1054394 1879021
38601A879021L97528M09788M53386j55760j126342j476408r05212p9214M14375
$$ 1879021 2276549 2686337 3139723 2983963 1857621 381213 -523999 -603213 -188838
38592a88838O43906P77006O52983J83284l14966m94857m00417k89610k41528j27424
$$ -188838 455068 1232074 1885057 2068341 1753375 1258518 858101 568491 326963 199539
38582A99539J19502L28147K28120j81536m81099k87250J68523L02726N7433l4009
$$ 199539 319041 647188 875308 693772 212673 -74577 93946 396672 454105 420096
38572D20096J65610O0116n70182q61714p1349J060536J153717J14070q30389r30257
$$ 420096 585706 645822 75640 -786074 -857423 203113 1356830 1470900 640511 -289746
38562b89746o58956n17679j99789N77638J279346J234280N70118q1690l99053
$$ -289746 -948702 -1466381 -1666170 -1088532 190814 1425094 1995212 1913522 1514469
38553A514469m22132j82767K25181M71041L19466l1198k42252k51345j41168J13132
$$ 1514469 1092337 909570 1134751 1605792 1925258 1894060 1651808 1400463 1259295 1372427
38543A372427M31655M40740q2788p32712q49177l30483K62567M10562J63306p2321
$$ 1372427 1804082 2244822 2162034 1429322 580145 249662 512229 922791 1086097 1013776
38533A013776l7700J88351L82246M38105M20386L88092K53935q6831n24272p68102
$$ 1013776 976076 1164427 1546673 1984778 2405164 2793256 3047191 2960360 2436088 1667986
38523A667986o52515l26034j02404j52134l36852l52470q5481K28521L41997L87069
$$ 1667986 1015471 689437 587033 434899 98047 -254423 -339904 -111383 230614 617683
38513F17683O08317P54520K64751p69954j410767j023140j23966L93275L89174
$$ 617683 1226000 1980520 2245271 1475317 64550 -958590 -1082556 -689281 -300107
38504c00107K61212R9970j79733k66330J13660M69097J83752l36468j96392M30450
$$ -300107 -38895 61075 -118658 -384988 -271328 197769 381521 45053 -151339 279111
38494B79111M67534k50702n98517L2021P44068N80078q2686l57296k26518k26176
$$ 279111 746645 495943 -102574 -70553 673515 1253593 1170907 813611 587093 360917
38484C60917l60625k17024J85412L94580J88265k46369n84972n17864L8965O63675
$$ 360917 292 -216732 -31320 363260 551525 305156 -279816 -797680 -758715 -95040
38474i5040P91084M94933L25927L01245p8191o26373m26831N41269R70598K05886
$$ -95040 696044 1190977 1516904 1818149 1739958 1113585 686754 1228023 2198621 2404507
38464B404507n64868j79936N81853L64105m18914k87926P88357J355286Q07682
$$ 2404507 1839639 1659703 2241556 2605661 2186747 1898821 2687178 4042464 4850146
38455D850146J20054J23935N17067Q38111J104995J150589N45463m01257o81352
$$ 4850146 4970200 5094135 5611202 6449313 7554308 8704897 9250360 8849103 8167751
38446H167751j09594K11454m96482j517009j730960j156814o90850p55374q56450
$$ 8167751 8058157 8269611 7773129 6256120 4525160 3368346 2677496 1922122 1065672
38437A065672l81734N02983Q47945j5579j345490j529864k27650Q37709J92946
$$ 1065672 683938 1186921 2034866 2019287 673797 -856067 -1083717 -246008 -53062
38428e3062j078936q62292O96107J400710N00654k61378K74101P67093j49944
$$ -53062 -1131998 -1994290 -1298183 102527 603181 341803 615904 1382997 1233053
38419A233053j346726r76624M84361J016353K05233l92663J02291P01932L47407
$$ 1233053 -113673 -1090297 -605936 410417 615650 222987 325278 1027210 1374617
38410A374617n21941q13564k93321L38947L94280j62470p34525o22347K32915
$$ 1374617 852676 39112 -254209 84738 479018 316548 -417977 -1040324 -807409
38401h07409J059129J050126K39358o50461j006360p18317q8317L32340J51745
$$ -807409 251720 1301846 1541204 890743 -115617 -833934 -922251 -589911 -438166
38392d38166k91936j80547O09984J119852N87482m39979r19305o99024l29408
$$ -438166 -730102 -910649 -300665 819187 1406669 966690 47385 -651639 -981047
38383i81047J4822M84001P70216M07280k66556m09944O8624M44546L72283K47931
$$ -981047 -966225 -482224 287992 695272 428716 18772 87396 531942 904225 1152156
38373A152156K94774K01523j06917j84524J28474L46641J37218j80773l01929
$$ 1152156 1446930 1648453 1541536 1357012 1485486 1832127 1969345 1788572 1486643
38364A486643m75691r33474j287703j008840j82231O16864R58631P70289J94751
$$ 1486643 1010952 77478 -1210225 -2219065 -2401296 -1784432 -825801 -55512 139239
38355A39239m28354o50140l11471K33301N02905M14367K64090K71925L20946J82753
$$ 139239 -289115 -939255 -1250726 -1017425 -514520 -100153 163937 435862 756808 939561
38345I39561q9554j49649J40095L57415K4503n89239p01470j68634K55060J25912
$$ 939561 850007 700358 840453 1197868 1222371 633132 -68338 -236972 18088 144000
38335A44000K4075M67348Q60782M36531l39140m21604R7188J66939m33872p75494
$$ 144000 168075 635423 1496205 1932736 1593596 1171992 1269180 1436119 1002247 226753
38325B26753l94005J0162j27651l48921j15929L02271M70837N00129N32952K74060
$$ 226753 -167252 -157090 -284741 -633662 -749591 -447320 23517 523646 1056598 1330658
38315A330658l54284p63276n33384j06708n3211k24156k23274j26647r4343J50763
$$ 1330658 976374 213098 -320286 -426994 -480205 -704361 -927635 -1054282 -1148625 -997862
38305i97862P36086J052608N39365l55977p73428o39373m87560m10321n8076M86951
$$ -997862 -261776 790832 1330197 974220 200792 -438581 -926141 -1336462 -1394538 -907587
38295i07587O96825M53175J89200J40213R1681p3521j66157j20529j26480k30760
$$ -907587 -210762 242413 431613 571826 663507 589986 423829 303300 176820 -53940
38285e3940k30020m7137J33002J50378J8590j73700k57878j9698M60459O84377
$$ -53940 -283960 -331097 -198095 -47717 -29127 -202827 -460705 -480403 -19944 664433
38275F64433L17554k78657m86026k35316L0183L1603j35164l29627m80289m64435
$$ 664433 981987 703330 217304 -18012 12171 43774 -91390 -421017 -901306 -1365741
38265a365741k33830N8264L18091O26625Q16744M09230n45262j075786m46229
$$ -1365741 -1599571 -1541307 -1223216 -596591 220153 629383 84121 -991665 -1437894
38256a437894P04411J150899O47091j29152p75563j247812j085071R9675J392789
$$ -1437894 -733483 417416 1064507 935355 159792 -1088020 -2173091 -2073416 -680627
38247f80627J290443q0793q70676j62783O88101K53342p23325n75312O53804J320861
$$ -680627 609816 529023 -341653 -504436 183665 437007 -286318 -861630 -207826 1113035
38237A113035O13654m90434p85602k83928K06572J95670j83000n48731o40693
$$ 1113035 1726689 1236255 450653 166725 373297 568967 385967 -162764 -803457
38228h03457m74329k44198k9147K59632N29394M21124j40553o21575n01476J3635
$$ -803457 -1277786 -1521984 -1551131 -1291499 -762105 -340981 -481534 -1103109 -1604585 -1590950
38218a590950L25101K82275K16839K81424K71749R8172k5512M4136J44185M7117
$$ -1590950 -1265849 -983574 -766735 -485311 -213562 -115390 -140902 -96766 47419 94536
38208I4536k44893m76381l29417K40415P82802P36702J89230j22299J63548M58715
$$ 94536 -150357 -626738 -956155 -715740 67062 803764 992994 870695 1034243 1492958
38198A492958J38733m11743l49881L03373O88642L90780j02871l38365n20862
$$ 1492958 1631691 1219948 870067 1173440 1862082 2252862 2149991 1811626 1290764
38189A290764q92220j113160p37249N4737O09402N32458L4357l26850j59487L36692
$$ 1290764 398544 -714616 -1451865 -1397128 -787726 -255268 -220911 -547761 -707248 -370556
38179c70556M87768l2566n98437l35805N77330R76308L10490n03092l46815M97753
$$ -370556 117212 84646 -513791 -849596 -272266 704042 1014532 511440 164625 662378
38169F62378P52601o0650r92542r67424j20914N22354L81723j25430l40666k42570
$$ 662378 1414979 1354329 361787 -605637 -726551 -204197 177526 52096 -288570 -531140
38159e31140k59246m24437k64815L23062O34401Q8741p66531q81511j93865L03257
$$ -531140 -790386 -1214823 -1479638 -1156576 -522175 -433434 -1199965 -2081476 -2275341 -1972084
38149a972084Q0060j84803K28442Q95211Q69391M4902p71728r25505m78015J57386
$$ -1972084 -1892024 -2076827 -1848385 -953174 -83783 -38881 -810609 -1736114 -2214129 -2056743
38139b056743O32858P59938N86647L71821K39204k148m47833p55016n64775o7565
$$ -2056743 -1423885 -663947 -77300 294521 533725 531577 83744 -671272 -1236047 -1303612
38129a303612K22041R7239k39174m84638l60439K47504R22999R15735J65193l61400
$$ -1303612 -1081571 -984332 -1223506 -1708144 -2068583 -1821079 -898080 17655 182848 -178552
38119a78552K2712O08408L43570m61468n97413J13808O03456L02251j50685j95936
$$ -178552 -155840 452568 796138 334670 -262743 -148935 454521 756772 606087 410151
38109D10151j58006l45531m36337k56589j77802k64344n8110L15313K4837q52347
$$ 410151 252145 -93386 -529723 -786312 -964114 -1228458 -1286568 -971255 -946418 -1798765
38099a798765r37632L01474J369945R57615L6283J49900P49387K36454j079342
$$ -1798765 -2736397 -2434923 -1064978 -107363 -71080 78820 828207 1064661 -14681
38090a4681j319104j07093R15464Q20168N12321O35254L90517o68136j413080
$$ -14681 -1333785 -1440878 -525414 294754 807075 1442329 1832846 1164710 -248370
38081b48370q52490K79204P46720N20852K32983m9082m42959n34114o9853L71265
$$ -248370 -1100860 -821656 -74936 445916 678899 629817 186858 -347256 -417109 -45844
38071d5844L02236J52632L30260L34628k44696p29199m24131J16885K7362m16874
$$ -45844 256392 409024 739284 1073912 829216 100017 -324114 -207229 -179867 -596741
38061e96741m31804r6366Q8560K67905O10198M30910o17163j279376l26866J213516
$$ -596741 -1028545 -1124911 -1036351 -768446 -158248 272662 -344501 -1623877 -1950743 -737227
38051g37227J363744K41028l09177J39378J64915o42680q49053J41640Q71237
$$ -737227 626517 867545 558368 697746 862661 219981 -629072 -487432 383805
38042C83805L41623l01756R0156O41417J11351q76613r51514k62473L0788k27660
$$ 383805 725428 423672 513828 1155245 1266596 389983 -561531 -824004 -793216 -1020876
38032a020876k34239K29137O43878P59816O41421J66380n16671o17134J51780
$$ -1020876 -1255115 -1025978 -382100 377716 1019137 1185517 668846 51712 203492
38023B03492P11495Q8720q99651p90094K28964O68522Q2751m90431l81761j04708
$$ 203492 914987 1003707 104056 -686038 -457074 211448 294199 -196232 -577993 -682701
38013f82701j45881k37789j20314M3639K34043N95864P97239L67730k61810j50599
$$ -682701 -828582 -1066371 -1186685 -1143046 -909003 -313139 484100 851830 590020 439421
38003D39421O12398R25731M24181l4211L4449k5170n78908p86891l3260P58927
$$ 439421 1051819 1977550 2401731 2367520 2401969 2376799 1797891 1011000 977740 1736667
37993A736667L70263q21277j335911o57490K38482L72901q9846l62782r6326L92111
$$ 1736667 2106930 1285653 -50258 -707748 -469266 -96365 -186211 -548993 -645319 -253208
37983b53208O48746N36140J83101k82631p23486p86680j48177Q30943J173133
$$ -253208 395538 931678 1114779 832148 108662 -678018 -826195 4748 1177881
37974A177881M61968m64135n83651o7124J64381q5933k03992N288M3514k51827
$$ 1177881 1639849 1175714 592063 524939 689320 603387 399395 404683 448197 196370
37964A96370l81004r6536K05042K26827J46941R2514k6287r6740K773j38717q53471
$$ 196370 -184634 -281170 -76128 150699 297640 390154 363867 267127 269900 131183 -722288
37953g22288j366213o13285R01393J495167P35986o6576j29192k00569o72842
$$ -722288 -2088501 -2701786 -1800393 -305226 430760 364184 234992 34423 -638419
37944f38419n68962N17257J226380N51626m05466l27614J27539k32934q46065
$$ -638419 -1207381 -690124 536256 1087882 682416 354802 482341 249407 -596658
37935e96658n38641J39541r1211p47776l78615P15302R16202J40110j42741L36077
$$ -596658 -1135299 -995758 -1086969 -1834745 -2213360 -1498058 -581856 -441746 -584487 -248410
37925b48410L15921l63593l01818P22386R66163l63015j578132j120171J54609
$$ -248410 67511 -296082 -597900 124486 1090649 727634 -850498 -1970669 -1816060
37916a816060O17478K11594j93266m01487m97256p9939P80674R61861j9080q29576
$$ -1816060 -1198582 -986988 -1180254 -1581741 -2078997 -2158936 -1378262 -416401 -435481 -1265057
37906a265057k30905Q81900Q78790o5179m88102m5670K99140J20270l2699J16192
$$ -1265057 -1495962 -614062 264728 199549 -288553 -334223 -35083 85187 52488 168680
37896A68680K80319M68903Q71259J010515K65396q41892j115910m44456R5053
$$ 168680 448999 917902 1789161 2799676 3065072 2223180 1107270 662814 757867
37887G57867o9944l52793j72643K79305O03264O19515J87631n26815p20425Q4174
$$ 757867 687923 335130 162487 441792 1045056 1664571 1852202 1325387 604962 689136
37877F89136R04631L85221j034107j481188l57688Q56926R34135M55691L23555
$$ 689136 1593767 1978988 944881 -536307 -893995 -37069 897066 1352757 1676312
37868A676312K49283j91637l34352L76554R76360K94461r89260j187977j78777
$$ 1676312 1925595 1733958 1399606 1776160 2752520 3046981 2057721 869744 690967
37859F90967M52918j29050r00003p30805j1248K05809j60571k96868J75123P02817
$$ 690967 1143885 1014835 114832 -615973 -627221 -421412 -581983 -878851 -703728 -911
37849i11O27331J8719m78444m32933o5242J27011K1536p2879L7966J83816K17123
$$ -911 626420 645139 166695 -266238 -331480 -204469 -182933 -255812 -217846 -34030 183093
37838A83093K39466K24212j23647p48085r51931l12642M86783M88921j18163k99289
$$ 183093 422559 646771 523124 -224961 -1176892 -1489534 -1002751 -513830 -631993 -931282
37828i31282J79128M38519N3172j73540L76959R10574M00133o45410q01026J24077
$$ -931282 -752154 -313635 -260463 -434003 -57044 853530 1253663 608253 -192773 -68696
37818f8696Q14352M61548j50796n5999M51895N51220K53169P1853q8356o21601
$$ -68696 745656 1207204 1056408 1000409 1452304 2003524 2256693 2328546 2240190 1618589
37808A618589j127009q16825M1577L05347k53323n79085j59015R3925m47146p92058
$$ 1618589 491580 -325245 -283668 21679 -231644 -810729 -969744 -875819 -1322965 -2115023
37798b115023P3140J264439J224732K39473m5642O01271O43690n04743j334480
$$ -2115023 -2041883 -777444 447288 686761 641119 1242390 1886080 1381337 46857
37789D6857o74112M08117M17561j96925q4074N64973M79758k51568k09063P85078
$$ 46857 -627255 -219138 198423 1498 -82576 482397 962155 710587 501524 1286602
37779A286602J057343k59370j603764j182720L85681J040501K16506o91212o23642
$$ 1286602 2343945 2084575 480811 -701909 -316228 724273 940779 249567 -374075
37770c74075j44509q6509j51609L37996J062862J067367K38550m66238l54243
$$ -374075 -518584 -605093 -756702 -418706 644156 1711523 1950073 1483835 1129592
37761A129592J44341K31888j75003n40427n51496l78133k18313m3038J66665K75326
$$ 1129592 1273933 1505821 1330818 790391 238895 -139238 -357551 -400589 -233924 41402
37751D1402J83622n6566l38968n00906k97231K76893O84215L60853l74046n00971
$$ 41402 225024 168458 -170510 -671416 -968647 -691754 -7539 353314 -20732 -521703
37741e21703L17919J111083Q49629j49128p33948n00943o6240Q7823J35761J83146
$$ -521703 -203784 907299 1756928 1607800 873852 372909 306669 394492 530253 713399
37731G13399n9555n09256m55797L20344Q73613L50219n80617n51394M64750J059588
$$ 713399 653844 144588 -311209 9135 882748 1232967 652350 100956 565706 1625294
37721A625294M90641k27752R0688J008393J150592J99351p83787q95931l33805
$$ 1625294 2115935 1888183 1978871 2987264 4137856 4337207 3553420 2657489 2323684
37712B323684K97818P49200Q76233M10022m62535q69985l10389M28297J69393
$$ 2323684 2621502 3370702 4246935 4656957 4194422 3324437 3014048 3442345 3611738
37703C611738r82170j664281j042184J52664O64864K32737l59004l84015J14792
$$ 3611738 2629568 965287 -76897 75767 740631 973368 614364 230349 345141
37694C45141N67977M98954n1430n54890n45786j98420j09721m12591m91998J29065
$$ 345141 913118 1412072 1360642 805752 259966 61546 -48175 -460766 -952764 -823699
37684h23699R76464J153211M90207l07497n91568l86014o5299J19042O3820k34103
$$ -823699 152765 1305976 1796183 1488686 897118 511104 445805 564847 628667 394564
37674C94564n42159n04606j04652K29300J86069p417J0739J50601O5267j97322
$$ 394564 -147595 -652201 -756853 -527553 -341484 -348901 -338162 -187561 -122294 -319616
37664c19616j99880J76677M78164L40470L2368K462J72325J27675j47189k46715
$$ -319616 -519496 -342819 135345 475815 508183 510645 682970 810645 663456 416741
37654D16741m1424J39369J22990J36022K20994J0095n34644p48698k21238L80498
$$ 416741 375317 514686 637676 773698 994692 1004787 470143 -278555 -499793 -119295
37644a19295K10390l95296l75030L93390Q83637M70014k74008o06442n63716m56299
$$ -119295 91095 -304201 -679231 -285841 597796 1067810 793802 187360 -376356 -832655
37634h32655k10640K30284M77307K48385j24823k39689k13535k79792k85281o8894
$$ -832655 -1043295 -813011 -335704 -87319 -212142 -451831 -665366 -945158 -1230439 -1299333
37624a299333J41104J80666K90633N31586M48937j22788n50902l49710J2926l504
$$ -1299333 -1158229 -977563 -686930 -155344 293593 170805 -380097 -729807 -716881 -720385
37614g20385j7634M68046R22132N51664k95079o69966n50496n83656o83969k81648
$$ -720385 -738019 -269973 652159 1203823 908744 238778 -311718 -895374 -1579343 -1860991
37604a860991K76366J00833n23100l99323M60064O54694k58374q93883k08690
$$ -1860991 -1584625 -1483792 -2006892 -2406215 -1946151 -1291457 -1549831 -2443714 -2652404
37595b652404R49416J330408J003840O35315K24131l69873o12669q5139O55736
$$ -2652404 -1702988 -372580 631260 1266575 1490706 1120833 508164 423025 1078761
37586A078761Q81708O26318J32150o63621j350360r47414M10706R50643k81504
$$ 1078761 1960469 2586787 2718937 2055316 704956 -242458 168248 1118891 837387
37577H37387j649733j211790L05221P24823j81881o77514n1137O00552O23583
$$ 837387 -812346 -2024136 -1718915 -994092 -1175973 -1853487 -1904624 -1304072 -680489
37568f80489O90903J039521P97197k45029r05871m98513L9222j93263n91713k58095
$$ -680489 10414 1049935 1847132 1602103 696232 197719 236941 43678 -548035 -806130
37558h06130M43398O37472L69381K05407P9909l98848r42094q44023l3400Q42474
$$ -806130 -362732 274740 644121 849528 929437 530589 -411505 -1255528 -1288928 -446454
37548d46454J205114R37018K66090l36289m57978k56733k76719n47896m66111
$$ -446454 758660 1695678 1961768 1625479 1167501 910768 634049 86153 -379958
37539c79958J39476N57680K96212q7054J07646N93023N95943K7242n51156p72723
$$ -379958 -240482 317198 613410 526356 634002 1227025 1822968 1850210 1299054 526331
37529E26331o46092k13695L62315O41585L71035j25668m25933n30545n35613k70720
$$ 526331 -119761 -333456 28859 670444 1041479 915811 489878 -40667 -576280 -847000
37519h47000K46080M91424J51882k91279k72838R940N2920j28855k61894m02815
$$ -847000 -600920 -109496 42386 -248893 -521731 -511791 -458871 -587726 -849620 -1252435
37509a252435n86571m19071K18172O20607K99033j7044N13004J247988Q81935
$$ -1252435 -1839006 -2258077 -2039905 -1419298 -1120265 -1137309 -624305 623683 1505618
37500A505618m37284j215878q13560j43724k517n9632R6357J71057p499K6524
$$ 1505618 1068334 -147544 -961104 -1104828 -1107345 -1166977 -1070620 -899563 -907062 -880538
37490h80538M10645M46010k20436p68508l79423M50176O27043P784n77614n21046
$$ -880538 -469893 -23883 -244319 -1012827 -1392250 -942074 -315031 -307247 -884861 -1405907
37480a405907L6772O31708Q52133M95356j90570o28296n91157m30677l67702j02226
$$ -1405907 -1369135 -737427 114706 610062 419492 -208804 -799961 -1230638 -1598340 -1700566
37470a700566M62791P46744L68461p4183J20271N74510M36264j59760k59530L58738
$$ -1700566 -1237775 -491031 -122570 -196753 -76482 498028 934292 774532 515002 873740
37460H73740Q14522M72943k06133m68699k24500J24674K59261M8766m34870p70285
$$ 873740 1688262 2161205 1955072 1486373 1261873 1386547 1645808 1694574 1259704 489419
37450D89419n30312K2530J21516l86999p31207l76061J67540K46283J41580M45981
$$ 489419 -40893 -18363 103153 -283846 -1015053 -1391114 -1223574 -977291 -835711 -389730
37440c89730Q32431M62760n27615j021987n53990O5395J46251J66061O98414J122216
$$ -389730 442701 905461 377846 -644141 -1198131 -1132736 -986485 -820424 -122010 1000206
37430A000206M90154p35211j060165j18573P29522L69916n36060p31422k42177
$$ 1000206 1490360 755149 -305016 -423589 305933 675849 139789 -591633 -833810
37421h33810k2141j92222R1153R62601J287192L41382q77696r09623J28046P55696
$$ -833810 -855951 -1048173 -957020 5581 1292773 1634155 756459 -153164 -25118 730578
37411G30578K36409n57279o15574k06208j95546n94446o57980j92766J55560K1305
$$ 730578 966987 409708 -205866 -412074 -607620 -1202066 -1860046 -2052812 -1897252 -1875947
37401a875947j12331J91633N80433N81857M05062M13864L41950j24427m26331
$$ -1875947 -1988278 -1796645 -1216212 -634355 -229293 184571 526521 402094 -24237
37392b4237J16903Q63608M67593r28560j517661l94664J014448R98853q7336p14905
$$ -24237 92666 956274 1423867 495307 -1022354 -1417018 -402570 596283 508947 -205958
37382b05958n36911m14935o06063m63285J53189N54819M41349K54667J75357r3915
$$ -205958 -742869 -1157804 -1763867 -2227152 -2073963 -1519144 -1077795 -823128 -647771 -741686
37372g41686l76665m2868P32004R16517K43076k84770j4469L94044K70928K6651
$$ -741686 -1118351 -1161219 -429215 487302 730378 445608 431139 825183 1096111 1122762
37362A122762J07512j7526p73245j343694q29397K08011O01884L65050L16454
$$ 1122762 1230274 1212748 439503 -904191 -1733588 -1525577 -923693 -558643 -242189
37353b42189M31259P179p72849r11185k55636K48083J34128J1856L07949N67620
$$ -242189 189070 196249 -576600 -1487785 -1743421 -1495338 -1361210 -1349354 -1041405 -473785
37343d73785M05541J31774J560k15429m79464k44204M82066P43204j5133r66886
$$ -473785 -68244 63530 65090 -150339 -629803 -874007 -391941 351263 336130 -630756
37333f30756j019435k77110L65953N54610N78684N45496K80491j42006m70617
$$ -630756 -1650191 -1927301 -1561348 -1006738 -428054 117442 397933 255927 -214690
37324b14690p27145r73320q34752L9786J142429J460930P47821j72869m82174
$$ -214690 -941835 -1915155 -2749907 -2710121 -1567692 -106762 641059 468190 -13984
37315a3984j98484K00361M18297L47421o0003n49705n76130J0672N55756L63453
$$ -13984 -212468 -12107 406190 753611 693608 143903 -432227 -421555 134201 497654
37305D97654k77907l94644L10079R81292P91020Q1241k18997j505m1652o37623
$$ 497654 219747 -174897 135182 1116474 1907494 1988735 1769738 1768233 1726581 1088958
37295A088958j011074m81235M08329O06935L0888m36019k92100j321j04486m14278
$$ 1088958 77884 -403351 4978 611913 642801 206782 -85318 -86639 -191125 -605403
37285f05403m20271n2286L10551L42261L9194l21345l50563R9957O40910O55503
$$ -605403 -1025674 -1077960 -767409 -425148 -385954 -707299 -1057862 -957905 -316995 338508
37275C38508M5671n71958n62901M0691O81055R05871P24741M60735L28993J46171
$$ 338508 384179 -187779 -750680 -709989 -28934 876937 1601678 2062413 2391406 2537577
37265B537577l96386j076097j127235k67771O43079O15545q2453l80925q6334
$$ 2537577 2141191 1065094 -62141 -329912 313167 928712 846259 465334 379000
37256C79000l6053m75887n08918L17158R93548M72375p33975j332042j010659
$$ 379000 342947 -132940 -641858 -324700 668848 1141223 407248 -924794 -1935453
37247a935453m56622r2403J83603L07069R8212j53020l8167J85578K5767k24279
$$ -1935453 -2392075 -2484478 -2300875 -1993806 -1895594 -2048614 -2086781 -1901203 -1875436 -2099715
37237b099715J18361Q12845Q76759J67612l37026j16683J35053j78304n05457
$$ -2099715 -1981354 -1168509 -291750 -124138 -461164 -577847 -442794 -621098 -1126555
37228a126555j41006N19721N86352L2596l98715l65641k07320j41701J06900P32929
$$ -1126555 -1267561 -747840 -161488 -128892 -527607 -893248 -1100568 -1242269 -1135369 -402440
37218d02440J359229J352395N00910o67400j235180p30992K99073P85540L32860
$$ -402440 956789 2309184 2810094 2142694 907514 176522 475595 1261135 1593995
37209A593995l54616m32371L5767L43482K08652P6714L44623P10863N55937j83675
$$ 1593995 1239379 807008 842775 1186257 1394909 1471623 1816246 2527109 3083046 2899371
37199B899371q13781o85076m9058J94869l32514r58831q87631k84967R1751R0860
$$ 2899371 2085590 1400514 1351456 1546325 1213811 254980 -632651 -917618 -825867 -735007
37189g35007K39172O29806O00621j40230q13433n84246K11581N29272N8340m48072
$$ -735007 -495835 133971 734592 594362 -219071 -803317 -591736 -62464 -4124 -452196
37179d52196k80501L15971N35667O7820m78785k85717N85757J093872M79517o36056
$$ -452196 -732697 -416726 118941 186761 -292024 -577741 8016 1101888 1581405 945349
37169I45349r72397k90416L76070K80021j20030j74187j01386l61760o76176n29604
$$ 945349 -27048 -317464 58606 338627 218597 44410 -56976 -418736 -1094912 -1624516
37159a624516j67472j80010m13677k32623L11398N24243K59154J17808L30972
$$ -1624516 -1791988 -1971998 -2385675 -2618298 -2306900 -1782657 -1523503 -1405695 -1074723
37150a074723L52774j05032m43026q8192N45155N95495n7442o65036n77268K2240
$$ -1074723 -721949 -826981 -1270007 -1358199 -813044 -217549 -274991 -940027 -1517295 -1495055
37140a495055L89634Q0580n39027p12952k15709L97506N88854N03206N03144M59434
$$ -1495055 -1105421 -1024841 -1563868 -2276820 -2492529 -2095023 -1506169 -1002963 -499819 -40385
37130d0385P9034l67356l53191L3382K53648K33899L22727M11869L3251n92331
$$ -40385 38649 -328707 -681898 -648516 -394868 -160969 161758 573627 606878 14547
37120A4547o13734P8363N35108K14794k19447j17235J26057L88p5009L92254Q21596
$$ 14547 -599187 -520824 14284 229078 9631 -107604 18453 18841 -56168 336086 1157682
37109A157682M08187m01976n01831J02072L51145q8922l65651K4887L95915O4994
$$ 1157682 1565869 1163893 662062 764134 1115279 1026357 660706 685593 1081508 1146502
37099A146502n29460n73521j01015K34002K08336J48303J61725p6423o44176r74610
$$ 1146502 617042 43521 -57494 176508 384844 533147 694872 618449 -25727 -1000337
37089a000337n05909M38529Q45178K47147n62391m67097M78881J094657O91755
$$ -1000337 -1506246 -1067717 -222539 24608 -537783 -1004880 -525999 568658 1260413
37080A260413n6717k43018k7869j22091m79604m44092j0105N0165n38195j011762
$$ 1260413 1203696 960678 932809 810718 331114 -112978 -123083 -72918 -611113 -1622875
37070a622875o79676O4337L46002N8136k1915O75935J642532J714475M21362j246016
$$ -1622875 -2302551 -2238214 -1892212 -1834076 -1855991 -1180056 462476 2176951 2598313 1352297
37060A352297j763849q21582L39349N49606O3376j84012j6522P6845o083J9303
$$ 1352297 -411552 -1233134 -893785 -344179 -280803 -464815 -481337 -404492 -410575 -391272
37050c91272N3299j84495l72945j6015N02612L77477k16891l85665j22328k71357
$$ -391272 -337973 -522468 -895413 -911428 -408816 -31339 -248230 -633895 -756223 -1027580
37040a027580p87688o14731L22954O75612r4471o90802j68795M80394K07335j81685
$$ -1027580 -1815268 -2429999 -2107045 -1431433 -1525904 -2216706 -2385501 -1905107 -1697772 -1879457
37030a879457L74875J015687L59227q75037q19906M90290J205662O29603k1829
$$ -1879457 -1504582 -488895 -129668 -1004705 -1824611 -1334321 -128659 500944 479115
37021D79115L4557Q5570l47483n65374j64153J19901k11604n46847l75040j09941
$$ 479115 513672 599242 251759 -313615 -477768 -357867 -569471 -1116318 -1491358 -1601299
37011a601299l3283L14386R62929J011857J43279n83033l65903R6265Q912r0375
$$ -1601299 -1634582 -1320196 -357267 654590 797869 214836 -151067 -54802 -45890 -136265
37001a36265M57836R15555L23326o65775p22061o51K62395q8655o8479M76138
$$ -136265 321571 1237126 1560452 894677 172616 171965 434360 345705 277226 753364
36991G53364N44299j38136m76260K18233J073868R64549K1708q23866j078661
$$ 753364 1297663 1159527 683267 901500 1975368 2939917 2961625 2137759 1059098
36982A059098q43894l19779K38531M46697J63378k85716n20878m81081k39729
$$ 1059098 215204 -104575 133956 580653 744031 458315 -62563 -543644 -783373
36973g83373J71165N60710N82215J77962k64037l80359k11822l579J07821J13807
$$ -783373 -612208 -51498 530717 708679 444642 64283 -147539 -151118 -43297 70510
36963G0510P5983Q6908Q6815j77140p07597r50140m01275N68091J020325N75303
$$ 70510 146493 233401 320216 143076 -564521 -1514661 -1915936 -1347845 -327520 247783
36953B47783k50461p78927p24566j06814P34662J056890L93040n81583o27315
$$ 247783 -2678 -781605 -1506171 -1612985 -878323 178567 571607 -9976 -637291
36944f37291M12991J304496J045203N3297o31333n97781p8752N63094Q32006K59762
$$ -637291 -224300 1080196 2125399 2178696 1547363 949582 870830 1433924 2265930 2525692
36934B525692q24503j303642o87819J02971Q3677l35350j61942M79257O31648
$$ 2525692 1701189 397547 -290272 -187301 -103624 -438974 -600916 -121659 509989
36925E09989J82404k0226K74456L04700k55059n78239r981P90439P81003P908
$$ 509989 692393 672167 946623 1251323 996264 418025 408044 1198483 1979486 1987394
36915A987394o15859o24415l60425k11661j63777j23372j56479k88865m16455
$$ 1987394 1371535 747120 386695 175034 11257 -112115 -268594 -557459 -973914
36906i73914m98885n70014n17579j53657L99816O88395M75003R2637R634K04325
$$ -973914 -1472799 -2042813 -2560392 -2714049 -2314233 -1625838 -1150835 -1058198 -1048564 -844239
36896h44239K85546J65233K01619N48435P69511M45385j22395l01981r5262j14164
$$ -844239 -558693 -393460 -191841 356594 1126105 1571490 1449095 1147114 1051852 937688
36886I37688n18459o29240L8340Q95680J002346L39147k81884m23207m33624n99780
$$ 937688 419229 -210011 -171671 724009 1726355 2065502 1783618 1360411 926787 327007
36876C27007o01656j59948L09552K15534k94140m68460K8197O80722Q29373M71860
$$ 327007 -274649 -434597 -125045 90489 -203651 -672111 -643914 36808 866181 1338041
36866A338041J11264n288j48545n60208r44770p82666p0639N58642N67134J45265
$$ 1338041 1449305 1444017 1295472 735264 -209506 -992172 -1062811 -504169 62965 208230
36856B08230o9212K23986O90773P94446L38172m03700r35866r32398n17865j50397
$$ 208230 139018 363004 1053777 1848223 2186395 1782695 846829 -85569 -603434 -753831
36846g53831j19351k34807j63862O5797J84722J97659L41204M92978J87641m83004
$$ -753831 -873182 -1107989 -1271851 -1206054 -1021332 -823673 -482469 10509 198150 -284854
36836b84854n60013N46152J850021J707529j6977j593639j599094o08791n6191
$$ -284854 -844867 -298715 1551306 3258835 3241858 1648219 49125 -559666 -615857
36827f15857j59476p5209K96744Q2151q14853j128143j32411R84552P37358m25591
$$ -615857 -775333 -850542 -553798 -471647 -1286500 -2414643 -2547054 -1562502 -825144 -1250735
36817a250735p95416O4161Q30967N10339k89030n53202k50287Q0430K76264L86725
$$ -1250735 -2046151 -1981990 -1151023 -640684 -929714 -1482916 -1733203 -1652773 -1376509 -989784
36807i89784K01549l14730n72502q4897O53674P46287J97571p9340L93079R37212
$$ -989784 -788235 -1102965 -1675467 -1760364 -1106690 -360403 -162832 -242172 150907 1088119
36797A088119O31130m20559j115196o60775M08029Q22241J76580n56223m47489
$$ 1088119 1719249 1298690 183494 -477281 -69252 752989 929569 373346 -74143
36788g4143K5676j47251o85941l42301Q89450J364476K43294r98171o48184O85226
$$ -74143 -48467 -195718 -881659 -1223960 -334510 1029966 1273260 275089 -373095 312131
36778C12131J042187J7768q75870n94777J93018M83812K96336J68547K18389K44985
$$ 312131 1354318 1372086 496216 -98561 94457 578269 874605 1043152 1261541 1506526
36768A506526J72129l632k81617m78014l88320j79229j64388k52000j72105j22091
$$ 1506526 1678655 1675023 1393406 915392 527072 347843 183455 -68545 -240650 -362741
36758c62741m61420q55205n98816J60121M71108N2837k33272K54569R75793J090785
$$ -362741 -824161 -1679366 -2278182 -2118061 -1646953 -1594116 -1827388 -1572819 -597026 493759
36748D93759N69329q6577n79720p74366m99534Q5381L95665J31459l24674n17054
$$ 493759 1063088 976511 396791 -377575 -877109 -791728 -396063 -264604 -589278 -1106332
36738a106332m33811j72691K94206P19458O10854L3703k81504j6081K61411J11195
$$ -1106332 -1540143 -1712834 -1418628 -699170 -88316 -54613 -336117 -352198 -90787 20408
36728B0408p7629O4962J53921j66627m51676k18801J92210K89842K91788M98885
$$ 20408 -57221 7741 161662 -4965 -456641 -675442 -483232 -193390 98398 597283
36718E97283M89472j26983p64041o69265j43241O7417L8639K09972K23812m32957
$$ 597283 1086755 959772 195731 -473534 -616775 -549358 -510719 -300747 -76935 -509892
36708e09892j044125m53939Q94102J284976K44255p91568o83872l9815J45312
$$ -509892 -1554017 -2007956 -1113854 171122 415377 -376191 -1060063 -1099878 -954566
36699i54566J9622K29494O98876Q87405O09793l0830q95964j484484j084489J46286
$$ -954566 -934944 -705450 -6574 880831 1490624 1459794 563830 -920654 -2005143 -1858857
36689a858857R62766N82358j94992j79198M80313O69700N4829n08567k63209N18728
$$ -1858857 -896091 -313733 -508725 -687923 -207610 462090 516919 8352 -254857 263871
36679B63871J001204O65418l39538j322828j500259o71199M98069J098239Q61410
$$ 263871 1265075 1930493 1590955 268127 -1232132 -1903331 -1405262 -307023 554387
36670E54387K40554k53823m87323n16662l07578J93689P96246J025667N16895
$$ 554387 794941 541118 53795 -462867 -770445 -576756 219490 1245157 1762052
36661A762052m57597j031521o09198L70416Q62682M11092m35316r14397q33338
$$ 1762052 1304455 272934 -336264 34152 896834 1307926 872610 -41787 -875125
36652h75125m39829L9968M58251O51202N83198M17233K64315M0232k97261n66925
$$ -875125 -1314954 -1274986 -816735 -165533 417665 834898 1099213 1139445 842184 275259
36642B75259n56011k50770J77539M70064M10330P9336j11819N9567K11392j33484
$$ 275259 -280752 -531522 -353983 116081 526411 605747 493928 553495 764887 631403
36632F31403p49186r42646n28755Q742L14975M77250N03126K12805j95845k17265
$$ 631403 -117783 -1060429 -1589184 -1580442 -1265467 -788217 -285091 -72286 -268131 -485396
36622d85396R5558R3959l38613m40926J93138Q45205P55160K57385R7269K16874
$$ -485396 -389838 -295879 -634492 -1075418 -882280 -37075 718085 975470 1072739 1289613
36612A289613P2348k64067k22160K35426N05096K43873k39742n06559m25552j09525
$$ 1289613 1361961 1097894 875734 1111160 1616256 1860129 1620387 1113828 688276 578751
36602E78751K06482K55419j4171l45012m66730l10312R6023N75775O62933J08485
$$ 578751 785233 1040652 1026481 681469 214739 -95573 450 576225 1239158 1347643
36592A347643m42079j11957P17818O76523m35352j060181k75093N82496j4589
$$ 1347643 905564 793607 1511425 2187948 1752596 692415 417322 999818 985229
36583I85229j246911j193033J71462J132012R94506O95271O89687K46332p68893
$$ 985229 -261682 -1454715 -1283253 -151241 843265 1538536 2228223 2474555 1705662
36574A705662j250305o76017n404M084o1603L37956N40357m6536o95511n38443
$$ 1705662 455357 -220660 -226064 -221980 -283583 54373 594730 548194 -147317 -685760
36564f85760k9599o0150m28429l90939m8901N3836J60132Q26092J574714J325375
$$ -685760 -715359 -775509 -1203938 -1594877 -1643778 -1589942 -1429810 -603718 970996 2296371
36554B296371N9796j084445j358569j016738m37762K83384P84776N54466j36947
$$ 2296371 2356167 1271722 -86847 -1103585 -1541347 -1257963 -473187 81279 -55668
36545e5668l54424J43200N34329K73058r3394L3501K59032p0408o62103o45232
$$ -55668 -410092 -266892 267437 540495 447101 480602 739634 669226 7123 -638109
36535f38109J06535P57606N89639k23338r30188r28397k21998N39317N98445j9742
$$ -638109 -531574 226032 815671 592333 -337855 -1266252 -1488250 -948933 -350488 -370230
36525c70230l77951J64319Q63301M39459j014643j869541j058270M70861J062978
$$ -370230 -748181 -583862 279439 718898 -295745 -2165286 -3223556 -2752695 -1689717
36516a689717M94794q8848o581K62994K22681J37871L11082M17027J06071l11076
$$ -1689717 -1194923 -1283771 -1290352 -1027358 -804677 -666806 -355724 61303 167374 -143702
36506a43702l15731R3211N36738P16456M32438l30826j014402q50346l4367K74639
$$ -143702 -459433 -366222 170516 886972 1319410 988584 -25818 -876164 -910531 -635892
36496f35892k95333n53595L71342J382521R78769l48587r28503n54166l99873
$$ -635892 -931225 -1484820 -1113478 269043 1247812 899225 -29278 -583444 -983317
36487i83317n57946J25861J481633J581232k14067j809881j314794K60211P93460
$$ -983317 -1541263 -1415402 66231 1647463 1433396 -376485 -1691279 -1431068 -637608
36478f37608J53188k62813m9119O1372k0380L25864R21259Q63411J19783l58389
$$ -637608 -484420 -747233 -796352 -734980 -755360 -429496 491763 1355174 1474957 1116568
36468A116568j75905J03846J50501K56841M29191K34140k63262m36733j50104
$$ 1116568 940663 1044509 1195010 1451851 1881042 2115182 1851920 1415187 1265083
36459A265083O5296j3407q8384j54270n09653q83480o24755J07208M48054K72035
$$ 1265083 1330379 1316972 1228588 1074318 564665 -318815 -943570 -836362 -388308 -116273
36449a16273L26445O98326M99235m61040j065719o69936j87031m66467p82835
$$ -116273 210172 908498 1407733 946693 -119026 -788962 -975993 -1442460 -2225295
36440b225295j33222R13077J040070K69411j58817K61871P15142M40899k95910
$$ -2225295 -2358517 -1445440 -405370 -135959 -294776 -32905 682237 1123136 827226
36431H27226p73262o51362j24533L04543K36012j14548p8715M48024O56696L8946
$$ 827226 53964 -597398 -721931 -417388 -181376 -295924 -374639 73385 730081 769027
36421G69027o48675m52881K69588M49609L9621o2070L14190L35656k39462m82501
$$ 769027 120352 -332529 -62941 386668 426289 364219 678409 1014065 774603 292102
36411B92102J73122R09789P58548R025m26047m20849n27871q47017q84841m36308
$$ 292102 465224 1375013 2133561 2142586 1716539 1295690 767819 -79198 -964039 -1400347
36401a400347J08109L65272L38820J67974m7614j23058J08979M81302O02047L68454
$$ -1400347 -1292238 -926966 -588146 -420172 -467786 -590844 -481865 -563 601484 969938
36391I69938Q5882j6370j01843l89147p08070o36962m9972O41054Q64431M78962
$$ 969938 1055820 1039450 937607 548460 -159610 -796572 -846544 -205490 658941 1137903
36381A137903p5673k64688l8314K07990K26849K01051K86031J71843n01404j401528
$$ 1137903 1062230 797542 759228 967218 1194067 1395118 1681149 1852992 1351588 -49940
36371d9940j669160r57753R0929O39681N68925K84960j6193l55829m49749J05659
$$ -49940 -1719100 -2676853 -2585924 -1946243 -1377318 -1092358 -1108551 -1464380 -1914129 -1808470
36361a808470J005204J262386M48965n82715p17825J1117N95670M38315o1027
$$ -1808470 -803266 459120 908085 325370 -392455 -381338 214332 652647 591620
36352E91620l04668k68066k55481l40837l64890k42941l5336J42169J63354J7984
$$ 591620 286952 18886 -236595 -577432 -942322 -1185263 -1220599 -1078430 -915076 -897092
36342h97092o7083J15225L51977K31671j48969j70759L70375Q05211N16266q6073
$$ -897092 -964175 -848950 -496973 -265302 -414271 -585030 -214655 590556 1106822 1020749
$$ [...]
##END NTUPLES=NMR SPECTRUM
##END=
