##TITLE=31Pdec_LR-685A-M1
 CDCl3, 24 sc
 29.7.2019
##JCAMPDX= 6.0         $$ Bruker NMR JCAMP-DX V2.0
##DATA TYPE= NMR SPECTRUM
##DATA CLASS= NTUPLES
##ORIGIN= UXNMR, Bruker Analytische Messtechnik GmbH
##OWNER= root
$$ XWIN-NMR		Version 3.5
$$ Mon Jul 29 16:42:16 2019 Russian Standard Time (UT+4h)  she@DPX200
##.OBSERVE FREQUENCY= 81.013821
##.OBSERVE NUCLEUS= ^31P
##.ACQUISITION MODE= SIMULTANEOUS
##.ACQUISITION SCHEME= undefined
##.AVERAGES= 24
##.DIGITISER RES= 17
##SPECTROMETER/DATA SYSTEM= spect
##.PULSE SEQUENCE= zgpg30
##.SOLVENT NAME= CDCl3
##.SHIFT REFERENCE= (INTERNAL, CDCl3, 0, 182.463)
##AUDIT TRAIL= $$ (NUMBER, WHEN, WHO, WHERE, WHAT)
$$ ##TITLE= Audit trail, XWIN-NMR		Version 3.5
$$ ##JCAMPDX= 5.01
$$ ##ORIGIN= Bruker BioSpin GmbH
$$ ##OWNER= she
$$ F:/spectra/data/she/nmr/P31/1/pdata/1/auditp.txt
$$ ##AUDIT TRAIL=  $$ (NUMBER, WHEN, WHO, WHERE, WHAT)
(   1,<2019-07-29 16:41:15.06 +0400>,<she>,<DPX200>,
      <created by zg, POWCHK disabled, PULCHK disabled
       configuration hash MD5:
       00 E9 B6 7A A2 85 ED C7 34 08 36 98 17 FE 4E 26
       data hash MD5: 32K
       F8 DF EA 4A 3F E5 71 69 76 89 DC 2C 02 8C CC 20>)
(   2,<2019-07-29 16:41:17.37 +0400>,<she>,<DPX200>,
      <Start of raw data processing
       efp BC_mod = 2 LB = 1 FT_mod = 6 PKNL = 1 PHC0 = -390.788 PHC1 = 111.4 SI = 64K 
       data hash MD5: 64K
       FE D3 3C CA 88 BE B5 A0 36 78 5A 17 59 1C C1 7E>)
(   3,<2019-07-29 16:41:31.71 +0400>,<she>,<DPX200>,
      <pk PHC0 = -1.241495 PHC1 = -10.2 
       data hash MD5: 64K
       49 12 70 68 D5 85 BD 70 F4 5B 76 FF D6 C0 48 FE>)
(   4,<2019-07-29 16:41:34.93 +0400>,<she>,<DPX200>,
      <abs ABSG = 5 
       data hash MD5: 64K
       4F FC BF D8 3C 4B 36 46 65 BA B5 B4 BC 74 33 F1>)
$$ ##END=
$$ 
$$ hash MD5
$$ 27 8D 7C C7 A7 6E DF F1 68 95 69 D1 7B F7 06 43
##$RELAX= 
##$RELAX= 
##$RELAX= 
##$RELAX= 
##$RELAX= 
##$RELAX= 
##$RELAX= 
##$RELAX= 
$$ Bruker specific parameters
$$ --------------------------
##$DU= <F:/spectra>
##$EXPNO= 1
##$NAME= <P31>
##$PROCNO= 1
##$TYPE= <nmr>
##$USER= <she>
##$AMP= (0..31)
100 100 100 100 100 100 100 100 100 100 100 100 100 100 100 100 100 100 
100 100 100 100 100 100 100 100 100 100 100 100 100 100 
##$AQSEQ= 0
##$AQ_mod= 1
##$AUNM= <au_zg>
##$AUTOPOS= <>
##$BF1= 81.014009
##$BF2= 200.13
##$BF3= 200.13
##$BF4= 200.13
##$BF5= 200.13
##$BF6= 200.13
##$BF7= 200.13
##$BF8= 200.13
##$BYTORDA= 1
##$CFDGTYP= 0
##$CFRGTYP= 5
##$CHEMSTR= <none>
##$CNST= (0..31)
1 1 145 1 1 1 1 1 1 1 1 1 1 1 1 1 1 1 1 1 1 1 1 1 1 1 1 1 1 1 1 1 
##$CPDPRG= <waltz16>
##$CPDPRG1= <>
##$CPDPRG2= <waltz16>
##$CPDPRG3= <>
##$CPDPRG4= <mlev>
##$CPDPRG5= <mlev>
##$CPDPRG6= <mlev>
##$CPDPRG7= <mlev>
##$CPDPRG8= <mlev>
##$CPDPRGB= <>
##$CPDPRGT= <>
##$D= (0..31)
0 1 0 0 0 0 0 0 0 0 0 0.03 2e-05 3e-06 0 0 0 0 0 0 0 0 0 0 0 0 0 0 0 0 
0 0 
##$DATE= 1564404074
##$DBL= (0..7)
120 120 120 11 120 120 24 19 
##$DBP= (0..7)
150 150 150 150 150 150 150 150 
##$DBP07= 0
##$DBPNAM0= <>
##$DBPNAM1= <>
##$DBPNAM2= <>
$$ [...]
##$SUBNAM3= <"">
##$SUBNAM4= <"">
##$SUBNAM5= <"">
##$SUBNAM6= <"">
##$SUBNAM7= <"">
##$SUBNAM8= <"">
##$SUBNAM9= <"">
##$SW= 369.568048894756
##$SWIBOX= (0..15)
0 1 3 0 0 0 0 0 0 0 0 0 0 0 0 0 
##$SW_h= 29940.119760479
##$TD= 32768
##$TD0= 1
##$TE= 0
##$TE2= 300
##$TE3= 300
##$TEG= 300
##$TL= (0..7)
0 120 53 12 22 120 120 120 
##$TP= (0..7)
150 150 150 150 150 150 150 150 
##$TP07= 0
##$TPNAME0= <>
##$TPNAME1= <>
##$TPNAME2= <>
##$TPNAME3= <>
##$TPNAME4= <>
##$TPNAME5= <>
##$TPNAME6= <>
##$TPNAME7= <>
##$TPOAL= (0..7)
0.5 0.5 0.5 0.5 0.5 0.5 0.5 0.5 
##$TPOFFS= (0..7)
0 0 0 0 0 0 0 0 
##$TUNHIN= 0
##$TUNHOUT= 0
##$TUNXOUT= 0
##$USERA1= <user>
##$USERA2= <user>
##$USERA3= <user>
##$USERA4= <user>
##$USERA5= <user>
##$V9= 5
##$VALIST= <valist>
##$VCLIST= <CCCCCCCCCCCCCCC>
##$VD= 0
##$VDLIST= <DDDDDDDDDDDDDDD>
##$VPLIST= <PPPPPPPPPPPPPPP>
##$VTLIST= <TTTTTTTTTTTTTTT>
##$WBST= 1024
##$WBSW= 4
##$XGAIN= (0..3)
0 0 0 0 
##$XL= 0
##$YL= 0
##$YMAX_a= 25700
##$YMIN_a= -29502
##$ZGOPTNS= <>
##$ZL1= 120
##$ZL2= 120
##$ZL3= 120
##$ZL4= 120
##$ABSF1= 182.463
##$ABSF2= -187.1042
##$ABSG= 5
##$ABSL= 3
##$ALPHA= 0
##$AQORDER= 0
##$ASSFAC= 0
##$ASSFACI= 0
##$ASSFACX= 0
##$ASSWID= 0
##$AUNMP= <proc_1d>
##$AZFE= 0.1
##$AZFW= 0.5
##$BCFW= 0
##$BC_mod= 2
##$BYTORDP= 0
##$COROFFS= 0
##$CY= -3
##$DATMOD= 1
##$DC= 0
##$DFILT= <>
##$DTYPP= 0
##$F1P= 0
##$F2P= 0
##$FCOR= 1
##$FTSIZE= 65536
##$FT_mod= 6
##$GAMMA= 0
##$GB= 0
##$INTBC= 1
##$INTSCL= 5.30512e-09
##$ISEN= 30
##$LB= 1
##$LEV0= 0
##$LPBIN= 0
##$MAXI= 10000
##$MC2= 0
##$MEAN= 0
##$ME_mod= 0
##$MI= 50
##$NCOEF= 0
##$NC_proc= -6
##$NLEV= 6
##$NOISF1= 182.463
##$NOISF2= 159.3651
##$NSP= 0
##$NTH_PI= 0
##$NZP= 0
##$OFFSET= 182.463
##$PC= 4
##$PHC0= -392.0295
##$PHC1= 101.2
##$PH_mod= 1
##$PKNL= yes
##$PPARMOD= 0
##$PSCAL= 0
##$PSIGN= 0
##$REVERSE= no
##$SF= 81.0140089999434
##$SI= 65536
##$SIGF1= 159.3651
##$SIGF2= -187.1042
##$SINO= 113.3802
##$SIOLD= 16384
##$SREGLST= <1H.CDCl3>
##$SSB= 0
##$STSI= 65536
##$STSR= 0
##$SW_p= 29940.119760479
##$SYMM= 0
##$S_DEV= 0
##$TDeff= 32768
##$TDoff= 0
##$TI= <>
##$TILT= no
##$TM1= 0
##$TM2= 0
##$TOPLEV= 0
##$USERP1= <user>
##$USERP2= <user>
##$USERP3= <user>
##$USERP4= <user>
##$USERP5= <user>
##$WDW= 1
##$XDIM= 65536
##$YMAX_p= 387247931
##$YMIN_p= -9394869
$$ End of Bruker specific parameters
$$ ---------------------------------
##NTUPLES= NMR SPECTRUM
##VAR_NAME=  FREQUENCY,     SPECTRUM/REAL,   SPECTRUM/IMAG
##SYMBOL=    X,             R,               I
##VAR_TYPE=  INDEPENDENT,   DEPENDENT,       DEPENDENT
##VAR_FORM=  AFFN,          ASDF,            ASDF
##VAR_DIM=   65536,         65536,           65536
##UNITS=     HZ,            ARBITRARY UNITS, ARBITRARY UNITS
##FACTOR=    0.456856943014862, 1,           1
##FIRST=     14782.0589164792, 0,            0
##LAST=      -15158.0608439998, 0,           0
##MIN=       -15158.0608439998, -9394869,    0
##MAX=       14782.0589164792, 387247931,    0
$$ Real data points
##PAGE= N=1
##DATA TABLE= (X++(R..R)), XYDATA
$$ [...]
45769A743952j489165j048392N2091L59408K50843R12567J824432J346425m01197
45760C550964j359984o20331K26531l46009j498142j460836r6553J244646J641374
45751A281660J210387L89920l26487m20778n4589k28017j317094k088058j285915
45742b838971L86867J189476P75011K34824L3847m01989j024274q65630J71262
45733b339577Q17533L46081m34657p29005q53640j013891m98247P91063J392829
45724b521511K98399j183401j133673K24700J111393R49482Q32663J427902J983648
45715A989602J577769K15002j390081k269982j694856j22878P90762K08181m84236
45706a180717L39343J826179J769587O7348j128262p97897l14153p62746j206080
$$ plain form
45769 1743952 254787 -793605 -741514 -382106 -131263 781304 2605736 3952161 3550964
45760 3550964 2190980 1570649 1797180 1451171 -46971 -1507807 -1604360 -359714 1281660
45751 1281660 2492047 2881967 2555480 2134702 2080113 1852096 535002 -1553056 -2838971
45742 -2838971 -2452104 -1262628 -487617 -252793 -218946 -620935 -1645209 -2510839 -2339577
45733 -2339577 -1522044 -1175963 -1610620 -2339625 -3193265 -4207156 -4705403 -3914340 -2521511
45724 -2521511 -2223112 -3406513 -4540186 -4315486 -3204093 -2254611 -1421948 5954 1989602
45715 1989602 3567371 3782373 2392292 122310 -1572546 -1695424 -904662 -696481 -1180717
45706 -1180717 -841374 984805 2754392 2821740 1693478 895581 581428 -181318 -1387398
45697a387398o22366L28742P02929Q06717J035834O65662p14217j792807j176972
45688b153876M31890J207305O93670l5609j85746O7587L22367L19638j19374p35715
45678a87863q48162l05804K58507N85324J125057J663346J093624n18503j333973
45669A531553n25895J24489q25662j794373p96852R17723Q24625n02868m19084
45660a466344J005801R87720r83238j933677k48937J644467J119117q51833j651857
45651b378781o90950P25281J569277J538279O89389j36274J22404R09321M90731
45642B838677j038768j453839j30895O08241n18076j328587p3114J115081j73400
45633a54680k032538j170486J332119J625756m21327j034249J030436K476850
$$ plain form
45697 -1387398 -2009764 -1681022 -978093 -171376 864458 1530120 815903 -976904 -2153876
45688 -2153876 -1721986 -514681 178989 143380 -42366 25221 347588 667226 547852 -187863
45678 -187863 -1036025 -1341829 -1083322 -497998 627059 2290405 3384029 2865526 1531553
45669 1531553 1005658 1130147 304485 -1489888 -2286740 -1369017 -544392 -1047260 -1466344
45660 -1466344 -460543 527177 -456061 -2389738 -2638675 -994208 124909 -726924 -2378781
45651 -2378781 -3069731 -2344450 -775173 763106 1452495 1316221 1438625 2347946 2838677
45642 2838677 1799909 346070 215175 823416 305340 -1023247 -1096361 18720 -154680
45633 -154680 -2187218 -3357704 -2025585 -399829 -821156 -1855405 -824969 1651881
45625A651881J057123r89616j015709K2391O4457l71748J90133R57344K40660
45616A806916j190027j010405Q70044J963805P83511j244912j940967r95176K28369
45607g28842O14287K96762K0978L4595r8107n97981r03822n06053J25252K92943
45597a449988L24895Q86654J380008O16026r57307j546800q24677m40525j092546
45588c104260j241175J58066J745563K049650J673002J441405M53889j711388
45580A464752k794222q60272J885960J731646q47214j807366J93120J982644J138863
45571B087911o12074r00859m16181q05935j388694o35554P58244R36303l9693
45562a016532n73571k72719q0178j68922J63827P38291O11289q6191k27952L48830
$$ plain form
45625 1651881 2709004 1719388 703679 726070 790527 418779 608912 1566256 1806916
45616 1806916 616889 -393516 476528 2440333 3223844 1978932 37965 -957211 -728842
45607 -728842 -114555 182207 203185 237780 139673 -458308 -1362130 -1868183 -1742931 -1449988
45597 -1449988 -1125093 -238439 1141569 1757595 800288 -746512 -1571189 -2011714 -3104260
45588 -3104260 -4345435 -4187369 -2441806 -392156 1280846 2722251 3176140 1464752
45580 1464752 -1329470 -2189742 -303782 1427864 580650 -1226716 -1033596 949048 2087911
45571 2087911 1475837 574978 158797 -647138 -2035832 -2671386 -1913142 -976839 -1016532
45562 -1016532 -1590103 -1862822 -1943000 -2111922 -1948095 -1209804 -598515 -684706 -912658 -563828
45552e63828O57797M35530N19022J112267J298942O67316q6284n72894j182840
45543B285028j658752q92609J008564K068516J041885o93845j214137p98156r14232
45534B32262j370695n83206J465575K568655J210772j298595k485298j616176
45526a876706q1275O21262M43150L70882R77404J632800J204522m45157j936978
45517I09904j763447j13684J251446J118988K62140K70141J267221J586710O140
45508D795559k300638k871883j016109J153615J296950l05538j459328j068518
45500a775890m3921O43143J071428J120816J2257j804294k083166J49746K393502
45491c16379J782111n81540j067623J092223K818271J961925J06990n40937l51871
$$ plain form
45552 -563828 93969 529499 1048521 2160788 3459730 4127046 4040762 3467868 2285028
45543 2285028 626276 -266333 742231 2810747 3852632 3158787 1944650 1146494 232262
45534 232262 -1138433 -1721639 -256064 2312591 3523363 2224768 -260530 -1876706
45526 -1876706 -1957981 -1336719 -893569 -522687 454717 2087517 3292039 2846882 909904
45517 909904 -853543 -967227 284219 1403207 1665347 1935488 3202709 4789419 4795559
45508 4795559 2494921 -376962 -1393071 -239456 1057494 751956 -707372 -1775890
45500 -1775890 -1819811 -1176668 -105240 1015576 1027833 -776461 -2859627 -2709881 -316379
45491 -316379 1465732 884192 -183431 908792 3727063 5688988 5795978 5255041 4903170
45482D903170n79831p39024P6708R00743L10928j002964j400360j068149j236118
45473A65103j432244k83162J311379Q49191j558810k599531m64666K401898K812168
45464A201326J034216l61198l42339q5904o10189j536862j988697j535502m16257
45455d641406N11061N03160M0949L23399J218019J099584m29110j318686l5833
45446b728863J824631J888019O43480K40670N62922m47900k651074l149611p91554
45437d609280J647634J428546k86083o12020O65822J295640L13978p99252p09883
45428a664898k325J55540k55988m36023m3711M77826N22990p2383q86798j271614
45418c477384r68935l11017K76844P15347J041456J099611P86309L19940l8233
$$ plain form
45482 4903170 4323339 3584315 3661023 4561766 4872694 3869730 2469370 1401221 165103
45473 165103 -1267141 -1550303 -238924 610267 -948543 -3548074 -4012740 -1610842 1201326
45464 1201326 2235542 1874344 1532005 1446101 835912 -700950 -2689647 -4225149 -4641406
45455 -4641406 -4130345 -3627185 -3586236 -3262837 -2044818 -945234 -1374344 -2693030 -2728863
45446 -2728863 -904232 983787 1627267 1867937 2430859 1982959 -668115 -3817726 -4609280
45437 -4609280 -2961646 -1533100 -1819183 -2431203 -1765381 -469741 -155763 -955015 -1664898
45428 -1664898 -1667223 -1511683 -1767671 -2203694 -2247405 -1769579 -1246589 -1318972 -2205770 -3477384
45418 -3477384 -4446319 -4757336 -4480492 -3765145 -2723689 -1624078 -837769 -517829 -556062
45409e56062k53610k67612J20262P94634J173019Q98594K88116k42272o63991
45400A291078q42604k58795J069455J974037J343313l80548j689753j700194o80993
45391A24996O23526J370026Q46446o36609j539194q94864J93755J87214l89841
45382a14545O1718J124652P11040j220012j977369k71311J520679J027625m22651
45373D39826k48489R94859P31074j065395j752830m63244N83429j7294n93683
45364a391747M76704J832126J339748m83688j450408j008182m37933l77247j91524
45355a692151L73259P20162O70083O95693P79984M33357o0906J03936N41791j89613
45345B375595k169508l368976k251546J29266J661216J704816R78388J2371q21706
$$ plain form
45409 -556062 -809672 -1077284 -957022 -162388 1010631 1909225 2197341 1955069 1291078
45400 1291078 448474 189679 1259134 3233171 4576484 4195936 2506183 805989 124996
45391 124996 748522 2118548 2964994 2328385 789191 -105673 88082 275296 -114545
45382 -114545 -52827 1071825 1782865 562853 -1414516 -1685827 -165148 862477 439826
45373 439826 191337 1186196 1917270 851875 -900955 -1364199 -780770 -798064 -1391747
45364 -1391747 -915043 917083 2256831 1773143 322735 -685447 -1123380 -1500627 -1692151
45355 -1692151 -1318892 -598730 71353 767046 1547030 1980387 1919481 2023417 2565208 2375595
45345 2375595 206087 -3162889 -5414435 -5285169 -3623953 -1919137 -940749 -928378 -1750084
45336a750084o19010R13341K062206Q46739j787305k542848j74486K549751K441262
45327A939566q6988k131669k280819j561972r74417k11643R06995J582834J384097
45318a434016J061371J134201Q56722l30068j357725r40124K72084N39574k75653
45309d73634n88921K21983P97841J25810p55144n50749R6161k17881j142008j066941
45299c553483J63942R36033N04821J51420R15179J713038J004772o68907j308413
45290a41598k30091J128248J209633R1650r84801j064566j89993P80512Q52811
45281A451805j80596j375460j565592o85435K43047M25146R1256p9069J87800
45272a487098O58191R54632Q58512N10138L09834L55079J71011n50983j228367
$$ plain form
45336 -1750084 -2369094 -1455753 606453 1453192 -334113 -2876961 -3051447 -501696 1939566
45327 1939566 1852578 -279091 -2559910 -4121882 -5096299 -5307942 -4400947 -2818113 -1434016
45318 -1434016 -372645 761556 1618278 1288210 -69515 -1009639 -737555 -197981 -473634
45309 -473634 -1062555 -840572 -42731 83079 -672065 -1222814 -1126653 -1344534 -2486542 -3553483
45299 -3553483 -3389541 -2453508 -1948687 -1797267 -882088 830950 1835722 1166815 -141598
45290 -141598 -371689 756559 1966192 2057842 1073041 8475 -181518 598994 1451805
45281 1451805 1271209 -104251 -1669843 -2355278 -2112231 -1687085 -1595829 -1674898 -1487098
45272 -1487098 -828907 125725 984237 1494375 1804209 2159288 2330299 1779316 550949
45263E50949j117087n62144n68762j133828j107119J9896J286547J673258J270823
45254C12533N00185o38838j716146j508099K67903J850787J539323J35404l31486
45245D11566L07156M74192k36203m62625K84159N52906n55241j640397j039459
45236a903946P30224J889423J708826O20758r74557k519690k712716q61313J474073
45227b548918J857076O6088j620790j430970m2813Q63273P42386J93240k12152
45218b133580k80987M7976N82771Q28551N71538K34485K45881L52495n23p80079
45208c31472j249385p43625N82953J749307J743748N44567p45663j116193q42334
45199d08097r19561j435895j384114l10251Q07490R30037M06042J99663L02839
$$ plain form
45263 550949 -566138 -1128282 -1697044 -2830872 -3937991 -3918095 -2631548 -958290 312533
45254 312533 812718 173880 -1542266 -3050365 -2782462 -931675 607648 743052 411566
45245 411566 718722 1192914 956711 494086 778245 1331151 775910 -864487 -1903946
45236 -1903946 -1173722 715701 2424527 3045285 2070728 -448962 -3161678 -4022991 -2548918
45227 -2548918 -691842 -625754 -2246544 -3677514 -3720327 -2857054 -2114668 -1921428 -2133580
45218 -2133580 -2414567 -2366591 -1783820 -955269 -383731 -149246 96635 449130 448607 -331472
45208 -331472 -1580857 -2324482 -1741529 7778 1751526 2296093 1550430 434237 -408097
45199 -408097 -1327658 -2763553 -4147667 -4457918 -3650428 -2720391 -2314349 -2114686 -1811847
45190a811847L1621m32592j37906Q57609J144406Q4782q19600J48374K207758
45181A272605K709091N88606k077675k618308r52002P19510Q56668L3591n04619
45172B7467n06027m01605k29025K65713Q26190P69400j44769j351920j925983
45163b670559j221880M97512J782412J050364j375467k956770j739723J010914
45155e623197K295851J227661k10458l10773L45578O72869R52321J563352J427338
45146B340542l76414k398968k304240j97847J479207J331473L68909k35178p53072
45137g45588j514302j668914n59282Q91543J421911J209801J254787J676456J764648
45128C731060J202976J97805j122058k405087k701877j562519q3094M02397K86017
$$ plain form
45190 -1811847 -1780226 -2212818 -2350724 -1493115 -348709 -263927 -1083527 -935153 1272605
45181 1272605 3981696 4570302 2492627 -125681 -1077683 -358173 498495 532086 27467
45172 27467 -478560 -880165 -1109190 -843477 -17287 752113 607344 -744576 -2670559
45163 -2670559 -3892439 -3394927 -1612515 -562151 -1937618 -4894388 -6634111 -5623197
45155 -5623197 -3327346 -2099685 -2310143 -2620916 -2275338 -1602469 -650148 913204 2340542
45146 2340542 1964128 -434840 -2739080 -2936927 -1457720 -126247 242662 7484 -745588
45137 -745588 -2259890 -3928804 -4488086 -3596543 -2174632 -964831 289956 1966412 3731060
45128 3731060 4934036 5131841 4009783 1604696 -1097181 -2659700 -2742794 -2340397 -2054380
45119b054380Q59631J782562J253949r58134k547675j666297O18578K027663J969914
45110A285811J350672N38441p03601j755340j458534j4917R45009N35896l84645
45101C38792p78724p81010q86575q46921k18424O83233J163364J024024M83685
45092A81444k68659q82123p67128J36446R86248J041778N39667M091n73071j048402
45082f49709n15484J289865K619353J479492j374751l007773k099464l77595K75358
45073b360708K20849M82387N94078k06156r22411n9316J689179K117014P36077
45064B290993o53663q05826n03578o31928n94527L20173J404135J569429R32514
45055C327722K62088k80837p55356o51968K33789Q36350J41775j018747r99023
$$ plain form
45119 -2054380 -1194749 587813 1841762 883628 -1664047 -3330344 -2711766 -684103 1285811
45110 1285811 2636483 3174924 2471323 715983 -742551 -757468 187541 723437 338792
45101 338792 -439932 -1220942 -2107517 -2954438 -3172862 -2489629 -1326265 -302241 181444
45092 181444 -87215 -969338 -1736466 -1600020 -613772 428006 967673 971764 398693 -649709
45082 -649709 -1165193 124672 2744025 4223517 2848766 -159007 -2258471 -2636066 -2360708
45073 -2360708 -2139859 -1657472 -1063394 -1269550 -2191961 -2251277 -562098 1554916 2290993
45064 2290993 1637330 831504 327926 -304002 -898529 -578356 825779 2395208 3327722
45055 3327722 3589810 3308973 2553617 1901649 2135438 2971788 3113563 2094816 1095793
45046A095793J46704P91217K84784l68125n76522j006836j703330j286233P07665
45037a914883K301776J617237k31872p51993J86118M60955o71964j508292r65422
45028a478340l82715r72870j400151J54289K660540L187208R19647j743867k420905
45019a477164j430720n65510m76704l54137M57679J561642K106956J663145N31677
45010B016864m49186n13425L09682J147906J151042L03030p14806j234821j041406
45001I74880l92001J53163J22425m14648r01528q98888m51903J59753O90857Q61996
44991i5894M51619l38051r75326j191248j018057k25301J383166K769501J986821
44982B747230j192760l907550l119894L93828K727643J744345m78171q74163N73517
$$ plain form
45046 1095793 1242497 2033714 2318498 1950373 1373851 367015 -1336315 -2622548 -1914883
45037 -1914883 386893 2004130 1772258 1020265 1206383 1667338 995374 -512918 -1478340
45028 -1478340 -1861055 -2833925 -4234076 -4079787 -1419247 1767961 2687608 943741 -1477164
45019 -1477164 -2907884 -3473394 -3950098 -4304235 -3846556 -2284914 -177958 1485187 2016864
45010 2016864 1567678 1054253 1363935 2511841 3662883 3965913 3251107 2016286 974880
45001 974880 582879 736042 858467 443819 -457709 -1356597 -1808500 -1648747 -957890 -95894
44991 -95894 355725 17674 -957652 -2148900 -3166957 -3392258 -2009092 760409 2747230
44982 2747230 1554470 -2353080 -5472974 -5079146 -2351503 -607158 -1085329 -1959492 -1385975
44973a385975J481214P05722m82409o56981l1430L85434K33531k21610p59432
44964g31936j167913j015851j23050R42728J359698R79779L79207L1170j72280
44955D81552m77598p01941m24148L29764R05355P10581l0408m61100p5804O86000
44945I42253R53705L78743n83441j211633j138702n24230J58228N08376N30987
44936A4286N49175O76560N58095p8410p83066p90074r3900M35869K60969n0268
44926F99236K46300P83192M96966p22189j598795j021719N44408J678519J657539
44917B763457R26300J32941n98151j299688j677826j430810p81015k62144l5375
44908b262311K31463P36449J089498P37910k11473q69076m77411O28004J287551
$$ plain form
44973 -1385975 95239 800961 318552 -338429 -369859 15575 249106 27496 -731936
44964 -731936 -1899849 -2915700 -3038750 -2096022 -736324 243455 622662 653832 481552
44955 481552 3954 -697987 -1122135 -792371 112984 823565 793157 332057 256253 942253
44945 942253 1895958 2274701 1691260 479627 -659075 -1183305 -1025077 -516701 14286
44936 14286 563461 1240021 1798116 1719706 936640 146566 52666 488535 749504 699236
44926 699236 945536 1728728 2225694 1503505 -95290 -1117009 -572601 1105918 2763457
44917 2763457 3689757 3822698 3224547 1924859 247033 -1183777 -1964792 -2226936 -2262311
44908 -2262311 -2030848 -1294399 -204901 533009 321536 -547540 -1024951 -396947 890604
44899H90604Q73263L7899k34699k2775k60273j174954j760585j200555r5429M54627
44889b492877M98130R72666J915826K059858O58757j133087j520319l44957P15789
44880A329786K68478j147271j866403j154410Q1413O29237M81678N64694J187343
44871C74545J458823N28392j132898k229499k115250j186813n1962R36109J389600
44862b028953J049023M70619O60950J547388J655520P8090j907101k225920p03242
44853a403626P23116N11981p66558j511936j007093K65842J540996K273215K060234
44844B686171Q26808q03910j764867j419337j25261J096260J431119Q85024R4405
44835B906412m64187r26808j515019j787468j000561O58057J820084J405568l2790
$$ plain form
44899 890604 1763867 1801766 1567067 1544292 1284019 109065 -1651520 -2852075 -2947504 -2492877
44889 -2492877 -1994747 -1022081 893745 2953603 3612360 2479273 958954 613997 1329786
44880 1329786 1598264 450993 -1415410 -2569820 -2488407 -1859170 -1377492 -812798 374545
44871 374545 1833368 2361760 1228862 -1000637 -3115887 -4302700 -4354662 -3418553 -2028953
44862 -2028953 -979930 -509311 151639 1699027 3354547 3432637 1525536 -700384 -1403626
44853 -1403626 -680510 -168529 -935087 -2447023 -3454116 -3188274 -1647278 625937 2686171
44844 2686171 3512979 2709069 944202 -475135 -600396 495864 1926983 2812007 2906412
44835 2906412 2442225 1515417 398 -1787070 -2787631 -2129574 -309490 1096078 1063288
44826A063288r94389q29179k19946M0912L894O9719J97827Q8298k19086m22273
44816a220935m44691m24900l52451j23000J21282J14039q2546j15592J55795N25848
44806a847151P75884P71788L21197n29877j088064o14848N05419J003892M83825
44797b17935L7560M74438R03822J92484r46927q88327K17212N15266n31157j081242
44787a324806J93228J778157J381125p23081k125560j568180j24828P76245Q78956
44778h58744M13154n64694j489082j211691M46497J924131J676841J59321q46951
44769c51218m89281M68448R72251P73262J93970l77655n46947q0339O94771J051631
44759B308893O36177k19552j027378j570817j670929j043174K09532J283244J357618
$$ plain form
44826 1063288 68899 -760280 -980226 -939314 -935420 -865701 -667874 -579576 -798662 -1220935
44816 -1220935 -1665626 -2090526 -2442977 -2565977 -2444695 -2330656 -2413202 -2528794 -2372999 -1847151
44806 -1847151 -1071267 -299479 21718 -508159 -1596223 -2211071 -1705652 -701760 -217935
44797 -217935 -180375 294063 1197885 1390369 443442 -444885 -227673 287593 -243564 -1324806
44787 -1324806 -1131578 646579 2027704 1304623 -820937 -2389117 -2513945 -1737700 -858744
44778 -858744 -445590 -1010284 -2499366 -3711057 -3264560 -1340429 336412 495733 -351218
44769 -351218 -840499 -372051 600200 1373462 1567432 1189777 642830 562491 1257262 2308893
44759 2308893 2945070 2725518 1698140 127323 -1543606 -2586780 -2377248 -1094004 263614
44750B63614N55188j49205m2049N48012O95361k3528j023383j353996p85895n6254
44740a372135P7659k41390l48547j12626K5812J7147L16522P68704M35081p32483
44730a166256j104952M38510K330951K118122J24669q27965L19761J234572p2240
44721C395172k091175k282468r32549j09057K2721R71204K501337K489275M97228
44712D461688j307254j532067j228045j196669l77401J508105K329871P79533
44704C437761r83580n20268Q98330M85195j299779j613894j11271O74553j84551
44695G82496p32776K0365L68459p63693j809189j431881o71142m90428J31553
44686d596236J578874J726548n89414k523444r48749K422064L284974J111774
$$ plain form
44750 263614 818802 669597 627548 1175560 1870921 1847393 824010 -529986 -1315881 -1372135
44740 -1372135 -1294476 -1535866 -1884413 -1997039 -1971227 -1954080 -1637558 -868854 -433773 -1166256
44730 -1166256 -2271208 -1832698 498253 2616375 2741044 1913079 2232840 3467412 3395172
44721 3395172 1303997 -978471 -1911020 -2020077 -1997356 -1026152 1475185 3964460 4461688
44712 4461688 3154434 1622367 394322 -802347 -1179748 328357 2658228 3437761
44704 3437761 2454181 1933913 2832243 3317438 2017659 403765 292494 967047 782496
44695 782496 49720 70085 438544 -325149 -2134338 -3566219 -4237361 -4727789 -4596236
44686 -4596236 -3017362 -1290814 -1880228 -4403672 -5352421 -2930357 354617 1466391
44678A466391n88675o2899O54423O0193l63173N16112J061547j32089j517744
44669A094086j197244o8289N5016l83066m680N34657k06771j340982q77459N67020
44659a827712N65849p39499n80700J500692K264062o9812k504410j620431J229061
44650a782900K114615L25781j258967q34185M44793J142292J212733O44583q79892
44641A128853k283283j579650R25116K289030J078826m56707m7108J039873M72300
44632B567250r79676p94816Q17279J117110n67153j665495n46842R74292P56600
44623A678549l17165o6179J390595J900608N48969j180542j541447n08534O46595
44614B551449R16550L27801m55338r63461j247411j357763r15656K29436J226054
$$ plain form
44678 1466391 877716 814817 1469240 1529433 1166260 1682372 2743919 2611830 1094086
44669 1094086 -103158 -171447 -116431 -499497 -504177 30480 -176291 -1517273 -2394732 -1827712
44659 -1827712 -1261863 -2001362 -2582062 -1081370 1182692 1112880 -1391530 -3011961 -1782900
44650 -1782900 331715 657496 -601471 -1435656 -990863 151429 1364162 2008745 1128853
44641 1128853 -1154430 -2734080 -1808964 480066 1558892 1102185 1055077 2094950 2567250
44632 2567250 1587574 792758 1610037 2727147 2159994 494499 -52343 921949 1678549
44623 1678549 1361384 1295205 2685800 4586408 5135377 3954835 2413388 1904854 2551449
44614 2551449 3467999 3795800 3340462 2377001 1129590 -228173 -1143829 -914393 311661
44605C11661J053574R1618k39910M16677Q38616K35866n14223m19214J5659k30666
44595A559658r94364j285028o77297N59669J975008K690621J602731r69912k721893
44586A739193j897078K74921J194018L48412n58798n25338l09405n20022n75536
44577h29633m6648N56684Q98464J322490J711373J203262l16279j671252j964684
44568H63777j526765p95765L54203J479714J310748k73462j396447o84318N48923
44559a19392K03847j393271j949780m58638J660121K573148J819530J61278j089572
44550A407271p03343J202064K583948J539795j010873k198859r63830P14390Q86672
44541C457235J68688P2316L54378k26992j406523j618810n35966L73748J24253
$$ plain form
44605 311661 1365235 1456853 1216943 1633620 2472236 2708102 2193879 1774665 1790324 1559658
44595 1559658 565294 -719734 -1397031 -837362 1137646 3828267 5430998 4461086 1739193
44586 1739193 -157885 117036 1311054 1659466 1100668 575330 265925 -254097 -829633
44577 -829633 -876281 -319597 578867 1901357 3612730 4815992 4499713 2828461 863777
44568 863777 -662988 -1458753 -1104550 375164 1685912 1412450 16003 -668315 -119392
44559 -119392 84455 -1308816 -3258596 -3717234 -2057113 516035 2335565 2496843 1407271
44550 1407271 703928 1905992 4489940 6029735 5018862 2820003 1856173 2570563 3457235
44541 3457235 3625923 3698239 4052617 3825625 2419102 800292 264326 638074 762327
44532G62327m67245l64173O2965m9156m39776k09269N49184Q27652L48764j7388
44522A003885K37819L59572m30643j540116j725275q42862L8447K32420K41141
44513b425612O83508J187269R56532J8110p82740r01865n85199j98079K98094
44504a749982Q82410J000521J67005j084932j470614m00643J189955J757729P61032
44495A052481q31794j527658o78412R57446J870721J216588k72195j044196n41964
44486B01017K15143J92019j88653O2333O71397M19298p77478j471133p61704M63107
44476i74654J010792R65745R10277O12026l18413j204359j064421j92119K66942
44467A1816O3948k7651K92449M08543r8041q67122j330998j070220J82641J946511
$$ plain form
44532 762327 295082 -69091 -6126 -55282 -495058 -704327 -155143 672509 1021273 1003885
44522 1003885 1241704 1601276 1170633 -369483 -2094758 -2937620 -2899173 -2666753 -2425612
44513 -2425612 -1742104 -554835 401697 419807 -362933 -1264798 -1849997 -2048076 -1749982
44504 -1749982 -867572 132949 299954 -784978 -2255592 -2656235 -1466280 291449 1052481
44495 1052481 220687 -1306971 -1985383 -1027937 842784 2059372 1787177 742981 201017
44486 201017 416160 608179 419526 481859 1153256 1572554 795076 -676057 -1437761 -974654
44476 -974654 36138 1001883 1912160 2524186 2205773 1001414 -63007 -255126 11816
44467 11816 75764 48113 340562 749105 651064 -216058 -1547056 -2617276 -2434635 -488124
44457d88124K728821J567883l93740j199324p02055l45288n42220k98796L70491
44448F97648J0192j432355j652077N74865K932124K570778J96994j102056l18183
44439B477930N30035j94774j484632j397644L09616J963508J842505r271j693045
44430B344228j477232K8547O10094l93607j148128l43800O55360K78241l85269
44421A68434M46057J737783J076838j042317j640005k4759J159018L50571o94516
44412A537104l96202k1879r34979j817678j045455K75429K77157l31812K86989
44403b171326J561192J411461j4788n39832L11853P04264j47568p70015k04864
44394A40377N27914N91553O26030Q73551K89938j193469j727072m85711N10532
$$ plain form
44457 -488124 2240697 3808580 3414840 2215516 1513461 1168173 625953 327157 697648
44448 697648 707840 -724515 -2376592 -1801727 1130397 3701175 3898169 2796113 2477930
44439 2477930 3007965 2813191 1328559 -69085 240531 2204039 4046544 4037273 2344228
44430 2344228 866996 895543 1505637 1112030 -36098 -379898 275462 553703 168434
44421 168434 614491 2352274 3429112 2386795 746790 722031 1881049 2231620 1537104
44412 1537104 1140902 1119023 184044 -1633634 -2679089 -2403660 -2126503 -2458315 -2171326
44403 -2171326 -610134 801327 786539 246707 558560 1262824 1115256 345241 140377
44394 140377 668291 1259844 1885874 2759425 3049363 1855894 128822 -356889 153643
44385A53643m66081j735757p30523J738559K574299J020330p15697j243928j415617
44376h20772j625396p15344J304922K125236M60396j580085j431599K59218J063158
44367i60266N55318K20236L65205j84420j344595j294196N78622K310539J981836
44358B228279J96346j110318j158936n58961K7522L65550L49304J00593R956J56279
44348F05614J61876m0051l3848J27240k00389q75102o83803O63720J517275O06445
44338A848977p49497n27770P31930P43944p25884j333378P2724J454377N94833
44329B110256j641425k659628j622756L7720R25741R28563M72288l1741k9734
44320a510716O51412J085569K49307j141727j137849O49529K107701J401357m27554
$$ plain form
44385 153643 -312438 -2048195 -2778718 -1040159 1534140 2554470 1838773 594845 -820772
44376 -820772 -2446168 -3161512 -1856590 268646 729042 -851043 -2282642 -2023424 -960266
44367 -960266 -404948 -184712 180493 -3927 -1348522 -2642718 -2064096 246443 2228279
44358 2228279 2424625 1314307 155371 -403590 -376068 -10518 338786 439379 449335 605614
44348 605614 767490 727439 693591 820831 620442 -254660 -938463 -274743 1242532 1848977
44338 1848977 1099480 571710 1303640 2047584 1321700 -11678 61046 1515423 2110256
44329 2110256 468831 -2190797 -3813553 -3775833 -2850092 -1921529 -1449241 -1480982 -1510716
44320 -1510716 -859304 226265 475572 -666155 -1804004 -1154475 953226 2354583 1927029
44311A927029r86885L6020O44490l28811j574702j444927l44073J48565l26108
44302b249402p03744l03083M28932R32832J166771J084538N27965q0820P6553
44293H80542R25690J316882O59002j60250j82403J46154j34875p75103o69835
44284B005804K72478P65891j49853j860425k957826k743524j635365m13853N61050
44275f155623J360557J927403J877889J130698L76805K68690L28651m05727j618402
44266i09059j781006l91077J081904J240590O02531L95397N76285L47124j90058
44257I72631l42197k05228k89481k47484N04955J268508Q14781m79194r39319
44248A057972j45734M63714j06628r99464r58751o359R13075J088515M75074l11711
$$ plain form
44311 1927029 940144 976164 1620654 1291843 -282859 -1727786 -2071859 -1923294 -2249402
44302 -2249402 -2953146 -3256229 -2827297 -1894465 -727694 356844 884809 803989 880542
44293 880542 1806232 3123114 3782116 3621866 3439463 3585617 3450742 2675639 2005804
44284 2005804 2278282 3044173 2894320 1033895 -1923931 -4667455 -6302820 -6716673 -6155623
44275 -6155623 -4795066 -2867663 -989774 140924 517729 786419 1115070 709343 -909059
44266 -909059 -2690065 -3081142 -1999238 -758648 -156117 239280 815565 1162689 972631
44257 972631 630434 425206 135725 -111759 393196 1661704 2476485 1997291 1057972
44248 1057972 912238 1375952 1269324 269860 -688891 -695250 217825 1306340 1781414 1469703
44238A469703l70500L83910P77749J4050q07224k76709P51003J79323j883326
44229B37979k958285j784918J54963J257846J698947J902775J372065J96766l11546
44220A766592K63722O14280J60444J97608J216860J428527j96883j711864j265618
44211B473668k14848n14248j063969R5974J604183O08743k092755k758984n15643
44202b377879J419506R56556r2606K31732Q05711m8818j337246j069442M18204
44193a094282J063930J91055q07204n69733P31639J879350J830095N70216q72964
44184B922102j458087j149861n39432J56966Q96146J076877K53587p26908p13259
44175G18131j08754j35752n32366m487J094979R67125l56839n88902R76822J851600
$$ plain form
44238 1469703 1099203 1483113 2260862 2274912 1467688 1190979 1941982 2121305 237979
44229 237979 -2720306 -4505224 -4350261 -3092415 -1393468 509307 1881372 2078138 1766592
44220 1766592 2030314 2644594 2805038 3002646 4219506 5648033 5451150 3739286 2473668
44211 2473668 2258820 1744572 680603 776577 2380760 2989503 896748 -1862236 -2377879
44202 -2377879 -958373 -1817 -94423 137309 943020 894202 -443044 -1512486 -1094282
44193 -1094282 -30352 160703 -646501 -1216234 -484595 1394755 3224850 3795066 2922102
44184 2922102 1464015 314154 -225278 -68312 827834 1904711 2158298 1431390 718131
44175 718131 609377 473625 -58741 -63228 1031751 1998876 1642037 1053135 2029957 3881557
44165C881557K19440j952926j849526K1428J054022N85265P2148K8256n29007
44156A530657j668651j932857n49671J417841K501476K159682O35191j228205
44148B865463k025222r92638P06725J123936P465j085153j149191p44708m36107
44139a729430J81702J234883J730337R43428l22687q56933p11160p71546j183909
44130a485315j265217p86929l26474j76529K59483J477492K748685K702699J102341
44121D250236n67670p71353J42818M29151o03261j549092q62753R16636J853205
44112C237917J137840j66997q47580q56936o19274j31553N37747P23975J16279
44103C131418l42165L41956J402398J087190o23705j612345o64547N93544K26417
$$ plain form
44165 3881557 4100997 2148071 298545 319973 1373995 1959260 2031408 2059664 1530657
44156 1530657 -137994 -2070851 -2620522 -1202681 1298795 3458477 4093668 2865463
44148 2865463 840241 -152397 554328 1678264 1685729 600576 -548615 -1293323 -1729430
44139 -1729430 -1547728 -312845 1417492 2360920 2038233 1181300 470140 -301406 -1485315
44130 -1485315 -2750532 -3537461 -3863935 -4040464 -3780981 -2303489 445196 3147895 4250236
44121 4250236 3682566 2911213 3054031 3483182 2879921 1330829 468076 1384712 3237917
44112 3237917 4375757 4208760 3361180 2504244 1884970 1753417 2291164 3015139 3131418
44103 3131418 2789253 3131209 4533607 5620797 4997092 3384747 2720200 3313744 3540161
44094C540161q00287j63624J634181J494383j287100l214556j587873J183861
44086G99146J069623j439161k171111K70847K619587K165021M37059M2164O18055
44077D411230K41954j051784j654496j168146n41640r4743N59087J026452M47721
44068B175635q49477j600344j411375r42111m83812K27784R32158J005384O52827
44059b93331N96655O58106O8168q47768q47913J90403R44691O95712K20826J78429
44049A563978Q6484m02243o02160q2393L35861j08375p95620p75032k50373J32491
44039h97382O65479J811541K578175J378866j343846k948046j782285N86653J367783
44030A416938P4686j188215p97173L90398O29301k08447p86382m02089L25598
$$ plain form
44094 3540161 2739874 2576250 4210431 5704814 4417714 1203158 -384715 799146
44086 799146 1868769 429608 -1741503 -1470656 1148931 3313952 3751011 3793175 4411230
44077 4411230 4653184 3601400 1946904 778758 237118 142375 701462 1727914 2175635
44068 2175635 1326158 -274186 -1685561 -2627672 -3111484 -2883700 -1951542 -946158 -293331
44059 -293331 303324 961430 1029598 181830 -666083 -475680 469011 1164723 1385549 1563978
44049 1563978 1650462 1248219 646059 563666 899527 791152 -4468 -779500 -1029873 -897382
44039 -897382 -231903 1579638 4157813 5536679 4192833 1244787 -537498 49155 1416938
44030 1416938 1491624 303409 -493764 -103366 525935 317488 -468894 -870983 -545385
44021e45385P71274J007638R22207l9201j518994j840111j48233J838150J662334
44012B109679n74075k157917j167993J232990K372828J152116j014398j980964
44004b7734j128911K24935N76560N2473n1869O24373R51544K46192m54405k3350
43994I89808Q33405N85036q13535j945463j881839q97587L86755J383871J464784
43985A05235P27871L69117J005364J314607k2504j754535j570957K40293J111056
43976A525547J62252p69582m78373m1255k62048j59942O61688P06877n90235j102965
43966c48036O98669K677617J857949j068034k761577j913838k89294M59844N09941
43957a76759M03192J11307r5371L70444J176084J243003M09920l53478n28766
$$ plain form
44021 -545385 225889 1233527 2155734 2116533 597539 -1242572 -1390805 447345 2109679
44012 2109679 1535604 -622313 -1790306 -557316 1815512 2967628 1953230 -27734
44004 -27734 -1156645 -931710 -355150 -302677 -354546 269827 1221371 1467563 1013158 989808
43994 989808 1823213 2408249 1594714 -350749 -2232588 -3130175 -2743420 -1359549 105235
43985 105235 833106 1202223 2207587 3522194 3499690 1745155 174198 414491 1525547
43976 1525547 1687799 918217 439844 398589 136541 -23401 638287 1345164 754929 -348036
43966 -348036 350633 3028250 4886199 3818165 1056588 -857250 -1146544 -686700 -176759
43957 -176759 226433 337740 242369 612813 1788897 3031900 3441820 3088342 2559576
43948B559576n94614q77580j087587j159289j400675j608522j097424J49571J234535
43939c882009J420169P75140j87571q44969o84167Q7247N12628J78505o9921M65764
43929b229184J084697R51916N86623O32894L03953r98876j671646j20529J831408
43920C71256R64060k070782l065583n13484K059437J538982l81677n98068M58008
43911a237851L10059j049595j407320j40557J178032J629978J847485K097997
43903C228228J686645N01168n80065j008326r18341k83408Q54457J522463P42099
43894E744920q03783j571961j478526j730038k401272k112836m62542J084295
43886c731743J385065J038985Q15959K46521j096248k165773j629212K35959J944013
$$ plain form
43948 2559576 1964962 1087382 -205 -1159494 -2560169 -4168691 -5266115 -5116544 -3882009
43939 -3882009 -2461840 -1686700 -1874271 -2719240 -3403407 -3316160 -2803532 -2625027 -2694948 -2229184
43929 -2229184 -1144487 -192571 394052 1026946 1330899 332023 -1339623 -1460152 371256
43920 371256 1335316 -735466 -3801049 -4314533 -2255096 -716114 -1097791 -1695859 -1237851
43911 -1237851 -927792 -1977387 -3384707 -3525264 -2347232 -717254 1130231 3228228
43903 3228228 4914873 5416041 4835976 3827650 2909309 2625901 3480358 5002821 5744920
43894 5744920 4941137 3369176 1890650 160612 -2240660 -4353496 -4816038 -3731743
43886 -3731743 -2346678 -1307693 -491734 -245213 -1341461 -3507234 -5136446 -4900487 -2956474
43877b956474K576543K218117J121030n06574k008448k455111j529105J10303
43869c429719J401946J693872J120081L37432j31946k40044q9242L04399O15753
43860A582532J62879j070259j884165j240675K38905J164013J275666J196042
43852A424938Q15191l39369j394197q75454O92921J155879J44937l01151O01615
43843A925310P91678r57100k377915j157925J072486J170125n51431j036162N74895
43834e46039J997731J698112O44092j80614j145363k131125j903426l34032R18857
43825i81807R15200O24254P62023N69265k16784l61639N47374Q75897l25155j298795
43815A109833k52007J580754J742985K50238p38415k00977Q20690J110477L88574
$$ plain form
43877 -2956474 -379931 1838186 2959216 2452642 444194 -2010917 -3540022 -3429719
43869 -3429719 -2027773 -333901 786180 1123612 991666 751622 662380 966779 1582532
43860 1582532 1745411 675152 -1209013 -2449688 -2210783 -1046770 228896 1424938
43852 1424938 2240129 1900760 506563 -368891 324030 1479909 1624846 1323695 1925310
43843 1925310 2716988 1759888 -618027 -1775952 -703466 466659 -84772 -1120934 -546039
43834 -546039 1451692 3149804 3793896 3613282 2467919 336794 -1566632 -1900664 -981807
43825 -981807 -66607 557647 1319670 1888935 1672151 1310512 1857886 2733783 2408628 1109833
43815 1109833 857826 2438580 4181565 4431803 3693388 3492411 4313101 5423578 5812152
43806E812152j012568k118752j616562L53533J573658N69735r67181o39946P51000
43797B705069M03157j847692l041800j577483N93164J165448N10900K26156N45639
43788c17442O93793N24374M21559L65024J18390k20647m57971m93558n4580Q89507
43778A468449J386665M17126j284547j800784p76703N1576l36307p14501R1139
43769a497887J091215P93290l26292o40403J81679J043501J172524P09342j7345
43760B509624o98054q89212n33365k11560j99332O3592Q48065J336742Q68220
43751C094720J40661J03084L71490j04178j333475k291373k200680j025973P00570
43742b545154J857707J425191j9721n84234K58648O66501o18471j913045j122892
$$ plain form
43806 5812152 4799584 2680832 1064270 1417803 2991461 3561196 2594015 1954069 2705069
43797 2705069 3108226 1260534 -1781266 -3358749 -2765585 -1600137 -1089237 -863081 -317442
43788 -317442 376351 900725 1322284 1687308 1805698 1585051 1127080 633522 578942 1468449
43778 1468449 2855114 3272240 1987693 186909 -589794 -538218 -874525 -1589026 -1497887
43769 -1497887 -406672 386618 60326 -580077 -398398 645103 1817627 2526969 2509624
43760 2509624 1811570 922358 388993 177433 -21899 41693 889758 2226500 3094720
43751 3094720 3235381 3338465 3709955 3605777 2272302 -19071 -2219751 -3245724 -2545154
43742 -2545154 -687447 737744 718023 133789 392437 1058938 440467 -1472578 -2595470
43733b595470P43567J056388k98113r53446Q0180J278448J449400J177603R99022
43724B937579N21871m707M59017J515137J218955p31696j933410q54365O13437
43715C741818R6209j490898j487449K43108J151896o2944j656023j514461L5763
43706i42981J009138L85282r35357j421582n35390Q77040J513432R01440j55491
43697F95531m08397N43142J784198J964303P45779p08764r93541j86027K08150
43688C644374p65648k221681k589418j500151N8650R77690Q26833m0813n76140
43679b186304J34315J470475J562152j77117j833492j505513N2551Q69780P87788
43670h25365J034148J581934J315725M31347J84893L61791m49460j954725k187923
$$ plain form
43733 -2595470 -1851903 -795515 -1093628 -2047074 -1966894 -688446 760954 1938557 2937579
43724 2937579 3459450 3454743 3913760 5428897 6647852 5916156 3982746 3128381 3741818
43715 3741818 3838027 2347129 859680 1102788 2254684 2191740 535717 -978744 -942981
43706 -942981 66157 451439 -483918 -1905500 -2440890 -1563850 -50418 851022 695531
43697 695531 287134 830276 2614474 4578777 5324556 4615792 3622251 3436224 3644374
43688 3644374 2878726 657045 -1932373 -3432524 -3373874 -2396184 -1569351 -1610164 -2186304
43679 -2186304 -2051989 -581514 980638 803521 -1029971 -2535484 -2482933 -1613153 -825365
43670 -825365 208783 1790717 3106442 3537789 3722682 4084473 3635013 1680288 -507635
43661e07635p99665L94431O49441J161842J948835J086130j548680k947701j344550
43652a907552R50964J300517N69895O63766Q82846j60596j215938m26480J003250
43643A660672O87194p18719p44353M88799Q00579J79701O14028J960152J892346
43634F820399J86079p60930k40497k90802j527214j713058K8504J183159N0147
43625C735787j254891m46231J090520R15994l01907l60399M18524p3j422748j560100
43615H14476M5588J148849L34679r88614j016582r7555L21857K4975m7103L91916
43605I32486N28981q0271n91729o5821R55160J065080J40974l88531R5499K52171
43595B843999q02018j404519K31066K516108K207118n63632k056786m05100J699863
$$ plain form
43661 -507635 -1307300 -912869 -263428 898414 2847249 3933379 2384699 -563002 -1907552
43652 -1907552 -956588 343929 913824 1577590 2460436 2299840 1083902 657422 1660672
43643 1660672 2347866 1629147 884794 1373593 2174172 2353873 2967901 4928053 6820399
43634 6820399 7006478 6245548 6005051 5714249 4187035 2473977 2502481 3685640 3735787
43625 3735787 2480896 2034665 3125185 4041179 3739272 3378873 3797397 3797324 2374576 814476
43615 814476 860064 2008913 2343592 1354978 338396 240841 562698 587673 540570 932486
43605 932486 1461467 1381196 789467 723646 1678806 2743886 2884860 2496329 2591828 2843999
43595 2843999 2041981 637462 868528 3384636 5591754 5028122 2971336 2566236 4266099
43586D266099J278629o78471j384198n88712j70614p11469j045338o03620p508
43577C54798L89735P56792Q30194K47388m41646m44307k5417R1742L9398K32425
43567B031102K25221l91190p43896M929Q91432N86371j85162J20010Q53431O0737
43557C452985j824896k118914j71176J383790P14939n39972k71982P46630N63608
43548A935012n88422q84125J20646J178496J483729J321084Q77110M165r05899
43539D541796j168886r51664j023097j344435j005486K80477J577885J897472
43531B804062J247735L03495l61855n15220k76446j17151m40254r90805j031375
43522F22186k52302P71588J162461O04446l92538r35779n40103L03772M83060
$$ plain form
43586 4266099 5544728 4866257 3482059 2893347 2722733 2011264 965926 362306 354798
43577 354798 744533 1501325 2331519 2578907 2137261 1692954 1667537 1759279 1798677 2031102
43567 2031102 2256323 1865133 1121237 1126166 2017598 2603969 2418807 2538817 3392248 3452985
43557 3452985 1628089 -490825 -662001 721789 1436728 896756 624774 1371404 1935012
43548 1935012 1346590 462465 583111 1761607 3245336 4566420 5443530 5447695 4541796
43539 4541796 3372910 2421246 1398149 53714 -951772 -671295 906590 2804062
43531 2804062 4051797 4355292 3993437 3478217 3201771 3084620 2644366 1653561 622186
43522 622186 369884 1141472 2303933 2908379 2515841 1580062 1039959 1343731 1826791
43513A826791m86584j673999j669912l63643P76720N44403l75187l24635R24311
43504h21735J668615O46148r64494j016995N21252J434882M83050p77674l65143
43495H07906J198747J844147J053044J83729m9761m56852j369418j615364m32883
43486A163295J016033J245022N49603K61198O07138O34697p0739q23672r89257
43477C593318p42988n57662o03482p35523n85676K52591J603842K401741J653693
43468F279854k29536j651714j588393p21600n28942j416208k097276j070173J355762
43459a668226L017572K302793J34350j244912j132992q08273j124444j214157
43451a738289k06826J187350J842098J834932J784664J625023J319158J800886
$$ plain form
43513 1826791 1340207 -333792 -2003704 -2367347 -1590627 -1046224 -1421411 -1746046 -821735
43504 -821735 846880 1493028 528534 -488461 32791 1467673 1950723 1173049 807906
43495 807906 2006653 3850800 4903844 5087573 5037812 4580960 3211542 1596178 1163295
43486 1163295 2179328 3424350 3973953 4235151 4842289 5476986 5406247 4582575 3593318
43477 3593318 2850330 2292668 1689186 953663 367987 620578 2224420 4626161 6279854
43468 6279854 6050318 4398604 2810211 2088611 1559669 143461 -1953815 -3023988 -1668226
43459 -1668226 1349346 3652139 3786489 2541577 1408585 600312 -524132 -1738289
43451 -1738289 -1945115 -757765 1084333 2919265 4703929 6328952 7648110 9448996
43443I448996L682839N823403O738470O591317N983052L771959j278145p027434
43435C3734457r169048o576123k851155j546053k244790k670464k241037j574753
43427D861034m42890J376148K472723J447795n46423j116848l4510P55816K93823
43418I066668k91485L5462P50326Q81475K12772r12253j866377j812981o81651
43409E381956R7945p79316k318803k303510m93831J087966J248271R81285J192797
43400D094760J117720L7824j162595j372071p77360M9974J119086J953672J222056
43391F283066j050657k452090j226753R47229J296481m5374p56416k52011j41322
43382B602153q96696q73268P03694K148995J804526L50643m75431j28613P30746
$$ plain form
43443 9448996 13131835 18955238 25693708 32285025 38268077 42040036 40761891 33734457
43435 33734457 24565409 17989286 15138131 13592078 11347288 8676824 6435787 4861034
43427 4861034 4418144 5794292 8267015 9714810 9168387 8051539 8017029 8772845 9066668
43418 9066668 8775183 8810645 9560971 10442446 10655218 9742965 7876588 6063607 5381956
43409 5381956 5479901 4700585 2381782 78272 -415559 672407 1920678 2901963 4094760
43400 4094760 5212480 5250304 4087709 2715638 1938278 1988252 3107338 5061010 6283066
43391 6283066 5232409 2780319 1553566 2500795 3797276 3751902 2995486 2743475 2602153
43382 2602153 1705457 832189 1535883 3684878 5489404 5840047 5364616 5236003 5966749
43373E966749J342525J167425J07387j002909j126776n53245m06391m85583N04197
43364E513379K099933J904937m85476j940526l01353J865116R69940j855274k372376
43355E398300J66227J995330P45146j421213j827086j071876q42939p29077K97126
43346B709938J272109P87884k60425p0274R63263J115803M86292N16060Q39912
43337H360562l27075k507946k814525m14671J733992J209509k79230J97524K117008
43328G275148K382963K7868k513126k844447j318399J31899M27480J0385r0567
43319C489204N84897J383543J239906J95044m02776J65523P25415J6625j041356
43310F356025n54496J250298K055086P88681q69192r76810J76463R71072P29086
$$ plain form
43373 5966749 7309274 8476699 8584086 7581177 6454401 5901156 5494765 5009182 5513379
43364 5513379 7613312 9518249 9032773 7092247 6790894 8656010 9625950 7770676 5398300
43355 5398300 5564527 7559857 8305003 6883790 5056704 3984828 3141889 2412812 2709938
43346 2709938 3982047 4769931 4509506 4439232 5402495 6518298 7004590 7520650 8360562
43337 8360562 8033487 5525541 2711016 2296345 4030337 5239846 4960616 5158140 7275148
43328 7275148 9658111 9685979 7172853 4328406 3010007 3141906 3569386 3579771 3489204
43319 3489204 4074101 5457644 6697550 6892594 6489818 6655341 7380756 7397381 6356025
43310 6356025 5801529 7051827 9106913 9895594 9026402 8049592 8226055 9197127 9926213
43301I926213J25948O3158Q83508K163706K825965K086023O40188J97476J531249
43292B0443434L720519N431254O004524N290832L770612K994205M218993O163742
43284E8038115O009335L363405J052430P41087J88127l001485p001906q085232
43276E1303876o047317m152931m170915m580756l874412k757445k326163k377746
43268B1016191k426930k571846k596823j818288m25278M91227N94257M51596n2225
43259A2661881j507214k980506k534979l43058J085521O70019K92828J316778
43251H661270K101782Q83851j045237j367952l81229k03792j341067k235966j689603
43242C382057l8805J540316J705238r5357k230123j962308O97910K184206M13505
$$ plain form
43301 9926213 10052161 10115319 10998827 13162533 15988498 18074521 18714709 18912185 20443434
43292 20443434 24163953 29595207 35599731 40890563 44661175 47655380 51874373 58038115
43284 58038115 64047450 67410855 68463285 69204372 69392499 66391014 59389108 51303876
43276 51303876 45256559 41103628 36932713 32351957 28477545 25720100 23393937 21016191
43268 21016191 18589261 16017415 13420592 11602304 11177026 11668253 12262510 12714106 12661881
43259 12661881 11154667 8174161 5639182 5296124 6381645 7051664 7344492 8661270
43251 8661270 10763052 11646903 10601666 9233714 8852485 8648693 7307626 5071660 3382057
43242 3382057 3343252 4883568 6588806 6493449 4263326 2301018 2998928 5183134 5596639
43233E596639j585701o5842L322363L755802O21019j740457q31461Q30539N50694
43224A0453595n17215l01548M40825l7451j167483j291407o26512m64813n43384
43215E944607L18638J650737J760643M99852n06151m69599l83382r62124j342506
43206F510715o76139K40658J15682o68400l30612J700723L521509K933364L78621
43197A3726121j512342j369533o43081r83440j551122n28727J682767K852086
43189A1672729K152984R14949J47169n00029r88087m54148O67186L95753j631747
43180A2376759k883054j502975P34325J108083j4631k83588O13206P93266l44010
43171A0597381j175451o63101K07966M35270M84424Q87634R80388J62107p31588
$$ plain form
43233 5596639 4010938 3945096 7267459 11023261 11644280 9903823 9072362 9902901 10453595
43224 10453595 9936380 9634832 10075657 10038206 8870723 7579316 6952804 6487991 5944607
43215 5944607 6263245 7913982 9674625 10174477 9668326 9198727 8815345 7853221 6510715
43206 6510715 5834576 6075234 6190916 5522516 5191904 6892627 10414136 13347500 13726121
43197 13726121 12213779 10844246 10201165 9217725 7666603 7137876 8820643 11672729
43189 11672729 13825713 14740662 14887831 14387802 13399715 12945567 13612753 14008506 12376759
43180 12376759 9493705 7990730 8725055 9833138 9818507 9534919 10148125 10941391 10597381
43171 10597381 9421930 8758829 8966795 9402065 9886489 10774123 11754511 11916618 11185030
43162A1185030n00011O23310J241209N76890p17100j429232j036397p0151O28089
43153A0501637R34943J418875K151047K220189J098149j70966k82893K34476k64093
43144A7841364j726277k048744k18349J805245J664851o1718p88630L50059J553733
43135A8371534J293210M24374M95700J301980J532751J143928J431763K749488
43127B8744728L735010L410817K733088L011657L768308L558231K413785J913523
43119E3289147K787329L896898M032150L532622L461373M049750M670846M745468
43111H4465583M088960K864663J644707J005067P11876p2799j421239k207035
43103I1079783j541253L0653J346048K107062L016313M818309P529595J0318267
$$ plain form
43162 11185030 10685019 11308329 12549538 13126428 12409328 10980096 9943699 9873548 10501637
43153 10501637 11436580 12855455 15006502 17226691 18324840 18153874 17870981 18105457 17841364
43144 17841364 16115087 14066343 13847994 15653239 17318090 17256372 16467742 16817801 18371534
43135 18371534 19664744 20089118 20584818 21886798 23419549 24563477 25995240 28744728
43127 28744728 32479738 35890555 38623643 41635300 45403608 48961839 51375624 53289147
43119 53289147 56076476 59973374 64005524 67538146 70999519 75049269 79720115 84465583
43111 84465583 88554543 91419206 93063913 94068980 94780856 94708057 93286818 91079783
43103 91079783 89538530 89569183 90915231 93022293 96038606 100856915 108386510 118704777
43095A18704777J2282226J3977059J7664141K4654563L2711457L7951345L9133465
43088B97079033L7479065L2129952J9757336Q02545j7499535k7975914l1124097
43081C10648385l2147954l2549875k9595387k3211566j7736003j5673578j4490276
43074A45243746j1577084q323302o769250n778167l654429j817249k438693m276416
43066A00609156m187612j639565J214666K974489L682070K975691O16243j541504
43058A04703634j125040J131422K094699Q18135l19037L70743J479769J275382
43050A10429707M54123M78157R57673M87921j071467k729536l908031m519290
43042A00579257m338077l613703l517566m558413n233487l866546j340072j75081
$$ plain form
43095 118704777 130987003 144964062 162628203 187282766 219994223 257945568 297079033
43088 297079033 334558098 366688050 386445386 387247931 369748396 341772482 310648385
43081 310648385 278500431 245950556 216355169 193143603 175407600 159734022 145243746
43074 145243746 133666662 125343360 118574110 112795943 109141514 107324265 104885572 100609156
43066 100609156 96421544 94781979 95996645 98971134 102653204 105628895 106245138 104703634
43058 104703634 103578594 104710016 106804715 107622850 107303813 107674556 109154325 110429707
43050 110429707 110883830 111361987 112319660 112807581 111736114 109006578 105098547 100579257
43042 100579257 96241180 92627477 89109911 84551498 79318011 75451465 74111393 73936312
43034G3936312r14259j338892J79228K371147L273049L269765M160806N893494
43026I0830650O287454M286924J724158Q84026J547344J775748Q74595q0208n73559
43017A07557132j735604m300385o760434o889066m625136k234783j667885k757466
43009G6586373m104549m688169m187631k675231q33160N1235p48643k344706l115935
43000E3939584k640086j974239j913898j930413j346531o52783o68825r74552
42992D1838257m57393P18739J087138J19821q80098q37943n76353j277385k322800
42983C7411983k245571j261787j057411k058957k680932j810808n21443l80048
42975B5395026j160219j372025m51779O64308R53758M52745p5850j18928J02449
$$ plain form
43034 73936312 73022053 71683161 71862389 74233536 77506585 80776350 84937156 90830650
43026 90830650 97118104 101405028 103129186 104013212 105560556 107336304 108210899 108130691 107557132
43017 107557132 105821528 101521143 94760709 87871643 83246507 81011724 79343839 76586373
43009 76586373 72481824 67793655 63606024 60930793 60097633 60148868 59400225 57055519 53939584
43000 53939584 51299498 49325259 47411361 45480948 44134417 43481634 42812809 41838257
42992 41838257 41380864 42099603 43186741 43306562 42426464 41588521 41012168 39734783 37411983
42983 37411983 35166412 33904625 32847214 30788257 28107325 26296517 25775074 25395026
42975 25395026 24234807 22862782 22411003 23075311 24029069 24481814 24405964 24287036 24389485
42966B4389485J6734m75046p83306m99973j19022k76100o26984m38652o9940n77327
42956B0539869j769074k122105j077782P1488L11065L96706J147218J716034J065108
42947B0278527k9610k07414J40035k81772j071386n61799J222995K197329J236667
42938B2923572l04385p98917m23974r7137K35586J005557J673879J308508J11829
42929B5634518o91157m13466L56094O09798R8555m56692k96223K49432m9151j586142
42919B3455566k912003k409563o55584K12367m62126r66363Q6706J644108J822660
42910A9815768N30802p38699j008536n24043J28352M85525J64418n87822o27543
42901A7638222P22380K304477K284788N88665r93433j206991o65072n09155q91257
$$ plain form
42966 24389485 24406219 23931173 23147867 22647894 22528872 22252772 21625788 21187136 21117196 20539869
42956 20539869 18770795 16648690 15570908 15642396 15953461 16350167 17497385 19213419 20278527
42947 20278527 20248917 20041503 20181538 19899766 18828380 18266581 19489576 21686905 22923572
42938 22923572 22619187 21820270 21396296 21299159 21534745 22540302 24214181 25522689 25634518
42929 25634518 24943361 24529895 24885989 25495787 25594342 25137650 24841427 25090859 25041708 23455566
42919 23455566 20543563 18134000 17478416 17690783 17228657 16262294 16349000 17993108 19815768
42910 19815768 20346570 19607871 18599335 18075292 18203644 18689169 18853587 18265765 17638222
42901 17638222 18360602 20665079 22949867 23538532 22545099 21338108 20673036 20163881 19272624
42892A9272624j361992j835991k380596k601353k011145q08835K25478N29303
42884I027493K06237j69030q7053L24103L01174n67567j484919j319010l53341
42875E878087j04399r84723j353041J16816K106263K172550J51680j588401j376186
42866E018646j46024M14734K13895K26925N85798M83507l31669j053781q93568
42857D518463N506Q10017P70477j62911j171495j222693k23196Q02044J038412
42848E164624Q62181R10274Q36614N4860p19898j30247J517958K109762N47826
42839A1153954j501258j710941r2624J320026J300834N87107J89970j02346q61780
42830A0282942j572219j151927K58992J113807M80976n77617n10507L50510K22638
$$ plain form
42892 19272624 17910632 16074641 13694045 11092692 9081547 8272712 8498190 9027493
42884 9027493 9233730 9064700 8977647 9301750 9602924 9035357 7550438 6231428 5878087
42875 5878087 5773688 4788965 3435924 3552740 5659003 7831553 7983233 6394832 5018646
42866 5018646 4872622 5287356 5501251 5728176 6313974 6797481 6465812 5412031 4518463
42857 4518463 4523969 5333986 6104463 5941552 4770057 3547364 3324168 4126212 5164624
42848 5164624 6026805 6937079 7773693 7828553 7108655 6978408 8496366 10606128 11153954
42839 11153954 9652696 7941755 7849131 9169157 10469991 11057098 11247068 11144722 10282942
42830 10282942 8710723 7558796 7817788 8931595 9412571 8834954 8324447 8674957 8897595
42821H897595j247724k050696o09182J743981K468486J192179k27731n74344m11364
42812I181200l93259k76520L810n0951k56655K93161J389229J509166K90009n86133
42802A1103057j30479J75867j027361k328465j641358L22246J118135L04609m38109
42793G458142n12418j017666k001357j783604J08230J563893P42080j275809j992161
42784A289330o27980J310094J896642N20226j622684k390036p92080J610767K356868
42775C551147J150615l8858n4483M4350p06909j311588n67074O88711O74655p30727
42765B699839j868478j427949K69122J796411J818522K48737j372281j392437
42757G71486k24563J53589p43775j049717L08134J502337N85107j229915j380702
$$ plain form
42821 8897595 7649871 5599175 4989993 6733974 9202460 10394639 10166908 9592564 9181200
42812 9181200 8787941 8511421 8515231 8464280 8207625 8500786 9890015 11399181 11689190 11103057
42802 11103057 10972578 11148445 10121084 7792619 6151261 6473507 7591642 7896251 7458142
42793 7458142 6945724 5928058 3926701 2143097 2251327 3815220 4557300 3281491 1289330
42784 1289330 661350 1971444 3868086 4388312 2765628 375592 -416488 1194279 3551147
42775 3551147 4701762 4662904 4608421 4652771 3945862 2634274 2067200 2755911 3430566 2699839
42765 2699839 831361 -596588 -327466 1468945 3287467 3536204 2163923 771486
42757 771486 546923 700512 -43263 -1092980 -784846 717491 1302598 72683 -1308019
42748a308019J2037N74340k90842n85386P52797K059729J627232J27584q39527
42739B129945j009200r51479n93236L13166J094663R44266L29275L60179J011629
42730C629208J151597L52240l89320o9283R33060J380142O99248n15633j402779
42721E768480j748488j824242j686057j133888l12592K32483L29885M76955R62465
42712A065001J210392O07963m10194q59392n43872q4582K40887P19710J172974
42703C118887P46330p58239k107618j914549l46158J039456J056406P6284n77662
42694C33137j99991M95676K96426q38427j544987q59399L54418O22372O9319J53616
42684a117840J207972J719638O42783q93443j199574l44093L78400N70293Q70074
$$ plain form
42748 -1308019 -1295982 -721642 -1012484 -1597870 -845073 1214656 2841888 2969472 2129945
42739 2129945 1120745 169266 -423970 -110804 983859 1928125 2257400 2617579 3629208
42730 3629208 4780805 5133045 4743725 4674442 5607502 6987644 7686892 7171259 5768480
42721 5768480 4019992 2195750 509693 -624195 -936787 -704304 -374419 102536 1065001
42712 1065001 2275393 2883356 2473162 1613770 1069898 985316 1226203 1945913 3118887
42703 3118887 3865217 3106978 999360 -915189 -1261347 -221891 834515 910799 333137
42694 333137 133146 628822 925248 86821 -1458166 -2317565 -1963147 -1340775 -1271456 -1117840
42684 -1117840 90132 1809770 2452553 1559110 359536 15443 393843 964136 1834210
42675A834210J310821J088403R7148o77296o78120m80800m91105j77841O14461
42666B439881P76607m29908j717943j263889N62229J553655P59594l70625l48515
42657A961086L50598M84531J1687k82230k76184l97553n31292k29578K97136M71434
42647A859635L50810K79593r3346j133776j818010o75015J673843K644346J022475
42638D110555j376018k294766j806876j207480m81684J211717L155399L264782
42630D575629R62625j681871k343876j003927M97150P72740Q7182m52299l09018
42621A104335K5618j42608o79770q01371l19800j04410q53973j918236k025314
42612e715529r06226N04200J335592J541418J411760J035385M66625k8047j41252
$$ plain form
42675 1834210 3145031 4233434 4330582 3653286 2975166 2494366 2003261 1825420 2439881
42666 2439881 3216488 2786580 1068637 -195252 366977 1920632 2680226 2309601 1961086
42657 1961086 2311684 2796215 2807902 2525672 2249488 1851935 1320643 1091065 1388201 1859635
42647 1859635 2210445 2490038 2396692 1262916 -555094 -1230109 443734 3088080 4110555
42638 4110555 2734537 439771 -1367105 -2574585 -3056269 -1844552 1310847 4575629
42630 4575629 5538254 3856383 1512507 508580 1005730 1778470 1865652 1413353 1104335
42621 1104335 1129953 987345 307575 -493796 -813596 -918006 -1771979 -3690215 -5715529
42612 -5715529 -6621755 -6117555 -4781963 -3240545 -1828785 -793400 -326775 -354822 -496074
42603d96074K20983Q67135J364227J303730P25412R2097l21314p04510j185236
42594A866450j462710j268372p38000k6512Q58963J486769J077662k07058r10360
42585F76832j34305J030014J051040J92830k07648p0514l78975r21972l46626
42576H90676J170744J431663n46213k555492k027713L48742J644116P40025n21830
42567E74718l45625O17499P31782J6865j01552O70804P80035p30132k252965j480025
42557a518596J217560K931998K033938K10368j99827N90269P69619j8769n26704
42548E489856l09856k30712m93412j59242Q39812R90033n28268k219279k108030
42539A270902l24046J256783J398802N50388j88668k83627L6310K47832O9333
$$ plain form
42603 -496074 -275091 592044 1956271 3260001 3985413 4077510 3756196 3051686 1866450
42594 1866450 403740 -864632 -1602632 -1629144 -770181 716588 1794250 1587192 676832
42585 676832 542527 1572541 2623581 2816411 2608763 2538249 2159274 1237302 890676
42576 890676 2061420 3493083 2946870 391378 -1636335 -1287593 356523 1096548 574718
42567 574718 229093 846592 1578374 1595239 1493687 2164491 2944526 2214394 -38571 -1518596
42557 -1518596 -301036 2630962 4664900 4875268 4675441 5265710 6035329 6016560 5489856
42548 5489856 5180000 4949288 4455876 4296634 5136446 6126479 5598211 3378932 1270902
42539 1270902 946856 2203639 3602441 4152829 3964161 3680534 3716844 3964676 4034009
42530D034009l27378n90601n29834r2508O21262J056927N34399n92141r18183
42521C195952k1541M71501o98787j895527o61383K111949K809983L32307k030419
42512C614035j229605J377979K353734R06778q57331j345285r77826o76151o35696
42503B530632o55963n15391M741P45795J069481O79792O1318l64479p60256j046274
42493A749396n81748N98571J324113R43927L09791J51926j95585j184489j580895
42484A535007l50830J120975P44528j053522j885877p97241Q62386J750563J806126
42475C732115J229267L7881j110621j217446l59720M15716O21262N15362J2815
42466C876631j052106j757811r51427O91665J263179M48836j03507M33025Q99665
$$ plain form
42530 4034009 3706631 3116030 2586196 2493688 3114950 4171877 4706276 4114135 3195952
42521 3195952 3174411 3645912 2947125 1051598 390215 2502164 5312147 5644454 3614035
42512 3614035 2384430 3762409 6116143 7022921 6165590 4820305 3842479 3166328 2530632
42503 2530632 1874669 1359278 1364019 2109814 3179295 3859087 3920405 3555926 2795670 1749396
42493 1749396 1167648 1766219 3090332 4034259 4344050 4495976 4300391 3115902 1535007
42484 1535007 1184177 2305152 3049680 1996158 110281 -686960 175426 1925989 3732115
42475 3732115 4961382 4999263 3888642 2671196 2311476 2727192 3348454 3863816 3876631
42466 3876631 2824525 1066714 115287 806952 2070131 2518967 2415460 2848485 3748150
42457C748150M23779q9867K47756P26926M70123K2751J91788M61964m1027q83839
42447E278504r72863k45269N02511R63746J324072J299982L75986j079925j952305
42438E494439j748072j090379o94572m47347K03161J245935J831363J108892o97580
42429E205840k263908k392145j107551N89832J687281J617674L94885j044685
42421B687223j211550K61294J692988J201243p56666j887101j027751O56061J528327
42412C144068J214280J76465j135643k121828k048242r01612M20045J129109J159722
42403A036364P29825J51598M9048O95438J147948L01818j166524j403677r8633
42394A443205J094966J224673J197147J513088R03775j368648l527637l333728
$$ plain form
42457 3748150 4171929 4082062 4329818 5056744 5526867 5549618 5741406 6203370 6162343 5278504
42447 5278504 4305641 4060372 4562883 5526629 6850701 8150683 8526669 7446744 5494439
42438 5494439 3746367 2655988 1961416 1514069 1717230 2963165 4794528 5903420 5205840
42429 5205840 2941932 549787 -557764 32068 1719349 3337023 3731908 2687223
42421 2687223 1475673 1736967 3429955 4631198 3874532 1987431 959680 1615741 3144068
42412 3144068 4358348 4534813 3399170 1277342 -770900 -1672512 -1252467 -123358 1036364
42403 1036364 1766189 1917787 1966835 2662273 3810221 4112039 2945515 1541838 1443205
42394 1443205 2538171 3762844 4959991 6473079 7376854 6008206 2480569 -853159
42386h53159j029672J278336K219159J745752J91825j627010k200134r04912P49026
42377d30789R68348J69323M4800P42940Q47936n3043o93045k33240N85506Q40852
42367B789588O51519M70292K01226m00949j135977j564785j366435m23846R14765
42358A35398J713857J251479m689p80072m09566N27848R31434K33412j072925
42349B526176j751623j060469K07352O17322J48227J75009R82755R33811p63082
42340B015478k125284j118348R52727J136264p53628j970964j002722O35057J219094
42331a012326J063601R93785O22920m57474j226782m98792J150035J947744J032834
42322C615545p88234k048934j901817p41372K05360K50025L5814L25323N02076
$$ plain form
42386 -853159 -1882831 -604495 1614664 3360416 3552241 1925231 -274903 -1179815 -430789
42377 -430789 537559 706882 751682 1494622 2342558 2289515 1596470 1363230 1948736 2789588
42367 2789588 3441107 3911399 4112625 3711676 2575699 1010914 -355521 -779367 135398
42358 135398 1849255 3100734 3096045 2315973 1906407 2434255 3365689 3599101 2526176
42349 2526176 774553 -285916 -78564 538758 686985 861994 1844749 2778560 2015478
42340 2015478 -109806 -1228154 -275427 860837 107209 -1863755 -2866477 -2231420 -1012326
42331 -1012326 51275 1045060 1667980 1210506 -16276 -515068 634967 2582711 3615545
42322 3615545 2827311 778377 -1123440 -1864812 -1659452 -1409427 -1373613 -1048290 -546214
42313e46214m11920j580809j085816R45788K042137J040215n1457P06065J944625
42304C002614J137310j212999k077370l54635J574450J331427l20863r84875p2057
42295B023002P46650K12273q04906p83607J73284O37859J78428l1507N45888M34421
42285C331785j549465l654352k998086K34525K702681K385669Q19471J3553l79352
42276I06429j160972j157451P57096K740671K052572o46879k024279r89048R0217
42267E68356m38775j094402k94995P98829M45716n94436m37274P13028J117262
42258G83309N76308N15994J146621R85080l06731r02151K53440J416984O20561
42249E089415j133228j310979K67811J268937N40595l32122P5715O42677k75087
$$ plain form
42313 -546214 -958134 -2538943 -3624759 -2678971 -636834 403381 351924 1057989 3002614
42304 3002614 4139924 2926925 849555 494920 2069370 3400797 3079934 2095059 2023002
42295 2023002 2769652 2981925 2177019 1393412 1566696 2204555 2382983 2351476 2897364 3331785
42285 3331785 1782320 -1872032 -4870118 -4635593 -1932912 452757 1272228 1285781 906429
42276 906429 -254543 -1411994 -654898 2085773 4138345 3491466 1467187 478139 568356
42267 568356 129581 -964821 -1259816 -460987 -15271 -609707 -1046981 -333953 783309
42258 783309 1359617 1875611 3022232 4007312 3700581 2798430 3051870 4468854 5089415
42249 5089415 3956187 2645208 2913019 4181956 4722551 4390429 4466144 5108821 4833734
42240D833734j898603k080177o06535N79178L65757k45042k14629l195j82380
42231E48108j01701P69465J365151M75440j059588j338361k88487K47833m77726
42222A40134q61345M40249K176542K240007Q12407J6439O44410J059317q1970
42213F586190j576987j434301K7550N06326r31445k436548j989429k13047O10680
42204h51011k68854j247628q03396M88991J030711M73530p9067P1317K14023m79912
42194a451296j403819j180242K73576J415859J234027P01627J099557J712781
42186B402070Q35506j161865j805383j74876J386027N99097j327926j573170R7534
42177g22986J360408J132673P94579J268073J286997k71308k106568k063297l3942
$$ plain form
42240 4833734 2935131 854954 248419 827597 1193354 948312 733683 730488 548108
42231 548108 446407 1215872 2581023 3056463 1996875 658514 370027 617860 140134
42222 140134 -721211 -280962 1895580 4135587 4947994 4964433 5608843 6668160 6586190
42213 6586190 5009203 3574902 3602452 4108778 3177333 740785 -1248644 -1461691 -851011
42204 -851011 -1119865 -2367493 -3170889 -2681898 -1651187 -1177657 -1256724 -1185407 -971384 -1451296
42194 -1451296 -2855115 -4035357 -3761781 -2345922 -1111895 -410268 689289 2402070
42186 2402070 3237576 2075711 270328 95452 1481479 2080576 752650 -820520 -722986
42177 -722986 637422 1770095 2564674 3832747 5119744 4848436 2741868 678571 644629
42168F44629J959941K111130M75600j276902j332457M50475K002074J231397j102866
42159E163021k055198m50262J446536J147444p39870j803217j176279J2408O35934
42150B180517M05872n96523j671519j398817O28586K513869K171115K83033o43085
42141C873048J37745R39523N71368r8129L7123O73908R28045M53554p33295k243493
42131D539397k834904j463145Q02139J596911N61728l1550J171114K419491J667669
42122H428850k10000r61374m16198k02547p82558j051722o52770n18053r07359
42113B726269q52022o1308L30623l22983r76902n52974L57773N26465m9255m52288
42103F73398m25034m49321n17778r134J073359J693198J028533m40129j496303
$$ plain form
42168 644629 2604570 4715700 5191300 3914398 2581941 3032416 5034490 6265887 5163021
42159 5163021 3107823 2657561 4104097 5251541 4511671 2708454 1532175 1544583 2180517
42150 2180517 2586389 1989866 318347 -1080470 -451884 2061985 4233100 4516133 3873048
42141 3873048 4010793 4950316 5521684 5423555 5460678 6134586 7062631 7516185 6782890 4539397
42131 4539397 1704493 241348 1043487 2640398 3202126 3170576 4341690 6761181 8428850
42122 8428850 8218850 7257476 6841278 6638731 5856173 4804451 4151681 3633628 2726269
42113 2726269 1874247 1812939 2143562 1820579 843677 290703 648476 1174941 1125686 673398
42103 673398 248364 -200957 -718735 -727869 345490 2038688 3067221 2627092 1130789
42094A130789j503793q42302k95989l15821p00804p26229K29299J834290K734729
42085A544169J852972j84042j478163j013494J56104L98834k92159m76979M91583
42076I98825J508723J366746L69579m48916r21855j481764j792841j041724L67200
42067a076027Q24855k13484j185524n79632Q24000J119515O4513p91323n84900
42058a598007j37899j77518j40318M61817Q73503M77661K17185J100461K061000
42049C137885J156472j334022k917989k246029o65191J61305M16336Q84470J141534
42040b65229M99948l51713l22027J74231o5647q76328j000212k91482J48389J03402
42030b246668O36208J866988K195732P46698r21092r13639K32158M15220r28708
$$ plain form
42094 1130789 -373004 -1215306 -1511295 -1827116 -2527920 -3254149 -3024850 -1190560 1544169
42085 1544169 3397141 3213099 1734936 721442 877546 1276380 984221 507242 998825
42076 998825 2507548 3874294 4243873 3794957 2873102 1391338 -401503 -1443227 -1076027
42067 -1076027 -251172 -464656 -1650180 -2229812 -1405812 -286297 -221784 -1013107 -1598007
42058 -1598007 -1735906 -1913424 -2053742 -1591925 -718422 -240761 -23576 1076885 3137885
42049 3137885 4294357 2960335 42346 -2203683 -2868874 -2707569 -2291233 -1406763 -265229
42040 -265229 234719 -116994 -439021 -264790 -330437 -1206765 -2206977 -2498459 -2350070 -2246668
42030 -2246668 -1610460 256528 2452260 3198958 2277866 1364227 1596385 2011605 1082897
42021A082897k100573j511729L96849J894815J872750P38804j56803J13666R91635
42012C322311R12093p38262k455785k157984J76323K233536J976114j50295j987740
42003A130311k051902o21306J073417J951701J476729j96004k056886k728333
41995b022273j691973O6053J028619P15984m7328l08833O9367O51078J007227
41986e32079Q41237J02346o84527p38806r1477K51890k17069n27903L87205J849678
41976F40495K169052J029977j75104n37666p65084j536173j989751r52948J026167
41967a091035K057182J191770n13686j296262n22616Q69080J465316Q29934j04494
41958B885189j75938O20330J242142R66929P1990q12073j294270j090629j73504
$$ plain form
42021 1082897 -1017676 -2529405 -2132556 -237741 1635009 2373813 2217010 2330676 3322311
42012 3322311 4234404 3496142 1040357 -1117627 -941304 1292232 3268346 3118051 1130311
42003 1130311 -921591 -1542897 -469480 1482221 2958950 2762946 706060 -2022273
41995 -2022273 -3714246 -3648193 -2619574 -1903590 -1950918 -2259751 -2190384 -1539306 -532079
41986 -532079 309158 411504 -273023 -1011829 -1103306 -851416 -1068485 -1596388 -1209183 640495
41976 640495 2809547 3839524 3664420 3126754 2361670 825497 -1164254 -2117202 -1091035
41967 -1091035 966147 2157917 1644231 347969 -174647 694433 2159749 2989683 2885189
41958 2885189 2709251 3329581 4571723 5538652 5610642 4798569 3504299 2413670 2240166
41949B240166O75377L89048q32416j382761k94296J372506J884045Q63586p11624
41940D203631j770111j663406k93692J340782J573399J27744j071327l69408J203493
41931C281105J517787N35215m1062J63602k24088j530641k107103r34029P49578
41922A410364J363030R07064J9090j250774k474587k171779K46721K860994L238962
41913D149085J460616l17607q09904n94942m53395l08283l1747m7460o34010j338890
41903A073463j451232p23683M11717J116255Q74850J77490k1822K38429j01821
41894A593646j171623j385185K60858K180512K095857K36230j158899j112967
41886A538429p11110p22737n54997L5376K09521k32600k07999O57271J083102
$$ plain form
41949 2240166 2915543 3304591 2472175 1089414 795118 2167624 4051669 4915255 4203631
41940 4203631 2433520 770114 476422 1817204 3390603 3518347 2447020 2077612 3281105
41931 3281105 4798892 5334107 5293045 5456647 5232559 3701918 1594815 660786 1410364
41922 1410364 2773394 3680458 3699548 2448774 -25813 -2197592 -1950871 910123 4149085
41913 4149085 5609701 5292094 4482190 3887248 3433853 3125570 3093823 3046363 2412353 1073463
41903 1073463 -377769 -1101452 -689735 426520 1301370 1478860 1457038 1695467 1593646
41894 1593646 422023 -963162 -702304 1478208 3574065 3810295 2651396 1538429
41886 1538429 827319 104582 -450415 -415039 -205518 -438118 -646117 11154 1094256
41877A094256K76551n84313l22940K66041p531n02926N925Q35228L13731j206728
41867A67294j444799M71089K555896K490226L90250j555968j514603K62708J718223
41858C540316J093075r11228j733926l48573J102392M31466j088479o47610J422514
41849B859947J932779Q859j304212Q5301J864625J029429j293884j731564j7326
41840C433954P95637p62033k444469j745164P57192K568220K319042O64611q53231
41831D733759j066236k8405Q88467L96369r72005j381325k13637R72799N63019
41822C892805r71134j820803j076998N39124J702918J560576J87644j350062j696227
41813I67843n80273P53862J019829M24568N8285J32433j45139r43186j218900
$$ plain form
41877 1094256 1370807 786494 463554 729595 722064 219138 225063 1060291 1374022 167294
41867 167294 -1277505 -806416 1749480 4239706 4629956 3073988 1559385 1822093 3540316
41858 3540316 4633391 3722163 1988237 1639664 2742056 3173522 2085043 1437433 2859947
41849 2859947 4792726 4801585 3497373 3582674 5447299 6476728 5182844 3451280 3433954
41840 3433954 4229591 3467558 1023089 -722075 35117 2603337 4922379 5586990 4733759
41831 4733759 3667523 3639118 4527585 4923954 3951949 2570624 2356987 3329786 3892805
41822 3892805 2921671 1100868 23870 562994 2265912 3826488 4014132 2664070 967843
41813 967843 387570 1141432 2161261 2585829 2644114 2776547 2631408 1688222 469322
41804D69322l10439P85005O54713m97641j146208o49650K1052M7370J2973N64264
41794d9239R10558N0879j143492q30263Q61825J651823M15912j093229r26278
41785a51504J92445K64978p71777j150019j80238Q02846N73956m01580r66938
41776a787831p65214k40686J23867J94080K25095N75391J073653J022570L09891
41767G30816j34391K11064L61297n89395j558036q57858R60761J648595O15943
41758A388796l04801J62830R62837O40722o11734j668433j857756j019415M71051
41749a835903J326899N77945n28661J39093J951675J801585r51162k763657j102602
41740a384788J412721R14171j807033k750552q28823J080223Q94620k03416m63270
$$ plain form
41804 469322 158883 943888 1598601 1100960 -45248 -694898 -673846 -626476 -613503 -49239
41794 -49239 861319 912198 -231294 -1061557 -199732 1452091 1868003 774774 -151504
41785 -151504 40941 305919 -465858 -1615877 -1796115 -993269 -419313 -820893 -1787831
41776 -1787831 -2553045 -2793731 -2669864 -2475784 -2250689 -1675298 -601645 420925 730816
41767 730816 596425 807489 1168786 579391 -978645 -1836503 -875742 772853 1388796
41758 1388796 1083995 1246825 2209662 2850384 2238650 570217 -1287539 -2306954 -1835903
41749 -1835903 -509004 68941 -459720 -320627 1631048 3432633 2481471 -282186 -1384788
41740 -1384788 27933 942104 -864929 -3615481 -4444304 -3364081 -2469461 -2672877 -3136147
41731c136147N5377N60367Q51116Q42437L92183L643K66930N98073J06886n42791
41721a926q2822Q01712K00469j690683k486474j247070L38305R92342J417950
41712a758197J934538J350209l78567j044105L54774J473197K04447j756481j611960
41703a232145M2331N03492m22573m36640R99062J723437O16974o36162n04780
41694F52996J08559j01656m93777J49637J239714J201273J4409p67768m21721
41685A581666J3867m39403j120987p69844N08475J306395Q69756O5844K9600N72147
41675B617516O34770r9079q76949j023447o39696j69252M7695j79526o16515n19677
41665h24160L73412J028778L82282q18293r01422L4371J54328r88531j437785
$$ plain form
41731 -3136147 -3080770 -2520403 -1669287 -826850 -434667 -431024 -164094 433979 540865 -1926
41721 -1926 -84748 716964 917433 -773250 -3259724 -4506794 -4168489 -3176147 -1758197
41712 -1758197 176341 1526550 1147983 103878 458652 1931849 2136296 379815 -1232145
41703 -1232145 -1189814 -686322 -1108895 -1545535 -546473 1176964 1793938 1157776 652996
41694 652996 761555 659899 166122 315759 1555473 2756746 2771155 2003387 1581666
41685 1581666 1595533 1156130 35143 -734701 -226226 1080169 1949925 2015769 2045369 2617516
41675 2617516 3252286 3153207 2276258 1252811 613115 443863 491558 312032 -304483 -824160
41665 -824160 -450748 578030 960312 142019 -759403 -725032 -570704 -1559235 -2997020
41656b997020L0856J735775J641264M42341J45968Q19824R62487L34462J23186
41647C239143N81535O82217J76786j2238K51184j62531j587376k602590j914729
41638a348599o5971J390317J562964O77313l29145m39261M22421J004181K78991
41629C153211q58329p45194M14883Q06909j6179m49151K77314O53216m69870j708068
41619A058742j304539M2877M89556Q4649K80098R92922N84334j069068j767047
41610f07476j72760J910049J834291l00803j878337j325293j6607j04818j412375
41601b074129j642649L46272K670938K691077M74826j340770j099702j3684J05498
41592A17677m63689k47223Q00089J266315O03895j51967j82329J8054j72901m16044
$$ plain form
41656 -2997020 -2966164 -1230389 410875 853216 999184 1819008 2781495 3115957 3239143
41647 3239143 3820678 4502895 4679681 4667443 4918627 4756096 3168720 566130 -1348599
41638 -1348599 -1414570 -24253 1538711 2216024 1886879 1447618 1870039 2874220 3153211
41629 3153211 2294882 1549688 1964571 2771480 2755301 2306150 2583464 3236680 2766810 1058742
41619 1058742 -245797 -202920 286636 371285 651383 1644305 2228639 1159571 -607476
41610 -607476 -780236 1129813 2964104 2663301 784964 -540329 -556936 -661754 -2074129
41601 -2074129 -3716778 -3370506 -699568 1991509 2466335 1125565 25863 12179 117677
41592 117677 -346012 -593235 206854 1473169 2077064 1925097 1742768 1760822 1587921 1171877
41582A171877j96599K21230L45982K21916l3257o84541j565327j575391j07135
41573b201245J545578J513385p8025j190545o47643M99583P93246K55674l10776
41564A79232p51185j166248r72790K57644J516019J394700K42641k58099K05902
41555F47816p9j661813k957476j843717Q55717K381072J626160K07964p5671O35122
41545a84905J169057J130679R42518Q07715N40562J23452k99445q18930j504083
41536A906620j862985j294199j74885K74968l71427r18647r1886J512357K009474
41527I89390P32554q92080j296860n89310J93492O55485Q78129N06209o46754
41518E30255j516526q06896R59018J817418R30587n62056j429743j643465j474969
$$ plain form
41582 1171877 975278 1196508 1542490 1764406 1731149 1046608 -518719 -2094110 -2201245
41573 -2201245 -655667 857718 779693 -410852 -1058495 -558912 234334 490008 179232
41564 179232 -571953 -1738201 -2710991 -2453347 -937328 457372 700013 441914 647816
41555 647816 647737 -1014076 -3971552 -5815269 -4959552 -2578480 -952320 -744356 -820027 -184905
41545 -184905 984152 2114831 3057349 3865064 4405626 4529078 4229633 3410703 1906620
41536 1906620 43635 -1250564 -1425449 -1150481 -1521908 -2440555 -2532441 -1020084 989390
41527 989390 1721944 829864 -466996 -1056306 -862814 -207329 670800 1177009 530255
41518 530255 -986271 -1793167 -834149 983269 1913856 1351800 -77943 -1721408 -3196377
41509c196377q61261k03934k43221m99425M48531K311428K715971Q05695q63319
41500D14088o579J669491J047413j438035k474402r32568Q56855R99054L11670
41491D46987R1764J58616N5408O6297O8726p19170j903805j705922L16942K066406
41481a057751J660872p4127j065952o03793O34452J828270K139836R13335j039640
41472C335502j623202j61569J357960J035636l29690r19689p96181j144498j664394
41463i10125r93169O87602J604755J003212N5229n7275M39737O76652K46282o14340
41453B138560j152174n49314R70390J867377J053236n37219j238196j027417j254604
41444B70639k245650k618513j176296J529519L693433L723912J500676j200966
$$ plain form
41509 -3196377 -4057638 -4261572 -4504793 -5004218 -4555687 -2244259 471712 1277407 414088
41500 414088 407509 2077000 3124413 1686378 -788024 -1720592 -863737 135317 446987
41491 446987 538751 697367 752775 819072 887798 168628 -1735177 -3441099 -3124157 -1057751
41481 -1057751 603121 528994 -536958 -1140751 -506299 1321971 3461807 4375142 3335502
41472 3335502 1712300 1550731 2908691 3944327 3614637 2694948 1898767 754269 -910125
41463 -910125 -1903294 -1215692 389063 1392275 1447504 1390229 1829966 2506618 2752900 2138560
41453 2138560 986386 437072 1407462 3274839 4328075 3790856 2552660 1525243 270639
41444 270639 -1975011 -4593524 -5769820 -4240301 -546868 3177044 4677720 3476754
41436C476754k095780r24245K00015k06023r24009l34915O92322L84771o22815
41427c53925l13722R82958R60821n76406j194510P927Q88139Q9153o39904L00303
41417A50834J490290J101374R9569K73845Q72299O3317j486040j506426q271O80467
41407A731258k41576r09810k8309J156802J087375J86962k84229k74054n50825
41398A873594j145797j358549q94253j51574L67079L82010j24791p29502p29833
41389b511616M0752P78844N44313n49517j340102q54190O52626J949566K039193
41380G49869J066184L9014k68288r748J29942j67944n07889l11589L57978O35101
41370A712630j81758j451851j590337j47328J162718N31023j273672j771770l23892
$$ plain form
41436 3476754 1380974 456729 656744 450721 -473288 -808203 -115881 268890 -353925
41427 -353925 -667647 315311 1276132 699726 -494784 -486857 401282 490435 -149469 150834
41417 150834 1641124 2742498 2842067 3115912 3988211 4051528 2565488 1059062 1050791 1731258
41407 1731258 1489682 579872 551563 1708365 2795740 2982702 2698473 2424419 1873594
41398 1873594 727797 -630752 -1525005 -1676579 -1309500 -927490 -1052281 -1781783 -2511616
41389 -2511616 -2470864 -1692020 -1147707 -1697224 -3037326 -3891516 -3238890 -1289324 749869
41380 749869 1816053 1855067 1586779 1577031 1706973 1539029 1031140 719551 1077529 1712630
41370 1712630 1530872 79021 -1511316 -1658644 -495926 35097 -1238575 -3010345 -3334237
41361c334237R54527M65761n05463n2900J241457J394991K96721l00757K50039
41352D10139P25766M26521K33530O33951O18178l97790j205339p39890m8791o54402
41342A873j882938j722847N3685J552195J627173J233785J334348J182352j18513
41333C261113j610241j642535m35479K02673l33785o24578K81809J113141L37464
41324E49582j169094j127646P25624J982540Q33698j428573k199546r19335O33483
41315b119267R69508M41910O7297K8740m4749j38856j2966J04479k22118p82212
41305a708234q46409k56667K50264J13966k04355L0180O09984O26944j66585r74751
41295b525663j047700m42559N02832J604687K299854J659615j66907j366293n89997
$$ plain form
41361 -3334237 -2379710 -1913949 -2419412 -2472312 -1230855 164136 460857 160100 410139
41352 410139 1135905 1562426 1795956 2429907 3048085 2650295 1444956 705066 656275 1873
41342 1873 -1881065 -3603912 -3550227 -1998032 -370859 862926 2197274 3379626 3261113
41333 3261113 1650872 8337 -427142 -224469 -558254 -1182832 -901023 212118 549582
41324 549582 -619512 -1747158 -1021534 961006 1794704 366131 -1833415 -2752750 -2119267
41315 -2119267 -1149759 -707849 -640552 -611812 -656561 -795417 -808383 -703904 -926022 -1708234
41305 -1708234 -2554643 -2811310 -2561046 -2447080 -2651435 -2621255 -2011271 -1384327 -1550912 -2525663
41295 -2525663 -3573363 -4015922 -3513090 -1908403 391451 2051066 1884159 517866 -72131
41286g2131R22152R16941m88741r36242M44567J577250O80361r86778j232532
41277H24847k90223l0895p30408q52832J89765J156993J086629M97953P3657k76986
41267A648500n22415j88948L92434j3210j483606k133569n85860J821297K690337
41258A624960J670773M17641q7180n11857j405517k008156j472260k23603P13109
41249a282090J110527J400922J468378N84699j183940k325323j480752N29836
41241a177743J306633j39463j936772j737313K04951J621764J446986P58267M59096
41232H06406r082q89764r76802L13833J331808N33286q01327m47545J028385J105978
41222A995176l95186q88880N56703J453724L4523j606231q29824J198266J362620
$$ plain form
41286 -72131 850021 1766962 1278221 341979 786546 2363796 3044157 2057379 824847
41277 824847 534624 503729 -226679 -1079511 -889746 267247 1353876 1851829 1925486 1648500
41267 1648500 1126085 937137 1329571 1316361 -167245 -2300814 -2886674 -1065377 1624960
41258 1624960 3295733 3713374 3626194 3114337 1708820 -299336 -1771596 -1995199 -1282090
41249 -1282090 -171563 1229359 2697737 3282436 2098496 -226827 -1707579 -1177743
41241 -1177743 128890 -10573 -1947345 -3684658 -3479707 -1857943 -410957 347310 806406
41232 806406 797324 -92440 -1069242 -755409 576399 1109685 308358 -139187 889198 1995176
41222 1995176 1599990 711110 1267813 2721537 2756060 1149829 320005 1518271 2880891
41213B880891m99343j679638j071241l69964n55169k70393J201793K034785O70435
41204B342156j447488j928605q29724Q723J075P6995M68848L86818j30919j514
41194a053635R16732J315544N34653k54471J92465J324827J624570N93775r25624
41185D268836j919008j938549j057909J65490Q42904N01589k92595m90414J65869
41176B46213P13543M2064j638870k695079j788010M11520J866784J686989J140472
41167a4374J634040K655409K748634J705646M09131q53153k218687k844929j745935
41158A475782N772J84882j127848j428695J09975J095285j02787j494749q00497
41149b082880P10460N64370n54420j60249J433576J532304k43625j320991n86572
$$ plain form
41213 2880891 2381548 701910 -369331 -739295 -1294464 -1564857 -363064 1671721 2342156
41204 2342156 894668 -1033937 -1863661 -1854938 -1853863 -1776868 -1308020 -921202 -1052121 -1053635
41194 -1053635 -136903 1178641 1713294 1458823 1651288 2976115 4600685 5194460 4268836
41185 4268836 2349828 411279 -646630 -481140 361764 863353 570758 80344 246213
41176 246213 959756 1001820 -637050 -3332129 -5120139 -4708619 -2841835 -1154846 -14374
41167 -14374 1619666 4275075 7023709 8729355 9138486 8285333 6066646 3221717 1475782
41158 1475782 1481554 1666436 538588 -890107 -780132 315153 212366 -1282383 -2082880
41149 -2082880 -1372420 -808050 -1362470 -1522719 -89143 1443161 1199536 -121455 -708027
41140g08027M9737n72783q19642M97991J718041J110589k77641o48653l52258
41131b646n65326p71400J7665P95034j13963j963595k289055m87512J442365J781620
41121b156813Q55569k43192r93241j102840k35296J292961K359856K033537M03375
41112B213916j459148k090793q32402J017342J176984o30260j829298m51575J808013
41103a077221J933435O226j175814m48219M78190L04901n5689K50014M45564K9562
41093F90949N4582R96408J256959l97960k406263k387130n27505R27999Q90111
41084i01850K76644R563r7293m03865p36438p90762m01803M64487J298575J129926
41074a52816p5075p64421K06577J540574J067224r53920j966796p71752Q09997
$$ plain form
41140 -708027 -658290 -1231073 -2050715 -1552724 165317 1275906 998265 349612 -2646
41131 -2646 -567972 -1339372 -1321707 -526673 -640636 -2604231 -4893286 -5380798 -3938433 -2156813
41121 -2156813 -1301244 -1544436 -2537677 -3640517 -3875813 -2582852 -222996 1810541 2213916
41112 2213916 754768 -1336025 -2168427 -1151085 25899 -604361 -2433659 -2885234 -1077221
41103 -1077221 856214 862440 -313374 -761593 -283403 21498 -34191 215823 661387 690949
41093 690949 745531 1741939 2998898 2600938 194675 -2192455 -2719960 -1791961 -901850
41084 -901850 -625206 -615643 -712936 -1116801 -1853239 -2644001 -3045804 -2581317 -1282742 -152816
41074 -152816 -227891 -992312 -785735 754839 1822063 868143 -1098653 -1870405 -1060408
41065a060408O93837o06831j074713r4688J105489J431938J055629N99267K56116
41056B305636K6616P4039L19231J15366j011740k368921k522419j018993Q54890
41047c226295J526481Q78839j19089r51985j578138j316464N35276K737984K741416
41038A228025K19084j881045j261492N04955O62406m44314n25847K95043k64341
41029a467526k107525k149537O64948L057096K097837m85892j188422J29396Q74294
41020e75331K28841q3473P92858J517509J032479J07661k68101k75030l22460
41011B154953j83129J85106J64861m30620p96028l50042L60018N96688M41840
41002B143647K23664k49408j095827j651674j223808j62654N86028P16991O27674
$$ plain form
41065 -1060408 -366571 -973402 -2048115 -2142803 -1037314 394624 1450253 2049520 2305636
41056 2305636 2332252 2406291 2725522 2840888 1829148 -539773 -3062192 -4081185 -3226295
41047 -3226295 -1699814 -820975 -940064 -1892049 -3470187 -4786651 -4251375 -1513391 1228025
41038 1228025 1447109 -433936 -1695428 -1190473 -528067 -972381 -1498228 -1203185 -1467526
41029 -1467526 -3575051 -5724588 -5059640 -2002544 95293 -390599 -1579021 -1449625 -575331
41020 -575331 -346490 -429963 362895 1880404 2912883 3020544 2752443 2477413 2154953
41011 2154953 1971824 2156930 2321791 1891171 1095143 745101 1105119 1701807 2143647
41002 2143647 2367311 2117903 1022076 -629598 -1853406 -2016060 -1430032 -713041 -85367
40993h5367M62849q2371r31936j330083p56241K67063P45946M62497J67434M00756
40983f79453O10459n2811j324990j950429j294001r5889O51454Q21077P16640
40974b597943L57881q0686J14705J177610K056865J704256O58099J56654J54275
40965C701716l41350j268732j521971r47121n76905o35604j52128R13337J088214
40956B59456j34437j084114m76778M95464K58381m64257o6430R94548R78285n2299
40946G07819l45100M56105P19087k90420j108384m90716O91855J059165P46317
40937B145728O01626N30009j9667p21372q60508o49891q08576j148301q37960
40928a768912j2372J30692q59390j821861j512692k74279N32094L43363j21467
$$ plain form
40993 -85367 377482 295111 -636825 -1966908 -2723149 -2456086 -1710140 -1247643 -1080209 -679453
40983 -679453 -68994 -121805 -1446795 -3397224 -4691225 -4787114 -4135660 -3314583 -2597943
40974 -2597943 -2240062 -2320748 -2206043 -1028433 1028432 2732688 3390787 3547441 3701716
40965 3701716 3360366 2091634 569663 -377458 -954363 -1589967 -1742095 -828758 259456
40956 259456 125019 -959095 -1435873 -940409 -682028 -1146285 -1212715 -218167 760118 707819
40946 707819 362719 818824 1537911 1247491 139107 -351609 340246 1399411 2145728
40937 2145728 2747354 3277363 3257696 2536324 1675816 1025925 217349 -930952 -1768912
40928 -1768912 -1781284 -1650592 -2509982 -4331843 -5844535 -6118814 -5586720 -5243357 -5364824
40919e364824q3919L35780O12742P05973R80668J487718J798141J550642Q29494
40910B852415m1875q17761j372439j610074j410841o78292L86384J071379P29656
40901h91448j61010j90412J099209K217749J617129m5842r11144p05929p26080
40892A302222j183254q08403M61446Q21227l11549r37028J75399J104618j2884
40883F11794j532802r96786M46613o7332j822578j292928J728371L064262M87748
40874F26362k682850k454779L94318K281448J907810O18022o87948k108717k997335
40865e103669k238026j57114J648784K272959J982659J203255L29002L2097M76827
40856D46774P50539K40092j67080M55417J283745R79692o1512m52978j88350l81428
$$ plain form
40919 -5364824 -5448743 -5112963 -4500221 -3794248 -2813580 -1325862 472279 2022921 2852415
40910 2852415 2810540 1992779 620340 -989734 -2400575 -3078867 -2692483 -1621104 -891448
40901 -891448 -1052458 -1242870 -143661 2074088 3691217 3645375 2734231 2028302 1302222
40892 1302222 118968 -689435 -227989 593238 281689 -655339 -479940 624678 611794
40883 611794 -921008 -1917794 -1471181 -1538513 -3361091 -4654019 -2925648 138614 626362
40874 626362 -2056488 -4511267 -4116949 -1835501 72309 690331 2383 -2106334 -5103669
40865 -5103669 -7341695 -7498809 -5850025 -3577066 -1594407 -391152 -62150 -30053 446774
40856 446774 1197313 1437405 1270325 1725742 3009487 3989179 3927667 3474689 3286339 2904911
40846B904911j042651j080277l67842R1369M9646K10009M79785n5654j162202
40837B7094j355356k34439Q37928R33649P45013R50307J058441O45954J91842
40828C800433j11427q33308j764536j569189m6475R43372J97650p74386j37355
40819b95221J233851J230388K6329l36034M85524N43887r94713k156479j018266
40810a280734J354407K287994R52788r45183j593179r98801l71519m45765q56846
40801a896838q27641r1093Q45498J201736O81757k03726n70774L4103J228898
40792D01920K155566K173298J223450k27782j371986j437769m14434O28876N49688
40783C680827m37707j024317o62644k00556k07747J11338J285910J997738P80038
$$ plain form
40846 2904911 1862260 781983 414141 505510 555156 765165 1244950 1189296 27094
40837 27094 -1328262 -1562701 -724773 208876 953889 1904196 2962637 3608591 3800433
40828 3800433 3689006 2855698 1091162 -478027 -524502 418870 616520 -157866 -295221
40819 -295221 938630 2169018 2195347 1859313 2344837 2888724 1894011 -262468 -1280734
40810 -1280734 73673 2361667 3314455 2369272 776093 -222708 -594227 -1039992 -1896838
40801 -1896838 -2724479 -2815572 -1970074 -768338 -86581 -290307 -861081 -826978 401920
40792 401920 2557486 4730784 5954234 5726452 4354466 2916697 2502263 3131139 3680827
40783 3680827 3243120 2218803 1556159 1355603 1147856 1259194 2545104 4542842 5322880
40774E322880j402143k217456j343645o53270r10511o64986P70838J604119L87511
40765H93337j306112j050088Q23850J876900J092435k90283j092751j344953j122510
40756a520175j16485J242417J746991J028540N8678l33789l49943l32072k08832
40747A215330k75448j243553k734786k865031m94596K731838L782045J603545
40739A719344j684929l025496j379841J533090L067820K112054j33979j662559
40731E45504j621031n70159O59617J520609J415039P1216j432011j287805N92559
40722a06462J860916O56770j603301j972275j20098J201090J93515j414126j051252
40713b355223Q64648J637634K78312j211923q65941O19621J225851M41852m99091
$$ plain form
40774 5322880 3920737 1703281 359636 -293634 -1204145 -1869131 -1098293 505826 893337
40765 893337 -412775 -1462863 -639013 1237887 2330322 2040039 947288 -397665 -1520175
40756 -1520175 -1636660 -394243 1352748 2381288 2439966 2106177 1756234 1424162 1215330
40747 1215330 939882 -303671 -3038457 -5903488 -6398084 -3666246 115799 1719344
40739 1719344 34415 -2991081 -4370922 -2837832 229988 2342042 2208063 545504
40731 545504 -1075527 -1645686 -986069 534540 1949579 2020795 588784 -699021 -106462
40722 -106462 1754454 2411224 807923 -1164352 -1284450 -83360 110155 -1303971 -2355223
40713 -2355223 -1490575 147059 425371 -786552 -1652493 -1032872 192979 634831 135740
40704A35740o59032l90592l14264l49931r2686M93525J093353J390410J236805
40695B543328P55014K83956n8253n89889j413145j826622j113834K41273J027314
40686a50858R77503R16615J094396O71931n51542j210337k57591J198731J282599
40677C971447l2177j091225j017203n33707l52156k22275K9177j52273r29694
40668c30086j333272n82048N21646N56268m56250r88906j28993J116245J136015
40659d89381j77018j336459j177049j38918O32816Q21189R15737J062127Q68874
40650I81918L64202J90302N06669N12056m25993j784759k528262k194926r57712
40641e336505O85340J771469J271019n60451j906057j355954L83980J548159J428990
$$ plain form
40704 135740 -523292 -913884 -1228148 -1578079 -1670765 -1177240 -83887 1306523 2543328
40695 2543328 3298342 3582298 3524045 2934156 1521011 -305611 -1419445 -1178172 -150858
40686 -150858 826645 1743260 2837656 3509587 2958045 1747708 1490117 2688848 3971447
40677 3971447 3939270 2848045 1830842 1297135 944979 722704 751881 599608 -330086
40668 -330086 -1663358 -2245406 -1723760 -1167492 -1623742 -2612648 -2741641 -1625396 -489381
40659 -489381 -666399 -2002858 -3179907 -3318825 -2686009 -1864820 -949083 113044 981918
40650 981918 1346120 1536422 2043091 2555147 2129154 344395 -2183867 -4378793 -5336505
40641 -5336505 -4651165 -2879696 -1608677 -2169128 -4075185 -5431139 -5047159 -3499000 -2070010
40632b070010N77065l23142o78337J15343J678094K299651J073720m17290l33910
40623A921184L75710m37297k078553j643162J066801K578295Q80084j566992j821266
40614g25196p10041o05396j227227p10242O51199R57586K06571R2035O17284M1565
40604a411862j578863j848286J45301K139793K023052N71750m65482r10946j139512
40595b475055m02379J706738L368665K415660m22269k151121j281069P04276J665592
40586C129038J070975k62023j308958j301485j58120J061568J004425k67202j226212
40577A742006r09535r9006O5451k44084j10790N15449P74888K19837o87265j316964
40567e0013j389274q33588J17893P41263N58161K96360J104413K537249K532631
$$ plain form
40632 -2070010 -1492945 -1816087 -2494424 -2379081 -700987 1598664 2672384 2255094 1921184
40623 1921184 2296894 1859597 -218956 -1862118 -795317 1782978 2663062 1096070 -725196
40614 -725196 -1435237 -2040633 -3267860 -3978102 -3326903 -2369317 -2162746 -2070711 -1453427 -1411862
40604 -1411862 -2990725 -4839011 -4693710 -2553917 -530865 40885 -424597 -1335543 -2475055
40595 -2475055 -2877434 -1170696 2197969 4613629 4191360 2040239 759170 1463446 3129038
40586 3129038 4200013 3937990 2629032 1327547 1169427 2230995 3235420 2968218 1742006
40577 1742006 832471 733465 798916 554832 444042 959491 1734379 1954216 1266951 -50013
40567 -50013 -1439287 -2272875 -2154982 -1413719 -855558 -559198 545215 3082464 5615095
40558E615095K16080k314603k345480j48318J319757L21374j599864j997311o22524
40549a555794Q48866J278889R92570N99943J33365m50966p85779n47801N703K86318
40539H05314Q714n57197q72316o43622j16277K10543J86334J54540M50456R95696
40529F22185J436571J382238N48777p81671j421898k56193K096389L527305K975548
40520A0129251J782816J705159K740258M287789P163576J1926086J5547964J2931348
40512F8214247L125268q159932j4103266j3465719j0092495p283812n213146l280809
40504I740336k027417j850398j863800j259069n35312l48058k32816M01316Q98013
40495B922795K64372j066431j652816j006752J0658O79936J164178J611572J599393
$$ plain form
40558 5615095 5831175 3516572 1171092 1022774 2342531 2663905 1064041 -933270 -1555794
40549 -1555794 -706928 571961 1564531 2164474 2297839 1846873 1061094 513293 518996 805314
40539 805314 814028 256831 -615485 -1259107 -1375384 -1164841 -978507 -823967 -373511 622185
40529 622185 2058756 3440994 3989771 3208100 1786202 1530009 3626398 7153703 10129251
40520 10129251 11912067 13617226 16357484 20645273 27808849 39734935 55282899 68214247
40512 68214247 71339515 63179583 49076317 35610598 25518103 18234291 13021145 9740336
40504 9740336 7712919 5862521 3998721 2739652 2204340 1856282 1623466 2024782 2922795
40495 2922795 3187167 2120736 467920 -538832 -528174 151762 1315940 2927512 4526905
40486D526905Q75929j75045j172278k014141k182252q72248J412766K482575R73465
40477C855676j439742j904379j99166J036692Q8242j612803j846381n96800N91896
40468b026765J028525J044308N72275o15408j583022j013138N70945J129222P4237
40459h18821p90879o0689J175253J212738L53051P5264M78552L02598q08129j672748
40449e53810j335378k17604P28826J066027Q75088N11558M53331P05271M88339
40440B721648o44291j656298j173938L41103R98212K18835m89267R666Q29862
40431A155532P20895q5037p83336j421662k089465j905454m31854Q86325N32667
40422c421389n43877k05615J491680K363670J493276L27340K9957n0415n14362
$$ plain form
40486 4526905 5402834 5227789 4055511 2041370 -140882 -1013130 399636 2882211 3855676
40477 3855676 2415934 511555 312389 1349081 1437323 -175480 -2021861 -2618661 -2026765
40468 -2026765 -998240 46068 618343 2935 -1580087 -2593225 -2022280 -893058 -818821
40459 -818821 -1609700 -1670389 -495136 717602 1070653 1145917 1624469 1927067 1118938 -553810
40449 -553810 -1889188 -2106792 -1377966 -311939 563149 1074707 1528038 2233309 2721648
40440 2721648 2077357 421059 -752879 -411776 586436 805271 316004 325670 1155532
40431 1155532 1876427 1791390 1008054 -413608 -2503073 -4408527 -4840381 -3954056 -3421389
40422 -3421389 -3965266 -4170881 -2679201 -315531 1177745 1505085 1535042 1484627 970265
40413I70265n98267J28638N68000m0173o27369j72737L86780j38091q64167k77685
40403f64806R60187R66455j31490l90966N43755P82102m69026j310127j77803
40394A08281J460336J210416o51478j588764l44925J610234K253885J328560P1802
40385E458347n10717m89508m42020n70968n88180l51779k36293n53843q87802
40376H27237n98026R0116K47856l36457o69475P1174J285659J673805Q40824l88672
40366C044041j060441r85083n83744k30086R2690N08513P35280K30036q62251
$$ plain form
40413 970265 371998 500636 1068636 1028463 401094 228357 615137 477046 -387121 -664806
40403 -664806 295381 1261836 1130346 739380 1283135 2065237 1596211 286084 108281
40394 108281 1568617 2779033 2127555 538791 193866 1804100 4057985 5386545 5458347
40385 5458347 4947630 4458122 4016102 3445134 2856954 2505175 2268882 1715039 827237
40376 827237 229211 319327 567183 230726 -438749 -367575 918084 2591889 3432713 3044041
40366 3044041 1983600 998517 414773 184687 277377 785890 1521170 1751206 888955
$$ [...]
##END NTUPLES=NMR SPECTRUM
##END=
