##TITLE=31Pdec_LR-685A-AK2
 D2O, 24 sc
 1.6.2020
##JCAMPDX= 6.0         $$ Bruker NMR JCAMP-DX V2.0
##DATA TYPE= NMR SPECTRUM
##DATA CLASS= NTUPLES
##ORIGIN= UXNMR, Bruker Analytische Messtechnik GmbH
##OWNER= root
$$ XWIN-NMR		Version 3.5
$$ Mon Jun  1 12:04:20 2020 Russian Standard Time (UT+4h)  she@DPX200
##.OBSERVE FREQUENCY= 81.013821
##.OBSERVE NUCLEUS= ^31P
##.ACQUISITION MODE= SIMULTANEOUS
##.ACQUISITION SCHEME= undefined
##.AVERAGES= 24
##.DIGITISER RES= 17
##SPECTROMETER/DATA SYSTEM= spect
##.PULSE SEQUENCE= zgpg30
##.SOLVENT NAME= CDCl3
##.SHIFT REFERENCE= (INTERNAL, CDCl3, 0, 182.463)
##AUDIT TRAIL= $$ (NUMBER, WHEN, WHO, WHERE, WHAT)
$$ ##TITLE= Audit trail, XWIN-NMR		Version 3.5
$$ ##JCAMPDX= 5.01
$$ ##ORIGIN= Bruker BioSpin GmbH
$$ ##OWNER= she
$$ F:/spectra/data/she/nmr/P31/1/pdata/1/auditp.txt
$$ ##AUDIT TRAIL=  $$ (NUMBER, WHEN, WHO, WHERE, WHAT)
(   1,<2020-06-01 12:03:25.84 +0400>,<she>,<DPX200>,
      <created by zg, POWCHK disabled, PULCHK disabled
       configuration hash MD5:
       00 E9 B6 7A A2 85 ED C7 34 08 36 98 17 FE 4E 26
       data hash MD5: 32K
       30 B9 A7 91 50 F7 55 FB 84 EF DA FC B4 0D 6E 17>)
(   2,<2020-06-01 12:03:35.20 +0400>,<she>,<DPX200>,
      <Start of raw data processing
       efp BC_mod = 2 LB = 1 FT_mod = 6 PKNL = 1 PHC0 = -1879.237 PHC1 = 566.002 SI = 64K 
       data hash MD5: 64K
       2E 9D 6C 86 8E 11 EB E5 A7 5F 06 22 6A C3 80 CD>)
(   3,<2020-06-01 12:03:48.60 +0400>,<she>,<DPX200>,
      <pk PHC0 = -5.269079 PHC1 = 0 
       data hash MD5: 64K
       C1 8A 45 08 16 2A F1 20 6C 61 87 D5 F4 B2 D8 16>)
(   4,<2020-06-01 12:03:51.87 +0400>,<she>,<DPX200>,
      <abs ABSG = 5 
       data hash MD5: 64K
       5B 93 8C CD 40 46 D9 57 2F E8 B1 77 C4 E6 FA A3>)
$$ ##END=
$$ 
$$ hash MD5
$$ E6 EC F3 22 A4 0C D3 B1 28 CC F9 DD E8 58 97 19
##$RELAX= 
##$RELAX= 
##$RELAX= 
##$RELAX= 
##$RELAX= 
##$RELAX= 
##$RELAX= 
##$RELAX= 
$$ Bruker specific parameters
$$ --------------------------
##$DU= <F:/spectra>
##$EXPNO= 1
##$NAME= <P31>
##$PROCNO= 1
##$TYPE= <nmr>
##$USER= <she>
##$AMP= (0..31)
100 100 100 100 100 100 100 100 100 100 100 100 100 100 100 100 100 100 
100 100 100 100 100 100 100 100 100 100 100 100 100 100 
##$AQSEQ= 0
##$AQ_mod= 1
##$AUNM= <au_zg>
##$AUTOPOS= <>
##$BF1= 81.014009
##$BF2= 200.13
##$BF3= 200.13
##$BF4= 200.13
##$BF5= 200.13
##$BF6= 200.13
##$BF7= 200.13
##$BF8= 200.13
##$BYTORDA= 1
##$CFDGTYP= 0
##$CFRGTYP= 5
##$CHEMSTR= <none>
##$CNST= (0..31)
1 1 145 1 1 1 1 1 1 1 1 1 1 1 1 1 1 1 1 1 1 1 1 1 1 1 1 1 1 1 1 1 
##$CPDPRG= <waltz16>
##$CPDPRG1= <>
##$CPDPRG2= <waltz16>
##$CPDPRG3= <>
##$CPDPRG4= <mlev>
##$CPDPRG5= <mlev>
##$CPDPRG6= <mlev>
##$CPDPRG7= <mlev>
##$CPDPRG8= <mlev>
##$CPDPRGB= <>
##$CPDPRGT= <>
##$D= (0..31)
0 1 0 0 0 0 0 0 0 0 0 0.03 2e-05 3e-06 0 0 0 0 0 0 0 0 0 0 0 0 0 0 0 0 
0 0 
##$DATE= 1590998605
##$DBL= (0..7)
120 120 120 11 120 120 24 19 
##$DBP= (0..7)
150 150 150 150 150 150 150 150 
##$DBP07= 0
##$DBPNAM0= <>
##$DBPNAM1= <>
##$DBPNAM2= <>
$$ [...]
##$SUBNAM3= <"">
##$SUBNAM4= <"">
##$SUBNAM5= <"">
##$SUBNAM6= <"">
##$SUBNAM7= <"">
##$SUBNAM8= <"">
##$SUBNAM9= <"">
##$SW= 369.568048894756
##$SWIBOX= (0..15)
0 1 3 0 0 0 0 0 0 0 0 0 0 0 0 0 
##$SW_h= 29940.119760479
##$TD= 32768
##$TD0= 1
##$TE= 0
##$TE2= 300
##$TE3= 300
##$TEG= 300
##$TL= (0..7)
0 120 53 12 22 120 120 120 
##$TP= (0..7)
150 150 150 150 150 150 150 150 
##$TP07= 0
##$TPNAME0= <>
##$TPNAME1= <>
##$TPNAME2= <>
##$TPNAME3= <>
##$TPNAME4= <>
##$TPNAME5= <>
##$TPNAME6= <>
##$TPNAME7= <>
##$TPOAL= (0..7)
0.5 0.5 0.5 0.5 0.5 0.5 0.5 0.5 
##$TPOFFS= (0..7)
0 0 0 0 0 0 0 0 
##$TUNHIN= 0
##$TUNHOUT= 0
##$TUNXOUT= 0
##$USERA1= <user>
##$USERA2= <user>
##$USERA3= <user>
##$USERA4= <user>
##$USERA5= <user>
##$V9= 5
##$VALIST= <valist>
##$VCLIST= <CCCCCCCCCCCCCCC>
##$VD= 0
##$VDLIST= <DDDDDDDDDDDDDDD>
##$VPLIST= <PPPPPPPPPPPPPPP>
##$VTLIST= <TTTTTTTTTTTTTTT>
##$WBST= 1024
##$WBSW= 4
##$XGAIN= (0..3)
0 0 0 0 
##$XL= 0
##$YL= 0
##$YMAX_a= 9544
##$YMIN_a= -10195
##$ZGOPTNS= <>
##$ZL1= 120
##$ZL2= 120
##$ZL3= 120
##$ZL4= 120
##$ABSF1= 182.463
##$ABSF2= -187.1042
##$ABSG= 5
##$ABSL= 3
##$ALPHA= 0
##$AQORDER= 0
##$ASSFAC= 0
##$ASSFACI= 0
##$ASSFACX= 0
##$ASSWID= 0
##$AUNMP= <proc_1d>
##$AZFE= 0.1
##$AZFW= 0.5
##$BCFW= 0
##$BC_mod= 2
##$BYTORDP= 0
##$COROFFS= 0
##$CY= -3
##$DATMOD= 1
##$DC= 0
##$DFILT= <>
##$DTYPP= 0
##$F1P= 0
##$F2P= 0
##$FCOR= 1
##$FTSIZE= 65536
##$FT_mod= 6
##$GAMMA= 0
##$GB= 0
##$INTBC= 1
##$INTSCL= 5.30512e-09
##$ISEN= 30
##$LB= 1
##$LEV0= 0
##$LPBIN= 0
##$MAXI= 10000
##$MC2= 0
##$MEAN= 0
##$ME_mod= 0
##$MI= 50
##$NCOEF= 0
##$NC_proc= -6
##$NLEV= 6
##$NOISF1= 182.463
##$NOISF2= 159.3651
##$NSP= 0
##$NTH_PI= 0
##$NZP= 0
##$OFFSET= 182.463
##$PC= 4
##$PHC0= -1884.506
##$PHC1= 566.002
##$PH_mod= 1
##$PKNL= yes
##$PPARMOD= 0
##$PSCAL= 0
##$PSIGN= 0
##$REVERSE= no
##$SF= 81.0140089999434
##$SI= 65536
##$SIGF1= 159.3651
##$SIGF2= -187.1042
##$SINO= 113.3802
##$SIOLD= 16384
##$SREGLST= <1H.CDCl3>
##$SSB= 0
##$STSI= 65536
##$STSR= 0
##$SW_p= 29940.119760479
##$SYMM= 0
##$S_DEV= 0
##$TDeff= 32768
##$TDoff= 0
##$TI= <>
##$TILT= no
##$TM1= 0
##$TM2= 0
##$TOPLEV= 0
##$USERP1= <user>
##$USERP2= <user>
##$USERP3= <user>
##$USERP4= <user>
##$USERP5= <user>
##$WDW= 1
##$XDIM= 65536
##$YMAX_p= 493988854
##$YMIN_p= -37011879
$$ End of Bruker specific parameters
$$ ---------------------------------
##NTUPLES= NMR SPECTRUM
##VAR_NAME=  FREQUENCY,     SPECTRUM/REAL,   SPECTRUM/IMAG
##SYMBOL=    X,             R,               I
##VAR_TYPE=  INDEPENDENT,   DEPENDENT,       DEPENDENT
##VAR_FORM=  AFFN,          ASDF,            ASDF
##VAR_DIM=   65536,         65536,           65536
##UNITS=     HZ,            ARBITRARY UNITS, ARBITRARY UNITS
##FACTOR=    0.456856943014862, 1,           1
##FIRST=     14782.0589164792, 0,            0
##LAST=      -15158.0608439998, 0,           0
##MIN=       -15158.0608439998, -37011879,   0
##MAX=       14782.0589164792, 493988854,    0
$$ Real data points
##PAGE= N=1
##DATA TABLE= (X++(R..R)), XYDATA
$$ [...]
44055 -641738 176809 551856 -181083 -1011475 -643846 449382 588375 -589038 -1484026
44046 -1484026 -849701 396070 488491 -805329 -2038930 -1920699 -452268 1626209 3754034
44037 3754034 5642674 6789499 6380666 4135537 1290740 -39819 776854 1785622
44029 1785622 836248 -1353983 -2123693 -796176 324750 -411020 -1358524 -102986 2763548
44020 2763548 4323123 3209306 1055744 144523 988590 2413126 3038877 2466475 1559957
44011 1559957 1498251 2151410 1879421 -403378 -3531686 -5334999 -5083340 -3707834 -2105574
44002 -2105574 -533274 527549 365804 -768441 -1537060 -1021554 314653 1365272 1422824
43993 1422824 405000 -1177862 -2268265 -1976498 -570056 694971 877079 126660 -736156
43984 -736156 -909339 -42056 1354106 2041463 1327729 113790 -95376 884444 1871904
43975 1871904 2101260 1921131 1594982 702273 -713615 -1551725 -1087835 -213766 -322396
43966 -322396 -1472755 -2518154 -2683264 -2185437 -1526029 -971836 -696250 -776518 -1002800
43957 -1002800 -1139100 -1290770 -1562255 -1562800 -932988 -264587 -595383 -1740273 -2059057 -585539
43947 -585539 1292454 1300721 -835407 -3078211 -3723284 -3166798 -2558177 -1944636 -869202
43938 -869202 106250 67410 -410766 173855 1679103 2069100 421399 -1439075 -1454891
43929 -1454891 -131606 665259 649187 999665 1858180 1963754 915158 11257 290207
43920 290207 1156145 1647921 1851585 2162851 2098297 918538 -1048019 -2644419 -3265466
43911 -3265466 -3301296 -3286933 -3197238 -2704587 -1825108 -1119708 -1186744 -1912677 -2442360 -2199149
43901 -2199149 -1741515 -2106533 -3387575 -4580525 -4907562 -4633538 -4318885 -3862955 -2739260
43892 -2739260 -866925 1119689 2359516 2433355 1743602 1197783 1220650 1210515 443509
43883 443509 -629809 -709406 649069 2390467 3289256 3260637 2962220 2673809 2137199
43874 2137199 1237867 369253 104637 610669 1344757 1484659 854029 116166 -266677
43865 -266677 -683061 -1301958 -1107337 676755 2673106 2664321 873260 -46256 1150168
43856 1150168 2524408 2132361 969599 959337 1604673 974554 -861422 -1822542 -1002940
43847 -1002940 359354 1210558 1895962 2627564 2668847 1806449 1033088 905641 602980
43838 602980 -488622 -1542056 -1674568 -1445732 -1822723 -2544319 -2682296 -2119751 -1352658
43829 -1352658 -478689 461138 760367 -25866 -898985 -563696 535993 807667 13151
43820 13151 -449900 38143 320005 -502766 -1585846 -1848016 -1632618 -1674643 -1542823 -581271
43810 -581271 429144 255255 -557494 -224785 1485717 2734819 2296741 1200800 974878
43801 974878 1582183 2010846 1798516 963525 -598742 -2519927 -3601091 -3270465 -2646333
43792 -2646333 -2822780 -2907278 -1532887 244435 -144466 -2794043 -4574097 -3283133 -557896
43783 -557896 739642 408193 408124 1571448 2751084 2795936 1695024 -33830 -1641302
43774 -1641302 -2051993 -941016 263435 -19287 -1098352 -1004150 121212 -57147 -2118827
43765 -2118827 -3378276 -1894458 232082 -25402 -1790190 -1630806 850011 2104696
43757 2104696 -75736 -3336492 -4306962 -3032520 -1811527 -1280380 -168860 1745192
43749 1745192 2899737 2354118 1073053 351420 356266 675997 1083859 1236123 644206
43740 644206 -554363 -1655821 -2485012 -3387886 -3909932 -2915981 -661852 768988 204077
43731 204077 -778703 -196229 1257513 1262228 -662350 -2649650 -3215482 -2650791 -1621700
43722 -1621700 -187657 1347531 2185847 2277322 2509413 3046450 2772251 1157736 -512350
43713 -512350 -747009 242772 1184243 1470362 1256309 540247 -702135 -1787910 -1712359
43704 -1712359 -238435 1898172 3643735 4184967 3410772 2267889 2046507 2806700 3167036
43695 3167036 2143698 363228 -1155697 -2376461 -3482537 -3850600 -3112404 -2319600 -2443403
43686 -2443403 -2418546 -567183 2390407 3839213 2922740 1655797 1824250 2663983 2594833
43677 2594833 1654421 901747 544153 41253 -623569 -1000437 -1062744 -1065075 -951704 -793850
43667 -793850 -1275549 -2647063 -3560029 -2208939 1303981 4789615 6394756 6371356 6139856
43658 6139856 6343963 6338314 5200269 2837701 282795 -950575 -112973 1939337 3376800
43649 3376800 3077477 1518131 -58884 -959825 -1238797 -1028072 -365285 322281 295131
43640 295131 -491220 -898281 224443 2468967 4099901 4005906 2874476 2136822 2281690
43631 2281690 2741601 3035238 3211507 3189574 2518696 1250298 497607 1369582 3341651
43622 3341651 4342071 2933949 160075 -1421837 -688521 709462 480928 -1402705
43614 -1402705 -2931238 -2985248 -2723022 -3589456 -5124979 -5704058 -4697034 -2862817 -1078112
43605 -1078112 293786 1071420 1274247 1312937 1381823 1004004 22261 -533082 182907 1065539
43595 1065539 320313 -1615266 -2260115 -571954 1566065 2102042 1394111 950732 1062658
43586 1062658 1099865 1076669 1368306 1522607 784422 -572026 -1604134 -2007331 -2014529 -1520301
43576 -1520301 -511207 98726 -583278 -1915910 -2484407 -2153511 -1961411 -2116312 -1708218
43567 -1708218 -588861 82025 -332583 -1026503 -1313983 -1727667 -2687389 -3373268 -3110241
43558 -3110241 -2843354 -3799528 -5299335 -5422134 -3706693 -1810030 -1253692 -1656385 -1725500
43549 -1725500 -1197783 -1049989 -2024740 -3516664 -4101697 -3086584 -1375042 -545398 -1023753
43540 -1023753 -1592091 -1033056 177706 501214 -492757 -1408630 -771797 1105055 2506125
43531 2506125 2292320 1027246 173371 510347 1428456 1609241 324024 -1863522 -3609416
43522 -3609416 -3968398 -3077991 -1825517 -1052229 -1049696 -1509471 -1776407 -1365446 -482211 63654
43512 63654 -343511 -1498545 -2655166 -3186491 -2755710 -1245772 884816 2396263 2234148
43503 2234148 822973 -344548 -597216 -687038 -1119052 -1003959 414853 1986313 1943869
43494 1943869 659370 392619 1987693 3453754 2743028 671414 -258447 764913 2128891
43485 2128891 2317014 1787074 1844234 2552083 2619972 1201354 -849036 -1823674 -1048924
43476 -1048924 515218 1665335 2388519 3327097 4224260 3978899 2425947 1009094 1045499
43467 1045499 2057815 2577515 2073014 1286904 1023540 1419742 2258241 3263183 4044532
43458 4044532 4238367 3768536 2815974 1761161 1225686 1576305 2151033 1791226 577564
43449 577564 -3718 596300 687061 -1238086 -3730147 -3887201 -1240562 1706498 2737961
43440 2737961 1896105 132164 -1957420 -3455206 -3097092 -984448 1039406 1603703 1125991
43431 1125991 258916 -1243708 -2967801 -2965911 -310408 2743924 3240069 1403116 -16279
43422 -16279 232544 783281 531623 308169 977373 1769503 1658334 1102063 1150038 1574175
43412 1574175 1081847 -854031 -3213817 -4457578 -3895551 -2150942 -601137 -284540 -1132041
43403 -1132041 -2256434 -2924417 -3045875 -2819860 -2311181 -1525279 -705592 -408731 -1141836
43394 -1141836 -2630149 -3515616 -2479801 18031 1873989 1775366 716935 299077 445789
43385 445789 125619 -405468 96176 1494026 2089877 1114962 -298889 -1098328 -1537983
43376 -1537983 -1744474 -856180 1245566 2905382 2817662 1917473 1682059 1781894 1181946
43367 1181946 490434 1024704 2138110 1830820 -13746 -1241296 -624633 609238 1048444
43358 1048444 923254 757481 33741 -1499610 -2668929 -2482405 -1749567 -1642220 -1694837
43349 -1694837 -896073 111006 -87367 -1009544 -626640 1451634 3107541 2641632 867291
43340 867291 -603985 -1647335 -2917753 -3993559 -3810100 -2472551 -1228225 -751747 -631876
43331 -631876 -552989 -835747 -1560353 -2149283 -2258223 -2332009 -2832988 -3549691 -4117811 -4629618
43321 -4629618 -5192216 -5394900 -4837944 -3816954 -2864132 -1943964 -813149 58459 -211502
43312 -211502 -1601129 -2861703 -2769385 -1305704 475388 1347862 747505 -691738 -1415316
43303 -1415316 -458083 1207115 1618490 360179 -789899 -294735 995489 1083915 -430866
43294 -430866 -2024931 -2411439 -1863388 -1286328 -1023326 -987309 -1233314 -1855875 -2637451 -3101947
43284 -3101947 -2766673 -1413577 486078 1707402 1233818 -599058 -2381899 -3076715 -2711273
43275 -2711273 -1782194 -752576 -175569 -405935 -918642 -755998 32214 305040 -382402
43266 -382402 -922912 -304427 827254 1219238 877432 781150 1281333 1936627 2531735 3014394
43256 3014394 2685881 871859 -1504560 -2398802 -1162697 517194 824465 82329 36297
43247 36297 1376549 2760986 2299827 -315052 -3239121 -4162177 -2732439 -950463 -726133
43238 -726133 -1586195 -1703001 -734694 -207360 -998969 -1996058 -1885522 -960516 -203079 365863
43228 365863 1247474 2077188 1920002 708956 -569095 -1031148 -601859 197746 580057
43219 580057 -55118 -1385182 -2235964 -1971087 -1352246 -1360490 -1735393 -1574979 -884316 -447365
43209 -447365 -474070 -509035 -516300 -888114 -1404900 -1373709 -920237 -955309 -1576061 -1672854 -623000
43198 -623000 666148 1048608 608591 127343 -198418 -691472 -1298347 -1523513 -1091399
43189 -1091399 -198023 740070 1327843 1462248 1531073 1938878 2330402 1922558 842611
43180 842611 330260 1087922 2194686 2428463 2054153 2314111 3450001 4275589 3794466
43171 3794466 2412607 1260256 858414 792158 429825 -299119 -804602 -463064 687946
43162 687946 2018960 3022744 3608261 3640818 2763704 1067706 -478406 -776223 380658
43153 380658 2292217 4039272 4917201 4658844 3692065 2815070 2227308 1374047 176670
43144 176670 -355184 424559 1454754 1317008 526117 1011850 3298247 5638856 6300289
43135 6300289 5388647 3898831 2278774 776981 47715 263988 428686 -282566 -1130754
43126 -1130754 -962681 -206075 -312686 -1468756 -2388704 -2514317 -2900196 -4352393 -5976550
43117 -5976550 -6434914 -5693220 -4581488 -3377641 -1904356 -544818 1929 -146825 -192303
43108 -192303 17723 -300101 -1609968 -3257939 -4211459 -4021632 -2861396 -1250604 -18106
43099 -18106 115340 -658101 -1336924 -1355893 -1165718 -1212186 -1089245 -384508 311104 204621
43089 204621 -310638 -149420 759203 1376116 1191333 815797 696344 420596 -151976 -170839
43079 -170839 928207 2294460 2862519 3038349 3957012 5406156 5853070 4600175 2626158
43070 2626158 958042 -511287 -1904952 -2309918 -1110559 372490 135820 -1733799
43062 -1733799 -3033889 -2479144 -1285362 -972341 -992593 29529 1625782 1956411 808946
43053 808946 207438 1501933 3518748 4552704 4725713 4968089 4826098 3194191 755913
43044 755913 -316617 672590 2003418 2166537 1933672 2795688 4418576 4964163 3546393
43035 3546393 1258553 -281303 -651875 -652805 -997735 -1347365 -801840 719770 2057492
43026 2057492 2153845 1400990 973140 1152497 1264918 1110459 1250917 1685601 1466089 144816
43016 144816 -1406558 -2174696 -2073738 -1379876 -236648 616323 -97187 -2316816 -3906134
43007 -3906134 -3102650 -913420 286677 -111467 -668180 -248802 904697 2217501 3291035
42998 3291035 3289699 1349810 -1936040 -4565051 -5144173 -4114541 -2785013 -1997695 -1927272
42989 -1927272 -2286728 -2381168 -1674955 -623678 -378019 -1451974 -3146769 -4329061 -4315492
42980 -4315492 -3121744 -1413829 -66007 738341 1585480 2456036 2081373 -197846 -2695203
42971 -2695203 -3153354 -1868867 -1178988 -1899370 -2344239 -1277176 282998 1104811 1679236
42962 1679236 2807261 3812764 3742587 3259395 3701872 4875474 5254613 4127215 2377434
42953 2377434 1231281 1052021 1283824 1040714 -64785 -1397523 -2029280 -2109534 -2681481
42944 -2681481 -3889218 -4507218 -3817300 -2712891 -2039262 -1065283 1083339 3409896 4042671
42935 4042671 2832729 1536444 1489286 2236068 2541670 1913561 971647 736672 1515862
42926 1515862 2414005 2401046 1808535 1796684 2283494 1912167 551938 -24067 958877 1596444
42916 1596444 212955 -1745972 -1895271 -626295 -134216 -699106 -685068 270874 922944
42907 922944 1163657 2227200 3847554 4055547 2509621 1306508 1462883 1278338 -311519
42898 -311519 -1257512 632581 4078066 5928691 5212873 3559893 2455966 2007128 1876953
42889 1876953 1692150 791463 -959967 -2300747 -1764843 413331 2570748 3456693 2853687
42880 2853687 911104 -1854061 -4147478 -4789179 -4112405 -3532664 -3690623 -3850122 -3163801
42871 -3163801 -1794579 -688586 -700778 -1837946 -3017210 -2955734 -1722887 -821977 -1158612
42862 -1158612 -1713105 -1140797 86561 424340 -357360 -978780 -692303 -134497 -85434
42853 -85434 -648809 -1766467 -3232673 -3960863 -2626277 407223 2982716 3591082 2839910
42844 2839910 1899878 807149 -627202 -1430165 -642029 690387 469943 -1442888 -2795053
42835 -2795053 -2042193 -484896 -299366 -1414196 -1718857 -43986 2444470 4016170 4315610
42826 4315610 3931833 3081195 1812406 949727 1461682 2796801 3044188 1267421 -1209380
42817 -1209380 -2530381 -2626590 -2891921 -3901060 -4512543 -3458366 -1091692 917449 1331383
42808 1331383 420853 -593831 -838581 -397090 172315 569610 826780 905776 630108
42799 630108 47226 -440336 -416142 187499 989652 1291773 588637 -717019 -1447700 -1042544
42789 -1042544 -492302 -1133506 -2767055 -3944860 -4017428 -3755451 -3860307 -4136380 -4440330
42780 -4440330 -5063453 -5604849 -4919514 -3090130 -2042321 -2941142 -4178164 -3446577 -883612
42771 -883612 1430908 2320825 2164788 1365317 99278 -688201 40098 1712359 2812410
42762 2812410 3220214 4104986 5462386 5818386 4792287 3862158 3783909 3245579 1274284
42753 1274284 -762396 -1051994 81342 998632 1114011 956623 715598 256258 29849
42744 29849 530289 1172663 951335 -30976 -742570 -637769 54322 1025031 1827903 1590327
42734 1590327 23056 -1562336 -1543079 -239286 330634 -968628 -3148141 -4572628 -4622203
42725 -4622203 -3608354 -2000418 -245667 1182573 1938406 1857296 1037707 176814 290505
42716 290505 1399579 2054019 1139433 -389190 -832323 -299622 -276227 -860059 -473408
42707 -473408 1303708 2692014 2431212 1656731 1701717 1653876 -68015 -2781377 -4184418
42698 -4184418 -3463901 -1959930 -897236 -118698 815623 1737386 2376954 2596158 1936178
42689 1936178 131165 -1713009 -1782121 89286 1905233 2003677 976520 301450 111760
42680 111760 -497720 -1589223 -2104196 -1352799 217814 1822667 3157281 4236915 4894684
42671 4894684 4649098 3051736 449244 -1568299 -1308578 823790 2102838 580078
42663 580078 -2128979 -2592507 52055 3068789 3766495 2473849 1039023 -8053 -1211048
42654 -1211048 -2139196 -1594758 215063 1414511 797328 -786601 -1852552 -2026428 -1767218
42645 -1767218 -1283085 -574669 21823 189787 229257 552481 738286 -196460 -2480932
42636 -2480932 -5015824 -6307807 -5835664 -4480970 -3642594 -3770502 -3807477 -2484612 -195331
42627 -195331 1136477 433900 -1058017 -1400977 -387925 698484 1225036 1678087 2093321
42618 2093321 1659322 408124 -182404 764457 2062010 2225834 1686091 1748844 2139371
42609 2139371 1502257 92840 -215372 915641 1265194 -586868 -2653928 -2178158 230900
42600 230900 1318116 -269649 -2366760 -2594396 -1305147 -296466 -189793 -451427 -946028
42591 -946028 -1898832 -2775137 -2627776 -1521874 -528520 -277694 -422158 -512965 -489360 -268231
42581 -268231 248506 687825 613159 426836 817772 1259738 415964 -1553786 -2562005
42572 -2562005 -1355051 576808 1051171 117356 -487172 -19955 725337 1106670 1217743
42563 1217743 953021 105294 -570670 -7744 1231414 1274447 -368521 -2024752 -2360727
42554 -2360727 -1997376 -1749628 -993861 796606 2354322 2282058 1443682 1740594 3028326
42545 3028326 3222515 1410774 -924113 -2038355 -1807227 -1128577 -696911 -757471 -1098397
42536 -1098397 -1058853 -380584 75643 -475521 -1160008 -551701 872575 1303237 663516
42527 663516 792180 2021420 2162407 203154 -1488755 -679950 1137639 1202615 -151638
42518 -151638 -565909 43904 -374549 -1900736 -2107961 -133431 1851672 2241799 2185641
42509 2185641 2718905 2378837 -187141 -3230885 -3970895 -2448154 -1023404 -765701 -498929
42500 -498929 876879 3012295 4993635 6054936 5509517 3422894 1250537 370476 98153
42491 98153 -1261117 -3394217 -3892548 -1727282 945589 1538885 301547 -473187 337539
42482 337539 1706111 2410707 2621594 3181611 4103408 4356624 3019058 422580 -1872844
42473 -1872844 -2345567 -927030 852241 1298818 243784 -767253 -126496 1960554 3513935
42464 3513935 2958934 996760 -269695 52916 794584 708808 257265 598610 1585419
42455 1585419 1953455 1226530 298726 70567 437022 801030 836417 551230 204703 275738
42445 275738 953207 1630394 1492943 597781 -227998 -458541 -158950 583913 1586311
42436 1586311 2033602 1151462 -463102 -1318276 -1082280 -977183 -1739107 -2479554 -2271633
42427 -2271633 -1654869 -1583319 -1853177 -1679605 -1098907 -678733 -399924 62838 382250 24716
42417 24716 -602510 -513987 434429 1382520 1639113 1208939 256660 -1113635 -2514357 -3385650
42407 -3385650 -3475404 -2764900 -1222178 749709 2059500 2059935 1668316 2315117 3880311
42398 3880311 4761932 4041146 2495361 1324497 1018727 1776007 3766401 6266025 7567631
42389 7567631 6740681 4883832 3761807 3652953 3393991 2218149 626615 -517653 -972274
42380 -972274 -1032912 -1026156 -1116364 -1305205 -1456385 -1466422 -1420569 -1439327 -1443082 -1238648 -747194
42369 -747194 158 906941 1641304 1694390 997503 255567 121497 180229 -480488 -1590573
42359 -1590573 -1585245 159482 1810864 1015486 -1927150 -4217444 -4140539 -3102579 -3273297
42350 -3273297 -4424919 -4542630 -2931224 -1071379 -432595 -940968 -1879879 -2861267 -3314753
42341 -3314753 -2346771 -49976 2031589 2714278 2616474 2807654 2920583 1978918 505450
42332 505450 150842 1224914 2092135 1427362 -110519 -1054489 -1079770 -1026234 -1479968 -2077927
42322 -2077927 -2151451 -1592804 -919446 -576946 -361553 238546 1181442 1785315 1630859 1026519
42312 1026519 325839 -568686 -1559796 -1887337 -997587 610646 2018207 2787486 2648098
42303 2648098 1169277 -1292102 -3186139 -3546019 -3368690 -3808994 -3926392 -2226187 201321
42294 201321 615688 -1250815 -2605186 -1777548 -515226 -929169 -2365182 -2936144 -2421241
42285 -2421241 -1841308 -1452299 -942957 -668060 -1054359 -1573826 -1748994 -2279204 -3616876
42276 -3616876 -4339963 -2804254 127404 1842963 1213133 -552932 -2008620 -2746144 -2701086
42267 -2701086 -1905768 -1116720 -1209874 -1722272 -1317970 86252 931391 23447 -2160172
42258 -2160172 -4326815 -5487243 -5212833 -3937682 -3011813 -3249160 -3506251 -2120262 313735
42249 313735 1387298 408965 -400665 936636 3426504 4621529 3639706 1549995 -329137
42240 -329137 -1457193 -1970354 -2279578 -2404935 -1672548 81950 1297622 335079 -1640730
42231 -1640730 -1653114 623299 1960512 449550 -1416724 -745927 1089064 869723 -1114530
42222 -1114530 -1792071 -574198 -39472 -1239561 -2046099 -1114877 -142258 -621931 -1247060
42213 -1247060 -550643 254413 -551001 -1937064 -1582721 479407 2076679 2178407 1772651
42204 1772651 1661427 1333785 227089 -1326480 -2594606 -2881837 -1675897 574973 2210921
42195 2210921 2141216 1483353 1996270 3283985 3356816 1860565 672059 867316 1161859
42186 1161859 313316 -752173 -600149 321630 574317 97133 3233 461101 424788 -456806
42176 -456806 -1017727 -128658 1742129 3034969 2831653 1759186 1196246 1676194 2322858
42167 2322858 2151868 1504568 1294273 1083231 -537578 -3221915 -4310289 -2291558 650212
42158 650212 1412208 266445 78426 1674959 2631345 1180985 -1078668 -1663145 -615790
42149 -615790 133252 -323838 -1211622 -1694649 -1718777 -1477850 -1170974 -1164559 -1532119 -1644595
42139 -1644595 -1015300 -229890 -103978 -210980 570874 2016252 2300715 313074 -2652906
42130 -2652906 -4212987 -3440565 -1543730 -321128 -487685 -1400672 -1952593 -1615605 -808332
42121 -808332 -334690 -474798 -730045 -488800 253440 961165 1139741 626015 -507986
42112 -507986 -1924605 -2876349 -2581637 -1087027 513972 1128644 806673 469807 687313
42103 687313 1273367 2000123 2913933 3717024 3635683 2444993 1061264 557505 1047597
42094 1047597 1999229 3002017 3592568 3079246 1522068 288272 474827 1219202 857790
42085 857790 -555900 -1331663 -620188 726107 1861452 2899661 3777772 3729423 2556409
42076 2556409 1156126 220447 -345927 -323035 889931 2571663 2699283 770486 -1052687
42067 -1052687 -942591 60845 114733 -367815 257514 1952343 3315028 4029607 4765445
42058 4765445 5142225 4086955 2085296 911784 989003 970378 146272 -637550 -792734
42049 -792734 -891288 -1248280 -1224899 -507671 314178 867024 1324623 1364167 344555 -1130336
42039 -1130336 -1479612 -459943 418657 259187 -252931 -838492 -2465503 -5077946 -6501305
42030 -6501305 -5212457 -2587569 -720757 484982 2114771 3477041 2960274 1006798
42022 1006798 -181111 122355 345383 -643457 -1861680 -1988137 -1330696 -1051145 -1391214
42013 -1391214 -1696544 -1748844 -2136089 -3222541 -4327955 -4360747 -3232238 -2185839 -2308713
42004 -2308713 -3050883 -3011854 -2103287 -1794209 -2793883 -3655249 -2655365 -301173 1215847
41995 1215847 767351 -568667 -1111511 -464419 440999 671949 340438 352838 1160956
41986 1160956 2014423 1868940 846078 75236 132698 538787 871328 1258865 1500134
41977 1500134 1004093 192047 585014 2543924 4191155 3826677 2349752 1835747 2552240
41968 2552240 2989582 2302390 1078234 -55885 -999084 -1357294 -542456 1013610 1887233
41959 1887233 1287031 -87000 -969436 -739428 223502 840473 226621 -1184711 -1868974
41950 -1868974 -1166973 -312481 -655046 -1676767 -1949911 -1301637 -591949 17990 900436
41941 900436 1475830 699493 -1058273 -2304433 -2580236 -2681950 -2777213 -2147951 -987694
41932 -987694 -546098 -1026792 -1122855 -204065 746057 971083 964153 958832 253845 -1018111
41922 -1018111 -1320958 -164833 641154 -267469 -1411330 -706129 1134868 1606520 187649
41913 187649 -993134 -220359 1747154 2861615 1861814 -850779 -3402978 -3658244 -1287786
41904 -1287786 1454833 1989477 277271 -1541231 -2093489 -2073408 -2571321 -3472979 -4019577
41895 -4019577 -3952863 -3477534 -2771509 -2117098 -2011063 -2560071 -3074047 -2806476 -1977371 -1557787
41885 -1557787 -1948872 -2329196 -1750490 -702421 -834343 -2693532 -4392369 -3516084 -218612
41876 -218612 2676207 2923979 1191339 -356749 -768413 -668091 -620964 -382179 255908
41867 255908 829520 779916 269356 132662 998028 2462700 3378260 3291985 3258423 4401824
41857 4401824 5863071 5480049 2876785 506813 717368 2861515 4442033 4224234 2913738
41848 2913738 1472599 342701 52033 987828 2360356 2647693 1440453 -43411 -510252
41839 -510252 124412 1105979 1671979 1396201 533347 180375 1294229 3375977 4908534
41830 4908534 5230570 5087306 5110175 4778274 3419703 1384936 -460045 -1773310 -2595093
41821 -2595093 -2717407 -1978165 -869592 -99152 353906 1122666 2404325 3564455 3879962
41812 3879962 3253540 2042365 546769 -1018646 -2195577 -2314863 -1099445 819921
41804 819921 2220802 2275426 1191508 -161447 -1127044 -1646992 -1931999 -2047923 -1943719
41795 -1943719 -1756821 -1858197 -2413604 -2971591 -2867400 -2252519 -2284194 -3707673 -5513950
41786 -5513950 -5845655 -4275790 -2300037 -1332485 -1180424 -991600 -684022 -559170 -346019
41777 -346019 222983 467305 -334450 -1448092 -1479509 -547109 -142523 -602498 -334663 1664310
41767 1664310 3902628 4231250 2695885 1186634 724784 550338 -125163 -898801 -1194850
41758 -1194850 -1345881 -1836284 -2299645 -2307482 -2579118 -4008656 -5513842 -4445262 21236
41749 21236 5020668 6775785 4691910 1455526 -566501 -1491567 -2372542 -3129285 -2921932
41740 -2921932 -1573410 336316 2168351 3245115 2808270 856279 -1385346 -2658384
41732 -2658384 -3035641 -3371608 -3763348 -3447037 -2096104 -407088 681160 816648 303402
41723 303402 -202501 -105770 677650 1729315 2632302 3074094 2495702 592123 -1489124
41714 -1489124 -1676192 376808 2278719 1863096 238317 190728 2169988 3924479 4060557
41705 4060557 3746752 4215822 4544546 3245598 803396 -831930 -645724 758403 2466232
41696 2466232 4045615 5063457 4881176 3402177 1526418 389811 270833 562050 771681
41687 771681 1101238 1772538 2277147 2014075 1427629 1492515 2008224 1661291 246679 -566515
41677 -566515 317402 1464922 858216 -1108726 -2283873 -1925887 -1478046 -2246773 -3830218
41668 -3830218 -4982686 -4840856 -3317601 -1405392 -855827 -2268374 -3777097 -3100507 -638934
41659 -638934 1096781 903535 -154659 -1104650 -2175909 -3204221 -3125197 -1824796 -589137
41650 -589137 66942 1133681 2822255 3541128 2348397 627897 -49664 -147389 -799891
41641 -799891 -1666806 -1724957 -1104334 -684270 -742078 -1159628 -2000180 -2836626 -2609019 -1192774
41631 -1192774 55709 288231 340763 920739 1243880 735276 372684 845793 1140012
41622 1140012 629030 663503 2029798 2796118 1243810 -843998 -801742 532513 423114
41613 423114 -938755 -1013712 256713 240201 -1598667 -2668693 -1817219 -1190501 -2207235
41604 -2207235 -3106252 -2296086 -1138353 -1297519 -1869393 -1386431 -517490 -471943 -593441
41595 -593441 80601 523051 -441100 -1331982 103157 2937384 3868142 1931310 -181246
41586 -181246 -4785 1679700 2589767 2014881 983382 425663 375366 551579 736737
41577 736737 572089 -321759 -1685848 -2407515 -1493349 607760 2106774 1708397 33709
41568 33709 -1254880 -1372790 -803433 -198496 141858 -36817 -632164 -723784 302341 1286238
41558 1286238 532845 -1383761 -1956066 -421967 945250 320508 -894629 -473438 1111918
41549 1111918 1754040 1232463 1280893 2529567 3631343 3536850 2699681 1704397 468209
41540 468209 -648313 -551725 893919 2100974 1643976 90099 -906740 -704408 -36510
41531 -36510 288261 228905 162146 277161 396662 174701 -481884 -1115653 -1067948 -262578
41521 -262578 607613 861197 578507 365170 536883 775203 533357 -380385 -1582367
41512 -1582367 -2340261 -2070729 -828296 594033 1214648 758295 -20449 -167923 320960
41503 320960 607992 397467 587689 1993909 3936819 4947180 4598248 3659390 2560134
41494 2560134 955913 -887955 -1600166 -443931 1376780 2178776 1945801 1914787 2406156
41485 2406156 2335573 1006628 -721686 -1619880 -1753481 -2195352 -3250732 -3750862 -2551888
41476 -2551888 -335719 901197 336585 -550967 -29114 1446125 2016369 1258727 681937
41467 681937 1226798 1923529 1775935 1488074 2089802 2962149 2745171 1583820 947602
41458 947602 1444434 2185608 2338119 2113710 2061997 2395463 3190397 4305757 4871705 3808149
41448 3808149 1294542 -1006924 -1682890 -1008574 -273090 -176897 -377698 -256291 430454
41439 430454 1559970 2832237 3818680 4100187 3630657 2954661 2797928 3259934 3647956
41430 3647956 3445856 3194823 3792278 4993531 5437405 4390111 2651360 1336184 614934
41421 614934 269056 584385 1680188 2616202 2440091 1849987 2498103 4526497 5982126
41412 5982126 5117910 2404713 -226166 -1432142 -1219641 -294775 554982 661344 -152810
41403 -152810 -1172004 -1204444 225066 2240617 3513056 3750284 3858382 4514175 5187962
41394 5187962 5053486 4288213 3653442 3195647 2448777 1733566 1919147 2711723 2584564
41385 2584564 983014 -653855 -837283 119314 1032023 1538773 1878798 2035564 2251592
41376 2251592 3412761 5578744 6998345 6135635 4043967 3087723 3729269 4311540 3860943
41367 3860943 3298522 3601270 4352668 4709072 4631165 4510621 4347595 3813631 2707640
41358 2707640 1189176 -123187 -495502 54675 654927 817002 1053703 1600471 1612445
41349 1612445 799867 693079 2541746 4886558 5334071 4099374 3364608 3454029 2463939
41340 2463939 22235 -1466075 -421470 1486615 1952430 1096370 381350 156922 -20373
41331 -20373 96273 891596 1687876 1551347 700742 787 -307930 -420279 -226744 304673
41321 304673 672046 579720 470351 680277 888773 976238 1354636 1743161 876425 -1538129
41311 -1538129 -3715879 -3866336 -2474391 -1347795 -1196831 -1324421 -1028391 -188675 998451
41302 998451 1965847 2033914 1420939 1217569 1736001 1940621 1249814 638890 992864 1674898
41292 1674898 1863102 1988247 2583382 3048985 2931919 3019402 3652456 3510994 1902079
41283 1902079 664232 1574734 3317417 3564930 2752328 2840632 3391829 2297361 -44629
41274 -44629 -900090 227324 690843 -861761 -2418631 -2199882 -1371692 -1574842 -2262648
41265 -2262648 -2266497 -1889319 -1647075 -794274 1029925 2275801 1515034 -250881 -1105121
41256 -1105121 -975177 -1159230 -1992556 -2666970 -2722884 -2240861 -1124940 488371 1702508
41247 1702508 1967356 2054107 2705617 3072618 1915597 -264869 -1833012 -2313019 -2513200
41238 -2513200 -2628810 -1893473 -240314 1203947 1700436 1766357 1959425 1823573 746381
41229 746381 -817514 -1756785 -1689752 -1331019 -1435086 -1808561 -1698606 -1018261 -653408 -1290527
41219 -1290527 -2466515 -3349385 -3944257 -4608980 -4812184 -3736950 -2047722 -1455338 -2160458
41210 -2160458 -2380061 -1164499 -38473 -635708 -2125961 -2544242 -1619214 -599986 -19519
41201 -19519 635963 1480838 2129041 2780569 3803211 4385985 3276905 940080 -668204
41192 -668204 -797120 -818944 -1912169 -3305220 -3714875 -3351259 -3333264 -3796864 -3765466 -2731273
41182 -2731273 -1414106 -728510 -579005 -151009 717780 1032821 1320 -1422971 -1311606
41173 -1311606 713180 2767269 3126382 2320614 1845555 1794092 1219053 164083 -415949
41164 -415949 -520276 -1115518 -2204085 -2616380 -2069438 -1746143 -2253460 -2622611 -2118893
41155 -2118893 -1489671 -1410418 -1177205 -234821 334245 -514494 -1606573 -917482 1328280
41146 1328280 2749834 2006216 324581 -416496 229044 1535237 2767422 3411045 3043199
41137 3043199 1714001 123572 -988396 -1391392 -1183644 -491344 453406 1306811 1884778
41128 1884778 2184347 2109314 1543320 730364 169746 55621 179080 355702 479383 214197
41118 214197 -677356 -1574346 -1348770 112862 1405473 1212849 -70914 -996291 -965054
41109 -965054 -652941 -619813 -424790 452041 1406589 1161980 -579525 -2492116 -2992998
41100 -2992998 -2017881 -957342 -842001 -1232271 -1256523 -1059463 -1349529 -1874972 -1534144
41091 -1534144 -133815 1118806 1347194 1177377 1499012 2066668 2294457 2533753 3281255
41082 3281255 3786774 2994340 1571995 1359276 2699667 3896809 3682222 2707652 1969100
41073 1969100 1205703 -143842 -1512256 -1861013 -1064204 245958 1524882 2210388 1567934
41064 1567934 -394249 -2468888 -3555833 -3782852 -3610051 -2809625 -1370662 -328776 -243540
41055 -243540 205346 2312209 4706972 4668306 1838803 -1392177 -3226423 -4123466 -4858127
41046 -4858127 -5035085 -4321521 -3422172 -2943408 -2688968 -2704001 -3420977 -4072372 -2804265
41037 -2804265 499663 3228540 3296889 1867566 1220697 1324702 571904 -988380 -1405573
41028 -1405573 292515 2718850 3807310 2734945 223391 -2096057 -2786641 -1927437
41020 -1927437 -1054082 -1149339 -1402259 -777638 203401 492245 323975 450578 470673 -236925
41010 -236925 -663832 604073 2758306 3652716 3140075 3071643 3823813 3510775 1431658
41001 1431658 -270631 226664 1710172 2004563 1046717 112270 -645115 -1906248 -3278887
40992 -3278887 -3558919 -2558180 -1222340 -213073 423327 568002 241699 151988 764912
40983 764912 1101838 -186350 -2610599 -4088838 -3626846 -2476017 -2111706 -2210752 -1577310
40974 -1577310 -373026 -167784 -1644419 -3240325 -2848527 -535404 1398418 1316056 250708
40965 250708 211247 1248167 1584413 450441 -835573 -1046014 -804175 -1238405 -2030503
40956 -2030503 -2036165 -1182472 -542248 -814844 -1700563 -2587270 -3034868 -2735021 -1727205 -588870
40946 -588870 101762 318466 243625 -176244 -834038 -1175192 -978639 -899015 -1472233 -2120128
40936 -2120128 -2047751 -1626503 -1788258 -2372051 -2264847 -1086105 406229 1592944 2535719
40927 2535719 3106655 2736296 1451522 256645 -5046 474081 1038107 1363435 1415128
40918 1415128 1285881 1396954 2238668 3577880 4453514 4214698 3064634 1486337 -158188
40909 -158188 -1291080 -1249444 -168523 995056 1715874 2400218 3218375 3410555 2512695
40900 2512695 1387265 1017640 997411 449896 -89247 733046 2643768 3497016 2030335
40891 2030335 -377782 -1524637 -1042964 -318378 -427052 -1228546 -2186498 -3026138 -3559745
40882 -3559745 -3701554 -3736879 -3845498 -3359236 -1440349 1265924 2721862 1924937 424842
40873 424842 494845 2316522 3989783 4042117 2841840 1550962 788483 657164 1164476
40864 1164476 2013012 2495043 2118995 1095428 -14489 -792422 -992609 -573090 95233
40855 95233 504899 652741 889461 1023930 321730 -1250349 -2504511 -2338798 -1088114
40846 -1088114 -54512 -67197 -908913 -1760508 -1855967 -1131915 -496306 -885397 -1834915 -1826922
40836 -1826922 -452014 803333 638976 -223166 -301584 449140 947272 784731 367147
40827 367147 -185455 -810135 -613069 1102327 3042328 2933049 613932 -1477196 -1415868
40818 -1415868 41484 1007903 792234 -181662 -1555389 -2989542 -3727870 -3339587 -2498773
40809 -2498773 -2165325 -2302676 -2106505 -1199755 44604 1114910 1710692 1684058 1144024
40800 1144024 479284 -96634 -813126 -1800246 -2543664 -2344393 -1204737 162127 1204338
40791 1204338 2076785 3184668 4358440 4758658 3794797 2007126 618137 146180 13247
40782 13247 -270422 -339033 22300 -11920 -1057426 -1943037 -818506 2219314 4909497
40773 4909497 5390469 3879323 1754371 243646 191409 1657513 3186378 2772988 317380
40764 317380 -1906724 -1904952 -121003 1623428 2228091 1646346 304698 -832729 -628731
40755 -628731 733801 1483419 552893 -686757 -191119 1909082 3498996 3138668 1381312
40746 1381312 -341743 -1154398 -1130081 -939488 -990202 -658231 984972 3363811 4438403
40737 4438403 3330364 1739028 1634491 2692378 3422700 3693804 4244237 4521611 3279629
40728 3279629 1099710 81410 776097 1442258 844224 -80686 -98856 456530 697049
40719 697049 672086 718279 415363 -561872 -1316283 -777497 437820 444663 -1451417 -3583255
40709 -3583255 -3735658 -1791405 64201 -16591 -1276134 -1508637 -198709 853405 412872
40700 412872 -303002 167954 864133 -93346 -2121391 -2606829 -662343 1706363 2550294
40691 2550294 2138200 1592643 1234974 1135342 1612205 2147994 1359011 -739083 -1868250
40682 -1868250 -403131 1950487 2110921 -330025 -2640526 -2373443 110266 2652194
40674 2652194 3732030 3505617 3021263 2851611 2555083 1524074 72574 -919990 -1317468
40665 -1317468 -1755043 -2259300 -1992602 -831956 -43165 -607411 -1857767 -2655140 -3008459
40656 -3008459 -3511415 -3992123 -3938295 -3701711 -4015083 -4594637 -4397915 -3204449 -1938045
40647 -1938045 -1357112 -1232579 -962743 -429919 -93933 -470379 -1429488 -1979695 -1243600
40638 -1243600 198067 684345 -425427 -1843966 -2085128 -1247310 -401270 -98944 -336698
40629 -336698 -1105037 -1934655 -1710971 -132845 1325024 1154206 -85726 -700955 -307338
40620 -307338 110990 97210 51439 -59351 -604245 -926661 169468 2277383 3347925
40611 3347925 2334245 518619 -391395 -272008 -23882 -79595 -267406 -440368 -580280
40602 -580280 -737874 -1182838 -2095327 -3018057 -3305975 -3127349 -3137502 -3138658 -2153426 -40813
40592 -40813 2058070 3197348 3490662 3235919 2433791 1663262 2115612 3932332 5592992
40583 5592992 5846455 5291538 5097522 5071901 4169832 2329223 633262 -102919 -27716
40574 -27716 257019 224301 -288881 -736149 -152839 1633237 3461580 4089985 3609707 3054573
40564 3054573 3009830 3207078 3136298 2502495 1437079 718138 1252535 2781040 3722571
40555 3722571 3056995 1786065 1620976 2698193 3647164 3631216 3182855 3027662 3137700
40546 3137700 3164784 2952600 2332243 1134163 -237552 -823569 -146554 1092695 1717590
40537 1717590 1308811 477285 -2755 -60199 -172591 -471106 -423992 304964 1105107 1188565
40527 1188565 876796 1208276 2263952 2966965 2806480 2535266 2551841 1855873 -353419
40518 -353419 -3077093 -4745354 -5197765 -5116819 -4349470 -2512712 -701660 -542066 -1547872
40509 -1547872 -1447819 438528 2081669 1790113 575100 221747 475641 -180845 -1823716
40500 -1823716 -2934485 -2723462 -2081310 -2015689 -2298032 -2091196 -1182376 -168644 198984
40491 198984 -332263 -1203313 -1366319 -323746 1162824 1883283 1716189 1744709 2648029
40482 2648029 3655574 3598192 2472315 1266198 578337 272971 367563 1164956 2223063
40473 2223063 2347359 1378761 984024 2460730 4483743 4629828 2834527 1447097 1624345
40464 1624345 1760906 487815 -742406 113542 2190369 2691760 908824 -861415 -532304
40455 -532304 1438246 3294464 3969930 3264923 1459109 -429932 -1021323 30368 1716152
40446 1716152 3115660 4173071 4667251 3799285 1746087 398746 1185505 2928068 3286022
40437 3286022 1864442 433852 264790 757774 907632 696289 419508 -231185 -1490583
40428 -1490583 -2594894 -2495472 -1255051 28386 600902 688380 743748 755809 603218 580763
40418 580763 1097612 2061277 2916269 3124450 2326422 370163 -2260827 -4276974 -4616481
40409 -4616481 -3714105 -3029074 -3204058 -3496820 -3209614 -2627510 -2039116 -983465 577590
40400 577590 1342297 251810 -1636864 -2257325 -1143232 408538 1417378 1927096 1850166
40391 1850166 877267 -280167 -277026 820604 1495514 1239778 1276917 2118922 2348664 1074249
40381 1074249 -199532 149955 1168588 925603 -240878 -364559 724557 956856 -749617
40372 -749617 -2791790 -3107856 -1683700 -58128 665948 538294 116009 -215381 -470032
40363 -470032 -881236 -1404541 -1542583 -946051 70240 970924 1574735 1759496 1183463
40354 1183463 -22040 -908948 -943063 -928551 -1581720 -1851216 -230520 2574457 4081055
40345 4081055 3272756 1686208 856496 427639 -368465 -955911 -431574 755148 1507815
40336 1507815 1773976 2217966 2628102 1970538 21271 -2117654 -3334415 -3563698 -3281582
40327 -3281582 -2605254 -1382033 79682 847752 146490 -1741094 -3513543 -3925334 -2806072
40318 -2806072 -1043487 182645 77771 -1335179 -2987608 -3350904 -1917366 48896
40310 48896 822743 127861 -831259 -986039 -312446 648322 1268913 914230 -504118 -1992058
40300 -1992058 -2368306 -1710661 -1011676 -537403 228907 1009515 682017 -721905 -1511083
40291 -1511083 -671798 621087 846994 309931 265138 854914 1274480 1340817 1558757 1984602
40281 1984602 2157417 1913126 1385934 591479 -158094 -13346 1197315 2084661 1286578
40272 1286578 -442352 -1050759 113315 1774335 2817501 3439831 3957107 3875876 2876387
40263 2876387 1781552 1729187 2797044 3974811 4268112 3557674 2542551 1938875 1664792
40254 1664792 1027752 -122627 -921610 -618790 328770 923598 908097 651977 277849
40245 277849 -201240 -336442 152860 658789 657330 874682 2073196 3109588 2050263
40236 2050263 -707658 -2338350 -1195452 1086399 1845096 361176 -2173778 -4255309
40228 -4255309 -4662316 -2734417 697773 3467487 4174804 3465782 2568742 1700729 921449
40219 921449 1275951 3435888 5933187 6479748 4819265 2803059 1753642 1178535 185496
40210 185496 -1175465 -2358950 -3095703 -3309337 -2979820 -2344111 -1645799 -651878 877343
40201 877343 2252180 2287508 897215 -539235 -719251 333187 1815768 3195040 4226170
40192 4226170 4519685 3759239 2201983 558122 -602733 -1186457 -1426703 -1483105 -1141343
40183 -1141343 -66453 1459343 2354206 1772573 172679 -1187371 -1726109 -1892783 -2066240
40174 -2066240 -1877389 -948057 280846 941522 728751 216173 307499 1410794 2927047
40165 2927047 3619358 2858068 1432279 661585 804425 1010361 828123 837723 1451131 1998980
40155 1998980 1695167 837781 230216 -96819 -599914 -881309 233777 2925124 5440526
40146 5440526 5527025 2613629 -1654204 -4812377 -5363471 -3590515 -1113009 357691 221693
40137 221693 -711586 -1060102 -117376 1572559 2787283 2779559 1898732 1081183 808032 733235
40127 733235 368354 -125099 -117879 549650 1145791 815892 -320430 -1160997 -890878 -56296
40117 -56296 15535 -1090780 -2228970 -2097044 -942705 -194720 -418342 -482195 717041
40108 717041 2323872 2293422 82002 -2373127 -2864577 -1484572 -248892 -469943 -1415585
40099 -1415585 -1676188 -952406 34404 710444 925698 460194 -801978 -2249257 -2966068
40090 -2966068 -2925844 -2962606 -3325919 -3132770 -1726373 220290 1625409 2350380 2835131
40081 2835131 2969569 2363762 1454639 1235528 1800503 2058732 1131684 -622589 -2147759
40072 -2147759 -2675209 -2077307 -845590 135992 336008 213060 619797 1562983 2145373
40063 2145373 1763039 728056 -320234 -944235 -856361 -127715 518585 464073 227008
40054 227008 715374 1490365 1186383 -93613 -516186 592207 1364705 248998 -1329668
40045 -1329668 -1053733 652160 1329619 335503 -388126 427376 1542928 1402075 400990
40036 400990 -132764 -3343 -5458 -455445 -921128 -1064648 -979772 -874676 -916842 -1217275
40026 -1217275 -1641264 -1814026 -1498617 -783520 110859 935910 1461727 1844438 2716910
40017 2716910 4279759 5515155 5135926 3245612 1211310 -20664 -529366 -504779 -18600
40008 -18600 213886 -692429 -2154026 -2397499 -992749 301002 -10021 -1279204 -2231359
39999 -2231359 -2811473 -3212108 -2551136 -348919 1736108 1669192 -79921 -1342967 -1431409
39990 -1431409 -1415991 -1500940 -506666 1630818 3055520 2623666 1614314 1708400 2617463
39981 2617463 2918998 2265286 1590125 1733977 2780774 4242108 5152511 4536916 2574657
39972 2574657 887866 938274 2382414 3549415 3282599 1863318 393385 -310357 -380242
39963 -380242 -713685 -1972195 -3753016 -5050441 -5366046 -4824536 -3465719 -1333094 834119
39954 834119 2090053 2561624 3151500 3924905 4161777 4160616 5198724 7060777 7550370
39945 7550370 5701103 3688959 3819135 5088571 4861515 2895549 1287623 930655 546610
39936 546610 -622326 -1485839 -1137348 -364525 -250960 -667337 -1028531 -1465159 -2387323
39927 -2387323 -3594462 -4397877 -4102406 -2242620 828515 3484416 3989687 2393328 359657
39918 359657 -938932 -1596566 -1632396 -549320 1186665 1871092 828247 -332934 99415
39909 99415 1592565 2464007 2358855 2157121 2062410 1387338 69487 -1006502 -1336190
39900 -1336190 -1372667 -1584044 -1788682 -1669236 -1323134 -1082160 -1163984 -1549079 -1925718 -1884561
39890 -1884561 -1430684 -1032876 -896174 -654479 -219944 -357113 -1657364 -3307756 -3728965
39881 -3728965 -2349711 -87250 1826070 2831802 2922309 2258617 1186443 291529 168869
39872 168869 1020171 2294882 2864496 2102511 853761 646265 1756909 2856917 2833151
39863 2833151 1965517 883372 -401962 -1642664 -1855076 -895093 -390519 -1623421 -3447371
39854 -3447371 -3952734 -3295348 -2924849 -2775441 -1614124 138658 580187 -421805 -766979
39845 -766979 333373 894427 -451542 -1877371 -1021529 1457294 3008275 2722392 1735892
39836 1735892 852741 -217601 -1439560 -1982988 -1402759 -187740 992249 1833231 2298322
39827 2298322 2623470 3179935 3805886 3772809 2972425 2350496 2352729 1890011 79885 -1822176
39817 -1822176 -1858006 -296065 594049 -371779 -2078208 -3137387 -3475970 -3389742 -2525799
39808 -2525799 -737378 1031871 1646216 1041898 35151 -625670 -627345 -94534 389972
39799 389972 323900 150134 930088 2782895 4344423 4299243 2868828 1244188 117867
39790 117867 -538100 -681781 -70259 1069793 1885280 1706505 832040 304174 790632
39781 790632 1706143 1763443 645426 -306618 304783 1964907 2797475 2028148 860218
39772 860218 686978 1489871 2429554 2957493 2700072 1298861 -699124 -1681104 -802631
39763 -802631 729678 1373538 1502082 2398275 3526216 2840123 50683 -2382602 -2402149
39754 -2402149 -917434 -11836 139847 942690 2654356 3751632 3097836 1393674 98959
39745 98959 -135520 435195 1364892 2348511 3239795 3971713 4184606 3135454 690116
39736 690116 -1736333 -2315266 -1092949 7166 -110056 -360267 308159 817470 -327888
39727 -327888 -2288456 -2927191 -2149031 -1943319 -2988568 -3562311 -2537668 -1196380 -798252
39718 -798252 -451518 759187 1346039 -367114 -2724759 -2325089 1067553 3918025 3644774
39709 3644774 1484670 -170696 -934374 -1507972 -1585482 -637236 396949 155481 -997810
39700 -997810 -1544316 -1120448 -672526 -554468 -113496 721870 970570 177269 -720051 -650869
39690 -650869 345222 1563019 2434016 2408823 964544 -1501744 -3418665 -3494914 -2101754
39681 -2101754 -623547 140170 252756 -202158 -1208954 -2125675 -1966034 -772681 81072
39672 81072 -427578 -1511656 -1536452 -193779 1102441 1077671 89187 -628860 -599623 -342903
39662 -342903 -348659 -616668 -1165398 -2156108 -3242693 -3534748 -2706594 -1575686 -971486 -528333
39652 -528333 568328 1939409 2172964 765168 -1041358 -1771857 -1321883 -534784 114102
39643 114102 645223 885547 617549 280294 576502 1228715 965181 -872464 -3345810
39634 -3345810 -4998168 -5398761 -5093039 -4480397 -3481159 -2170767 -1031023 -425716 -264599
39625 -264599 -298237 -409524 -564912 -805326 -1293238 -1994369 -2310919 -1519770 258091 1937354
39615 1937354 2539351 2073032 1190388 333300 -510104 -1440432 -2283444 -2553881 -1902621
39606 -1902621 -840500 -671741 -2028915 -3708120 -3966682 -2950547 -2517811 -3340552 -3778202
39597 -3778202 -2515575 -688487 129977 610674 2178723 3844002 3274042 889999 -25554
39588 -25554 1909788 3932466 3075826 187375 -1822354 -1984110 -1346469 -364351 1228859
39579 1228859 2489955 1764140 -678055 -2600193 -2849454 -2611805 -3038080 -3447531 -2918480
39570 -2918480 -2098189 -1996210 -2053564 -1034761 708815 1513926 925643 450460 1330393
39561 1330393 2753788 3128025 2373870 1854555 2214129 2384000 1135874 -1111585 -2678963
39552 -2678963 -2441594 -623919 1934731 4452908 6104161 6160569 4744342 2913232 1557830
39543 1557830 646518 -87035 -340089 201323 954795 950380 146896 -478104 -203613 618786
39533 618786 1106352 803491 61149 -259800 463004 1932612 3189956 3708632 3777360
39524 3777360 3555055 2583636 962075 114450 1091917 2652434 2637227 1123263 417193
39515 417193 1579489 2823774 2316563 914946 633398 1567551 2150167 1864757 1788204
39506 1788204 2397972 2576178 1363163 -598782 -2127408 -3031969 -3741354 -4156960 -3891424
39497 -3891424 -3254385 -2966547 -2963688 -2445581 -1291717 -529973 -919876 -1761674 -1776126 -724474
39487 -724474 521851 1144155 815812 -657182 -2977825 -4641871 -3945785 -1278009 783473
39478 783473 564254 -526165 -103028 1739633 2711886 1734761 228012 -345974 -522524
39469 -522524 -1453068 -2717719 -2886748 -1761300 -758135 -979650 -1846283 -2048156 -1305111
39460 -1305111 -619400 -886909 -1784061 -2318208 -2129484 -1657325 -1117486 -162739 1126067
39451 1126067 1789352 1238685 287693 100800 705536 1483258 2467427 3859818 4756371
39442 4756371 3962517 1965129 482378 -27567 -734259 -2050537 -2677832 -1675241 146734
39433 146734 1665271 2723316 3170875 2326404 486016 -667748 -427525 -174750 -693889
39424 -693889 -277458 2354470 4912929 4148399 686978 -1719312 -1460369 -565973 -711287
39415 -711287 -839016 127454 917143 125518 -1052360 -407088 1909312 3471292 2773002
39406 2773002 946427 220500 1518373 3719330 4900937 4280933 2971269 2573246 3172789
39397 3172789 3343980 2139837 322364 -588769 135632 1969423 3582442 3708675 2302709
39388 2302709 922323 1227510 3044109 4643598 4836700 3879028 2483291 1152257 479202
39379 479202 760587 1170483 692438 -31155 579593 2261753 2849567 1614406 510506
39370 510506 1002312 1834593 1551638 1114095 1781469 2136033 871 -3684240 -5772902
39361 -5772902 -5294109 -4193714 -3761922 -3117640 -1773500 -1071953 -1894400 -2984255 -2941044
39352 -2941044 -2372369 -2667030 -3740156 -4358269 -3994555 -3179436 -2420791 -1715657 -954938
39343 -954938 -223036 227275 175458 -108282 172996 1202452 1657250 147612 -2494954
39334 -2494954 -3834378 -3006811 -1681728 -1292416 -1092629 -67071 914131 509671 -732566
39325 -732566 -1256846 -928344 -731372 -620978 311832 1674673 1758878 22368 -2039203
39316 -2039203 -2938117 -2685405 -1809944 -379942 1250511 1989080 1275915 -6168 -642679
39307 -642679 -385661 418921 1594829 2804576 3327704 3021775 2756050 3058704 3170505
39298 3170505 2475004 2032973 3298394 5805534 7629024 7949770 7675039 7508247 7010032
39289 7010032 6001603 5421291 5962967 6937514 7350430 7274522 7312344 7429022 7232892 6857575
39279 6857575 6649644 6392774 5718673 4942061 4581221 4294365 3246620 1481318 52960
39270 52960 -271145 303062 1252729 2305020 3182855 3507295 3286121 3043647 3244668 3918989
39260 3918989 4857856 5739877 6115262 5800381 5224026 4811152 4237111 3141795 2368039
39251 2368039 3188498 5102786 5898921 4666084 3378884 4248609 6546607 7649567 6654950
39242 6654950 5196906 4758302 4976415 5096579 5454966 6432553 7091797 6289653 4650116
39233 4650116 4012041 4909960 5901303 5818039 5519643 6464128 8290253 9145654 8317040
39224 8317040 7199852 7194955 7800006 7729759 7137764 7458274 9277239 11550762 13050076
39215 13050076 13605229 13721840 13884726 14548322 15964851 17600894 18439707 18289148 18179631
39206 18179631 19118266 21064890 23447130 26048873 29111890 33166153 38815934 45878140
39198 45878140 52887269 58817977 65349909 75647333 90522807 107994571 127549788
39191 127549788 152438655 186355304 230563314 285976424 353320228 425247027 480410156
39184 480410156 493988854 458544974 391503690 319662079 259050855 211183747 173079446
39177 173079446 143996372 123107781 106900320 91962182 78194760 67423106 60072188
39170 60072188 54537785 49080016 43262080 37727825 33173089 29678645 27042786 25549285
39162 25549285 25703583 26943747 27549150 26608808 25255584 24836292 24499781 22053119 17084476
39153 17084476 11884870 9025809 9000743 10434371 11644675 11641511 10384382 8610873 7139013
39144 7139013 6167898 5450128 4934617 4749521 4706886 4384765 3645304 2658191 1624671
39135 1624671 916486 1102689 2212151 3364964 3894118 4407743 5744106 7196436 7058033
39126 7058033 5016100 2765199 1814593 1707965 1077235 -246631 -981776 -73837 1909779
39117 1909779 3221338 2727782 1164700 341812 1116239 2681707 3953226 4742413 5082533
39108 5082533 4505433 3030130 1922902 2081178 2387561 1331162 -213812 233385 3220665
39099 3220665 6499234 7989705 7816947 6936583 5606087 4102989 3343294 3626298 3914764
39090 3914764 3343340 2414099 1869048 1506606 1037058 1003129 1811446 2807337 3308707 3651247
39080 3651247 4262452 4635825 4175086 3118090 1777484 46450 -1409033 -1014345 1225872
39071 1225872 2669889 1435079 -465615 222390 3132102 4804869 3736731 2060632
39063 2060632 1955003 3124567 4609695 6512862 8609499 9397877 8189326 6523946
39055 6523946 5829628 5031669 2347055 -1518454 -3949232 -3756127 -2148668 -557314 768021
39046 768021 1816909 2142158 1771245 1536842 1694547 1210726 -595920 -2476860 -2572107
39037 -2572107 -964674 463865 830370 1385469 3078736 4373432 3087157 -227037
39029 -227037 -2595406 -2376833 -923929 -31524 403375 1063672 1258227 123745 -1228546
39020 -1228546 -828025 1224779 2850594 3067522 3189217 4504134 6279343 6862718 5794591
39011 5794591 4129918 3251373 3711684 4734179 4823387 3503697 2237846 2689237 4361919
39002 4361919 5267701 4774410 4135863 4022357 3434948 1839004 638875 1317316 3366370
38993 3366370 5236454 6254079 6470676 5722914 4192684 3010569 2907354 2970634 2088632
38984 2088632 924112 933824 1968182 2536433 2228639 2124532 2634620 2606421 1208253
38975 1208253 -562834 -1095417 -120278 1273658 2075698 2135440 1732765 959457 -250490
38966 -250490 -1573678 -2075842 -1001333 1078682 2420812 1863371 143005 -938372 -421279
38957 -421279 1057804 2118434 1907337 792018 16894 361987 1146148 1189769 689748
38948 689748 972682 2093811 2170641 29408 -2803012 -4008346 -3273443 -1791419 -96030
38939 -96030 1783790 2846039 1982023 110222 -562120 521166 1831457 2264888 2188756
38930 2188756 1855033 882300 -147987 332302 2361718 3754636 3094971 1807953 1913350
38921 1913350 3170458 4073135 4582208 6067018 9096622 12927134 16914101 20895362
38913 20895362 24082720 24918621 22615301 18232973 13851125 10888274 9258964 7924343
38905 7924343 6199129 4499573 3694994 3959748 4701969 5336414 5385253 4151624 1562308
38896 1562308 -659180 -280849 2357961 4098078 2878805 587469 513790 2891765 4767188
38887 4767188 4034345 1912264 1038980 2267522 3988629 4140047 2435045 613568 502701
38878 502701 1981838 3299388 3302972 2524633 1907700 1549359 1244464 1182996 1260980 666909
38868 666909 -819829 -1952590 -1570846 -315143 408856 538121 1102047 2350046 3510010
38859 3510010 4121194 4291060 3860934 2644114 1337173 863879 912201 483519 -161194
38850 -161194 384321 2404208 4357471 4877863 4234363 3334589 2454866 1565449 939791
38841 939791 805356 1079045 1786861 2952763 3841294 3330031 1461267 -357189 -1206689
38832 -1206689 -1751184 -2853817 -4011693 -4010546 -2570496 -625015 657284 673131 -315355
38823 -315355 -1265710 -1212107 -356147 212658 60125 -92860 305243 737023 572047 60140
38813 60140 -301717 -626482 -1108629 -1318611 -854820 -179439 -33901 -479068 -1164900 -1928073
38803 -1928073 -2351315 -1490834 820475 2970967 3233625 2127178 1622430 2070438 1731057
38794 1731057 -84141 -1251651 322341 3312330 4396442 2742112 1048634 1626993
38786 1626993 3263199 3264157 1367249 -195440 -65192 732609 927592 932385 1722609 2968972
38776 2968972 3388111 2334973 265714 -1770208 -2490322 -1119496 1379724 2684859
38768 2684859 1686195 -192867 -1223195 -1697443 -2563163 -3041107 -1840615 44583 341536
38759 341536 -926530 -1506138 -700430 -324144 -1256529 -1859254 -1031884 -196596 -543016
38750 -543016 -674574 848305 2586941 2346666 799763 333759 1126686 1024943 -884218
38741 -884218 -2935744 -3353503 -2229421 -750917 90092 -196967 -1342569 -2207510 -1924539
38732 -1924539 -1058787 -695567 -788581 -639326 -553795 -1413257 -2728851 -2834399 -1306306
38723 -1306306 283438 493743 -322977 -959615 -885359 -311552 393478 824917 728355 474832
38713 474832 823195 1907958 2888546 2816499 1590008 57054 -639159 -104228 658393
38704 658393 138298 -1789451 -3544933 -3853261 -3113163 -2090885 -526535 1705508 3222336
38695 3222336 2659816 829600 -415604 -864424 -1631887 -2703894 -2934652 -2284617 -1866066
38686 -1866066 -1703174 -664675 1041793 1492925 -169355 -2448452 -3640682 -3567654 -2670493
38677 -2670493 -1267481 -371057 -1293440 -3515263 -4693694 -3700646 -1966487 -1009713 -579052
38668 -579052 -259665 -774286 -2156054 -2553517 -735139 1698485 2447202 1584813 717753
38659 717753 303024 -252221 -804851 -787175 -642011 -1164522 -1992048 -2351963 -2623845 -3509778
38649 -3509778 -4377444 -4201845 -3472339 -3238576 -2844609 -782949 2409262 4274555 3624892
38640 3624892 1734198 130827 -995400 -1829637 -2092530 -1731262 -1077119 72578 2118647
38631 2118647 4036184 3698772 622655 -2932182 -4548463 -4338062 -4129744 -4814688 -5548542
38622 -5548542 -5182975 -3594611 -1638988 -302210 47771 -243438 -688034 -1115996 -1410387
38613 -1410387 -1212059 -420662 303274 191980 -606271 -1220892 -1113842 -422878 478809
38604 478809 1179423 1275601 810190 308942 -150705 -1253010 -3037985 -4019279 -2993775
38595 -2993775 -1109351 -515609 -1212336 -1002482 1229495 3870492 4789449 3832146 2354535
38586 2354535 1321872 732516 299377 -31025 -21236 637868 1807598 2721551 2786896 2314973
38576 2314973 1866614 1316116 426459 -177749 156243 692587 207956 -851759 -759559
38567 -759559 812598 2150367 1927041 752687 -191166 -578685 -419056 402548 1295186
38558 1295186 1038451 -447852 -1635733 -1534819 -1080007 -1463529 -2332644 -2764413 -2899531
38549 -2899531 -3294844 -3531075 -2851264 -1614013 -820259 -544887 2345 1009800 1618024
38540 1618024 973239 -821543 -2727703 -3499838 -2768049 -1569185 -1210163 -1482328 -910440
38531 -910440 963725 2705315 2975281 2248284 1717030 1506460 964871 -68213 -1215890
38522 -1215890 -2095024 -2137227 -720939 1680441 3332310 3109022 1761947 619280 57440
38513 57440 45729 873679 2168728 2502339 1405750 556429 1386497 2789996 3091744
38504 3091744 3004962 4205367 5903132 5690381 3503878 1838190 1767171 1567419 15293
38495 15293 -1604055 -1952462 -1753740 -1938322 -1659268 29142 1996851 2444176 1519723
38486 1519723 817199 963137 1290763 1370531 1313575 893141 -144935 -1044713 -730742 430457
38476 430457 895655 178343 -458774 22947 936859 1024905 156671 -964229 -1974298
38467 -1974298 -2629416 -2004493 595643 3908134 5411069 4361179 2882336 3113500 4421017
38458 4421017 4782344 3972793 3468986 3602293 3062332 1552255 700409 1367956 2063877
38449 2063877 1474246 802427 1689518 3170569 2982915 1143442 -125770 195680 824695
38440 824695 628480 113691 -24622 -34956 -79824 422385 1620970 2595434 2642664 2201845
38430 2201845 1858044 1368533 334007 -934564 -1766473 -1732835 -654763 1231811 3001406
38421 3001406 3843901 4172400 4786269 4976600 3119682 -462396 -3086222 -3084496 -1922801
38412 -1922801 -1684227 -1984675 -1089618 1044784 2821773 3512839 3796064 3947445 3317717
38403 3317717 1905705 919181 1127104 1712916 1460601 395862 -383427 -111198 919086
38394 919086 1835927 2040544 1616543 1076970 774622 622236 386226 44864 -291463 -630191
38384 -630191 -1028923 -1316118 -1041300 189603 2191794 3978866 4398002 3336024 2053516
38375 2053516 1860734 2633026 3128162 2567908 1302334 111039 -410595 93745 1449468
38366 1449468 2732110 3154306 3084126 3252563 3152759 1604451 -954770 -2348768 -1519074
38357 -1519074 -93392 -76898 -1100368 -1238233 119738 1512413 1348468 -324942 -2035727
38348 -2035727 -2395741 -1425503 -476156 -571546 -1037207 -534900 722518 1030159 -358916
38339 -358916 -2243646 -3423917 -4163728 -4884503 -4859577 -3463731 -1615381 -623828 -416336
38330 -416336 -178659 -19575 -656665 -1939122 -2901996 -2965799 -2157210 -637649 1049191
38321 1049191 1814647 1122939 -155739 -797804 -635805 -270681 -132282 -517360 -1601065
38312 -1601065 -2590650 -1985436 312156 2313359 2473331 1603426 1023313 403391 -808147
38303 -808147 -1382711 -27559 2054306 2741813 2224402 2187073 2646696 2383998 1894944
38294 1894944 2788402 4357834 3938065 1108817 -1387353 -1600475 -545460 295160 895491
38285 895491 1134957 25519 -2140826 -3213160 -2196734 -786910 -563743 -756396 -264093
38276 -264093 188591 -328431 -978717 -637314 186783 664921 1444013 3269117 5004384
38267 5004384 4902872 3041313 959355 -348071 -807416 -574527 -215227 -634599 -1691736
38258 -1691736 -1920499 -668929 721467 945436 526977 433129 524134 743504 2047364
38249 2047364 4423994 5760577 4707366 3024949 2893883 3544550 3062913 1956933 1984628
38240 1984628 2682212 2255115 1059754 897907 1424873 706609 -910532 -1097725 166238
38231 166238 351122 -963020 -1033968 1127841 2519428 907620 -1388403 -1146691 812809
38222 812809 1286869 -396438 -2037268 -2135251 -1156328 197533 1576284 2044896 715896
38213 715896 -1508072 -2525512 -1625744 -132233 690236 999969 1289206 1210508 277248
38204 277248 -1017338 -1660683 -1507866 -1522508 -2443064 -3654927 -3907699 -3043512 -2256642
38195 -2256642 -2317379 -2400869 -1514531 -348163 -391088 -1577748 -2376678 -2275354 -2515178 -3828912
38185 -3828912 -5003274 -4695305 -3552222 -3330134 -4479629 -5600446 -5093758 -2822238 -340839
38176 -340839 365167 -1156107 -3084568 -3239504 -1677933 -411583 -573253 -1229619 -1282730
38167 -1282730 -985789 -853596 -523367 291993 931806 918078 833619 991518 402195 -1592540
38157 -1592540 -3652828 -3914087 -2426040 -708775 451033 1231388 1360580 242532 -1546261
38148 -1546261 -2426331 -1758316 -548406 -75222 -709663 -2094423 -3578830 -4410052 -4232429
38139 -4232429 -3399181 -2296828 -765463 1143542 2473517 2452758 1732923 1349941 958344
38130 958344 -455264 -2416786 -3186363 -2231323 -943123 -571515 -807767 -812794 -372601
38121 -372601 444176 1585557 2439272 2080774 707820 -180266 349010 1546182 2287555
38112 2287555 2461530 2343136 1641774 170999 -1317498 -2014023 -2197508 -2532469 -2755959
38103 -2755959 -2151976 -988400 -345683 -612186 -1200856 -1793331 -2794819 -4257169 -5313095
38094 -5313095 -5237242 -4357966 -3274043 -1765291 629318 3232033 4472064 3736162 2145507
38085 2145507 1052521 493135 -186885 -790049 -404572 1094397 2708048 3532630 3364823
38076 3364823 2064169 -418675 -2956055 -3534972 -1573063 1056379 2297360 2239353 2039646
38067 2039646 1619447 203348 -1458005 -1506070 223572 1618366 1041698 -754405 -2047289
38058 -2047289 -2189849 -1535745 -443323 759081 1536070 1599872 1129723 212474 -1243415
38049 -1243415 -2779632 -3492686 -3275143 -3012685 -3100635 -2856788 -2049716 -1788956 -2810398
38040 -2810398 -3858971 -3163681 -999840 573040 367380 -688386 -986897 1955 1510865
38031 1510865 2291743 1564751 -293176 -1976366 -2551255 -2343209 -2127570 -1899568 -1233905
38022 -1233905 -548494 -925804 -2505815 -3963535 -4043983 -3047808 -2299059 -2459702 -2868051
38013 -2868051 -2516004 -1309239 -130231 232400 -157514 -868797 -1853709 -3038438 -3455307
38004 -3455307 -1940604 960376 2906397 2418637 812376 426954 1530306 2287314 1579103
37995 1579103 418331 257198 1101443 1947261 2224094 2042877 1586928 1053658 902887
37986 902887 1431269 2198931 2491467 2311960 2296145 2582944 2478898 1593801 671772 641557
37976 641557 1242166 1411142 856780 260352 -176310 -1221360 -3081144 -4444719 -4056281
37967 -4056281 -2493533 -1229176 -493599 565324 1921049 2444635 1759807 854174 476097
37958 476097 267239 -33883 102254 740042 762486 -612194 -2524649 -3614072 -3652299
37949 -3652299 -3145307 -2133881 -498011 1070319 1468212 381740 -1545644 -3443352
37941 -3443352 -4684855 -5119555 -5217118 -5443669 -5381105 -4384913 -3145711 -3086504 -3835826 -3216199
37931 -3216199 -675229 1321146 820942 -663195 -744841 80942 -223727 -1581661 -2377848
37922 -2377848 -2735332 -4076907 -5817916 -5670884 -3393466 -1296813 -639438 -309161 407452
37913 407452 582586 -70871 -455113 -566122 -1914313 -4278566 -4928375 -2770454 -588607
37904 -588607 -1088102 -3087820 -3943196 -3591623 -3544381 -3610846 -2523225 -686725 426926
37895 426926 835077 1492372 1941612 1088529 -238639 -168302 1022533 1242050 149386
37886 149386 -271306 858584 1887036 1595569 1346630 2835715 5285826 6457004 5590712
37877 5590712 4032073 3297991 3457868 3360606 2019629 -217676 -1887788 -1981102 -1025299
37868 -1025299 -218518 56904 181775 241879 -23665 -487331 -808442 -1162553 -1871363 -2486871
37858 -2486871 -2206416 -1116227 -182850 -124740 -953006 -2221162 -2997786 -2299746 -578020
37849 -578020 74255 -1433504 -3223779 -2916687 -1268733 -1047601 -2649976 -3481588 -1961641
37840 -1961641 458068 2001248 2839196 3549406 3547050 2508770 1494844 1128129 326413
37831 326413 -1546848 -2858036 -1904064 330927 1595025 1568470 1604629 1969040 1514221
37822 1514221 -33632 -1410020 -1686387 -1297349 -859185 -176942 1157739 3011332 4817430
37813 4817430 5868912 5525483 3730647 1243206 -1105154 -3050155 -4332779 -4233589 -2634994
37804 -2634994 -970123 -867545 -2078224 -2908015 -2551006 -1766508 -1244580 -624950 472273
37795 472273 1497080 1613597 651949 -921611 -2410628 -3070941 -2558765 -1478961 -892751
37786 -892751 -1001271 -892781 89105 1308300 1648937 963492 125202 -255045 -593677
37777 -593677 -1540890 -2732078 -2924850 -1604774 93306 712843 361455 305480 832137
37768 832137 874635 115334 -73169 1204216 2551220 2088326 204001 -1085122 -935983
37759 -935983 -185142 515413 1177578 1176249 -454196 -2911445 -3680138 -1621684 1449440
37750 1449440 3226854 3564718 3536904 3233118 2207424 1297611 1978672 3847733 4441571
37741 4441571 2189982 -1523107 -3933256 -3799613 -2068046 -272209 723928 551397 -931445
37732 -931445 -3141753 -4730489 -4928788 -4609884 -5019122 -5597537 -4423240 -1204406 1644259
37723 1644259 1971190 728579 356070 1230080 1639320 900087 314231 718956 1107133
37714 1107133 500795 -466871 -844134 -825290 -845643 -507973 364082 771291 27759 -795705
37704 -795705 -433729 421910 215067 -884444 -1332422 -779099 -354728 -501770 -540840 -561779
37694 -561779 -1578525 -3179412 -3218225 -1058280 808158 57215 -2076329 -2673216 -1259154
37685 -1259154 162368 499364 521503 557729 -161097 -1299427 -1006861 1118342 2782399
37676 2782399 2310287 1355897 2242115 4103581 4292304 2742557 1921036 2486059 2175471
37667 2175471 -46639 -1677838 -385184 2218867 2916813 1549488 730013 1626348 2666577
37658 2666577 2463967 1670409 1344918 1345062 1121453 685776 64972 -980972 -2030025 -1953327
37648 -1953327 -506184 1099060 1876297 2200258 2500058 2056520 270653 -1795091 -2458485
37639 -2458485 -1475515 32374 1187474 1808621 1782033 1230405 1016647 1863528 3119169
37630 3119169 3526510 3057032 2744976 2764805 2087142 334510 -1333384 -1720747 -907404
37621 -907404 429882 1852564 2640293 1674668 -979736 -3214378 -2934340 -563505 1684790
37612 1684790 2622191 2762929 2417539 962457 -1373698 -2619944 -1281021 1437748 2990137
37603 2990137 2630434 1866003 1949810 2379028 2229650 1670751 1326431 1020412 186050 -911142
37593 -911142 -1383629 -1117306 -1120408 -2222444 -3911746 -4763305 -3852529 -1631825 508027
37584 508027 1527172 1581155 1494748 1586601 1498379 1145386 1024234 1208220 877086 -394767
37574 -394767 -1545595 -1269910 -39503 228157 -1433636 -3885623 -5282129 -4887725 -3352460
37565 -3352460 -1870607 -1289586 -1508345 -1529507 -433975 1643818 3681932 4605523 3730284
37556 3730284 1128711 -1748171 -2655476 -938092 1282118 1615342 457996 -103868 211526
37547 211526 -195538 -1484055 -1664919 38129 1624523 1424978 616301 990504 2038408
37538 2038408 2149595 1307928 667950 549569 693259 1518272 3242506 4566279 4103897
37529 4103897 2480676 1278954 617350 -433663 -1789386 -2655720 -3177829 -3694248 -3091094
37520 -3091094 -382335 2557548 2682015 251051 -1238342 -99516 1393704 883485
37512 883485 -723641 -1318782 -808922 -449181 -540864 -559957 -469727 -418069 -41345 721836
37502 721836 1063576 623729 319661 744178 840971 -530717 -2659463 -3929550 -3910151
37493 -3910151 -3264527 -2370154 -1311605 -542838 -280982 136243 1099208 1643488 795795
37484 795795 -722446 -1563853 -1858849 -2627785 -3578712 -3314019 -1663598 -109722 319728
37475 319728 118700 6982 -68587 -271192 -427258 -653741 -1358664 -2239343 -2331132 -1482751
37465 -1482751 -788742 -1076932 -1888666 -2441801 -2665730 -2694417 -2250005 -1298769 -575201 -605796
37455 -605796 -763115 -124518 1159333 2177981 2577095 2657588 2393588 1403483 19763
37446 19763 -612391 -10598 766221 406985 -836521 -1360729 -226034 1668340 2667832
37437 2667832 2185947 1083802 503600 792583 1535484 2156495 2244176 1592523 349568
37428 349568 -833137 -1117547 -233203 1113600 1852287 1694699 1415142 1718466 2098282
37419 2098282 1371211 -685459 -2838624 -3681880 -2855907 -899729 1315171 2712660 2561668
37410 2561668 1569987 1523490 2949268 4029917 3010059 854930 -16497 918566 1969937
37401 1969937 2017918 1690145 1595096 1271538 439587 -336415 -851268 -1633641 -2579604 -2830616
37391 -2830616 -2643935 -3557994 -5717063 -6871805 -5426135 -2868549 -1574464 -1586992 -1348298
37382 -1348298 -460345 210551 370162 385834 105304 -761599 -1605119 -1772713 -1837228 -2473039
37372 -2473039 -2808758 -1651115 309823 1406901 1544221 1845597 2267436 1803164 803478
37363 803478 694626 1328519 1061773 -143687 -153804 2002340 4438893 5103921 4246728
37354 4246728 3092278 1873483 523440 -231270 10882 240308 -536942 -1658746 -1821305
37345 -1821305 -980359 -104120 355950 727459 1316180 2128229 2945629 3160329 2185646
37336 2185646 512073 -461389 -184253 356426 277310 68079 404750 743540 224916
37327 224916 -763674 -1118564 -694057 -392024 -774603 -1423406 -1615240 -1072396 -97389 728856
37317 728856 1080768 1132891 1018555 379100 -846227 -1601206 -894691 399242 442619 -809284
37307 -809284 -1492524 -801992 -109842 -373779 -478837 551284 1511818 844409 -884562
37298 -884562 -1982718 -1928265 -1118876 408089 2249796 2827437 1300455 -647869 -956585
37289 -956585 -216001 -322231 -931275 11289 2408024 3551862 2121776 166684 54965
37280 54965 1417350 2392125 2394820 2214079 2269637 2120235 1398294 346240 -545401 -1034250
37270 -1034250 -1269809 -1468136 -1394676 -524360 1025222 2312054 2827755 3230969 4120530
37261 4120530 4909123 4874900 4431043 4123039 3317054 1467735 -190330 -158363 800717
37252 800717 861040 361523 1241332 3323348 4045740 2500229 937795 1113318 1717172
37243 1717172 1036810 -108918 -103095 571895 338848 -807196 -1697281 -2123103 -2592292
37234 -2592292 -2655817 -1471839 295069 939095 21801 -1221930 -1686861 -1313893 -371066
37225 -371066 852787 1674788 1559726 1042283 1009363 1157909 392806 -1240378 -2374355
37216 -2374355 -2350430 -2123284 -2549232 -2886083 -1900609 201820 1899598 2178430 1497115
37207 1497115 940459 993571 1371404 1677124 1789691 1626804 994276 -1411 -703976 -602807
37197 -602807 -160358 -332776 -1235616 -1948411 -1802953 -1161255 -613525 -135933 430302 659934
37187 659934 -14754 -1425319 -2739234 -3241592 -2785864 -1764929 -833072 -308700 190088
37178 190088 972684 1249700 -69391 -2338498 -3257947 -1732495 553580 1437011 1016289
37169 1016289 712675 548691 -749536 -3184216 -4871149 -4405949 -2548889 -1050035 -735353
37160 -735353 -1194799 -1601189 -1380356 -557655 257785 515787 350057 271243 510617 1115029
37150 1115029 2226026 3529254 3908632 2685144 920215 369380 1289207 2414505 2936335
37141 2936335 3140699 3107442 2377384 1265745 912203 1361012 1082590 -710907 -2679201
37132 -2679201 -3371280 -3282712 -3511011 -3584331 -2464033 -920807 -803531 -2104490 -2789902
37123 -2789902 -1887234 -903852 -1431012 -2855084 -3448085 -2572405 -755384 1429308 3362729
37114 3362729 4094395 3458534 2927301 3783059 4705908 3046831 -1131215 -4165588 -3097658
37105 -3097658 503488 2566335 1522920 -494856 -1174166 -764198 -738891 -1318603 -1501055
37096 -1501055 -735623 551390 1697960 2129086 1189171 -1384078 -4701532 -7095846 -7455038
37087 -7455038 -5872363 -3115179 -50016 2383804 3390706 3029012 2388776 2547583 3375940
37078 3375940 3762744 3095177 2086333 1771352 2011560 1745993 803251 496517 1717368
37069 1717368 3221260 3015231 1128266 -386072 -281634 493623 646354 249619 -243999
37060 -243999 -1235599 -2844257 -3645322 -2289137 164771 1263114 338148 -957235 -1325755
37051 -1325755 -1359328 -1976321 -2860457 -3271201 -3299759 -3451501 -3758398 -4028591 -4255112 -4075591
37041 -4075591 -2597464 272437 2828567 3007574 800606 -1635917 -2432496 -1883386 -1585421
37032 -1585421 -2287915 -3201242 -3250239 -2290108 -791370 1033296 2986207 4065886 3082973
37023 3082973 471442 -1562385 -1440871 68453 1365741 2290086 3559125 4676417
37015 4676417 4221990 2196539 356532 -189298 -265281 -956736 -1969759 -2424634 -2226921
37006 -2226921 -1804477 -1249424 -478829 295800 780431 821025 290547 -482733 -227647 2023531
36996 2023531 4937712 5682968 3418235 500816 -635824 -210703 413316 1156008 2327614
36987 2327614 2821119 1559220 -105787 121698 1962004 2895916 1948919 753826 563068
36978 563068 608636 168293 -15522 424350 184980 -1616944 -3568668 -3840379 -2814884
36969 -2814884 -2150132 -2071301 -1406495 104026 1282191 1282102 428167 -830169 -2464283 -4075154
36959 -4075154 -4761236 -4294989 -3533115 -3159692 -2806167 -1959645 -1042734 -906413 -1687490
36950 -1687490 -2768731 -3515279 -3476045 -2224691 216777 2868186 4433432 4603354 4174510
36941 4174510 3750430 2985862 1503494 -50107 -612497 -168060 168092 -318063 -943646
36932 -943646 -564571 839179 1981761 1629229 -150822 -2112412 -3022816 -2703542 -1992233
36923 -1992233 -1742482 -1956787 -2024810 -1670434 -1238910 -905841 -71843 1929589 4613503
36914 4613503 6336315 5743590 3095170 77835 -1598757 -1457520 -377753 338123 84652
36905 84652 -690474 -1149961 -1039519 -933910 -1463098 -2377768 -2641104 -1631947 -31270
36896 -31270 927727 1038145 1293592 2227635 2858443 2056312 417804 -348938 200962 684925
36886 684925 -23081 -1263645 -1739597 -1276222 -667388 -465197 -748878 -1534116 -2506052
36877 -2506052 -2740511 -1630226 115040 1239069 1535424 1803309 2324159 2383172 1494264
36868 1494264 227041 -580364 -814678 -888719 -997968 -989312 -731225 -280877 271738 977310
36858 977310 1974960 3157173 3948288 3799291 3009222 2530349 2704770 2870129 2662406
36849 2662406 2819247 3793070 4418691 3371675 1483741 934570 2151053 3241431 2924270
36840 2924270 2327342 3004027 4593662 5627533 5576328 4825441 3482527 1640080 258583
36831 258583 263416 964401 851367 32220 379803 2729893 5216261 5351692 3029730
36822 3029730 496397 -279820 663697 1964191 2404737 1596267 46304 -1028081 -587959
36813 -587959 943065 1735503 609736 -1262141 -1594354 132142 2033449 2304720 1286558
36804 1286558 477033 482515 913180 1581519 2593040 3555236 3806438 3333962 2583761 1606087
36794 1606087 371567 -375328 179343 1474563 2117787 1835176 1501818 1249692 263669
36785 263669 -1204503 -1499956 -81920 1311195 1116034 60725 -395356 -254698 -139206
36776 -139206 308342 1315182 1479313 -350989 -2438340 -1901252 1039051 3033048 2225506
36767 2225506 575820 626715 1990941 2557132 1801246 1096849 1225846 1130762 -602615
36758 -602615 -3794431 -6533355 -6866877 -4685256 -1934541 -739827 -1389285 -2495329 -2882881
36749 -2882881 -2597775 -2094505 -1341438 -149613 1155049 1816031 1243097 -455383 -2249514
36740 -2249514 -2777597 -1767255 -622786 -808556 -1870310 -2082995 -967564 106002 58162
36731 58162 -467920 -402232 161602 497037 511780 601012 799544 833485 610562 130111
36721 130111 -645696 -1468156 -1978562 -2510479 -3769607 -5191362 -4820983 -1922175 1252541
36712 1252541 1754004 -455593 -2576888 -2452562 -619406 1128821 1841181 1622635 840211
36703 840211 -117862 -771420 -788171 -170414 868719 1926487 2391724 1922120 976949
36694 976949 341259 27618 -767478 -2368827 -3826805 -3898652 -2590642 -1226644 -899160
36685 -899160 -1210957 -928145 196665 883281 80797 -1258752 -1161287 709088 2589231
36676 2589231 3142234 3092800 3488575 3633493 2253309 -87783 -1529906 -1634629 -1767453
36667 -1767453 -2561068 -2724241 -1095817 1476073 3266734 3730343 3464036 2855769 1827665
36658 1827665 566979 -428625 -972653 -1225100 -1200755 -820281 -431427 -717469 -1860295
36649 -1860295 -3086131 -3355375 -2548979 -1761440 -2114773 -3313560 -3890669 -3117012 -2001268
36640 -2001268 -1785650 -2114530 -1751364 -714503 -336264 -1150146 -2087753 -2164904 -1718108
36631 -1718108 -1380391 -987309 -284943 268761 292585 237895 485713 502801 -142288 -700511
36621 -700511 -300274 529076 571622 -274389 -1034771 -1117169 -649681 180869 906558 356254
36611 356254 -2038790 -4718658 -5369685 -3866025 -2250050 -1664769 -1181848 -230347 -142608
36602 -142608 -1914587 -3973545 -3984403 -2045941 -319424 127018 348050 1341424 2518468
36593 2518468 3006326 3212269 3997165 4895413 4371876 2005623 -452947 -828212 1007467
36584 1007467 3083743 3713905 3112334 2304549 1378348 -147857 -1741774 -2043157 -752378
36575 -752378 879288 1785729 2176930 2437408 2189528 1312550 792336 1379607 2204062
36566 2204062 2028513 1313586 1587357 2993469 3920282 3195091 1409572 -179361 -958806
36557 -958806 -880745 -171052 423046 57232 -997632 -1397941 -506931 709343 1166161
36548 1166161 1135436 1375062 1610621 1120255 399675 827036 2531542 3819224 3252796
36539 3252796 1428604 573 -435422 -618313 -1072566 -1269616 -594462 556960 1178928
36530 1178928 816069 -165368 -1212343 -1909355 -1820227 -774999 538040 1020321 557213
36521 557213 248208 745494 1154159 432259 -797847 -1046969 -216924 333578 13614
36512 13614 -155682 638290 1667609 1934163 1680050 1654301 1734456 1392262 903081 868077
36502 868077 884015 -40541 -1753836 -2802924 -2301758 -1103683 -724884 -1652105 -3000555
36493 -3000555 -3451566 -2408375 -634207 195473 -983733 -3461315 -5444656 -5838804 -4931101
36484 -4931101 -3536026 -2175928 -1095324 -340595 325037 975353 973618 -330757 -2254706
36475 -2254706 -3130817 -2437587 -1657355 -2352664 -4160793 -5468960 -5393432 -4162468 -2128444
36466 -2128444 361405 2264791 2283511 400954 -1803236 -2796968 -2577471 -2258125 -2650477
36457 -2650477 -3574646 -4268231 -4200595 -3591641 -3146862 -3143985 -3022944 -2279528 -1429424 -1271056
36447 -1271056 -1302802 -34151 2668717 4631299 3751817 716567 -1766754 -2162560 -1389630
36438 -1389630 -941458 -1022496 -1093973 -1220221 -1884273 -2950466 -3765509 -4132931 -4334191 -4185664
36428 -4185664 -2992532 -813461 950706 890213 -794130 -2568929 -3316139 -3268496 -3226405
36419 -3226405 -3416644 -3409222 -2860074 -1996885 -1388049 -1366467 -1687496 -1747629 -1184742 -221151
36409 -221151 653475 1208634 1513427 1633568 1651815 1910645 2721666 3680339 3755458 2408605
36399 2408605 310006 -1389962 -2196988 -2311338 -1893602 -914485 377817 1477108 2196760
36390 2196760 2723210 3004402 2639714 1599310 509438 -176960 -875967 -2217843 -3912025
36381 -3912025 -4814521 -4165608 -2391856 -585868 561329 1205321 1891170 2790413 3422670
36372 3422670 3165541 2000814 601314 -348633 -731615 -853430 -978134 -1138687 -1182516
36363 -1182516 -868424 -147611 569188 783965 674346 958377 1709929 1986684 1264509
36354 1264509 580954 1186385 2379716 2011631 -626080 -3580040 -4464441 -3033108 -906560
36345 -906560 457328 673519 -93976 -1479907 -2762347 -3116184 -2224972 -402693 1711469
36336 1711469 3278869 3468835 2165117 362928 -649026 -485204 260063 900123 1187392
36327 1187392 1175457 1054017 1013901 915417 352462 -545494 -803521 240877 1804953 2473405
36317 2473405 1914262 952588 156118 -622380 -1316218 -1385732 -772955 -161875 86533 440133
36307 440133 1282071 2277962 3016961 3509563 3679018 3165953 2080790 1182394 871724
36298 871724 786087 779965 1346472 2501187 3253826 2947668 2206527 1768252 1377579 765550
36288 765550 613106 1254539 1426527 -60962 -2084327 -2396825 -700692 1203547 2122494
36279 2122494 2472338 2539566 1735150 152522 -849830 -466078 488586 1086685 1579792
36270 1579792 2325090 2649558 1892216 699205 206965 536120 937826 841722 51034
36261 51034 -1389699 -2769895 -2929761 -1745026 -605286 -475685 -374313 937667 2489507
36252 2489507 1991131 -975922 -4190119 -5382406 -4332004 -2189403 -46583 1302770
36244 1302770 1368332 621350 474502 1782379 3705612 4688614 4323940 3696919 3973572
36235 3973572 5079416 5848066 5313164 3808928 2703309 2843237 3377897 2581047 -28734
36226 -28734 -2824631 -3637438 -1943085 745674 2393541 2041093 182834 -1879098 -2961173
36217 -2961173 -2697391 -1650508 -708200 -278794 -117891 96190 259464 47568 -598956
36208 -598956 -1449958 -2278235 -2818905 -2565787 -1188408 690490 1704320 1136316 -266306
36199 -266306 -1238720 -1347104 -966182 -451394 -56659 -244633 -1128852 -1825894 -1397973 -350220
36189 -350220 -5781 -301003 383028 2660651 4818383 5060231 3945489 3263776 3295623
36180 3295623 2821914 1561428 835265 1382803 1964530 1100716 -654136 -1350911 -361516
36171 -361516 657665 -15782 -1689789 -1923589 344485 3287677 4372579 3314387 1873400
36162 1873400 1136958 378185 -1199807 -2951185 -3785300 -3738154 -3597797 -3479527 -2669474
36153 -2669474 -741656 1732168 3536017 3720629 2494512 1271787 1297989 2198258 2594427
36144 2594427 2079578 1479579 1101800 196930 -1424706 -2852278 -3837391 -5317699 -7114098
36135 -7114098 -7029785 -3933664 -85929 1649011 1535129 1686543 2321599 1945282 471743
36126 471743 -629900 -976239 -1423875 -1818781 -1257199 -418377 -773465 -1515968 -487412
36117 -487412 1568026 1302158 -1714631 -3496995 -1461760 1686212 2258314 700530 -461795
36108 -461795 -1104052 -2465593 -3607392 -2710040 -874377 -984274 -3125167 -4410240 -3385361
36099 -3385361 -1606976 -579454 1797 341592 -424477 -2196537 -3076547 -1880548 65063
36090 65063 805769 245636 -259168 142028 1128860 1860224 1659682 485054 -1002073
36081 -1002073 -2171285 -3034723 -3599497 -3236080 -1783855 -683437 -1434432 -3199380 -3669463
36072 -3669463 -2270635 -674783 11139 516854 1351781 1561675 554269 -607721 -929996
36063 -929996 -957437 -1269438 -1009957 544655 2197970 2325287 1246429 426603 80948
36054 80948 -601016 -1373849 -1090819 111625 704962 189216 -109266 687554 1500539 1123306
36044 1123306 393175 1140360 3459699 5325126 4993811 2927432 1119239 1094006 2752345
36035 2752345 4678077 5294501 4075088 1960422 445524 100805 206177 -78828 -669083
36026 -669083 -1025465 -1141492 -1366511 -1590747 -1509340 -1565536 -2549921 -4077868 -4582879 -3334671
36016 -3334671 -1509111 -639772 -889074 -1496662 -1964965 -1973100 -1119585 209256 691167
36007 691167 -11230 -215870 1387032 3338901 3363771 1914321 1403970 2310306 2748518
35998 2748518 2062059 1906772 2877891 2904484 665525 -1745365 -1694128 177515 1241107
35989 1241107 707454 -146747 -703570 -1541114 -2538267 -2658672 -1793866 -1015455 -716263
35980 -716263 -113350 973496 1304067 -108988 -2488869 -4117859 -4082433 -2830800 -1531229
35971 -1531229 -1148262 -1718478 -2369939 -2337863 -1841641 -1597444 -1801953 -2208886 -2885560 -4087760
35961 -4087760 -5532184 -6559463 -6912677 -6652350 -5548927 -3497960 -1440060 -797671 -1747241
35952 -1747241 -2852795 -2669251 -1104514 842763 1941122 1280645 -1075132 -3641643
35944 -3641643 -4509799 -3277677 -1485286 -834564 -1531644 -2653490 -3456962 -3795020 -3737386
35935 -3737386 -3406296 -2983747 -2418717 -1277959 658762 2643226 3200883 1457936 -1747515
35926 -1747515 -4330372 -4824405 -3718752 -2594118 -2052834 -1222711 499415 2146951 2368539
35917 2368539 1278365 198600 -84003 128480 431392 896600 1591795 2202425 2196087
35908 2196087 1022638 -1407697 -3850035 -4059970 -1193340 2538539 3958755 2511618
35900 2511618 453322 -329582 -72413 316781 558270 308512 -1033498 -2908535 -3534694
35891 -3534694 -2325100 -971847 -981338 -1548645 -1283191 -657642 -888225 -1428765 -759213
35882 -759213 852797 1646292 1421356 2073699 4474501 6714517 6572519 4499857 2970119
35873 2970119 3480508 5092199 5680050 4169945 1740790 800260 2248701 3970366 3051978
35864 3051978 -522029 -3724646 -4330920 -3317401 -2607794 -2137074 -822762 769293 989504
35855 989504 -18752 -273875 868281 1554984 335903 -1549071 -2136192 -1645278 -1711038
35846 -1711038 -2505223 -2514519 -1051476 730114 1627831 1760588 1632512 1085119 -67551
35837 -67551 -1330590 -2242073 -2984626 -3530593 -3078903 -1393032 67521 -276928 -1799204
35828 -1799204 -2355947 -1248045 -13696 28627 -444213 -210835 482316 530914 -119335
35819 -119335 -475379 -229131 -326842 -1563093 -3414758 -4650503 -4568930 -3293650 -1347765
35810 -1347765 522439 1404197 829760 -540760 -1419652 -1391825 -1436783 -2472354 -3856686
35801 -3856686 -4218200 -3604620 -3638911 -5144861 -6674809 -6207611 -3583167 -378665 1993282
35792 1993282 3042785 2664542 1219358 -43591 -46905 534762 68816 -1467836 -2171930
35783 -2171930 -1010446 486358 305069 -1354620 -2622000 -2497998 -1718230 -1455267 -2126590
35774 -2126590 -3289241 -3990098 -3452458 -2002371 -957843 -1014308 -1218943 -265986 1677022
35765 1677022 3309412 3968410 4060552 3925587 3316905 2110340 705446 -453799 -1175307
35756 -1175307 -1300108 -740338 263284 1376109 2504131 3436970 3560327 2678224 1766971
35747 1766971 1950632 2933544 3486029 3330535 3304792 3591691 3184444 1579720 -233957
35738 -233957 -1160785 -1344336 -1414107 -1363920 -1031492 -807675 -867816 -443804 1019878 2581139
35728 2581139 2903266 2228158 1909937 2174399 1809660 273798 -1290418 -1672707 -1052916
35719 -1052916 -179138 809351 1792812 1814771 109861 -2375778 -3698235 -3149953 -1859561
35710 -1859561 -1178657 -1405449 -2162465 -2968362 -3080295 -1792462 435171 1908583 1541622
35701 1541622 251191 -215928 606091 1729895 2242161 2114466 1724373 1459182 1698768
35692 1698768 2364306 2549613 1413311 -620683 -2340567 -3234680 -3543979 -3122507 -1674611
35683 -1674611 -179549 -410229 -2465080 -4294707 -4442887 -3740380 -3310086 -2578158 -826119
35674 -826119 732890 486926 -881979 -1398261 -919689 -991141 -1815527 -1839780 -684612
35665 -684612 -97727 -1162562 -2657919 -3255498 -3386146 -3594132 -2946758 -919679 692487
35656 692487 1235 -1847761 -2198199 -1016349 -868555 -2616172 -3835087 -2595285 -520168
35647 -520168 -266930 -1515555 -1670965 177213 2272841 3165897 3493223 4083960 4164380
35638 4164380 2823315 1001194 330351 630692 270421 -1181751 -2373894 -2423883 -2102881
35629 -2102881 -2218066 -2318525 -1819602 -1058890 -280574 1077743 2886168 3475881 1900386
35620 1900386 -113595 -393735 434363 165303 -1192460 -1487643 -176825 827743 555709
35611 555709 392800 1030398 770724 -1342209 -3075214 -2038731 536201 1562555 460091
35602 460091 -805591 -1275931 -1891473 -2961908 -3267641 -2140532 -461061 938130 2149279
35593 2149279 2950662 2370486 292032 -1854102 -2861974 -3163613 -3716111 -4447348 -4644122
35584 -4644122 -4145093 -3328990 -2391883 -1280277 -36118 1162664 1985070 1853784 428206
35575 428206 -1643926 -3047650 -3067759 -2032569 -560949 825692 1380606 576292 -782970
35566 -782970 -1007216 326212 1619720 1321453 -144213 -1271986 -1473849 -1283935 -1242309
35557 -1242309 -1540984 -2277777 -3113478 -3099691 -1837001 -480823 -516266 -1644079 -1990728
35548 -1990728 -616077 1153844 1375001 -173409 -1891735 -2348933 -1809597 -1620352 -2389975
35539 -2389975 -3275342 -3239480 -2461305 -1837730 -1478046 -783263 10175 -220810 -1428839
35530 -1428839 -1670707 408601 3349081 4508676 3292607 1327655 -129189 -1303556
35522 -1303556 -2461021 -3033821 -2701267 -2067441 -1604309 -863977 616452 2351609 3446954
35513 3446954 3622559 3342641 3362326 4239685 5662452 6238705 4839885 2285825 674054
35504 674054 780556 1293855 1067941 778010 1452250 2594370 3049738 2893754 3078099
35495 3078099 3697867 3916023 3333481 2277992 964810 -508833 -1526616 -1467043 -800877
35486 -800877 -595627 -917142 -742606 488739 2168693 3342270 3331291 1728879 -1075492
35477 -1075492 -3459425 -3940080 -3024495 -2407361 -2392794 -1774284 -432145 -5954 -1212812
35468 -1212812 -2467615 -2407101 -2027712 -2739653 -3813778 -3645400 -2397494 -1382055 -707260
35459 -707260 333024 1182647 644777 -700112 -1040990 -356551 -532819 -2063393 -3006364
35450 -3006364 -2112952 -806837 -727964 -1136723 -386563 1371645 2647521 2852728 2513666
35441 2513666 1898788 906167 -67617 -396754 -106079 453266 1351680 2566586 3292262
35432 3292262 2833084 1672403 605448 -532402 -2010477 -2801921 -1738563 316657
35424 316657 1318754 1001634 1025151 1914616 2008298 333305 -1463456 -1518493 -534300 -335091
35414 -335091 -702667 183035 2435988 3755669 2599471 458821 -49582 1580178 3495611
35405 3495611 4025153 3410795 2935207 3112356 3219929 2391511 769279 -561998 -713683
35396 -713683 58316 661451 428563 -123303 15998 1055858 2172486 2560688 2208286
35387 2208286 1408265 136174 -1433240 -2244416 -1226755 1103711 2839820 2784117 1613723
35378 1613723 704048 658859 1363108 2448616 3039444 2098184 28091 -1018077 291637
35369 291637 2360147 2621923 1002238 -380055 -643294 -1122285 -2596218 -3681731 -3022540
35360 -3022540 -1443411 -641206 -882133 -1218372 -1080020 -509294 378145 1062208 568820
35351 568820 -1033837 -1858395 -355512 2249659 3172250 1503470 -955664 -2169825 -1747407
35342 -1747407 -295393 1579164 3128786 3529565 2755130 1640796 729788 -114438 -688702
35333 -688702 -151554 1619025 3299687 3579050 2698515 1786808 1266981 799672 373753
35324 373753 476675 1264613 2311873 3185036 3711157 3758155 3299506 2621730 1948479 994527
35314 994527 -494115 -1878674 -2094276 -1086215 -21721 185972 -157382 -397320 -589135
35305 -589135 -1024524 -1312348 -845954 74232 500548 205229 -62805 169873 417392 140286
35295 140286 -391561 -632237 -579996 -528189 -494622 -477191 -792436 -1452152 -1632031 -648809
35285 -648809 788383 1289340 667221 42710 -57026 -503382 -1923250 -3297469 -3125505
35276 -3125505 -1391115 533410 1577842 1709221 1213367 208530 -942191 -1444854 -747016
35267 -747016 798234 2156455 2498249 1903433 1198038 959702 790278 4478 -1002410
35258 -1002410 -885201 744260 2351342 2241442 732329 -441908 -555042 -517172 -1084216
35249 -1084216 -1722550 -1714846 -1302151 -946723 -278978 1199692 2802128 3163696 2089407
35240 2089407 940729 881724 1516885 1752022 1321910 685473 -129830 -1470354 -2846767
35231 -2846767 -3013398 -1817385 -894781 -1524356 -2613931 -2213712 -591052 -97944 -1827232
35222 -1827232 -4072374 -4749487 -3899915 -2894647 -2454389 -2583215 -3318791 -4198650 -3928069
35213 -3928069 -2092161 -451487 -893216 -2662638 -3414393 -2609051 -1813944 -1659254 -762407
35204 -762407 1647047 3977460 4253153 2503238 223056 -1391897 -1831667 -1077792 1102
35195 1102 58013 -1021557 -1766142 -1275784 -597665 -969767 -1897665 -2245541 -2128668 -2193226
35185 -2193226 -1948302 -611334 961460 1086367 -163721 -954525 -410111 209414 -638534
35176 -638534 -2998921 -5719704 -7390761 -6915343 -4458762 -2004417 -1577873 -2601274 -2447689
35167 -2447689 -84791 2393114 2678799 1203492 -33076 -381071 -754868 -1588487 -2111059
35158 -2111059 -1580820 -174047 1333804 2037700 1309709 -451741 -1740935 -1499253 -563837
35149 -563837 -644629 -1984406 -3059416 -2657004 -1202162 211494 1033692 1020850 -130832
35140 -130832 -1978563 -2887882 -1635783 659265 1329910 -787786 -3882740 -5234324 -4183573
35131 -4183573 -2439334 -1810794 -2444317 -3317725 -3689477 -3622348 -3508742 -3590675 -3824453 -3889192
35121 -3889192 -3427748 -2507239 -1661432 -1241711 -998436 -630450 -392138 -620088 -967261
35112 -967261 -857128 -560292 -927952 -1947064 -2485744 -1854362 -812564 -499509 -1063969
35103 -1063969 -1975559 -3028624 -4185155 -4846466 -4240926 -2487178 -567628 737617 1328771
35094 1328771 1322318 778702 -68535 -859222 -1435888 -1717659 -1377857 -217991 1209620
35085 1209620 1990173 1890543 1434162 948044 247324 -604210 -967290 -421247 622495
35076 622495 1387805 1384198 439757 -1319539 -3205338 -4210837 -3955831 -3104183 -2591875
35067 -2591875 -2718092 -3088167 -3050091 -2142270 -620547 457550 338193 -256380 37527
35058 37527 1142942 1482218 378021 -816101 -768305 -101917 -188877 -1084170 -1914679 -2364760
35048 -2364760 -2381595 -1356171 687911 1891429 635795 -1569683 -1535679 1215931 3759005
35039 3759005 3873408 2623359 2040024 2363034 2815721 3308680 3879579 3838127 2941304
35030 2941304 2263774 2531134 2713305 1680336 160580 -452253 -211056 48669 454105
35021 454105 1377015 1876358 894632 -603546 -773474 237920 658171 1278 -664389
35012 -664389 -1239612 -2840838 -5119504 -5838727 -4077828 -1762893 -899903 -1111760 -1085546
35003 -1085546 -754091 -681431 -686192 -425479 -210805 -138203 367107 1099885 643101 -1306313
34993 -1306313 -2698401 -1867765 -125048 333421 -105859 560857 2284678 2875547 1547505
34984 1547505 124156 176050 961124 1048343 429799 22029 113989 240225 33542 -389828
34974 -389828 -579602 -126628 774583 1341636 1307700 1535888 2645235 3563240 2783718 791895
34964 791895 -325731 247904 1170259 1232783 926260 1055836 1280162 1023853 699213 906533
34954 906533 1211312 786465 -217246 -819423 -403436 854200 2373149 3464369 3626371
34945 3626371 3019484 2317089 1814871 1178241 324111 -87652 552231 2016135 3514034
34936 3514034 4244575 3640045 1907952 455921 696997 2082628 2481757 1031594 -643930
34927 -643930 -797098 194087 1018066 1606434 2608116 3557094 3266921 1740579 255442
34918 255442 -341447 -267586 103450 694118 1349194 1881130 2293894 2292880 1184497 -841273
34908 -841273 -2193775 -1963585 -1654581 -3080843 -5221077 -5368543 -3175862 -1147386 -880576
34899 -880576 -1312536 -1378355 -1810486 -2937672 -3100743 -1320890 273104 -859794 -3651732
34890 -3651732 -4627237 -2677820 -243350 362027 -364632 -691387 -175753 318837 38529
34881 38529 -1065131 -2501007 -3446688 -3273562 -2170637 -837660 425121 1695856 2638357
34872 2638357 2700134 2201492 2180328 2834342 3121554 2348705 1151283 298880 -466701 -1551810
34862 -1551810 -2340361 -2005527 -980306 -536673 -1136261 -2087662 -2608737 -2378869 -1309790
34853 -1309790 247923 1214150 756705 -359630 -363801 1398948 3769759 5305760 5566170
34844 5566170 4703655 2895863 723708 -788542 -1163383 -888472 -485633 12531 299873
34835 299873 -342515 -1706946 -2347945 -1625753 -932216 -1562903 -2452718 -1798025 -136166
34826 -136166 349659 -696107 -1341141 -616586 71283 -482049 -1436260 -1785656 -2132117
34817 -2132117 -3043374 -3323154 -1863028 4953 200285 -736204 -221746 2496022 5107096
34808 5107096 5278076 3256359 858463 -731679 -1353374 -1122200 -288825 566950 850453
34799 850453 383374 -554557 -1322768 -1177663 39515 1529944 2359153 2476428 2325404
34790 2325404 1781174 409204 -1366535 -2413611 -2320092 -1777135 -1461710 -1427917 -1631105
34781 -1631105 -2076764 -2408789 -2372415 -2624346 -3806769 -4850768 -3882692 -1182029 577813
34772 577813 -167059 -1852949 -2326412 -1675337 -1099649 -607480 219488 433199 -994634
34763 -994634 -2775272 -2550951 -381871 1207416 811518 -329158 -846075 -1260647 -2519177
34754 -2519177 -4073528 -4621563 -3835129 -2451854 -1367813 -1234963 -2119757 -2970500 -2315733
34745 -2315733 -175770 1549893 1311424 -268202 -1521051 -1822446 -1602722 -1018585 164815
34736 164815 1656626 2678302 2889679 2525396 1759184 721130 43988 504917 1920356
34727 1920356 3056052 2956729 1995353 1376754 1855217 3130845 4353116 4973456 4960338
34718 4960338 4276210 2644056 276646 -1585700 -1781864 -851357 -523685 -1345938 -1959993
34709 -1959993 -1309704 -361842 -598625 -1789454 -2615509 -2829527 -3237803 -3843029 -3639462
34700 -3639462 -2380144 -1087358 -442032 64360 899447 1575220 1583404 1267225 1080289
34691 1080289 788815 100081 -588172 -720922 -320277 325305 1108569 1784288 1935611
34682 1935611 1821465 2456348 4087670 5328256 4724010 2620672 561027 -615460 -1053041
34673 -1053041 -822674 77873 852034 398820 -1099706 -2166558 -1918478 -1079376 -788613
34664 -788613 -1177447 -1486459 -993902 404426 1969172 2401832 1112567 -664248 -908041
34655 -908041 727090 2374673 2321649 1026558 139666 321277 917061 1266507 1363397
34646 1363397 1392363 1392379 1371486 1231743 664796 -422075 -1498352 -1864653 -1414111 -602031
34636 -602031 134266 540876 398687 -267111 -957059 -1167669 -1048054 -1193385 -1830900 -2527565
34626 -2527565 -2606961 -1599799 460914 2783182 4077847 3601276 1921531 326537 -407875
34617 -407875 -393642 -89200 146756 162315 128775 400626 948431 1286891 1344615 1827212
34607 1827212 3053359 4047189 3773753 2794832 2474296 2840691 2687245 1768557 1272588
34598 1272588 1713191 1927496 919845 -674407 -1866545 -2748023 -3548116 -3525594 -2260707
34589 -2260707 -1063090 -1401515 -2569276 -2658691 -1445033 -431370 -171001 417079 1767751
34580 1767751 2736104 2698229 2736859 3620517 4237474 3479571 2318584 2301726 3063030 3294140
34570 3294140 3393005 4775630 6732023 6553423 3487081 284135 -485506 200256 -167834
34561 -167834 -1713526 -2454319 -1749991 -1117531 -1514183 -1902472 -1232045 -257156 -365538
34552 -365538 -1613299 -2857501 -3172330 -2436142 -1149985 -282510 -631735 -1751784 -2230446
34543 -2230446 -1609770 -1108560 -1651387 -2290551 -1862484 -1207106 -1911565 -3369525 -3231134
34534 -3231134 -935404 1255118 1388259 142349 -955866 -1872560 -3119722 -3854581 -2941036
34525 -2941036 -1320115 -1329278 -3554873 -5938121 -6367173 -4903192 -3041097 -1957003 -2075847
34516 -2075847 -3265692 -4553549 -4452026 -2640952 -855944 -990490 -2538487 -3155298 -1879834
34507 -1879834 -442868 -675573 -1824316 -1760963 -171668 1137505 1062490 568095 687068
34498 687068 841760 301154 -130862 451372 960482 -289635 -2567855 -3331441 -1914471
34489 -1914471 -376366 -177640 -319697 143971 36915 -1627658 -3015629 -1598069 1897615
34480 1897615 3984773 2688291 -605074 -3511870 -4980269 -5004558 -3809487 -2072998
34472 -2072998 -790243 -249675 121812 685009 1225221 1714630 2363310 2801033 2405512
34463 2405512 1641584 1748658 2741796 3154875 2354835 1608143 1933115 2369803 1737129
34454 1737129 893612 1495747 3176852 3825061 2611526 1106311 1005426 1982518 2364423
34445 2364423 1137677 -1199942 -3218108 -3632478 -2305883 -507691 180982 -577789 -1753145
34436 -1753145 -2410199 -2698637 -3099061 -3328141 -2693038 -1304011 -178822 42470 -70508
34427 -70508 404004 1404246 2001580 1781735 1407940 1512747 1677136 1176002 341995 269193
34417 269193 1135864 1723998 1026183 -290879 -603095 754986 2726375 3583557 2518112
34408 2518112 324333 -1336416 -1481851 -687291 -295358 -899411 -1982574 -2882296 -3437618
34399 -3437618 -3639457 -3425152 -3093509 -3155274 -3355785 -2649507 -796258 775924 657515
34390 657515 -505546 -827518 116327 685663 -347111 -1826993 -1662721 286263 1916009
34381 1916009 1633739 393707 173009 1012691 946317 -892793 -2560628 -1854733 389441
34372 389441 1243232 -350481 -2354259 -2664912 -1635404 -815399 -715179 -963107 -1469095
34363 -1469095 -2091108 -2037647 -980871 -101705 -674803 -2164561 -3098709 -3317479 -3788045
34354 -3788045 -4489218 -4233195 -2745615 -1341215 -1083594 -1544256 -1863161 -1925316 -1969001
34345 -1969001 -1978869 -1984798 -2216127 -2623597 -2962984 -3467043 -4497390 -5405275 -4909803 -2980835
34335 -2980835 -1200524 -751544 -1140936 -1450995 -1660361 -1988675 -2101657 -1907399 -2104464
34326 -2104464 -2924471 -3334504 -2634471 -1852513 -2158736 -2779456 -2204778 -876875 -673915
34317 -673915 -1791769 -2211279 -833519 653842 117227 -2041530 -3446928 -2602895 -160594
$$ [...]
##END NTUPLES=NMR SPECTRUM
##END=
