##TITLE=31Pdec_LR-685A-3(R)
 , 24 sc
 26.7.2019
##JCAMPDX= 6.0         $$ Bruker NMR JCAMP-DX V2.0
##DATA TYPE= NMR SPECTRUM
##DATA CLASS= NTUPLES
##ORIGIN= UXNMR, Bruker Analytische Messtechnik GmbH
##OWNER= root
$$ XWIN-NMR		Version 3.5
$$ Fri Jul 26 15:11:31 2019 Russian Standard Time (UT+4h)  she@DPX200
##.OBSERVE FREQUENCY= 81.013821
##.OBSERVE NUCLEUS= ^31P
##.ACQUISITION MODE= SIMULTANEOUS
##.ACQUISITION SCHEME= undefined
##.AVERAGES= 24
##.DIGITISER RES= 17
##SPECTROMETER/DATA SYSTEM= spect
##.PULSE SEQUENCE= zgpg30
##.SOLVENT NAME= CDCl3
##.SHIFT REFERENCE= (INTERNAL, CDCl3, 0, 182.463)
##AUDIT TRAIL= $$ (NUMBER, WHEN, WHO, WHERE, WHAT)
$$ ##TITLE= Audit trail, XWIN-NMR		Version 3.5
$$ ##JCAMPDX= 5.01
$$ ##ORIGIN= Bruker BioSpin GmbH
$$ ##OWNER= she
$$ F:/spectra/data/she/nmr/P31/1/pdata/1/auditp.txt
$$ ##AUDIT TRAIL=  $$ (NUMBER, WHEN, WHO, WHERE, WHAT)
(   1,<2019-07-26 15:10:31.64 +0400>,<she>,<DPX200>,
      <created by zg, POWCHK disabled, PULCHK disabled
       configuration hash MD5:
       00 E9 B6 7A A2 85 ED C7 34 08 36 98 17 FE 4E 26
       data hash MD5: 32K
       1F C3 56 69 22 73 C6 5E 6A 10 B3 CB A7 32 98 1D>)
(   2,<2019-07-26 15:10:34.32 +0400>,<she>,<DPX200>,
      <Start of raw data processing
       efp BC_mod = 2 LB = 1 FT_mod = 6 PKNL = 1 PHC0 = -372.7894 PHC1 = 51.39999 SI = 64K 
       data hash MD5: 64K
       F1 4B D6 55 01 49 A7 EF C7 95 21 7B A4 39 F7 A7>)
(   3,<2019-07-26 15:10:53.35 +0400>,<she>,<DPX200>,
      <pk PHC0 = -47.91549 PHC1 = 79 
       data hash MD5: 64K
       0E BE 62 A0 CF 63 E1 AF 74 29 C4 6F A2 40 BA 5A>)
(   4,<2019-07-26 15:10:56.56 +0400>,<she>,<DPX200>,
      <abs ABSG = 5 
       data hash MD5: 64K
       3C A6 60 F8 F7 4F 79 42 30 77 0E 05 49 51 77 C4>)
$$ ##END=
$$ 
$$ hash MD5
$$ BA AA 8E BA 3B DB 46 12 DC 52 40 0D 0A 8A 59 10
##$RELAX= 
##$RELAX= 
##$RELAX= 
##$RELAX= 
##$RELAX= 
##$RELAX= 
##$RELAX= 
##$RELAX= 
$$ Bruker specific parameters
$$ --------------------------
##$DU= <F:/spectra>
##$EXPNO= 1
##$NAME= <P31>
##$PROCNO= 1
##$TYPE= <nmr>
##$USER= <she>
##$AMP= (0..31)
100 100 100 100 100 100 100 100 100 100 100 100 100 100 100 100 100 100 
100 100 100 100 100 100 100 100 100 100 100 100 100 100 
##$AQSEQ= 0
##$AQ_mod= 1
##$AUNM= <au_zg>
##$AUTOPOS= <>
##$BF1= 81.014009
##$BF2= 200.13
##$BF3= 200.13
##$BF4= 200.13
##$BF5= 200.13
##$BF6= 200.13
##$BF7= 200.13
##$BF8= 200.13
##$BYTORDA= 1
##$CFDGTYP= 0
##$CFRGTYP= 5
##$CHEMSTR= <none>
##$CNST= (0..31)
1 1 145 1 1 1 1 1 1 1 1 1 1 1 1 1 1 1 1 1 1 1 1 1 1 1 1 1 1 1 1 1 
##$CPDPRG= <waltz16>
##$CPDPRG1= <>
##$CPDPRG2= <waltz16>
##$CPDPRG3= <>
##$CPDPRG4= <mlev>
##$CPDPRG5= <mlev>
##$CPDPRG6= <mlev>
##$CPDPRG7= <mlev>
##$CPDPRG8= <mlev>
##$CPDPRGB= <>
##$CPDPRGT= <>
##$D= (0..31)
0 1 0 0 0 0 0 0 0 0 0 0.03 2e-05 3e-06 0 0 0 0 0 0 0 0 0 0 0 0 0 0 0 0 
0 0 
##$DATE= 1564139431
##$DBL= (0..7)
120 120 120 11 120 120 24 19 
##$DBP= (0..7)
150 150 150 150 150 150 150 150 
##$DBP07= 0
##$DBPNAM0= <>
##$DBPNAM1= <>
##$DBPNAM2= <>
$$ [...]
##$SUBNAM3= <"">
##$SUBNAM4= <"">
##$SUBNAM5= <"">
##$SUBNAM6= <"">
##$SUBNAM7= <"">
##$SUBNAM8= <"">
##$SUBNAM9= <"">
##$SW= 369.568048894756
##$SWIBOX= (0..15)
0 1 3 0 0 0 0 0 0 0 0 0 0 0 0 0 
##$SW_h= 29940.119760479
##$TD= 32768
##$TD0= 1
##$TE= 0
##$TE2= 300
##$TE3= 300
##$TEG= 300
##$TL= (0..7)
0 120 53 12 22 120 120 120 
##$TP= (0..7)
150 150 150 150 150 150 150 150 
##$TP07= 0
##$TPNAME0= <>
##$TPNAME1= <>
##$TPNAME2= <>
##$TPNAME3= <>
##$TPNAME4= <>
##$TPNAME5= <>
##$TPNAME6= <>
##$TPNAME7= <>
##$TPOAL= (0..7)
0.5 0.5 0.5 0.5 0.5 0.5 0.5 0.5 
##$TPOFFS= (0..7)
0 0 0 0 0 0 0 0 
##$TUNHIN= 0
##$TUNHOUT= 0
##$TUNXOUT= 0
##$USERA1= <user>
##$USERA2= <user>
##$USERA3= <user>
##$USERA4= <user>
##$USERA5= <user>
##$V9= 5
##$VALIST= <valist>
##$VCLIST= <CCCCCCCCCCCCCCC>
##$VD= 0
##$VDLIST= <DDDDDDDDDDDDDDD>
##$VPLIST= <PPPPPPPPPPPPPPP>
##$VTLIST= <TTTTTTTTTTTTTTT>
##$WBST= 1024
##$WBSW= 4
##$XGAIN= (0..3)
0 0 0 0 
##$XL= 0
##$YL= 0
##$YMAX_a= 98974
##$YMIN_a= -127650
##$ZGOPTNS= <>
##$ZL1= 120
##$ZL2= 120
##$ZL3= 120
##$ZL4= 120
##$ABSF1= 182.463
##$ABSF2= -187.1042
##$ABSG= 5
##$ABSL= 3
##$ALPHA= 0
##$AQORDER= 0
##$ASSFAC= 0
##$ASSFACI= 0
##$ASSFACX= 0
##$ASSWID= 0
##$AUNMP= <proc_1d>
##$AZFE= 0.1
##$AZFW= 0.5
##$BCFW= 0
##$BC_mod= 2
##$BYTORDP= 0
##$COROFFS= 0
##$CY= -3
##$DATMOD= 1
##$DC= 0
##$DFILT= <>
##$DTYPP= 0
##$F1P= 0
##$F2P= 0
##$FCOR= 1
##$FTSIZE= 65536
##$FT_mod= 6
##$GAMMA= 0
##$GB= 0
##$INTBC= 1
##$INTSCL= 5.30512e-09
##$ISEN= 30
##$LB= 1
##$LEV0= 0
##$LPBIN= 0
##$MAXI= 10000
##$MC2= 0
##$MEAN= 0
##$ME_mod= 0
##$MI= 50
##$NCOEF= 0
##$NC_proc= -5
##$NLEV= 6
##$NOISF1= 182.463
##$NOISF2= 159.3651
##$NSP= 0
##$NTH_PI= 0
##$NZP= 0
##$OFFSET= 182.463
##$PC= 4
##$PHC0= -420.7049
##$PHC1= 130.4
##$PH_mod= 1
##$PKNL= yes
##$PPARMOD= 0
##$PSCAL= 0
##$PSIGN= 0
##$REVERSE= no
##$SF= 81.0140089999434
##$SI= 65536
##$SIGF1= 159.3651
##$SIGF2= -187.1042
##$SINO= 113.3802
##$SIOLD= 16384
##$SREGLST= <1H.CDCl3>
##$SSB= 0
##$STSI= 65536
##$STSR= 0
##$SW_p= 29940.119760479
##$SYMM= 0
##$S_DEV= 0
##$TDeff= 32768
##$TDoff= 0
##$TI= <>
##$TILT= no
##$TM1= 0
##$TM2= 0
##$TOPLEV= 0
##$USERP1= <user>
##$USERP2= <user>
##$USERP3= <user>
##$USERP4= <user>
##$USERP5= <user>
##$WDW= 1
##$XDIM= 65536
##$YMAX_p= 301175545
##$YMIN_p= -4901893
$$ End of Bruker specific parameters
$$ ---------------------------------
##NTUPLES= NMR SPECTRUM
##VAR_NAME=  FREQUENCY,     SPECTRUM/REAL,   SPECTRUM/IMAG
##SYMBOL=    X,             R,               I
##VAR_TYPE=  INDEPENDENT,   DEPENDENT,       DEPENDENT
##VAR_FORM=  AFFN,          ASDF,            ASDF
##VAR_DIM=   65536,         65536,           65536
##UNITS=     HZ,            ARBITRARY UNITS, ARBITRARY UNITS
##FACTOR=    0.456856943014862, 1,           1
##FIRST=     14782.0589164792, 0,            0
##LAST=      -15158.0608439998, 0,           0
##MIN=       -15158.0608439998, -4901893,    0
##MAX=       14782.0589164792, 301175545,    0
$$ Real data points
##PAGE= N=1
##DATA TABLE= (X++(R..R)), XYDATA
$$ [...]
47878 48464 -313204 -834483 -954061 -499661 135764 517787 651044 799030 1018012 1128661
47868 1128661 1088960 1112921 1353728 1686895 1890230 1818220 1308141 235343 -1090411 -1899256
47858 -1899256 -1747607 -1125148 -800124 -744478 -359080 305171 427519 -213069 -628224 -313
47848 -313 1007680 1140388 307421 -444644 -485375 -192475 -12253 152127 401771 475579
47838 475579 275520 163671 372115 584267 431531 3961 -424093 -793520 -1100914 -1198775
47828 -1198775 -1041288 -814220 -571610 -66861 801485 1679651 2129982 2034864 1478791 609278
47818 609278 -188127 -417281 -87223 152385 -217431 -996748 -1657233 -1904169 -1623035 -795784
47808 -795784 165398 523183 121260 -271704 1376 590969 825137 760438 829888 884273
47798 884273 455950 -268532 -624483 -519395 -461986 -558726 -339804 289362 735442 621469
47788 621469 318185 246031 220837 -133099 -750311 -1250351 -1380593 -1073115 -352050 564650
47778 564650 1271790 1465212 1127111 458162 -184499 -434191 -340852 -471537 -1105839 -1520751
47768 -1520751 -785299 752432 1618875 1117432 277545 397817 1288719 1671630 965955
47759 965955 -75103 -481556 -219115 -11749 -313738 -746671 -616876 127736 731524
47750 731524 575915 -12271 -285305 -157368 -162520 -440611 -540612 -376018 -547454 -1277743
47740 -1277743 -1750056 -1188181 -109637 284533 -261954 -830761 -723149 -327218 -310161
47731 -310161 -534255 -341166 292140 521922 -194819 -1151444 -1179430 -256346 414591 161796
47721 161796 -132163 565588 1690253 1799017 706676 -335545 -595934 -677886 -1043069
47712 -1043069 -1053449 -238634 595237 518271 -99061 -359274 -316158 -504164 -574277 203851
47702 203851 1327748 1408761 259987 -692207 -467933 171450 87230 -563436 -814074 -362467
47692 -362467 286926 743635 998442 972234 522419 -99764 -366111 -151795 98852 -7034
47682 -7034 -342815 -537985 -453852 -204130 117252 498182 854122 1046133 1136669 1447422
47672 1447422 2142018 2779926 2551713 1147147 -697902 -1722838 -1297926 -32524 814368
47663 814368 563617 -258951 -604871 -182740 187039 -362836 -1612700 -2522259 -2427938 -1549268
47653 -1549268 -472519 298430 347473 -380685 -1171472 -1104678 -278783 232227 -43749 -280677
47643 -280677 211652 734540 301681 -666492 -907319 -243200 271721 103356 -41677 496528
47633 496528 1339564 1803409 1814948 1609988 1185009 574415 132522 10618 -187963 -690548
47623 -690548 -922149 -261647 830610 1214601 637428 183909 817391 1967103 2144444
47614 2144444 825905 -887742 -1667758 -1452420 -1067872 -813785 -299171 390385 434045
47605 434045 -382941 -1011787 -591254 183909 122106 -603387 -855556 -496529 -559108 -1349605
47595 -1349605 -1770472 -1073037 -116663 -61584 -674013 -901817 -593729 -612172 -1377975 -2184359
47585 -2184359 -2148740 -1335251 -677759 -940229 -1840779 -2246213 -1392191 138179 994160
47576 994160 639955 -119632 -355575 -184892 -316149 -901101 -1454178 -1711311 -1942396 -2333515
47566 -2333515 -2522472 -2030156 -1014022 -323690 -631184 -1554073 -1955930 -1303448 -374410
47557 -374410 -209873 -696042 -844712 -293078 318912 503996 547555 699504 632692 200731
47547 200731 -18866 448743 1198345 1586642 1598630 1472691 1055502 284345 -201253 172508
47537 172508 856488 805371 -1044 -556158 -312620 197739 345147 205658 119693 106422
47527 106422 90682 250587 738395 1294591 1449547 1042260 415152 116597 361047 720435
47517 720435 527616 -259486 -849405 -562417 244104 588020 67283 -754907 -1121819 -857962
47507 -857962 -327081 101445 423630 876450 1417786 1480728 635414 -533769 -856119 -122014
47497 -122014 505610 112540 -639535 -559853 271154 712171 247141 -544291 -1070736 -1284190
47487 -1284190 -1124455 -402095 517956 766100 80477 -756475 -927140 -508536 -127038
47478 -127038 -178836 -672348 -1413406 -2042128 -2163383 -1649565 -683011 434870 1295315 1476768
47468 1476768 1087759 933097 1512303 2121510 1758546 719408 284567 820413 1301777
47459 1301777 961362 322030 136803 293281 368361 415138 530866 383785 -131103 -429666
47449 -429666 -176289 -93188 -990062 -2380100 -2896974 -1930670 -225692 1012840 1140479
47440 1140479 408446 -284159 -145452 710505 1460005 1670610 1665587 1616782 1100872 55543
47430 55543 -656014 -396783 212075 260442 -56508 40048 525115 768275 734441 868555
47420 868555 1030266 686456 42944 -164576 7014 -247729 -1026795 -1486057 -1291417 -1135669
47410 -1135669 -1419426 -1553402 -1136164 -774220 -1003455 -1307824 -1050606 -606083 -624401 -804032
47400 -804032 -458741 116925 5692 -734731 -962022 -116587 981984 1406911 1379953 1629915
47390 1629915 2043791 1766000 532707 -806259 -1314689 -1035912 -666298 -473588 -84005
47381 -84005 652799 1151761 796854 -157320 -829942 -749036 -240759 170314 304732 178555
47371 178555 -255571 -927264 -1443761 -1381551 -750247 3091 445294 527885 524014 652931
47361 652931 801788 676643 234876 -168119 -157221 259974 770470 1077807 1027216 639918
47351 639918 229649 234103 642961 855600 480142 -7299 89142 626717 891083 792106
47341 792106 953966 1499823 1647521 952219 181930 263687 858626 787438 -310175 -1480552
47331 -1480552 -1688732 -990687 -282235 -245976 -785831 -1314167 -1360098 -899439 -236540 294055
47321 294055 482729 277197 -140666 -387704 -230339 108845 215730 24468 -160858 -143023
47311 -143023 -27835 20206 -120100 -598904 -1321201 -1657971 -1044392 49749 449404 -158501
47301 -158501 -698597 -200618 842950 1253910 777958 142790 -163778 -341211 -588487
47292 -588487 -719922 -575693 -284019 -12661 156506 108358 -173194 -400006 -279550 65586
47282 65586 346777 596546 928800 1022077 502939 -227241 -287601 451501 1124405 1064430
47272 1064430 590625 307536 241201 96982 -128651 -289701 -478392 -780039 -903544 -541848
47262 -541848 48184 264516 -86446 -584813 -728318 -429534 -7250 148733 -54781 -292445
47252 -292445 -177927 215301 428336 304624 268428 687479 1285891 1543476 1422077 1259466
47242 1259466 1101768 651144 -103059 -666623 -633874 -202358 94641 -6249 -286118 -283257
47232 -283257 348079 1534057 2683250 3039967 2358691 1210419 459871 431912 724194
47223 724194 808669 559273 81547 -649553 -1591836 -2226252 -1895820 -708015 362329
47214 362329 561655 180751 -26705 157098 451371 732670 1042803 1216034 1185224 1429728
47204 1429728 2294193 3016253 2472660 987661 258942 1081122 2228423 2232818 1267700
47195 1267700 435664 109578 49742 424162 1431938 2335759 2150215 1111480 307442
47186 307442 18509 -353054 -817462 -666963 33871 253506 -287197 -559000 -24622 313421
47176 313421 -397613 -1233182 -756841 811018 1910772 1727397 862458 156493 -159943
47167 -159943 -206345 -174400 -313446 -575852 -401330 545640 1638718 1970489 1563007 1160002
47157 1160002 1018926 794314 546318 855735 1708253 2153393 1525727 405326 -74419
47148 -74419 508606 1581909 2226914 1922043 961952 256417 401928 951243 1009368 501555
47138 501555 281747 934690 2087601 3045314 3471558 3227974 2217384 789937 -229157
47129 -229157 -376186 -67551 42389 -130341 -212291 75418 752120 1616826 2226415 2191628
47119 2191628 1662266 1135894 749480 337222 194518 883988 2022449 2298262 1275998
47110 1275998 198986 211700 750964 751524 550098 1165473 2243041 2334756 1119190 -186438
47100 -186438 -789325 -1248874 -2040265 -2534931 -2108838 -1222376 -635298 -364465 -144260 -173162
47090 -173162 -599510 -871214 -453764 217820 309582 -188570 -573139 -542436 -440808 -482860
47080 -482860 -469785 -336584 -334278 -486210 -394344 116329 516438 110141 -1028161 -1937880
47070 -1937880 -1726082 -571914 402154 356010 -365974 -795032 -592943 -293357 -357133 -565879
47060 -565879 -503603 -118429 414774 900836 984731 392760 -385684 -337683 665794 1399703
47050 1399703 923718 38407 138138 1080539 1403706 554929 -344352 -225809 512799 830848
47040 830848 444317 -210135 -793525 -1197917 -1255350 -904693 -447413 -229924 -251314 -340310
47030 -340310 -430284 -417876 -135562 238110 196281 -266938 -337887 530960 1646056 1918954
47020 1918954 1394388 1069648 1285686 1263417 469761 -429942 -493761 227286 911363 1050776
47010 1050776 752321 250797 -255593 -388480 183168 1164018 1694774 1207482 19882
47001 19882 -1039306 -1437253 -1280449 -990022 -766130 -402361 346695 1271014 1790434 1621982
46991 1621982 1113960 731501 503503 307132 393984 1073252 1996329 2403826 2158124 1917730
46981 1917730 2120379 2422925 2427076 2298336 2210687 1805419 851446 -50443 -189568 172672
46971 172672 260061 74715 312254 1056204 1531615 1313021 874425 668965 541264 450245
46961 450245 896621 2003882 2879910 2629219 1499086 334744 -616167 -1568727 -2270724
46952 -2270724 -2148826 -1293722 -484889 -181657 -140946 -70880 -27445 -63371 -50546 20945
46942 20945 45966 167227 621779 1152680 1129714 411196 -430513 -909079 -1112635 -1175437
46932 -1175437 -852906 -40155 743501 923616 693943 768726 1359421 1807579 1361179 105474
46922 105474 -1072046 -1461949 -1307787 -1347800 -1649421 -1444516 -411600 505407 281405
46913 281405 -603312 -735962 205620 1090255 1113239 777815 677018 443070 -320422 -1008925
46903 -1008925 -907400 -428558 -418236 -718039 -504129 260365 808735 851951 812627 818977
46893 818977 524061 19687 -106300 151388 64190 -579611 -1024418 -793971 -482193 -692813
46883 -692813 -979702 -592226 318110 1022191 1323096 1570453 1844179 1869644 1631858 1439541
46873 1439541 1400138 1324894 1142132 1025473 1150759 1567539 2115040 2253841 1423049 -5804
46863 -5804 -650350 279310 1665852 1673544 97946 -1434001 -1640566 -937704 -337413 -16976
46853 -16976 374514 737864 681091 294122 65677 203342 569278 1114447 1856010 2538802
46843 2538802 2818091 2744599 2643873 2545775 2168074 1505881 1014749 1042426 1382232 1614942
46833 1614942 1729326 2154294 3145204 4302499 4911973 4819985 4715750 5258091 6117309
46824 6117309 6375350 5825635 5226932 5105511 5049548 4645311 4401487 4964211 5867065 5968803
46814 5968803 4968217 3654731 2723004 2166360 1867389 1908575 2071284 1814261 1098704
46805 1098704 597507 753508 1216528 1511740 1625477 1575185 1104724 326695 10431 563445
46795 563445 1260894 1232900 788126 923793 1804539 2627455 2916226 3053106 3375138 3524435
46785 3524435 3049639 2120687 1268105 742689 454798 338632 478333 894171 1346303
46776 1346303 1445698 1078438 711329 995853 1910068 2600057 2359318 1495506 880476 895067
46766 895067 1221295 1441489 1374395 1002426 551556 476208 859432 1019157 315971 -787486
46756 -787486 -1164418 -483527 480868 1021402 1190905 1155141 686132 -266816 -1146786 -1452759
46746 -1452759 -1388142 -1380033 -1348106 -973997 -435261 -318670 -825905 -1451320 -1551662 -1082648
46736 -1082648 -681318 -974791 -1803919 -2313804 -1942365 -1047884 -304215 157803 564983
46727 564983 866946 953078 1151365 1656889 1748336 656329 -908899 -1372612 -555297 72880
46717 72880 -247264 -487145 138722 626656 -68566 -1023923 -719334 429995 698108 -216294
46707 -216294 -895361 -652479 -552383 -1518897 -2810436 -3112596 -2230685 -1019660 -259621
46698 -259621 -148762 -448256 -691462 -564284 -321540 -510740 -1168719 -1680021 -1544445 -911691
46688 -911691 -265516 83119 141342 156176 344543 495754 139117 -572687 -671237 311423
46678 311423 1380777 1351896 632524 568946 1298775 1661670 1254275 1026874 1444191 1564341
46668 1564341 709780 -244258 -232832 390856 672449 614969 765395 909411 413202 -511794
46658 -511794 -1024396 -910400 -606695 -185749 603699 1363050 1258791 416892 78865 926664
46648 926664 2041703 2093457 1035529 31839 -33931 553764 910685 631066 130250
46639 130250 4414 242038 274662 -195322 -737409 -777684 -368336 -6500 167024 538441
46629 538441 1343354 2210118 2590363 2424167 2125156 1979549 1838771 1524149 1286505 1490394
46619 1490394 1887690 1744464 953748 480983 1146152 2377678 2931058 2573432 2134112
46610 2134112 1998612 1674783 1044870 853734 1385715 1707753 1051654 121743 77397 827165
46600 827165 1342285 1260349 1159905 1413202 1665668 1453249 692992 -360379 -1133867 -972417
46590 -972417 66127 982628 1046857 826116 1220178 1933190 1978203 1416033 1319376 1968723
46580 1968723 2358197 1838805 1119664 1073175 1459751 1514027 1123217 742649 610665 667598
46570 667598 936037 1442672 1951455 2180415 2144518 1988628 1619632 775684 -559928 -1925411
46560 -1925411 -2594502 -2174066 -1113328 -370389 -315577 -275293 460265 1568948 2212018
46551 2212018 2240590 2117555 1930100 1429777 920397 1028033 1491384 1259830 94445
46542 94445 -909477 -794933 139589 1094417 1761079 2087639 1902051 1344270 971601 945602
46532 945602 821898 540276 718339 1432727 1724948 1092524 503895 952853 1842580 1927256
46522 1927256 1185393 558080 346672 138047 -6255 432308 1322040 1922876 2021365 2042958
46512 2042958 2108338 1974519 1838425 2133332 2515508 2145604 1097863 413821 545614
46503 545614 804476 649718 453947 533278 432774 -169433 -649692 -252631 822453 1745691
46493 1745691 2040334 1791278 1309357 981299 1022312 1072667 548030 -348581 -632686 73177
46483 73177 906525 1060413 956239 1383547 2142776 2489467 2464709 2729670 3280361 3370195
46473 3370195 2752846 2079555 1864896 1838934 1607888 1298632 1192303 1215859 1134388 866927
46463 866927 364067 -414899 -1127780 -1092338 -116989 1019198 1365601 902481 429499 471162
46453 471162 742156 729571 403948 167978 317419 725501 975911 743075 129538 -363602
46443 -363602 -334629 41208 197235 -146263 -704402 -1072626 -1157525 -1015289 -588793 79652
46433 79652 615410 692042 501631 426548 367539 -71010 -751512 -996420 -592821 -196777
46423 -196777 -384894 -809164 -741879 -72281 700579 1144298 1110571 610561 -5505 -39276
46413 -39276 788610 1762640 1952433 1380826 774233 334529 -417769 -1536097 -2219514 -1803433
46403 -1803433 -592791 597172 1284874 1483334 1436231 1396732 1347516 918388 -253 -682935
46393 -682935 -317214 662184 879047 -86399 -1024946 -816152 35253 277392 -372372 -1198941
46383 -1198941 -1648883 -1663224 -1223216 -424303 203377 217122 -37751 89528 587053 998465
46373 998465 1352641 2007889 2695206 2683273 1994793 1543833 1795951 2088729 1642223 574446
46363 574446 -460387 -1043652 -1023768 -361921 586985 1110887 928575 563157 530792 595668
46353 595668 318099 -85739 -70827 319637 542262 448097 427824 639888 735659 548913
46343 548913 508222 999169 1662092 1739548 1003059 12348 -536691 -487043 -192988 9160
46333 9160 145656 406175 716105 696828 152807 -543606 -782517 -412252 131635 416871
46323 416871 430976 289717 -71925 -552719 -570826 263543 1246227 1119716 -249319 -1471727
46313 -1471727 -1407548 -666753 -583407 -1230126 -1519326 -1063656 -691345 -896485 -976841 -301376
46303 -301376 566406 822207 705133 875503 1109411 707386 -126558 -435454 40033 600255
46293 600255 839354 1159586 1804526 2296663 2234763 1919066 1767313 1726804 1664017 1757262
46283 1757262 2067465 2227594 2002395 1715713 1702583 1761336 1578700 1294720 1189522 1164921
46273 1164921 991612 750833 593620 384804 40954 -94668 294209 937866 1344541
46264 1344541 1435595 1325471 805874 -301708 -1484504 -1908844 -1390728 -436590 541651
46255 541651 1386986 1679178 912001 -576795 -1541237 -1110044 224661 1160380 853113
46246 853113 -463986 -1768456 -2039025 -1111479 137363 727243 619803 413041 200489
46237 200489 -455874 -1361884 -1518239 -610453 218559 -105493 -941721 -823659 353756
46228 353756 1150461 604777 -608960 -1388706 -1675492 -2059082 -2488425 -2243773 -1139146
46219 -1139146 -35374 154910 -407756 -767364 -439238 87258 277818 493829 1406249
46210 1406249 2635794 2825408 1439218 -201965 -401315 776728 1687406 1296577 272749
46201 272749 -272113 -208368 -38569 144237 557425 955505 775056 28186 -569196 -453949
46191 -453949 228691 957485 1310052 1075699 334171 -463323 -863460 -978183 -1341636 -2105828
46181 -2105828 -2759117 -2789574 -2255468 -1531268 -876982 -457420 -358266 -304023 196158 1046824
46171 1046824 1355022 538401 -713087 -1199411 -694910 -17152 220990 182848 145579 54962
46161 54962 -56770 97848 487911 601953 240737 -25273 372247 1171022 1684141 1721506
46151 1721506 1625797 1608032 1541875 1347646 1167335 1116805 1109379 964399 613376 273242
46141 273242 395567 1184921 2155542 2562722 2362020 2236731 2495690 2582271 2059861 1410243
46131 1410243 1235795 1266388 955768 567111 679179 921283 325239 -1082864 -2129451
46122 -2129451 -2108396 -1549012 -1090647 -594271 130022 600872 365399 -192247 -406043 -251891
46112 -251891 -156605 -275366 -462759 -601894 -522537 20064 868845 1390353 1266202 852976
46102 852976 369451 -558371 -1937274 -2799619 -2492544 -1891061 -2141275 -2697081 -2034041
46093 -2034041 -129928 1312264 1296129 682158 447080 270077 -315511 -660576 -61441
46084 -61441 849534 1042701 753421 865188 1087360 273940 -1453384 -2390013 -1498405 213023
46074 213023 1206756 1359012 1547807 1970653 1904455 985760 -131014 -589813 -308903 107103
46064 107103 185662 81511 256307 771852 1091052 752013 80698 -157631 184801 423735
46054 423735 79581 -354550 -52564 1096186 2473710 3438767 3616300 2864739 1588984
46045 1588984 845367 1388723 2642733 3300710 2969735 2504346 2626774 3033877 3154529
46036 3154529 2989337 2726027 2227508 1498302 1064744 1225300 1431255 1129853 755050
46027 755050 1048451 1767432 2013220 1628100 1270144 1172586 883696 357911 241864 725589
46017 725589 1062998 739871 309305 479266 1050247 1390430 1392407 1289847 991965 310667
46007 310667 -445734 -736577 -462637 78786 643797 1020896 907854 295512 -350590 -732219
45997 -732219 -1103624 -1515843 -1283496 -9705 1371123 1611656 919506 585554 972351
45988 972351 1131363 605512 329023 1136814 2390545 2888915 2461504 1845124 1434512
45979 1434512 986195 395633 63665 392539 1281116 2194232 2609163 2468385 2232713
45970 2232713 2319214 2549061 2491813 2246320 2269228 2392514 1827985 484404 -555100 -502014
45960 -502014 -97006 -512734 -1528387 -1839455 -991990 63773 461275 475737 725104
45951 725104 1128470 1254160 1170697 1267722 1461066 1219507 426757 -258826 -120150 770058
45941 770058 1614132 1715365 1093676 317604 -112749 -152163 -105411 -275679 -679581 -996458
45931 -996458 -845314 -248588 248392 145641 -340621 -465685 101096 817694 941739 417752
45921 417752 -171179 -383305 -340501 -380104 -534879 -476442 95474 1083958 2034208 2520620
45911 2520620 2434263 1911085 1177518 565968 404067 609477 630488 160983 -316804 -191349
45901 -191349 304481 445841 188735 115979 180181 -433714 -1801557 -2660731 -2048690 -717729
45891 -717729 -46962 -206090 -376682 -268506 -272789 -356914 29862 886346 1462742 1320259
45881 1320259 842708 562207 634487 1036243 1611994 1904493 1637183 1341932 1711779 2358217
45871 2358217 2193229 1173744 557247 1018626 1584214 1099636 -150826 -1101777 -1445549
45862 -1445549 -1581721 -1544582 -996210 -110348 410513 243776 -235780 -585345 -769557 -966734
45852 -966734 -1237039 -1404706 -1123205 -235709 794460 1175279 760279 303394 387739 590977
45842 590977 239092 -478786 -859459 -831261 -949584 -1370265 -1606762 -1343384 -800939 -196137
45832 -196137 523954 1241232 1532409 1212673 584310 -23089 -544633 -884563 -805769 -342025
45822 -342025 81859 187776 173155 303570 517580 645158 674501 571434 191532 -336436
45812 -336436 -483061 44027 787429 1073939 878666 710789 738173 546270 -115432 -783729
45802 -783729 -776800 -38693 778382 1006647 557540 -100310 -348074 162362 1218281 2072664
45792 2072664 2003622 1069080 163947 94358 716892 1269312 1397802 1394186 1445412 1279315
45782 1279315 828395 660977 1213943 1978255 2098274 1596322 1307805 1594867 1820866
45773 1820866 1327699 353541 -389247 -624620 -574716 -402130 -66124 362779 653409 711900
45763 711900 659388 589556 476907 344521 283450 238806 14135 -366509 -502405 -60759
45753 -60759 715349 1206862 1126658 769102 498928 296988 1789 -276186 -293060 -39917
45743 -39917 367276 996704 1867289 2526682 2421763 1725645 1221638 1233588 1278038 1002624
45733 1002624 779569 928413 1007110 536220 -69866 -64700 468136 813617 777433 815790
45723 815790 1105717 1323715 1376779 1519349 1617676 1158765 280382 -35587 719272 1736719
45713 1736719 1934912 1338604 823821 856203 1096824 1070950 695717 212330 -18671 272678
45703 272678 942234 1402669 1212449 642246 417634 929788 1851702 2469728 2302218 1520144
45693 1520144 852312 939144 1712223 2530623 2860957 2564861 1647030 236079 -1117958
45684 -1117958 -1681595 -1309743 -560260 100141 672032 1060278 886377 281843 136011
45675 136011 908744 1795957 1820326 1235169 991952 1243869 1373101 1230849 1237859 1302521
45665 1302521 811432 -61534 -134988 1182107 2950870 3971357 4260350 4541978 4843672
45656 4843672 4503319 3379601 2249831 1899315 2326505 2970669 3360232 3409533 3336079
45647 3336079 3430354 3794373 4245098 4527742 4591340 4566730 4512385 4297937 3771438 3004077
45637 3004077 2318205 1992703 1922953 1731759 1339507 1212551 1746964 2546581 2755098 2149921
45627 2149921 1475830 1519712 2226287 2979624 3426479 3648471 3709176 3459107 2826159 2010154
45617 2010154 1266222 638321 40525 -431243 -430334 222513 1070778 1265833 493004 -569928
45607 -569928 -1035286 -860345 -705091 -895330 -1114938 -1127661 -1114147 -1075235 -590439 396246
45597 396246 1139315 1026369 513790 482346 984708 1343630 1280367 1151985 1102346 794312
45587 794312 172414 -225861 -49252 351930 555595 695626 1007964 1194823 837522 208990
45577 208990 61570 625872 1334738 1638039 1667549 1896310 2439519 2954053 3095157 2845760
45567 2845760 2409431 1926616 1360612 648717 -62912 -408238 -127135 580876 1126698
45558 1126698 1046808 441357 -153325 -323488 -139396 67525 172109 325211 567124 631894
45548 631894 328280 -61504 -66006 349936 783077 1047516 1436378 2136503 2757823 2815296
45538 2815296 2440594 2166054 2100919 1809182 1069359 307322 71088 410739 1019638 1707840
45528 1707840 2420950 2964946 3063228 2678075 2048596 1411096 844937 362487 -15042 -255474
45518 -255474 -263515 106459 832984 1600773 2088836 2329218 2555308 2737504 2561253 1919373
45508 1919373 1148109 644987 478676 534448 830533 1436276 2163695 2586441 2414370 1757935
45498 1757935 1037270 704590 984425 1721301 2446726 2712032 2450074 2005847 1788960
45489 1788960 1913158 2189761 2414324 2540017 2531027 2213648 1505385 764505 611511 1252155
45479 1252155 2194102 2820049 3035373 3115477 3145051 2993343 2736430 2680531 2948343 3397292
45469 3397292 3959190 4678468 5369869 5657505 5478427 5167507 4926952 4639506 4363481
45460 4363481 4500621 5153838 5787407 5978391 6156946 7085226 8797507 10524225 11547401
45451 11547401 11736461 11365211 10802230 10310266 9814506 8959606 7676937 6491921 5897612
45442 5897612 5651910 5186348 4535143 4254998 4458705 4571708 4208649 3753398 3786293 4285159
45432 4285159 4657574 4374493 3446039 2435249 2008621 2260749 2551093 2298249 1807720
45423 1807720 1856426 2499044 2859866 2277563 1174081 530494 857822 1910058 3068114
45414 3068114 3730504 3591896 2851911 2072356 1683860 1685372 1798467 1745536 1432988 1077283
45404 1077283 1048953 1348403 1459482 1108037 863644 1364239 2185810 2323399 1705573 1228596
45394 1228596 1178368 772235 -292027 -982712 -431803 636718 973016 632771 670711
45385 670711 1429522 2217013 2504193 2462886 2346016 2175914 2063951 2115855 2036840 1518630
45375 1518630 962040 1089218 1867488 2549924 2747749 2674389 2369097 1643423 932351 1140501
45365 1140501 2222683 2877458 2267471 1227734 1021008 1597584 2014238 2063659 2351037
45356 2351037 2880222 2744416 1597362 536596 836412 2274037 3440828 3533717 3077286
45347 3077286 2748320 2274017 1096120 -358765 -964982 -425785 340800 582000 641575
45338 641575 1019926 1301792 847577 6872 -325584 -50415 223730 377859 770185 1089367
45328 1089367 519531 -654740 -884934 558815 2409525 3112281 2803949 2643458 2928582
45319 2928582 3019839 2694714 2431735 2498543 2721261 3068976 3584647 3822498 3271010 2338262
45309 2338262 2005196 2421304 2756335 2570396 2322702 2232327 1725608 624238 -85995
45300 -85995 451345 1598966 2117103 1926128 1937757 2413423 2641482 2309659 2102983 2529403
45290 2529403 3012532 2764731 1990111 1539544 1675576 1842519 1598049 1203172 1144308 1447785
45280 1447785 1714085 1686980 1572490 1738053 2168765 2385104 2040611 1484955 1428192 2015072
45270 2015072 2597163 2612770 2340693 2431501 2938057 3259906 2972170 2297874 1745931 1624670
45260 1624670 1928618 2362062 2430396 1852874 976342 479905 595310 924978 1083269 1132967
45250 1132967 1251664 1360322 1322997 1218219 1187791 1264034 1500603 1964952 2436532 2476907
45240 2476907 2018558 1516340 1296528 1202578 1160765 1520193 2325408 2785343 2191769 1035351
45230 1035351 440790 690936 1106014 1292031 1629964 2380409 3098557 3279540 3015301
45221 3015301 2688827 2479621 2459049 2743892 3234065 3531061 3402602 3066436 2811766 2631119
45211 2631119 2437261 2363270 2598497 3094937 3589689 3788544 3519978 2937593 2543204 2695008
45201 2695008 3108573 3198450 2871753 2540310 2378938 2134367 1734098 1465538 1380927 1164526
45191 1164526 860934 1071292 1988022 2812459 2699542 1886137 1328065 1487157 1964746
45182 1964746 2127506 1676788 785470 34313 35086 819221 1782688 2404671 2670873 2616984
45172 2616984 2040305 1095173 593161 1040481 1776433 1803686 1203356 934656 1352200 1760549
45162 1760549 1567405 1161721 1328327 2247778 3388000 4123709 4237247 3959210 3665959
45153 3665959 3515560 3406879 3294315 3313010 3455646 3403823 2937492 2285050 1809298 1589899
45143 1589899 1580903 1868235 2408314 2810172 2815395 2753506 3059376 3531322 3536544 2832484 1810983
45132 1810983 1100658 1241438 2412671 4025674 4940502 4664238 4037155 4131455 4815295
45123 4815295 5146982 4873202 4611737 4695502 4834442 4964746 5435857 6142150 6416897 6162358
45113 6162358 6250144 7306359 8762185 9619190 9637005 9304905 9095489 9195178 9606115 10116847
45103 10116847 10445137 10646352 11031396 11513994 11537431 10914231 10212034 9939534 9841490 9443640
45093 9443640 8861059 8542056 8513674 8400773 8017704 7504648 7003595 6568667 6295694 6214838
45083 6214838 6111746 5708107 5000461 4291859 3946842 4139633 4681606 5087807 5032513 4721588
45073 4721588 4537992 4392466 3852517 2906023 2076711 1684502 1521821 1413938 1531468
45064 1531468 1906629 2205418 2303767 2557032 3118445 3500444 3270547 2745474 2497764 2529480
45054 2529480 2438263 2118690 1802384 1607962 1508337 1602147 2012947 2583698 2945865 2834287
45044 2834287 2232272 1410427 895207 1078365 1748688 2347547 2714123 3095495 3414771
45035 3414771 3244441 2670034 2351215 2385024 2004231 951830 247294 784233 1936763
45026 1936763 2506592 2423128 2448396 2686998 2571878 2094100 1889053 2110882 2230651 2028158
45016 2028158 1893114 2031743 2173299 2182715 2246811 2364660 2331423 2275993 2535175 2969236
45006 2969236 3099591 2938476 2952776 3196062 3258226 3097361 3064549 3046387 2567766 1949795
44996 1949795 2291552 3828186 5279770 5486703 4868368 4486465 4364635 3714706 2446203
44987 2446203 1423614 1207531 1367309 1310254 1208194 1623037 2432833 2701880 1906451
44978 1906451 949238 1297887 3022998 4453700 4293932 3377532 3417134 4489327 4985328
44969 4985328 4011313 2583772 2099305 2675626 3521144 4057221 4058845 3401488 2329732
44960 2329732 1486420 1180660 1093065 1025576 1257710 1729754 1672473 716773 -321755 -533789
44950 -533789 -195561 -132761 -340873 -182281 418219 959370 1328045 1808606 2209774 1938382
44940 1938382 1045855 361215 362938 602023 491138 91188 -160306 -60932 265445 577937
44930 577937 674003 592841 687984 1199820 1786140 1835908 1228668 414227 -207140 -541384
44920 -541384 -479120 119375 975869 1431917 1198577 722900 576444 791108 1068829 1390292
44910 1390292 2034407 2992829 3632058 3166009 1563466 -111535 -543141 516617 1972178
44901 1972178 2567304 2089178 1212525 527680 151921 44943 158303 314125 369943 471277
44891 471277 764643 968672 689855 83593 -313092 -364611 -378221 -353763 121684 1023809
44881 1023809 1603139 1364696 841031 886912 1514420 1931158 1594780 797449 211326 154256
44871 154256 363322 366273 61030 -89438 415771 1403999 2122999 2154937 1947915 2227895
44861 2227895 3114225 4076247 4601297 4623351 4368376 4044957 3722331 3363502 2932088 2493758
44851 2493758 2161026 1913742 1581648 1070682 524247 215504 343496 892983 1544419
44842 1544419 1789802 1417133 886409 867155 1294657 1309132 423406 -636352 -741589 203040
44832 203040 1215040 1604294 1748464 2227764 2732882 2438199 1307051 399083 660115
44823 660115 1792663 2662671 2624690 2066461 1701163 1747765 1963590 2134081 2203445 2090295
44813 2090295 1743386 1394394 1454043 2017786 2628521 2671206 1973078 974583 348783 456833
44803 456833 1101282 1754941 2027029 1922885 1710225 1618206 1650989 1592689 1217176 627797
44793 627797 323925 668884 1307175 1488042 1071025 763337 1103852 1685372 1838209 1683761
44783 1683761 1879612 2551306 3180594 3488522 3711535 3916450 3740492 3053164 2287984
44774 2287984 1830781 1598436 1500988 1750099 2315170 2633511 2414183 2277940 2922752 3939159
44764 3939159 4203104 3389005 2398075 2160506 2588476 2952675 2849829 2481280 2254718
44755 2254718 2433938 3058065 3930718 4667073 4899818 4539378 3875820 3406664 3434006 3733889
44745 3733889 3730149 3127963 2275407 1748239 1707999 1889534 2087248 2316920 2539836 2635636
44735 2635636 2754388 3296216 4282933 5062179 5009373 4354546 3897583 3946193 3994072 3588425
44725 3588425 3065060 3027761 3356338 3290400 2560118 1919004 2212541 3227361 3936875 3813250
44715 3813250 3408405 3498455 4091152 4636620 4949320 5403704 6193594 6895754 7086640 7111215
44705 7111215 7781592 9311513 10959249 11921678 12289146 12815344 13918856 15279821 16388620
44696 16388620 17141238 17843060 18948934 20890451 23838232 27501448 31472494 35889690
44688 35889690 41345672 47913637 54748896 61065942 67021340 72939496 77933731 80137048
44680 80137048 78417421 73294686 66130636 58080848 50001366 42638484 36372234 31087573
44672 31087573 26624278 23060200 20336008 18027997 15851415 14049345 12902550 12135874
44664 12135874 11206221 9968527 8690770 7594411 6734820 6167565 5854609 5494552 4769843
44655 4769843 3721339 2671524 1898013 1563710 1747325 2275233 2721640 2842683 2796409
44646 2796409 2693366 2284424 1494821 896949 1049513 1595671 1706564 1334152 1285262 1975470
44636 1975470 2849778 3288410 3396603 3477500 3315945 2591533 1638280 1129641 1133076 1086254
44626 1086254 749771 619577 1164194 2093416 2772036 3100275 3490117 4009027 4113816
44617 4113816 3519905 2883231 3061757 3893778 4381249 4139694 3932267 4411772 5013938
44608 5013938 4772966 3804464 3147541 3272937 3586475 3513845 3285128 3306464 3402710 3197648
44598 3197648 2827539 2718456 2863750 2851148 2580749 2518645 3115969 4244801 5361140
44589 5361140 6073016 6369576 6324334 5801563 4685601 3358550 2599151 2778432 3410275
44580 3410275 3834392 4115425 4744764 5542145 5560695 4364694 2850619 2322470 3041094
44571 3041094 4116181 4631077 4445121 3995623 3737677 3813568 3983337 3853410 3367668
44562 3367668 2982034 3079683 3329869 3051480 2230364 1679718 1957488 2556788 2594803 2025842
44552 2025842 1598857 1651804 1592037 875012 -788 -35108 935026 2027045 2473352 2440806
44542 2440806 2497451 2761503 2952207 2940558 2817594 2616697 2355952 2194305 2190239 2102053
44532 2102053 1817611 1722279 2099752 2405098 1878095 817165 385593 985890 1704691
44523 1704691 1751842 1572256 1865082 2250473 1861064 832285 181727 331657 709908
44514 709908 866840 1034175 1297358 1116911 247614 -528964 -323419 574948 1055193 661004
44504 661004 -2481 -334401 -459996 -608428 -431502 459750 1618759 2108760 1690687
44495 1690687 1058038 770120 556400 6400 -586911 -620502 -94980 449360 708328 727227
44485 727227 419859 -273086 -779236 -330144 784399 1283772 642787 -97341 93482
44476 93482 687424 582823 -29674 -38304 655248 961412 485882 237846 913238 1593739
44466 1593739 1027119 -510580 -1545831 -1218362 18253 1245586 1894853 1853636 1457527
44457 1457527 1386296 2006558 2783298 2833350 2086135 1400425 1464221 2075669 2645590 2908552
44447 2908552 2867410 2448187 1611392 639504 14439 40214 665764 1527461 2105822 2083476
44437 2083476 1680498 1414111 1417625 1291040 786695 266031 147946 235129 61622 -292870
44427 -292870 -282423 262154 913889 1340107 1678278 2035097 2125603 1771461 1384245 1507659
44417 1507659 2070924 2496903 2447772 2108726 1794692 1619895 1559497 1537348 1408604 1096010
44407 1096010 778194 720712 885614 926363 626502 154393 -173617 -213117 -18331 309839
44397 309839 755785 1443637 2476777 3566181 3981365 3238744 1834810 902928 1017835
44388 1017835 1668796 2054637 2025999 1965237 2042768 2010404 1661797 1174597 932574 1128862
44378 1128862 1536979 1644177 1139770 326588 -139255 -4637 321487 402319 371080 619405
44368 619405 1126389 1481159 1487280 1377992 1397720 1458935 1327967 998746 774571 987195
44358 987195 1626912 2291728 2619128 2701419 2824868 2870189 2448610 1738622 1572662 2293125
44348 2293125 3080427 3038396 2511001 2522697 3171615 3517639 3067669 2420130 2190188 2174661
44338 2174661 2016618 1913753 2056395 2002972 1372818 713614 822951 1424227 1426861 575269
44328 575269 -19366 620061 1935658 2533139 1982190 1267562 1398708 2131437 2431371
44319 2431371 1890782 1139980 848539 900631 899142 1020028 1722188 2749226 3132078 2394458
44309 2394458 1256116 840417 1494133 2604442 3288918 3085715 2268164 1648357 1767910
44300 1767910 2196179 2058712 1329241 929682 1287520 1614036 1205675 681018 1014626
44291 1014626 1917436 2279492 1888388 1510851 1390976 967854 248563 150752 1004364 1890094
44281 1890094 2131942 2368047 3273594 4178523 4057650 3193734 2651480 2574434 2278235 1767872
44271 1767872 1784524 2281950 2198074 1141123 157841 217654 856511 1058703 773723 721075
44261 721075 1120070 1438857 1272521 842816 615752 802000 1220098 1462104 1333350 1207448
44251 1207448 1593474 2236825 2215412 1245098 251701 108197 429382 389513 190203 660211
44241 660211 1648396 1990826 1201118 153104 -236677 -100564 37902 202925 653783
44232 653783 1218108 1542909 1632407 1669350 1657635 1632383 1822754 2211550 2367199 2133240
44222 2133240 2000727 2292935 2497577 2066388 1420456 1356927 1772565 1863144 1441769 1142274
44212 1142274 1279950 1395087 1142848 872242 997271 1399113 1786372 2156041 2585350
44203 2585350 2963194 3159018 3089859 2511778 1253247 -178510 -808514 -309597 606335
44194 606335 1196163 1510063 1854070 2096834 2115952 2380343 3288801 4230700 4135645 2912642
44184 2912642 1649140 1329071 1935886 2881287 3705013 4123930 3899725 3055171 2023222
44175 2023222 1309713 1051435 977441 733171 262988 -35256 330788 1234202 1762178 1157246
44165 1157246 -129354 -788220 -171927 949110 1378626 893108 303729 344483 946230
44156 946230 1628781 2187879 2708181 3100347 3043636 2494222 1923781 1765691 1821004 1598508
44146 1598508 1141054 988295 1221253 1142187 307474 -580165 -437588 699479 1569975
44137 1569975 1186806 -26056 -827670 -590291 177438 666988 817541 1255747 2205871
44128 2205871 2901601 2542579 1584466 1300422 1964549 2368457 1604976 458010 201602
44119 201602 725611 951542 660332 626906 1075651 1347041 1273124 1576257 2462591 3032939
44109 3032939 2743065 2355188 2615135 2965590 2587031 1903687 1869234 2328495 2368236 1976422
44099 1976422 2030066 2670805 2972275 2466468 1879508 1920652 2281033 2389581 2403612 2783594
44089 2783594 3381482 3596018 3186139 2465073 1864195 1628773 1752796 1946531 1850061 1469493
44079 1469493 1184278 1188993 1235334 1091887 900240 845397 837597 812096 999382 1543579 2128830
44068 2128830 2344164 2205092 2010484 1922883 1980225 2224597 2482302 2354638 1837958 1579902
44058 1579902 1985323 2441778 2151393 1458877 1459091 2345063 3118012 3119879 2885747 3050520
44048 3050520 3296330 3033411 2416497 1930233 1537436 1069644 960478 1578434 2160233
44039 2160233 1606526 320520 -12861 1181772 2411062 2227770 1250552 1043095 1725917
44030 1725917 2004335 1308423 585485 758808 1497921 2008075 2207230 2467455 2732274
44021 2732274 2595352 2021952 1427445 1129674 1137517 1410609 1963464 2702571 3385925 3743470
44011 3743470 3582712 2974676 2419800 2470299 2964206 3062647 2432517 1927680 2467037 3597316
44001 3597316 4025341 3457632 2945870 3242834 3797130 3853544 3659779 3775319 3806148 2876166
43991 2876166 1184534 82489 375452 1301641 1595609 1040875 460156 439327 610165
43982 610165 249803 -772922 -1855160 -2322014 -2020567 -1247099 -287325 777297 1851137
43973 1851137 2643538 2840436 2409935 1703685 1274095 1470918 2036513 2214114 1576897
43964 1576897 704392 610754 1455720 2355212 2657791 2764486 3227687 3673476 3419083 2777966
43954 2777966 2757340 3478814 3873188 3233352 2246720 1982894 2461817 2839455 2653165 2265783
43944 2265783 2199858 2534553 2984115 3231843 3117620 2705345 2259852 2105377 2448182 3207382
43934 3207382 3897311 3864494 2980677 2014796 1881995 2511610 2938436 2588795 1920380 1598979
43924 1598979 1644956 1762673 1986537 2511789 3242566 3915555 4330674 4161051 3079254
43915 3079254 1530704 766536 1421561 2577117 3012116 2861763 3051471 3537461 3403115
43906 3403115 2592258 2162360 2560279 2937247 2674170 2387388 2678064 2938911 2395140
43897 2395140 1546774 1452842 2060269 2378505 2101418 1957575 2396140 2903231 2913590 2639745
43887 2639745 2560994 2585495 2199445 1258922 292318 4636 571455 1427096 1811653 1571978
43877 1571978 1261320 1351549 1632298 1653383 1471745 1508552 1803843 1918368 1610043 1179379
43867 1179379 1031999 1240565 1660881 2165026 2580611 2646678 2268507 1728298 1473411 1675904
43857 1675904 2032964 2025950 1454196 736427 544935 1073206 1859208 2451393 2965260 3689390
43847 3689390 4375517 4378762 3508932 2385759 1849400 2209236 3081952 3790973 3958557 3869996
43837 3869996 4157614 4946591 5516292 5127835 4005612 3071408 2827101 3013485 3326385
43828 3326385 3821798 4421968 4633163 4177631 3507267 3225308 3251970 3052800 2580263 2460447
43818 2460447 3103235 4008961 4283832 3744065 3201238 3516881 4530562 5167282 4632265
43809 4632265 3295784 2295660 2421852 3483756 4574395 4807497 4005592 2875962 2346583
43800 2346583 2568005 2825471 2618741 2385461 2708390 3234473 3123396 2385503 1926751
43791 1926751 2195392 2627204 2731552 2942065 3827463 5010127 5558869 5215218 4622112
43782 4622112 4386415 4407653 4231532 3740523 3304701 3336243 3827244 4417706 4893125 5356851
43772 5356851 5720067 5365659 3873297 1981559 1151702 1968436 3498103 4474957 4611104
43763 4611104 4410000 4202670 3899119 3422225 2902069 2530100 2485828 2825686 3226770 3127998
43753 3127998 2422138 1731453 1662095 2038499 2235511 2035169 1751811 1671557 1769842 1910119
43743 1910119 1999670 1997010 1990843 2174733 2570076 2946681 3189668 3500994 4013676 4458670
43733 4458670 4466528 3983746 3227762 2556548 2521782 3501705 4930184 5494641 4699452 3737889
43723 3737889 4065837 5476275 6452707 6241978 5634108 5617723 6135122 6471196 6223406
43714 6223406 5520929 4728909 4257899 4364332 4901965 5457963 5793574 5916801 5775206
43705 5775206 5270229 4616346 4288921 4487118 4932129 5271384 5432906 5560249 5836227
43696 5836227 6333194 6796543 6703815 5866638 4838661 4332216 4339234 4250099 3747294 3138824
43686 3138824 2878175 3167875 3909565 4603982 4515935 3526901 2639809 2936030 4136614
43677 4136614 4961159 4860100 4519744 4573496 4767398 4718438 4640141 4844215 5191854 5493593
43667 5493593 5873953 6316382 6391701 5870122 5133617 4605476 4218239 3767482 3337452 3101947
43657 3101947 3160865 3718259 4797993 5659927 5373824 4298364 4022064 5278747 6856118
43648 6856118 7283159 6678996 6027314 5494460 4651047 3750326 3486763 3770650 3920378
43639 3920378 3903407 4272100 4974129 5360931 5398402 5739142 6415260 6555160 5783436 4961158
43629 4961158 5004220 5677517 6126608 6105942 6129878 6671327 7635209 8542433 9013366 9051037
43619 9051037 8830145 8284061 7289030 6362336 6477798 7661747 8491747 7882514 6765572
43610 6765572 6801135 7845267 8198428 7299634 6492457 6713094 7054534 6480673 5587522
43601 5587522 5514017 6127034 6519261 6558756 6693026 6752175 6223159 5428175 5234812 5693658
43591 5693658 6020992 5897790 5785442 5918407 5946544 5703895 5455243 5242081 4846532 4545901
43581 4545901 4951405 5823810 6049995 5285515 4677842 5264442 6467795 7044147 6873245
43572 6873245 6783007 7018610 7022896 6639121 6443593 6716685 7027360 7138385 7450411 8080500
43562 8080500 8283470 7480106 6327282 5998010 6674799 7465160 7665302 7414736 7099212
43553 7099212 6774416 6401242 6198013 6485503 7371026 8644832 9798648 10245807 9865637
43544 9865637 9265882 9134379 9428416 9651542 9770307 10179741 10790970 10996063 10757074
43535 10757074 10878910 11769600 12721655 13034331 13171826 14083232 15930314 18267775 20973976
43526 20973976 24085221 27103935 29584531 32364879 37183534 44761911 53767912 61604992
43518 61604992 65653459 64161233 57249098 47445565 38289508 31754680 27357924 23784107
43510 23784107 20558469 17878967 15766693 14090218 12921848 12292003 11925730 11591914
43502 11591914 11315106 10942115 10026417 8557883 7305277 6937162 7207963 7489392 7698518
43493 7698518 8136448 8695220 8807991 8117687 6854346 5660576 5211294 5701611 6495465
43484 6495465 6648544 6018088 5441433 5587677 6172438 6627442 6905534 7116622 6983623
43475 6983623 6340028 5702646 5649213 5986746 6175830 6186743 6260938 6246296 5951027 5789779
43465 5789779 6225516 6860151 6952031 6570951 6314075 6138993 5558400 4855063 4905417 5715570
43455 5715570 6311365 6311009 6446470 7154695 7795219 7812315 7618641 7654139 7546147 7011007
43445 7011007 6704846 7202597 7829313 7591028 6803360 6683868 7554791 8514389 8871450
43436 8871450 8940208 9250081 9763803 10149701 10246854 10018310 9494599 8942765 8703958 8747941
43426 8747941 8761860 8731512 8980042 9523507 9882632 9762906 9489579 9473726 9624543 9665358
43416 9665358 9734243 10183874 10881965 11199177 10827626 10276687 10303031 10998653 11715087 11889197
43406 11889197 11676591 11599988 11760024 11729205 11256394 10740339 10775153 11413061 12131304 12404654
43396 12404654 12032724 11026345 9626313 8533379 8622192 9985994 11486926 11786478 10870641
43387 10870641 10087257 10488363 11608090 12275272 12198355 12031001 12050962 11739057 10956543
43378 10956543 10604211 11359013 12398561 12399416 11522214 11281183 12359782 13669234 14012079
43369 14012079 13696646 13748334 14255368 14499361 14391585 14730949 15923020 17235167 17655182
43360 17655182 17038586 16133252 15761262 16174518 16996411 17633483 17864801 18067251 18725494
43351 18725494 19773906 20672530 21137110 21517644 22364374 23813603 25478423 26809612 27556910
43342 27556910 28020055 28798866 30118560 31521175 32522520 33451583 35153091 37807660
43334 37807660 40599694 42825343 44833208 47413216 50637653 53945177 57215365 61021061
43326 61021061 65660667 70627026 75492771 80816664 87445803 95053560 102137442 107684844
43318 107684844 112190126 116551338 120461387 122622896 122380767 120361119 117390140 113522641
43310 113522641 108491034 102499874 96049995 89403692 82788020 76789744 71893519 67800331
43302 67800331 63831829 59894454 56385152 53225198 49800478 46009822 42574070 39954483
43294 39954483 37668318 35153577 32689027 30850684 29566425 28424602 27541322 27294330
43286 27294330 27367811 26923657 25791463 24725261 24274932 24083133 23614264 22967608 22514046
43277 22514046 22206520 21808133 21494821 21612984 21935265 21756878 20866259 19975964 19935339
43268 19935339 20772968 21768771 22300838 22325497 22081964 21694057 21258084 21067678 21364889
43259 21364889 21882054 22028660 21688342 21434624 21623274 21650485 20723333 19211933 18463811
43250 18463811 19093553 20176162 20555553 20311602 20266302 20521094 20414309 19809837 19442105
43241 19442105 19711762 19973726 19559860 18895760 18879394 19475004 19709579 19050228 18091912
43232 18091912 17687087 17951540 18441177 18854372 19122585 19128048 18882372 18873669 19680860 21164820
43222 21164820 22510537 23218414 23594698 24025955 24277292 23986520 23479466 23445203 23939157
43213 23939157 24372069 24518902 24872701 25776859 26783081 27215696 26933490 26189669 25159686
43204 25159686 24030737 23217306 23018517 23269171 23681266 24248770 24948044 25415500 25442237
43195 25442237 25457112 25908932 26454729 26461036 26073037 25956105 26096230 25808117 25027592 24636219
43185 24636219 25200356 26245471 27161697 27983236 28759967 29004890 28549415 28335667 29446680
43176 29446680 31620108 33498997 34242112 34270971 34518664 35511472 37196000 39218060 41266863
43167 41266863 43306449 45404148 47343996 48822212 50160746 52245483 55395943 58855424
43159 58855424 61869484 64728516 68221902 72656358 78046408 84590937 92044513 99182100
43151 99182100 105037562 110403011 116964029 125037121 133207258 140109028 145415699 149044044
43143 149044044 150685092 150539878 149468206 147884144 145302590 141385615 136648811 131713669
43135 131713669 126602357 121193633 115703528 110364322 105311422 101049919 98193326 96392010
43127 96392010 94439282 91909515 89750146 88686681 88070822 87128605 86389293 86775694 87933443
43118 87933443 88604781 88282076 87486609 86697923 85939218 85200234 84399076 83097088 81056332
43109 81056332 78917324 77540129 76790982 75712327 73799008 71436863 69184481 67251016
43101 67251016 65578727 63894582 61862230 59668434 58089798 57381497 56586837 54759168
43093 54759168 52417600 50818271 50144666 49518207 48556615 47717136 47169062 46558174 45971213
43084 45971213 45927428 46237498 46091053 45562010 45769951 47080681 48370418 48709873 48599070
43075 48599070 48706192 48514786 47384177 46116951 46075716 47068730 47424049 46260203 44641430
43066 44641430 44111283 44772138 45321171 44710198 43329611 42461584 42769687 43652269 44207798
43057 44207798 44436952 44993665 45993888 46815813 47124043 47327534 47757710 48071816 47870694
43048 47870694 47367803 47021548 46926491 46927695 46930219 46764384 46158502 45181533 44327501 43863379
43038 43863379 43480834 42829130 41926275 40813654 39386171 37901781 37057246 37109781 37441649
43029 37441649 37414362 37105821 36778014 36275990 35557404 35202672 35631265 36232428 36032345
43020 36032345 34958099 33812802 33270217 33457571 34204239 35098632 35580987 35530241 35462653
43011 35462653 35687148 35732125 35184179 34567596 34675975 35513174 36647831 38068670 39760433
43002 39760433 40947396 40917629 40332970 40555938 41767618 42837355 43000158 42554700 41887593
42993 41887593 40979068 40077717 39778377 40113433 40499964 40855124 41829203 43646757 45666336
42984 45666336 47436194 49239454 51163770 52555078 52949462 52775233 52606875 52439240 52198312
42975 52198312 52255220 52887683 53843167 54890886 56183569 57710462 59162975 60760661 63313713
42966 63313713 66882617 70291391 72726262 74975662 78246051 82573974 87375554 92749184
42958 92749184 99024558 105657613 111943838 118462134 126438320 135869276 145680211 155717050
42950 155717050 167055980 179919400 192560950 202844560 209963425 214024969 214908955
42943 214908955 212393167 206833901 198983120 189524153 179329500 169659139 161371989 154237658
42935 154237658 147683401 141947298 137743647 134913339 132258066 128952000 125507976 123026345
42927 123026345 121992073 122261720 123856924 127121063 132132200 138556490 146268532 155636632
42919 155636632 166894612 179669164 193582121 208924878 226016816 244018015 261142822
42912 261142822 276098766 288472764 297450158 301175545 298247290 289350868 276594226
42905 276594226 261529170 244621021 226428597 208286149 191528778 176635502 163385592
42898 163385592 151447514 140648014 131009228 122665962 115549341 109230118 103363567 98107560
42890 98107560 93679807 89731427 85773491 82074691 79369259 77655621 76104641 74335576
42882 74335576 72929162 72291099 71809188 70749864 69402030 68655963 68841431 69608795 70630725
42873 70630725 71749021 72614213 72861535 72687627 72781184 73600959 74979020 76358046 77171799
42864 77171799 77189395 76841310 77025446 78171863 79623454 80368316 80280399 80172173 80680968
42855 80680968 81617895 82463659 82996886 83255341 83291657 83220203 83251687 83504770 83987652 84841346
42845 84841346 86289636 88165075 89730670 90185675 89218337 86990428 83855751 80288565
42837 80288565 76835776 73826763 71199782 68792639 66668221 64940544 63444180 61917547
42829 61917547 60476999 59539367 59159812 58756098 57722215 56136647 54621842 53618248
42821 53618248 53058579 52686565 52362724 51993424 51472098 50847157 50277581 49626142 48400301
42812 48400301 46439799 44424221 43211145 42732947 42056360 40627115 38999862 38139296
42804 38139296 38359152 39161348 39808615 39851307 39398872 39095387 39546795 40593121 41485962
42795 41485962 41946380 42542177 43689385 44842147 45232922 44953022 44601584 44228107 43464427
42786 43464427 42499375 41969524 41860901 41487696 40798589 40743211 41797077 42868143 42401967
42777 42401967 40174548 37344131 34980808 33172164 31514826 29916807 28692431 28084449
42769 28084449 27915899 27822545 27806895 28270794 29252453 29986470 29789645 29151259 29157259 29892046
42759 29892046 30356412 30106080 29872747 30125927 30176994 29521698 29041693 29742418 31048656
42750 31048656 31623787 31379778 31333305 31747706 31814831 31174328 30432467 30009755 29692617 29559918
42740 29559918 30118465 31126811 31483018 30846276 30286365 30672941 31454139 31809664 32029726
42731 32029726 32758520 33660363 33974678 33900133 34312404 35358475 36325414 36796260 37072706
42722 37072706 37479100 37984393 38519445 39050579 39347331 39199469 38802295 38473615 38158047
42713 38158047 37678851 37202761 36874320 36293413 35077601 33700629 32935176 32579929 31640253
42704 31640253 29814841 27900607 26508660 25221247 23421940 21305978 19580431 18555435
42696 18555435 17910113 17112915 15863248 14330921 13029759 12241986 11677924 11032746 10615976
42687 10615976 10827716 11218984 10910804 9958186 9386717 9641524 9889495 9310707 8322488
42678 8322488 7909322 8252433 8632345 8411305 7671729 7054783 7168472 7911582 8372429
42669 8372429 7851350 6940184 6877857 7783103 8455492 8198739 7783111 8031250 8502172 8461793
42659 8461793 8264958 8647814 9267501 9158216 8292971 7537489 7257405 7098751 7040209 7471676
42649 7471676 8125298 8101008 7313047 6896082 7640146 8828041 9256454 8826051 8447821
42640 8447821 8712306 9287130 9561681 9436409 9371703 9827255 10746123 11642169 12202169 12602673
42630 12602673 13077925 13447382 13418788 13171763 13237503 13920957 15216298 17114645 19530377
42621 19530377 22077230 24445764 26902533 29890340 33261129 36486766 39454438 42285760
42613 42285760 44440081 44925934 43592560 41367689 38959639 36207288 33106206 30520639
42605 30520639 29132712 28367166 27183006 25472153 23883440 22644793 21449765 20336311
42597 20336311 19765299 19720304 19481342 18569245 17396631 16704104 16738352 17251376 17975049
42588 17975049 18743764 19319639 19461004 19197067 18810544 18473678 18069212 17483083 16896957
42579 16896957 16538768 16235507 15591731 14672925 14057109 13946154 13677763 12601612 11116511
42570 11116511 10238371 10314795 10785734 11099482 11171964 10960484 10353950 9637160 9335536 9355437
42560 9355437 8966234 7927396 6935611 6568388 6465141 6047828 5431478 5041662 4863431
42551 4863431 4695424 4702909 5073918 5484248 5519663 5309603 5158699 4901139 4273920 3630293
42541 3630293 3579835 4106042 4663590 4942617 4924492 4455989 3510781 2682997 2629056 3101306
42531 3101306 3284338 3003286 2796201 2843941 2750688 2505076 2721226 3583799 4334610 4242121
42521 4242121 3505533 2854787 2777573 3384171 4423322 5150903 4857781 3911767 3608920
42512 3608920 4525914 5692452 5989548 5712986 5947536 6871840 7626138 7661132 7312644
42503 7312644 7024220 6798634 6574446 6466273 6383433 5970429 5238299 4820031 5246059 6240993
42493 6240993 7024568 7095828 6496261 5546738 4630415 4085506 4000002 4138775 4256179 4377075
42483 4377075 4550865 4482204 3802732 2731703 2045570 2180081 2685977 2871718 2717832
42474 2717832 2733455 3052582 3199850 2837385 2284711 2069525 2284867 2622483 2772288 2565378
42464 2565378 2002080 1411068 1320637 1853213 2466123 2619459 2470883 2517973 2769129 2769031
42454 2769031 2346411 1818679 1452382 1208829 1080161 1195063 1464488 1574342 1510025 1656731
42444 1656731 2117039 2308726 1623670 309190 -637334 -435545 753629 2003282 2442796
42435 2442796 2006667 1427539 1419336 1923902 2326117 2305495 2150536 2225369 2499364 2763372
42425 2763372 3023160 3431562 3942809 4222516 3940269 3162507 2423311 2222501 2401668
42416 2401668 2334681 1899522 1777453 2360986 2889064 2432396 1387870 1010304 1567882
42407 1567882 2060329 1903778 1719325 2012360 2233561 1933359 1853074 2793999 4085978
42398 4085978 4400341 3759153 3523820 4389043 5494043 5817430 5568373 5674631 6415530
42389 6415530 7111588 7025088 6230248 5531193 5566437 6065856 6179809 5568400 4828453 4667037
42379 4667037 5039092 5412968 5512670 5389506 5101486 4791769 4777259 5061806 5080610 4490898
42369 4490898 3882457 4009756 4586099 4648508 3985193 3344435 3223393 3311053 3274743 3280656
42359 3280656 3467196 3612463 3635496 3821717 4273546 4707107 5016725 5415763 5790192 5643999
42349 5643999 5039889 4828679 5420661 6038069 5857175 5283140 5282918 5892681 6280092 6066837
42339 6066837 5700917 5524154 5292886 4843996 4605489 5070525 6075153 6901866 7028225
42330 7028225 6671820 6579497 7173351 7914290 7825345 6760918 5698198 5454933 5640047
42321 5640047 5450304 5043183 5253710 6143099 6815604 6812707 6773056 7329769 8121693 8435255
42311 8435255 8236821 7963397 7737006 7442430 7273762 7501167 7826592 7639016 6911156
42302 6911156 6234109 5887494 5494275 4828484 4391409 4732378 5522615 5799324 5079881
42293 5079881 3914834 3303067 3697608 4564280 4875027 4155744 3055363 2630517 3032442
42284 3032442 3325054 2814146 2032127 1889233 2269609 2253617 1591269 1072093 1262741 1704628
42274 1704628 1787809 1730401 2061474 2594835 2650994 2128779 1704120 1935993 2649494 3271734
42264 3271734 3416643 3067941 2477371 1988035 1813276 1960612 2395054 3088923 3796325
42255 3796325 4068693 3764541 3325644 3278101 3665160 4182779 4543540 4445142 3658506 2595784
42245 2595784 2273309 3056120 3909004 3716635 2920030 2781631 3310643 3265027 2318162 1807318
42235 1807318 2765039 4390458 5282720 5281379 5187516 5357971 5542263 5683561 5984116 6386417
42225 6386417 6674172 6890608 7115232 7114167 6745752 6376095 6333243 6314437 5940691 5520297
42215 5520297 5576870 5955358 6127406 6097992 6254864 6566435 6697078 6688759 6752914 6665415
42205 6665415 6255932 6207469 7264762 8765349 9176151 8195435 7101037 6757765 6570616
42196 6570616 5937797 5469962 5875984 6611810 6668624 6049154 5490024 5228734 5011679 4955061
42186 4955061 5427264 6246172 6822440 6978958 6908531 6523593 5677185 4900792 4986781 5753200
42176 5753200 6118412 5653781 5232775 5703640 6603872 6795298 5968313 4931353 4591135
42167 4591135 5106399 5972700 6587559 6728803 6684933 6913121 7506049 8120857 8454873 8498349
42157 8498349 8207865 7383246 6262034 5829102 6804278 8363407 8653085 6924751 4568274
42148 4568274 3485967 3847299 4161253 3395158 2155343 1540757 1613379 1617142 1255161 990816
42138 990816 1178091 1578378 1881167 2167601 2590410 2971400 3027729 2773025 2436596 2157897
42128 2157897 1988718 2032568 2313433 2586709 2524863 2083405 1522267 1097653 890179 900467
42118 900467 1109603 1379749 1442947 1135730 646064 427236 767124 1434097 1848482 1676694
42108 1676694 1181259 897618 1062642 1508964 2035484 2647559 3400984 4192498 4780524
42099 4780524 4926027 4518519 3683122 2767856 2133560 1964639 2280169 2923640 3439804
42090 3439804 3295293 2528877 1868303 1759830 1615727 709234 -410225 -352765 1145170
42081 1145170 2677222 3013245 2582600 2445859 2592835 2251712 1417654 952817 1229925
42072 1229925 1668200 1793856 1925387 2452860 3079157 3245051 2916543 2506628 2226995
42063 2226995 1907852 1414349 958275 902100 1330324 1894983 2144062 1979131 1667184 1417178
42053 1417178 1182840 943138 848589 893752 768238 320006 -126753 -247520 -219896 -364439
42043 -364439 -571038 -533283 -279248 41536 614965 1577891 2415352 2499779 2121841 2162408
42033 2162408 2719958 2939017 2399149 1822362 2020502 2846810 3612720 3927962 3716326
42024 3716326 3022903 2297895 2298368 3149465 3988771 4094774 3881574 4151345 4829493 5214973
42014 5214973 5178878 5279770 5775080 6268574 6404115 6320825 6323740 6539413 6915767 7190049
42004 7190049 6960817 6224067 5664534 5847831 6268008 5913805 4778753 4000363 4266909
41995 4266909 4850190 4679908 3786548 3082203 3069993 3394431 3547444 3469884 3374332 3353448
41985 3353448 3363145 3444780 3777479 4439071 5138309 5322702 4694992 3562154 2528588 1926973
41975 1926973 1712905 1737149 1789459 1521703 818667 232159 479922 1371909 1823222 1239655
41965 1239655 337290 135369 631079 1082222 1211599 1334095 1440155 1041726 124201
41956 124201 -487212 -113502 918870 1793427 2171234 2237318 2159883 2021456 2037342 2275571
41946 2275571 2285550 1586644 497016 -133137 -82016 19867 -157078 -17939 895628 1868572
41936 1868572 1870817 1099530 701150 1000846 1015938 45718 -1132776 -1273549 -304426 709947
41926 709947 934290 483430 -30781 -95203 490335 1480013 2233056 2283481 1879716 1649690
41916 1649690 1772479 1812282 1344487 436214 -460441 -828468 -426954 361479 698160 224788
41906 224788 -343967 -90632 805633 1338404 1216471 1290581 2162502 3139947 3115848 1997721
41896 1997721 733255 222649 609035 1343900 1587991 861586 -334731 -863714 -278080
41887 -278080 556737 579881 -131229 -690828 -692163 -446578 -146459 391043 1078228 1369713
41877 1369713 969080 224102 -411626 -890898 -1297663 -1402833 -815520 516529 2074381
41868 2074381 2979098 2553111 960384 -727482 -1407250 -952310 -177089 108554 -253484
41859 -253484 -901530 -1295277 -984518 -17488 890756 1056739 723774 748839 1341740 1743038
41849 1743038 1372014 652638 296520 310505 241610 6124 -101837 20143 249496 618120
41839 618120 1206777 1728884 1701945 1076567 340964 -41702 -25110 201169 526616 981307
41829 981307 1569722 2010338 1701659 312770 -1449778 -2166107 -1245451 216062 674054
41820 674054 -40111 -773228 -720787 -239286 32097 23179 -79807 -293232 -543744 -441137
41810 -441137 177896 845630 1025587 755831 337323 -248934 -1081333 -1728726 -1606334 -889793
41800 -889793 -492144 -957215 -1781545 -2061009 -1554519 -882167 -787364 -1367303 -2018627 -2093633
41790 -2093633 -1598102 -1170052 -1318230 -1801383 -1888817 -1138823 212329 1490610 1999455
41781 1999455 1353598 -203049 -1736011 -2221789 -1481369 -407023 -46992 -481122 -785637
41772 -785637 -171224 1029483 1743248 1475245 875427 775646 1036085 861645 56874 -768068
41762 -768068 -1287278 -1874913 -2551297 -2442863 -1127740 198479 77773 -1053078 -1409384
41753 -1409384 -561424 -114866 -1198409 -2665386 -2806809 -1829404 -1328682 -1876730 -2523699
41744 -2523699 -2536113 -2277083 -2122703 -1684122 -687586 200162 135621 -758406 -1601693 -1842656
41734 -1842656 -1665283 -1497164 -1530596 -1668205 -1651022 -1254666 -507588 327216 1006458 1388676
41724 1388676 1312099 736442 61971 -125968 174031 294657 -132461 -579371 -440410 -48706
41714 -48706 -227747 -1005943 -1485754 -1075123 -236665 245763 282595 389445 840054 1300443
41704 1300443 1301035 845351 440081 513448 844691 737796 -102487 -1056587 -1267914 -747739
41694 -747739 -368929 -667079 -1109993 -879565 -48769 498319 242365 -325092 -362939 309249
41684 309249 1082688 1314411 1003439 700089 853349 1315450 1496673 988354 -16351
41675 -16351 -950155 -1443312 -1543428 -1394816 -942872 -149704 638923 878441 476503 22037
41665 22037 178783 977852 1864320 2296176 2094745 1361699 380921 -412673 -673906 -437132
41655 -437132 2322 440278 752571 669116 30553 -706318 -768846 -82702 522855 430356
41645 430356 49089 66763 345707 201788 -465253 -981200 -780312 61832 1136969 2018503
41635 2018503 2267416 1664000 569796 -315970 -642047 -571283 -358912 -170895 -227977 -646594
41625 -646594 -1180090 -1573826 -2026828 -2708802 -3034397 -2313181 -1098080 -790848 -1601758
41616 -1601758 -2026896 -998548 466428 734609 -78238 -396450 491715 1557018 1518750
41607 1518750 297290 -1227718 -2243008 -2533914 -2420673 -2350153 -2345843 -1943782 -923750
41598 -923750 156717 593223 456724 347529 431854 368392 106556 64324 417805 778707
41588 778707 702587 78357 -998604 -2242988 -3054630 -2916225 -2003264 -961094 -122556
41579 -122556 515702 666398 -76441 -1308492 -1896696 -1356988 -477984 -178808 -380147
41570 -380147 -474671 -320500 -169267 -51852 123656 135701 -300916 -1007571 -1563682 -1936252
41560 -1936252 -2419803 -3000751 -3222484 -2768922 -1905452 -1228582 -1088695 -1309432 -1453761
41551 -1453761 -1333421 -1128022 -956595 -654255 -259286 -325614 -1157809 -2030096 -1985692 -1277737
41541 -1277737 -1026277 -1397504 -1293918 -211514 811735 800416 303252 321787 711424
41532 711424 746880 513854 517099 509337 26719 -374670 148709 1045016 956474 -65310
41522 -65310 -545854 5323 340155 -317073 -911394 -371635 572119 656588 190790 463101
41512 463101 1600632 2443029 2374972 1992516 1843609 1646166 1109415 606223 488113 388195
41502 388195 -163233 -826529 -826102 -111277 491038 416350 107761 234580 553468 204874
41492 204874 -886362 -1617807 -1043828 437647 1692772 2189411 2144128 1736869 972325
41483 972325 152533 -322648 -603069 -1073143 -1415655 -875700 432067 1436341 1614057
41474 1614057 1626016 2015207 2243841 1693344 764489 157948 -232058 -802907 -1226530 -957814
41464 -957814 -322309 -33460 103074 911938 2365417 3437642 3521365 3036079 2485616
41455 2485616 1864934 1279279 1219870 1720711 1964713 1309358 198136 -474595 -488053 -263885
41445 -263885 -62444 188837 401551 218721 -497378 -1392959 -1976786 -2102415 -2002406 -1906513
41435 -1906513 -1743446 -1309480 -676231 -215686 -145623 -290409 -438121 -639549 -898165 -890875
41425 -890875 -411102 159390 307252 134086 122856 308931 286021 -31955 -309718 -478150
41415 -478150 -846396 -1391643 -1604627 -1302552 -1011745 -1218758 -1718057 -2009553 -1929703 -1631428
41405 -1631428 -1342096 -1350942 -1799731 -2302388 -2264906 -1750307 -1428569 -1467478 -1231695 -466802
41395 -466802 47568 -323326 -953753 -840818 -58729 556354 759230 981504 1325702 1441988
41385 1441988 1300636 1166690 859109 10301 -858418 -560367 1092404 2713789 2944836
41376 2944836 1999741 1136324 1132870 1792395 2491290 2649169 1950555 649335 -457469
41367 -457469 -748862 -414172 -145342 -338226 -795618 -1044337 -752956 -8532 677206 850743
41357 850743 696830 801995 1215517 1240116 494437 -305319 -191410 727662 1412871 1236315
41347 1236315 565459 33073 -159778 -107362 46231 -22744 -680389 -1711463 -2230983 -1662585
41337 -1662585 -565293 -36607 -418316 -1043059 -1236260 -1085815 -1056314 -1243675 -1346830
41328 -1346830 -1178398 -848302 -479710 -57147 371723 609364 603401 655274 1064011 1573002
41318 1573002 1458089 381338 -950516 -1285905 -141939 1546542 2326861 1707890 452760
41309 452760 -567930 -1300881 -2000409 -2328960 -1720259 -525786 49787 -535829 -1368209
41300 -1368209 -1280681 -356942 364887 330422 -100082 -495924 -858314 -1173241 -1128376 -573187
41290 -573187 168772 697193 902201 774670 286706 -264548 -214070 738338 1984135 2604744
41280 2604744 2398552 1962383 1827332 1881118 1715293 1267681 909295 910989 967551 462110
41270 462110 -683731 -1653171 -1579473 -651417 98095 146823 51619 412386 859349 608870
41260 608870 -349890 -1254066 -1588208 -1514210 -1329031 -1075324 -805579 -758698 -1047580 -1437606
41250 -1437606 -1583905 -1328223 -767345 -246194 -205389 -704602 -1147032 -891874 -166007 94789
41240 94789 -562438 -1539431 -2027632 -1957138 -1754973 -1556882 -1177953 -683645 -459190 -678498
41230 -678498 -1087856 -1392788 -1554282 -1616049 -1535629 -1352283 -1286829 -1441738 -1542317 -1241177
41220 -1241177 -634325 -186881 -81301 61712 597485 1243036 1432537 1192114 1175699 1702435
41210 1702435 2209987 1960577 940918 -298910 -1384292 -2219732 -2593831 -2289892 -1576211
41201 -1576211 -1053724 -947474 -988440 -997669 -1055781 -1051612 -698202 -167160 -26676 -240798
41191 -240798 43056 1174517 2130026 1739441 356973 -551224 -282027 486780 883177
41182 883177 765479 315014 -462673 -1426789 -2072033 -2055222 -1591503 -1008728 -275255 686350
41172 686350 1546142 1835940 1497992 856403 199640 -336078 -622790 -579457 -320177 -110662
41162 -110662 -227834 -844357 -1774617 -2294711 -1675371 -161983 1009771 989129 332702
41153 332702 140495 500934 500157 -338415 -1385619 -1796202 -1401350 -485375 699433 1796977
41143 1796977 2212699 1626676 424540 -715484 -1424706 -1579896 -1062879 -94497 487680
41134 487680 -45983 -1319912 -2126750 -1795596 -856323 -238232 -220425 -349755 -67625 773904
41124 773904 1781206 2275224 1897375 1018400 300966 -99678 -491544 -842822 -677965
41115 -677965 7749 436794 138313 -266035 -31578 472774 365613 -240927 -359204 305930
41105 305930 948385 994849 830466 813939 568058 -99194 -439373 166192 985523 787715
41095 787715 -436189 -1595652 -2129058 -2450910 -2790055 -2709396 -2093966 -1617383 -1683098 -1708706
41085 -1708706 -1128647 -454419 -530746 -1162113 -1346494 -707505 112426 484761 472844 337334
41075 337334 66205 -259218 -182588 530859 1295455 1213826 160049 -995800 -1314147 -735763
41065 -735763 -42892 1200 -595705 -1117546 -912283 -68980 720967 930471 672689 385162
41055 385162 253575 133775 -75873 -242137 -210330 -36675 68041 -57884 -403515 -776228
41045 -776228 -914775 -729573 -439029 -326467 -356365 -245574 16982 12038 -507952 -1083829
41035 -1083829 -997597 -201346 577845 713474 310404 -146364 -389909 -367030 24705 763062
41025 763062 1383026 1266771 347780 -723173 -1204424 -902583 -178270 464331 694492
41016 694492 441542 -122597 -645818 -742427 -259897 453058 655530 -89100 -1267242 -1828724
41006 -1828724 -1429159 -852896 -872357 -1166947 -1003007 -617259 -979740 -2187813 -3116032
40997 -3116032 -3030362 -2637055 -2879107 -3434961 -3311518 -2479886 -1916755 -2140276 -2645907 -2896786
40987 -2896786 -3019593 -3232608 -3314714 -3072962 -2777803 -2651814 -2358386 -1523290 -461667
40978 -461667 159947 222928 204116 381792 462575 42862 -922947 -2148943 -3173854 -3480372
40968 -3480372 -2872834 -1864437 -1314378 -1486484 -1788857 -1634920 -1172659 -847589 -658343
40959 -658343 -388840 -301466 -862603 -1770073 -2012940 -1190057 -132554 228782 60168 80042
40949 80042 276777 27546 -656297 -935934 -385258 380622 682242 668617 707982 527192
40939 527192 -258885 -1143188 -1169582 -341884 249264 -107456 -874921 -1194462 -1049947 -1011363
40929 -1011363 -1286607 -1629073 -1908085 -2144616 -2119558 -1608588 -1023212 -1128175 -1902257 -2335585
40919 -2335585 -1787671 -984736 -1030955 -1820216 -2247557 -1875026 -1488073 -1797741 -2422564 -2642534
40909 -2642534 -2526307 -2660869 -3155397 -3579286 -3677523 -3541970 -3208374 -2664349 -2187234 -2130862
40899 -2130862 -2410786 -2676189 -2872956 -3091501 -3029684 -2329166 -1368145 -893733 -833013 -380111
40889 -380111 582372 1170614 965345 728634 1048430 1283806 729186 -36028 -34635 501407
40879 501407 571408 54234 -257270 -79571 32084 -227753 -494317 -472325 -230454 267070
40869 267070 1050468 1544631 1023194 -196839 -915682 -603348 60853 380239 439846 423543
40859 423543 100408 -505795 -754985 -296129 288030 294357 -137464 -335931 53882 870057
40849 870057 1651676 1842450 1282443 618955 599000 918643 657807 -57490 -30502 978323
40839 978323 1538092 666766 -551693 -566333 406664 980297 652500 -31759 -771112 -1604761
40829 -1604761 -2111519 -1829625 -1249427 -1196760 -1462207 -1228843 -594807 -350479 -419040 20070
40819 20070 823272 818525 -244278 -1106619 -893823 -343677 -496998 -1239067 -1858804 -2146125
40809 -2146125 -2187101 -1808675 -952431 -51705 517631 842010 943327 528475 -290215 -757769
40799 -757769 -517743 -231011 -586648 -1323918 -1804469 -1903196 -1702863 -974308 257919 1164825
40789 1164825 964826 -5561 -773592 -959511 -870336 -703146 -362470 114228 505874 613925
40779 613925 201078 -825291 -1801981 -1592665 -136520 1005391 540034 -765923 -1250775
40770 -1250775 -733202 -387659 -602853 -547936 33308 175288 -608103 -1276679 -741151 538152
40760 538152 1276108 1023456 307045 -379916 -930483 -1274492 -1389557 -1520698 -1853970 -2106133
40750 -2106133 -1888995 -1321296 -829634 -487433 -38288 478558 619061 159181 -518729
40741 -518729 -824100 -548104 50346 593885 889110 926949 700107 138041 -704206 -1484840
40731 -1484840 -1810003 -1672642 -1476404 -1532072 -1686321 -1569604 -1082388 -480838 -35366 267743
40721 267743 673848 1341781 2066830 2365422 1945568 1087975 425708 319413 584816 862830
40711 862830 1053586 1226223 1239906 741588 -354538 -1556880 -2202841 -2195940 -2102585 -2363773
40701 -2363773 -2657943 -2394794 -1678194 -1225145 -1266471 -1178497 -560160 -67554 -523435 -1571167
40691 -1571167 -2003037 -1317566 -184956 669870 1243853 1661533 1570601 684667 -538277
40682 -538277 -1350022 -1608834 -1723096 -1868551 -1792271 -1401380 -1076868 -1216651 -1735414 -2213147
40672 -2213147 -2399900 -2394275 -2369230 -2303250 -2081533 -1771469 -1601464 -1617329 -1575315 -1361913
40662 -1361913 -1328616 -1855586 -2606584 -2624345 -1379548 501392 1790372 1844856 1076836
40653 1076836 330785 26692 -16132 -87481 -186800 -214631 -335894 -806799 -1458276 -1767357
40643 -1767357 -1596376 -1420903 -1505409 -1312810 -306121 973806 1378510 649056 -282400
40634 -282400 -586883 -425921 -318055 -338478 -401768 -746991 -1494855 -2051406 -1637290 -383500
40624 -383500 609305 416566 -791976 -2056904 -2648870 -2665808 -2660132 -2799566 -2647106 -1941150
40614 -1941150 -1283288 -1524161 -2536856 -3233663 -2937065 -2087842 -1314582 -513223 581291
40605 581291 1494628 1515222 877456 657928 1425263 2542678 2928981 2147503 696924
40596 696924 -477284 -763634 -419748 -245826 -536925 -648655 35109 1056252 1410137
40587 1410137 909069 302220 88928 -490 -197175 -170203 276442 612568 263597 -480529
40577 -480529 -800863 -429061 80167 108452 -369246 -919844 -1182486 -1190231 -1289619 -1771237
40567 -1771237 -2532063 -3140244 -3262551 -2944542 -2437762 -1879028 -1242120 -550789 -45279
40558 -45279 -68800 -699772 -1514280 -1935709 -1913692 -1939882 -2154454 -1868088 -533587 1112311
40548 1112311 1699735 1010957 247197 292036 606126 339112 -314756 -671295 -825563 -1369774
40538 -1369774 -2187674 -2568788 -2419204 -2328137 -2342662 -1720503 -251788 1115778 1539984
40529 1539984 1417232 1581192 1987453 1999756 1568554 1242560 1171804 928984 338820 -247117
40519 -247117 -617212 -981383 -1393454 -1491869 -1097784 -568185 -242445 11628 346190 442002
40509 442002 -73071 -962023 -1563371 -1519610 -1028061 -515907 -324448 -540659 -892987 -997601
40499 -997601 -891767 -998887 -1316670 -1128999 -43436 1121789 1252108 517666 177068
40490 177068 795802 1545476 1519478 922629 491546 401309 358859 322724 457956 607894
40480 607894 439885 70050 23418 493788 1019874 1040671 553551 74067 8198 159872
40470 159872 -53755 -848963 -1686245 -1854491 -1333581 -743236 -506027 -522823 -700372 -1201849
40460 -1201849 -1918017 -2245750 -1834527 -1168131 -946038 -1172042 -1298266 -1034744 -561863
40451 -561863 -102790 280423 538380 613353 512248 220962 -264212 -667288 -540471 106216
40441 106216 672159 767076 685525 707993 522253 -43399 -290695 449900 1549144 1708543
40431 1708543 737679 -271029 -556871 -500048 -630826 -776329 -626238 -442459 -698095
40422 -698095 -1406093 -2122529 -2336226 -1802856 -892291 -530651 -1218215 -2187761 -2271467 -1531287
40412 -1531287 -1075881 -1205613 -939885 200868 1168213 936987 83859 -184973 161293
40403 161293 237606 -190263 -508022 -381407 -91697 152387 379906 406863 13717 -472521
40393 -472521 -523522 -297051 -428557 -953618 -1230271 -1006402 -758882 -778438 -696416 -259670
40383 -259670 95274 -122129 -756345 -1361211 -1812739 -2112276 -1950511 -1033009 289084
40374 289084 1205470 1329991 1106210 1234622 1858646 2441818 2435471 1964145 1691054 1960479
40364 1960479 2300528 2003255 1031000 9881 -598258 -893560 -1039993 -826343 -54611
40355 -54611 863015 1100026 285169 -1012853 -1790588 -1551117 -659590 192621 673704 840309
40345 840309 721500 263550 -335858 -677297 -688521 -730628 -1013903 -1326706 -1563141 -1999212
40335 -1999212 -2641421 -2819172 -2039637 -873717 -297519 -425925 -657456 -858719 -1467759
40326 -1467759 -2390181 -2766201 -2173713 -1283490 -866513 -757198 -293670 666048 1643913
40317 1643913 2143503 1975272 1246719 325836 -410248 -939074 -1403145 -1564771 -1058984
40308 -1058984 -313278 -374264 -1371120 -2006076 -1331408 -285215 -402376 -1496231 -1905385
40299 -1905385 -941973 219827 382482 -134550 -407827 -425956 -825630 -1650149 -2244680
40290 -2244680 -2197200 -1702879 -1076840 -471493 -47619 77858 87981 262284 511861 518978
40280 518978 327250 305130 440515 220192 -520209 -1120361 -911298 -173103 233903 1182
40270 1182 -407647 -586589 -627971 -619543 -301589 416424 1023990 971715 450935 142963 257208
40259 257208 261112 -344295 -1312410 -1894786 -1642845 -839840 -189951 -113792 -336198 -249918
40249 -249918 269227 613966 209841 -666971 -1177498 -942173 -389272 -70493 -40532 -53062
40239 -53062 -2743 64349 115320 64814 -250757 -813738 -1328113 -1592799 -1765354 -1999636
40229 -1999636 -2033240 -1496262 -531098 263019 496929 288092 -93686 -493578 -695797 -394063
40219 -394063 374019 1026924 1030193 574599 318006 480764 591454 271521 -106517 74300
40209 74300 679476 836161 88548 -863396 -954936 -104831 677757 571989 -108046 -496565
40199 -496565 -364830 -272191 -624768 -1085394 -1092087 -583813 86143 677524 1097524 1080821
40189 1080821 372502 -711367 -1419739 -1480560 -1422666 -1682752 -1885354 -1533717 -999115 -1062201
40179 -1062201 -1660231 -1964207 -1750510 -1762861 -2380822 -2824331 -2306752 -1268560 -666017
40170 -666017 -543948 -231253 339308 505615 65719 -327019 -181613 156955 159763 -148904
40160 -148904 -428440 -512986 -368659 -3197 292688 62046 -615442 -960896 -471157 271241
40150 271241 252732 -691693 -1717395 -2015145 -1611754 -1119193 -1025950 -1330370 -1658040 -1632213
40140 -1632213 -1226274 -810438 -815776 -1342878 -2095045 -2637927 -2713432 -2381446 -1910375 -1523090
40130 -1523090 -1258972 -1051352 -808513 -412275 125637 429940 41616 -838485 -1298224
40121 -1298224 -826209 -89066 -17519 -470080 -598326 -311662 -367995 -961712 -1306194 -968176
40111 -968176 -599134 -766371 -984111 -709084 -533433 -1345585 -2719165 -3212446 -2237164
40102 -2237164 -780870 -150513 -628781 -1539284 -2169981 -2404478 -2638219 -3176830 -3744758
40093 -3744758 -3786566 -3235354 -2542373 -1875697 -964831 -23196 22942 -1119464 -2289198
40084 -2289198 -2295001 -1567332 -1349700 -1734029 -1760944 -1220527 -930306 -1119572 -954583 -128549
40074 -128549 339353 -364001 -1492827 -1787614 -1177873 -563122 -367470 -194476 275575
40065 275575 793178 963286 692142 191836 -197720 -280175 -276512 -630724 -1369327 -1930743
40055 -1930743 -1843920 -1269751 -621714 15697 764939 1538557 2099887 2333121 2155482 1403018
40045 1403018 165280 -937820 -1206830 -597931 201805 443128 12904 -453720 -216172
40036 -216172 632899 1064848 374778 -683854 -792425 -45071 46073 -1117378 -2067988
40027 -2067988 -1329130 357819 1121727 652613 335048 911211 1559278 1535532 1294670
40018 1294670 1352175 1215416 325581 -792599 -1286227 -1300554 -1586535 -2153262 -2278700 -1721952
40008 -1721952 -1039870 -687974 -600473 -744963 -1286338 -1926890 -1805747 -534367 1121752
39999 1121752 2030510 1839704 1012515 120795 -454037 -461632 9108 419681 370999 161852
39989 161852 263915 416977 -81793 -1203436 -2051757 -2096329 -1820034 -1777859 -1714609 -1217672
39979 -1217672 -681715 -797581 -1333669 -1277741 -239184 996119 1500389 1218308 674090
39970 674090 159886 -334252 -626668 -297952 720881 1771163 1984466 1251381 420116
39961 420116 251071 388063 -90038 -1157753 -1698122 -1163172 -482610 -623714 -1061175
39952 -1061175 -748852 -21161 -136410 -1129495 -1645245 -1131231 -706785 -1256650 -2003979
39943 -2003979 -1877716 -1192248 -876788 -892352 -628309 -276613 -538825 -1269351 -1595774 -1268143
39933 -1268143 -834867 -573874 -320436 -335304 -1183767 -2544109 -3245377 -2894809 -2469086
39924 -2469086 -2742560 -3049035 -2377114 -1006777 -147393 -304874 -847422 -1050459 -832510
39915 -832510 -442864 -60049 141024 5063 -293914 -289609 185789 652562 473178 -375203
39905 -375203 -1205267 -1316363 -683190 76713 319730 -121734 -944379 -1646600 -1746362 -999773
39895 -999773 325975 1483360 1820375 1374507 751704 436942 393436 310482 21348 -361013
39885 -361013 -535202 -216248 535069 1144826 955151 -11457 -899197 -845655 100125 1043262
39875 1043262 1191686 592239 -96446 -424200 -596859 -1080490 -1895756 -2513245 -2500901 -2074941
39865 -2074941 -1816835 -1946517 -2122403 -1976019 -1611500 -1430391 -1556337 -1590798 -1012800 166416
39855 166416 1198893 1192023 18412 -1423384 -1990363 -1357221 -238330 424446 385212
39846 385212 159948 258868 534447 445506 -109978 -556402 -407023 54644 249227 210265
39836 210265 408754 724971 377355 -837052 -1961367 -2082962 -1532938 -1183030 -1040806
39827 -1040806 -505900 201391 35892 -1176310 -2067778 -1427409 108355 885211 392414
39818 392414 -303845 -260272 135439 85162 -187776 247286 1467886 2334872 1983227 983077
39808 983077 427257 342363 -163991 -1348219 -2369305 -2559152 -2271169 -2028939 -1617501
39799 -1617501 -703912 222814 375658 -144211 -452806 -60286 690545 1240648 1248136 525426
39789 525426 -769328 -1879956 -2041543 -1409291 -870216 -913836 -1240293 -1460660 -1509976 -1285626
39779 -1285626 -592393 322526 821423 761161 760430 1250045 1771345 1622694 817559 10286
39769 10286 -271960 -41074 280077 211700 -330072 -858409 -880119 -601655 -615047 -907343
39759 -907343 -844282 -290698 -4688 -512541 -1206456 -1090387 -4835 1359322 2304984
39750 2304984 2550671 2150567 1450175 895448 557198 96406 -576500 -1014061 -895604
39741 -895604 -527214 -323658 -263699 -264754 -563055 -1161741 -1383677 -662451 555921 1379061
39731 1379061 1648936 1841867 2019797 1704793 798533 -108625 -503429 -487344 -413418 -426153
39721 -426153 -487656 -521636 -447686 -299853 -250481 -287647 -65952 592146 1281552 1503807
39711 1503807 1309176 983208 438305 -401464 -894939 -287058 991773 1586583 1023060
39702 1023060 366265 629307 1313748 1228638 237508 -627194 -618501 -113474 93295 -217952
39692 -217952 -682724 -1024276 -1363297 -1852788 -2271887 -2204668 -1588769 -880832 -611565 -924912
39682 -924912 -1567171 -2061969 -1828675 -551841 1251443 2374895 2076243 888781 -108854
39673 -108854 -565173 -879374 -1216956 -1268687 -1016154 -974737 -1390316 -1777715 -1624647 -1115763
39663 -1115763 -765166 -655208 -454434 -8584 460874 692058 640231 375502 -119975 -961132
39653 -961132 -2104381 -3066855 -3118102 -2036332 -582015 152183 -82324 -475593 -190376
39644 -190376 715228 1520012 1678918 1224842 569697 150111 161730 467092 798162 1074982
39634 1074982 1387636 1642882 1471722 665892 -424468 -1137668 -1161352 -839157 -760164 -1081937
39624 -1081937 -1369805 -1170336 -604644 -179149 -90056 -45482 202324 540675 832287 1141938
39614 1141938 1407303 1323678 891616 672503 1069299 1673299 1766899 1216118 476998 3499
39604 3499 -4059 348611 483175 -227530 -1393541 -1653891 -493292 752539 723224 124197
39594 124197 582864 1926586 2372120 1402002 574637 959982 1488538 808927 -554312
39585 -554312 -1068079 -320237 817486 1552352 1738488 1490941 1000280 460218 -248681
39576 -248681 -1356158 -2418037 -2493717 -1516161 -624882 -610971 -955022 -1020238 -1135125 -1627270
39566 -1627270 -1832881 -1177539 -348548 -203279 -345966 -75612 100815 -553063 -1223871
39557 -1223871 -556163 948661 1432310 486880 -432543 -540690 -703691 -1385024 -1525154
39548 -1525154 -434063 769169 799074 107541 -55570 435547 801971 805242 775164 638135
39538 638135 38666 -777737 -1147385 -977640 -814133 -983588 -1276056 -1401665 -1239931 -734429
39528 -734429 -17553 459830 358732 -74346 -323950 -268371 -190796 -288600 -522457 -824016
39518 -824016 -1135003 -1342778 -1405782 -1388533 -1217555 -700863 -2654 295104 -45179 -458847
39508 -458847 -314082 209857 460212 262344 2168 -66188 -57373 -89588 -179903 -454952
39498 -454952 -995088 -1482006 -1447885 -901441 -314293 19411 202993 304550 168330 -197666
39488 -197666 -431535 -231651 284683 794124 1121660 1244189 1156003 924679 764462 872249
39478 872249 1186865 1375962 1090249 286776 -660447 -1258571 -1391656 -1434279 -1775146 -2340883
39468 -2340883 -2732440 -2724141 -2440180 -2087490 -1683968 -1059831 -73516 1108028 1953253 2018078
39458 2018078 1538687 1285795 1659826 2258761 2588727 2773331 3074143 3083538 2159164 599996
39448 599996 -398908 -194584 524635 743570 387525 137026 335167 607823 477200 -39214
39438 -39214 -475266 -380293 234643 847146 969086 779872 906162 1437088 1599898 801256
39428 801256 -373196 -777044 -155977 644298 926284 941371 1221602 1690560 1865446 1582456
39418 1582456 1074348 551504 139600 86230 569434 1322445 1859990 2109410 2411255 2800837
39408 2800837 2748249 1921580 893890 648859 1432330 2446925 2772069 2344175 1862518
39399 1862518 1859363 2113849 2074825 1678049 1441667 1696813 2065097 2009731 1679912 1727399
39389 1727399 2321917 2901981 3066018 3152920 3562554 3975685 3823453 3262956 3048736 3492658
39379 3492658 4122679 4407768 4277538 3808518 2949938 1859252 1110995 1205496 2049909
39370 2049909 3130495 3986377 4349178 4115165 3481637 2925807 2742960 2694932 2364527
39361 2364527 1793240 1519156 1946192 2822966 3434177 3329390 2854351 2835482 3626204 4649920
39351 4649920 5151846 5200710 5460295 6046062 6270832 5713699 4900022 4534806 4604816 4730354
39341 4730354 4930883 5429117 6029593 6326411 6302199 6145603 5756053 5101180 4770823 5306997
39331 5306997 6144481 6229269 5706016 5835636 6941527 7690271 7147858 6438318 7202669
39322 7202669 9134775 10414696 10322595 10060211 10842362 12393616 13780428 14724780 15429021
39313 15429021 15860581 16039152 16595404 18190186 20489915 22434686 23618712 24882424
39305 24882424 27360785 31308092 36067803 40975163 46075512 52020131 59404678 68314537
39297 68314537 78616927 90658699 105400905 123630241 145033256 167919265 189381610
39290 189381610 205558989 212535963 208195287 193663471 172642718 149156038 126013863
39283 126013863 104954545 87133735 72914550 61716489 52639992 45055353 38446001
39276 38446001 32332640 26887904 23030191 21090562 19776668 17445251 14251129 11933215
39268 11933215 11338007 11314613 10529757 9219148 8222650 7228063 5357711 3117367 2244458
39259 2244458 3364267 5027790 5606911 5121120 4470746 3800854 2729542 1633767 1382430
39250 1382430 1823778 1738294 595183 -650845 -977212 -616581 -348544 -276946 -145404
39241 -145404 -234145 -912154 -1647015 -1521050 -596935 255010 828448 1737883 2968320 3510686
39231 3510686 2924588 2128148 1923371 1767416 942259 40935 72585 672070 537240 -568934
39221 -568934 -1512971 -1501666 -943490 -422672 107809 729705 1060140 853338 447273 156318
39211 156318 -253733 -1078823 -2093983 -2792188 -2867876 -2296073 -1349956 -651126 -683058 -1118223
39201 -1118223 -1187471 -824672 -742796 -1178642 -1389678 -806166 106122 677160 992821 1366020
39191 1366020 1519505 1104566 535056 454441 710391 664581 251409 -67990 -187489 -376962
39181 -376962 -571484 -474937 -312173 -618808 -1218145 -1264435 -523993 182792 181888 -107960
39171 -107960 57009 548695 569389 -174732 -1076637 -1416304 -1127267 -633020 -201030 237683
39161 237683 642321 572329 -329894 -1644390 -2368119 -1969264 -972275 -320748 -420729 -989325
39151 -989325 -1528458 -1663606 -1272994 -594983 -35871 326637 776983 1313073 1396469 720348
39141 720348 -176002 -546444 -376391 -172680 -103689 70693 401808 671816 828330 1005217
39131 1005217 1172964 1161393 907448 372221 -493337 -1343717 -1475854 -832222 -450916 -1131220
39121 -1131220 -2097148 -1951347 -637872 628117 1190261 1497487 1828782 1780990 1321064
39112 1321064 1125098 1366591 1246388 345881 -515363 -499839 -23339 -29262 -640044 -1308781
39102 -1308781 -1790421 -2174555 -2306553 -1896496 -1027027 -70260 676470 944226 485013
39093 485013 -482470 -1210182 -1207068 -737798 -280232 -20364 -165042 -998473 -2102970 -2298556
39083 -2298556 -1116966 303180 628012 63953 -239700 3319 111271 -195902 -513921
39074 -513921 -754760 -1264475 -1820129 -1596631 -447517 701422 1121054 1139993 1309669
39065 1309669 1448868 1098182 414609 31614 296261 1027054 1764500 1979770 1379094
39056 1379094 344391 -233687 71364 668414 730653 280797 37415 316607 622017
39047 622017 426597 -83716 -335714 -186831 -39972 -161708 -255408 62551 580885 658988
39037 658988 91260 -536573 -538884 50338 593244 663109 489034 588305 1141033 1805701
39027 1805701 2096190 1873627 1405706 950238 465587 -115086 -539421 -511880 -199725 -16745
39017 -16745 100675 700935 1961839 3305378 4108529 4405588 4651044 5176374 6119587
39008 6119587 7456099 8773697 9402370 9099667 8254528 7161755 5616436 3627728 1962365
38999 1962365 1336296 1432116 1348956 754320 15261 -506580 -643914 -175818 881959 1856872
38989 1856872 1950838 1144332 52982 -918022 -1658149 -1845666 -1213005 -310186 -177497
38980 -177497 -1072508 -2159760 -2617191 -2462687 -2143069 -1884555 -1654662 -1318118 -709162
38971 -709162 66074 451098 59604 -650015 -972278 -1093312 -1752249 -2738254 -2793961 -1421138
38961 -1421138 163192 521243 -251014 -955696 -946413 -606650 -497856 -747839 -1208581 -1701312
38951 -1701312 -2092668 -2419745 -2870134 -3448115 -3830575 -3731941 -3195301 -2369801 -1309100
38942 -1309100 -211524 475078 514439 214737 43 -149567 -529773 -1141041 -1598988
38933 -1598988 -1591111 -1244817 -1039539 -1380311 -2175446 -2859553 -2955476 -2519530 -1873665 -1143827
38923 -1143827 -424405 -130625 -579944 -1324868 -1585965 -1377163 -1482143 -2173040 -2701094
38914 -2701094 -2349786 -1319100 -231250 586209 953452 661087 -60221 -480215 -286725
38905 -286725 -7589 -36631 74333 663101 968356 84361 -1452193 -2088138 -1271083 -167151
38895 -167151 -166004 -1296770 -2379940 -2355239 -1254982 -55135 376344 223298 407155
38886 407155 1253662 1953426 1697854 838529 318784 340251 326987 -13240 -385294 -608911
38876 -608911 -852590 -1065847 -877852 -295844 61250 -272588 -1011395 -1540928 -1623551 -1446336
38866 -1446336 -1226054 -1029531 -886050 -887191 -1101863 -1348151 -1141408 -186782 980250 1285551
38856 1285551 397283 -656662 -634780 437200 1472599 1756283 1500550 1110671 686487
38847 686487 361914 404738 671126 523707 -324188 -1257367 -1393010 -525901 773478 1740025
38837 1740025 1895435 1233643 207230 -590187 -879693 -751352 -305711 450042 1276567
38828 1276567 1643283 1249630 405086 -314619 -631285 -623748 -412881 -26142 486697 980611
38818 980611 1275522 1264107 1029583 849316 921541 1050628 817536 194758 -224627 113678
38808 113678 929179 1322705 884379 242675 203678 591420 474025 -456537 -1366649 -1449492
38798 -1449492 -1012907 -807917 -738061 -100583 1060754 1799395 1583943 906497 339050
38789 339050 -144752 -522635 -295047 649278 1451746 1321459 632984 260367 276307 95476
38779 95476 -421452 -785313 -621035 17098 857814 1433836 1249132 485133 106141 630724
38769 630724 1310138 1279213 930699 1148425 1697963 1614611 888104 433352 473104 292922
38759 292922 -286033 -488743 87021 892107 1468860 1946632 2196764 1681476 572902
38750 572902 -131360 -103874 -147846 -617307 -627183 369665 1399483 1379533 733356 486003
38740 486003 555798 139035 -789321 -1532294 -1839175 -1966406 -1881003 -1364620 -651101 -108812
38730 -108812 395562 1001384 1177375 521748 -199991 8482 694738 535613 -474684
38721 -474684 -835410 185381 1427312 1589598 993648 769418 1086656 1148646 536950
38712 536950 -303168 -813902 -918598 -842087 -790149 -883035 -1107869 -1250051 -1057962 -560850
38702 -560850 -124572 -103554 -452152 -774515 -836725 -919708 -1422601 -2139260 -2316638 -1617549
38692 -1617549 -656491 -253426 -468035 -793517 -1028163 -1364692 -1708740 -1571797 -834895
38683 -834895 -121390 -79352 -563638 -844052 -516652 43565 161833 -342157 -948690 -1045966
38673 -1045966 -622661 -180265 -29454 -5429 35094 -167920 -863265 -1766905 -2325393 -2354359
38663 -2354359 -2081336 -1676710 -1110533 -438957 118485 448746 643713 766136 714485 405753
38653 405753 -35592 -380599 -578812 -858615 -1415979 -1983985 -1973230 -1260470 -543675 -472721
38643 -472721 -671245 -282228 620481 1018099 486873 -161620 -178305 64873 -68506 -358571
38633 -358571 -287916 -102913 -379316 -945871 -1189429 -1145805 -1324202 -1616983 -1380856 -608202
38623 -608202 -71880 -149129 -334365 -153732 169558 250302 122240 -13919 -107327 -51965
38613 -51965 369104 1051489 1458357 1213547 555273 35908 -23092 274024 523136 358822
38603 358822 -108726 -315527 17478 375041 78979 -767009 -1432323 -1479712 -1025633 -281126
38593 -281126 567408 1160300 1282184 1298275 1683288 2245785 2445094 2279937 2113472 1822059
38583 1822059 1031618 80602 -292718 -230566 -592973 -1362499 -1432967 -382940 740366
38574 740366 1024459 973983 1387441 1916463 1732738 930576 248117 -136472 -570546 -1007276
38564 -1007276 -1023492 -615529 -232256 -82396 7292 133723 217951 267913 338182 367773
38554 367773 377113 579381 962029 1066260 568005 -214430 -755587 -937123 -865552 -468837
38544 -468837 270991 1000690 1325006 1162539 511432 -626497 -1740168 -1921678 -1090490
38535 -1090490 -448629 -934451 -1810573 -1725459 -682922 161709 364132 599372 1203818
38526 1203818 1528273 1070673 277288 -220554 -417882 -579392 -715449 -808760 -1009201 -1230978
38516 -1230978 -1055098 -394132 194518 194376 -298101 -985277 -1844709 -2766843 -3194429 -2736618
38506 -2736618 -1895307 -1567308 -1881705 -2069031 -1551567 -693568 -258551 -447225 -759839
38497 -759839 -650401 -35042 792758 1458639 1650480 1239695 474011 -98842 -132296 161119
38487 161119 326732 219538 26201 -86157 -26608 326824 859206 1014979 427189 -368506
38477 -368506 -546761 -264960 -439960 -1152777 -1354770 -575162 221700 246984 268829 1238584
38467 1238584 2377112 2082760 346199 -1206282 -1602007 -1467453 -1550016 -1639566 -1382137
38458 -1382137 -1023620 -784770 -432638 -33957 -260821 -1299300 -2224409 -2179319 -1516667
38449 -1516667 -1009640 -560218 342810 1290407 1203194 -64821 -1336038 -1616672 -1272866
38440 -1272866 -1272608 -1770788 -2023694 -1521618 -653368 -116127 -13372 168375 774885 1467985
38430 1467985 1635425 1204769 853309 1295900 2371672 2985930 2196233 390841 -957143
38421 -957143 -969378 -425202 -622186 -1496108 -1766479 -962312 -229114 -653989 -1740256 -2307255
38411 -2307255 -2150717 -1878492 -1654940 -1153102 -442771 72427 418047 830598 974521
38402 974521 345493 -695488 -1301705 -1432475 -1683647 -1948716 -1553755 -804186 -930822
38393 -930822 -2078178 -2780371 -2144960 -1232315 -1301686 -1848074 -1595234 -563105 210665
38384 210665 470403 880361 1538037 1607440 607472 -837889 -1769108 -1807297 -1206348 -525083
38374 -525083 -311924 -656014 -1007349 -795663 -162541 268116 196233 -173957 -560334 -715685
38364 -715685 -277419 892683 2207001 2744825 2298834 1627084 1498183 1803225 1815869
38355 1815869 1128406 96402 -620353 -770095 -589492 -225930 535175 1687917 2535855
38346 2535855 2409406 1674488 1301748 1480078 1503867 1116584 943079 1227362 1199888 363815
38336 363815 -517378 -549141 -33370 241157 299700 526477 566185 -77290 -784724 -495652
38326 -495652 555983 1075741 635065 94321 26427 16672 -190810 -116440 368577 485436
38316 485436 -227290 -981886 -779884 191808 838398 439117 -772890 -1924105 -2111542
38307 -2111542 -1139004 176308 924113 1304053 2090059 2905545 2343679 317695 -1099918
38298 -1099918 -274688 1624715 2228819 1187941 236087 441973 1106426 1477712 1902487
38289 1902487 2703892 3289225 3239678 3266363 4091220 5097589 5144156 4280287 3606555 3632235
38279 3632235 3786108 3575357 3266097 3167621 3076982 2840994 2779601 3055197 3224947 3036566
38269 3036566 3151984 4271498 5839443 6551088 6136498 5711535 6087531 6584599 6091660
38260 6091660 4701115 3553451 3319057 3521924 3362289 2672336 1912198 1557861 1679666
38251 1679666 1988296 2172724 2177244 2132134 2102202 2093164 2244076 2680114 3140189 3156822 2736607
38240 2736607 2418994 2453857 2425948 2029251 1676065 1816437 2116511 1988169 1622823 1745612
38230 1745612 2466642 3098767 3134214 2782198 2487785 2487115 2901918 3705431 4459079 4579824
38220 4579824 4020987 3279096 2669748 2083822 1540369 1400855 1782480 2245474 2385767
38211 2385767 2353181 2432608 2424202 1875244 830204 -15899 -3048 815204 1782153 2367756
38201 2367756 2622423 2825301 2939489 2788107 2608059 2808780 3131183 2807650 1841515
38192 1841515 1281243 1668248 2068891 1504166 583211 569649 1339620 1588710 880855 198331
38182 198331 401144 1286824 2296090 3077518 3220494 2499219 1572189 1432542 2021195
38173 2021195 2403618 2347690 2485629 2828652 2619768 2002886 2223468 3507059 4310962
38164 4310962 3614773 2497433 2308705 2613841 2293560 1540605 1270679 1429505 1389891
38155 1389891 1348885 1858908 2513367 2525807 2167707 2247432 2570418 2321891 1640972 1389166
38145 1389166 1604725 1601794 1402330 1633536 2170008 2385132 2636183 3832686 5451543
38136 5451543 5771502 4491191 3384036 3659519 4287040 3912868 3018960 2895925 3486012
38127 3486012 3639782 2979240 2264565 2114211 2346023 2560612 2654314 2715587 2891671 3344971
38117 3344971 4005524 4451636 4331756 3844211 3600871 4063482 5163241 6336055 6932651
38108 6932651 6788576 6375105 6236470 6450344 6873768 7593216 8679396 9803382 10697894
38099 10697894 11770492 13592029 15958117 18187304 20243759 22841054 26516336 31303924
38091 31303924 37209453 44303964 52538130 62215028 74427521 90378705 110782528 136414738
38083 136414738 167345772 199110694 220829655 221439501 199742060 166232297 133638061
38076 133638061 107464038 86522089 69161881 55526070 45321351 37215895 30724552
38069 30724552 26237098 22977563 19136847 14460923 10802326 9463326 9488439 9180929
38061 9180929 8013912 6463247 5094623 4406762 4616009 5066807 4681895 3404307 2377403
38052 2377403 2341878 2704014 2588106 1983682 1388257 1042335 973186 1161105 1289367 967523
38042 967523 517214 812458 1961877 2903508 2797406 2126874 1873395 2245081 2826902
38033 2826902 3391124 3852629 3898036 3434312 3118260 3705251 4999818 6066278 6399305
38024 6399305 6342795 6411200 6734714 7196397 7612431 7647521 6969842 5714201 4522511 3888302
38014 3888302 3615410 3158433 2426532 1968015 2251355 2991820 3455035 3319678 2888383
38005 2888383 2454509 1927706 1265478 780522 634477 438412 -132604 -643838 -421370
37996 -421370 416972 1061153 1048940 641876 259069 134093 450564 1145604 1591178 1187247
37986 1187247 346239 164398 972442 1940504 2311345 2240512 2097700 1742405 1026204 378391
37976 378391 289804 643843 1034234 1313374 1397039 1037654 324735 -66646 255406 675692
37966 675692 379985 -416250 -758682 -319716 207193 71210 -731525 -1648428 -2109930 -1847301
37956 -1847301 -1072265 -410519 -388195 -974776 -1794157 -2605433 -3305462 -3682025 -3567625 -3133669
37946 -3133669 -2696083 -2351107 -2102796 -2126255 -2488472 -2803323 -2647137 -2171845 -1793590 -1422187
37936 -1422187 -647661 327882 675177 56999 -876735 -1421436 -1661739 -1959591 -2131918
37927 -2131918 -1764438 -1037044 -548354 -402386 -131877 388741 611317 196910 -328746
$$ [...]
##END NTUPLES=NMR SPECTRUM
##END=
