##TITLE=31Pdec_LR-685A-2(R)
 , 24 sc
 25.7.2019
##JCAMPDX= 6.0         $$ Bruker NMR JCAMP-DX V2.0
##DATA TYPE= NMR SPECTRUM
##DATA CLASS= NTUPLES
##ORIGIN= UXNMR, Bruker Analytische Messtechnik GmbH
##OWNER= root
$$ XWIN-NMR		Version 3.5
$$ Thu Jul 25 14:56:42 2019 Russian Standard Time (UT+4h)  she@DPX200
##.OBSERVE FREQUENCY= 81.013821
##.OBSERVE NUCLEUS= ^31P
##.ACQUISITION MODE= SIMULTANEOUS
##.ACQUISITION SCHEME= undefined
##.AVERAGES= 24
##.DIGITISER RES= 17
##SPECTROMETER/DATA SYSTEM= spect
##.PULSE SEQUENCE= zgpg30
##.SOLVENT NAME= CDCl3
##.SHIFT REFERENCE= (INTERNAL, CDCl3, 0, 182.463)
##AUDIT TRAIL= $$ (NUMBER, WHEN, WHO, WHERE, WHAT)
$$ ##TITLE= Audit trail, XWIN-NMR		Version 3.5
$$ ##JCAMPDX= 5.01
$$ ##ORIGIN= Bruker BioSpin GmbH
$$ ##OWNER= she
$$ F:/spectra/data/she/nmr/P31/1/pdata/1/auditp.txt
$$ ##AUDIT TRAIL=  $$ (NUMBER, WHEN, WHO, WHERE, WHAT)
(   1,<2019-07-25 14:55:39.15 +0400>,<she>,<DPX200>,
      <created by zg, POWCHK disabled, PULCHK disabled
       configuration hash MD5:
       00 E9 B6 7A A2 85 ED C7 34 08 36 98 17 FE 4E 26
       data hash MD5: 32K
       C2 B4 2F 3E F2 17 1D 10 ED 56 F7 1C 0D 6C BE 31>)
(   2,<2019-07-25 14:55:41.62 +0400>,<she>,<DPX200>,
      <Start of raw data processing
       efp BC_mod = 2 LB = 1 FT_mod = 6 PKNL = 1 PHC0 = -635.6448 PHC1 = 692.6 SI = 64K 
       data hash MD5: 64K
       81 ED 57 12 18 8B BC EA 60 03 E2 24 5C 56 38 7E>)
(   3,<2019-07-25 14:56:08.73 +0400>,<she>,<DPX200>,
      <pk PHC0 = 209.8322 PHC1 = -543.6 
       data hash MD5: 64K
       83 34 F6 46 85 29 7E 0F 56 DD 01 54 C2 C3 E3 02>)
$$ ##END=
$$ 
$$ hash MD5
$$ 81 CC 6D BD 82 31 FB D3 3A 58 6F D6 9B 93 0A 4F
##$RELAX= 
##$RELAX= 
##$RELAX= 
##$RELAX= 
##$RELAX= 
##$RELAX= 
##$RELAX= 
##$RELAX= 
$$ Bruker specific parameters
$$ --------------------------
##$DU= <F:/spectra>
##$EXPNO= 1
##$NAME= <P31>
##$PROCNO= 1
##$TYPE= <nmr>
##$USER= <she>
##$AMP= (0..31)
100 100 100 100 100 100 100 100 100 100 100 100 100 100 100 100 100 100 
100 100 100 100 100 100 100 100 100 100 100 100 100 100 
##$AQSEQ= 0
##$AQ_mod= 1
##$AUNM= <au_zg>
##$AUTOPOS= <>
##$BF1= 81.014009
##$BF2= 200.13
##$BF3= 200.13
##$BF4= 200.13
##$BF5= 200.13
##$BF6= 200.13
##$BF7= 200.13
##$BF8= 200.13
##$BYTORDA= 1
##$CFDGTYP= 0
##$CFRGTYP= 5
##$CHEMSTR= <none>
##$CNST= (0..31)
1 1 145 1 1 1 1 1 1 1 1 1 1 1 1 1 1 1 1 1 1 1 1 1 1 1 1 1 1 1 1 1 
##$CPDPRG= <waltz16>
##$CPDPRG1= <>
##$CPDPRG2= <waltz16>
##$CPDPRG3= <>
##$CPDPRG4= <mlev>
##$CPDPRG5= <mlev>
##$CPDPRG6= <mlev>
##$CPDPRG7= <mlev>
##$CPDPRG8= <mlev>
##$CPDPRGB= <>
##$CPDPRGT= <>
##$D= (0..31)
0 1 0 0 0 0 0 0 0 0 0 0.03 2e-05 3e-06 0 0 0 0 0 0 0 0 0 0 0 0 0 0 0 0 
0 0 
##$DATE= 1564052138
##$DBL= (0..7)
120 120 120 11 120 120 24 19 
##$DBP= (0..7)
150 150 150 150 150 150 150 150 
##$DBP07= 0
##$DBPNAM0= <>
##$DBPNAM1= <>
##$DBPNAM2= <>
##$DBPNAM3= <>
##$DBPNAM4= <>
##$DBPNAM5= <>
##$DBPNAM6= <>
##$DBPNAM7= <>
##$DBPOAL= (0..7)
0.5 0.5 0.5 0.5 0.5 0.5 0.5 0.5 
##$DBPOFFS= (0..7)
0 0 0 0 0 0 0 0 
$$ [...]
##$SUBNAM2= <"">
##$SUBNAM3= <"">
##$SUBNAM4= <"">
##$SUBNAM5= <"">
##$SUBNAM6= <"">
##$SUBNAM7= <"">
##$SUBNAM8= <"">
##$SUBNAM9= <"">
##$SW= 369.568048894756
##$SWIBOX= (0..15)
0 1 3 0 0 0 0 0 0 0 0 0 0 0 0 0 
##$SW_h= 29940.119760479
##$TD= 32768
##$TD0= 1
##$TE= 0
##$TE2= 300
##$TE3= 300
##$TEG= 300
##$TL= (0..7)
0 120 53 12 22 120 120 120 
##$TP= (0..7)
150 150 150 150 150 150 150 150 
##$TP07= 0
##$TPNAME0= <>
##$TPNAME1= <>
##$TPNAME2= <>
##$TPNAME3= <>
##$TPNAME4= <>
##$TPNAME5= <>
##$TPNAME6= <>
##$TPNAME7= <>
##$TPOAL= (0..7)
0.5 0.5 0.5 0.5 0.5 0.5 0.5 0.5 
##$TPOFFS= (0..7)
0 0 0 0 0 0 0 0 
##$TUNHIN= 0
##$TUNHOUT= 0
##$TUNXOUT= 0
##$USERA1= <user>
##$USERA2= <user>
##$USERA3= <user>
##$USERA4= <user>
##$USERA5= <user>
##$V9= 5
##$VALIST= <valist>
##$VCLIST= <CCCCCCCCCCCCCCC>
##$VD= 0
##$VDLIST= <DDDDDDDDDDDDDDD>
##$VPLIST= <PPPPPPPPPPPPPPP>
##$VTLIST= <TTTTTTTTTTTTTTT>
##$WBST= 1024
##$WBSW= 4
##$XGAIN= (0..3)
0 0 0 0 
##$XL= 0
##$YL= 0
##$YMAX_a= 95367
##$YMIN_a= -125470
##$ZGOPTNS= <>
##$ZL1= 120
##$ZL2= 120
##$ZL3= 120
##$ZL4= 120
##$ABSF1= 0
##$ABSF2= 0
##$ABSG= 0
##$ABSL= 0
##$ALPHA= 0
##$AQORDER= 0
##$ASSFAC= 0
##$ASSFACI= 0
##$ASSFACX= 0
##$ASSWID= 0
##$AUNMP= <proc_1d>
##$AZFE= 0.1
##$AZFW= 0.5
##$BCFW= 0
##$BC_mod= 2
##$BYTORDP= 0
##$COROFFS= 0
##$CY= -3
##$DATMOD= 1
##$DC= 0
##$DFILT= <>
##$DTYPP= 0
##$F1P= 0
##$F2P= 0
##$FCOR= 1
##$FTSIZE= 65536
##$FT_mod= 6
##$GAMMA= 0
##$GB= 0
##$INTBC= 1
##$INTSCL= 5.30512e-09
##$ISEN= 30
##$LB= 1
##$LEV0= 0
##$LPBIN= 0
##$MAXI= 10000
##$MC2= 0
##$MEAN= 0
##$ME_mod= 0
##$MI= 50
##$NCOEF= 0
##$NC_proc= -5
##$NLEV= 6
##$NOISF1= 182.463
##$NOISF2= 159.3651
##$NSP= 0
##$NTH_PI= 0
##$NZP= 0
##$OFFSET= 182.463
##$PC= 4
##$PHC0= -425.8126
##$PHC1= 149
##$PH_mod= 1
##$PKNL= yes
##$PPARMOD= 0
##$PSCAL= 0
##$PSIGN= 0
##$REVERSE= no
##$SF= 81.0140089999434
##$SI= 65536
##$SIGF1= 159.3651
##$SIGF2= -187.1042
##$SINO= 113.3802
##$SIOLD= 16384
##$SREGLST= <1H.CDCl3>
##$SSB= 0
##$STSI= 65536
##$STSR= 0
##$SW_p= 29940.119760479
##$SYMM= 0
##$S_DEV= 0
##$TDeff= 32768
##$TDoff= 0
##$TI= <>
##$TILT= no
##$TM1= 0
##$TM2= 0
##$TOPLEV= 0
##$USERP1= <user>
##$USERP2= <user>
##$USERP3= <user>
##$USERP4= <user>
##$USERP5= <user>
##$WDW= 1
##$XDIM= 65536
##$YMAX_p= 297923564
##$YMIN_p= -50935507
$$ End of Bruker specific parameters
$$ ---------------------------------
##NTUPLES= NMR SPECTRUM
##VAR_NAME=  FREQUENCY,     SPECTRUM/REAL,   SPECTRUM/IMAG
##SYMBOL=    X,             R,               I
##VAR_TYPE=  INDEPENDENT,   DEPENDENT,       DEPENDENT
##VAR_FORM=  AFFN,          ASDF,            ASDF
##VAR_DIM=   65536,         65536,           65536
##UNITS=     HZ,            ARBITRARY UNITS, ARBITRARY UNITS
##FACTOR=    0.456856943014862, 1,           1
##FIRST=     14782.0589164792, 0,            0
##LAST=      -15158.0608439998, 0,           0
##MIN=       -15158.0608439998, -50935507,   0
##MAX=       14782.0589164792, 297923564,    0
$$ Real data points
##PAGE= N=1
##DATA TABLE= (X++(R..R)), XYDATA
$$ [...]
$$ plain form
45730 153929 805521 1094432 836843 401470 284013 613506 1061338 1273123 1333843 1632973
45720 1632973 2288228 2969204 3352972 3444304 3313738 2891103 2292462 1994521 2263686 2663621
45710 2663621 2604146 2193329 2010479 2153589 2131093 1711838 1252604 1063851 1062534 1215245
45700 1215245 1649753 2049441 1672714 468111 -479838 -246415 724351 1371851 1452089
45691 1452089 1416688 1346834 1024347 763340 1016418 1229443 331985 -1430669 -2394742 -1691578
45681 -1691578 -444991 -76604 -434841 -521538 -228928 -195131 -436408 -338163 143991 356445
45671 356445 69591 -194281 -95606 74053 81358 137574 293233 99390 -717009 -1685525
45661 -1685525 -2050422 -1486904 -205942 1196803 1807350 925582 -984773 -2317065 -1881438
$$ packed form
45730A53929O51592K88911k57589m35373j17457L29493M47832K11785O0720K99130
45720A632973O55255O80976L83768R1332j30566m22635n98641k97941K69165L99935
45710B663621n9475m10817j82850J43110k2496m19255m59234j88753j317J52711
45700A215245M34508L99688l76727j204603r47949K33423R70766O47500Q0238
45691A452089l5401o9854l22487k61007K53078K13025q97458j762654r64073P03164
45681a691578J246587L68387l58237q6697K92610L3797k41277R8245M82154K12454
45671C56445k86854k63872R8675J69659P305N6216J55659j93843q16399r68516
45661a685525l64897N63518J280962J402745O10547q81768j910355j332292M35627
$$ plain form
45652 -1881438 -225161 1106824 1407106 1290636 1457135 1759619 1797622 1788048 2215432 2876060
45642 2876060 2948580 2102203 990341 372932 181886 -110734 -502010 -449281 177322 743805
45632 743805 669271 140050 -265586 -298993 -102239 112700 137050 -157268 -493140 -305738
45622 -305738 428050 881034 414321 -455483 -775039 -517567 -445968 -829489 -1192725 -1279209
45612 -1279209 -1306649 -1190969 -544389 316774 457021 -125515 -139740 1075293 2316533
45603 2316533 2238018 1430993 1457231 2353384 2624925 1650865 610933 646956 1298468 1368725
45593 1368725 489760 -781507 -1783990 -2112740 -1673470 -884470 -430177 -450262 -412277
45584 -412277 -68191 97655 -183190 -271656 410681 1276007 1298217 502381 -165403 -255244
$$ packed form
45652a881438J656277J331985L00282j16470J66499L02484L8003r574M27384O60628
45642B876060P2520q46377j111862o17409j91046k92620l91276N2729O26603N66483
45632G43805p4534n29221m05636l3407J96754K14939K4350k94318l35872J87402
45622c05738P33788M52984m66713q69804l19556K57472P1599l83521l63236q6484
45612a279209k7440J15680O46580Q61163J40247n82536j4225J215033J241240
45603B316533p8515q07025K6238Q96153K71541r74060j039932L6023O51512P0257
45593A368725q78965j271267j002483l28750M39270P89000M54293k0085L7985
45584d12277L44086J65846k80845q8466O82337Q65326K2210p95836o67784q9841
$$ plain form
45574 -255244 -176851 -208413 -115774 85811 -77839 -633829 -864466 -410425 21652 -324575
45564 -324575 -1058544 -1171839 -465682 221054 92749 -832735 -1953918 -2608724 -2425189
45555 -2425189 -1602235 -841240 -631533 -642310 -183913 811115 1716904 2112178 2263010 2591897
45545 2591897 3087826 3447518 3507995 3357462 3225568 3360297 3792519 4163645 4045030 3506626
45535 3506626 3128007 3387490 4270510 5465686 6618674 7382425 7618281 7639122 7881921
45526 7881921 8286471 8454713 8488110 9034727 10224183 11179439 11063074 10116116 9123846
45517 9123846 8290338 7294157 6153750 5312870 4961095 4882731 4928000 5064806 5001537 4363620
45507 4363620 3329290 2574355 2465412 2727546 2966975 3066883 2986360 2649460 2197837 1942476
$$ packed form
45574b55244P8393l1562R2639K01585j63650n55990k30637M54041M32077l46227
45564c24575p33969j13295P06157O86736j28305r25484j121183o54806J83535
45555b425189Q22954P60995K09707j0777M58397R95028R05789L95274J50832L28887
45545B591897M95929L59692O0477j50533j31894J34729M32222L71126j18615n38404
45535C506626l78619K59483Q83020J195176J152988P63751K35856K0841K42799
45526G881921M04550J68242L3397N46617J189456R55256j16365r46958r92270
45517I123846q33508r96181j140407q40880l51775p8364M5269J36806o3269o37917
45507D363620j034330p54935j08943K62134K39429R9908q0523l36900m51623k55361
$$ plain form
45497 1942476 1903082 1777686 1517818 1525270 2058711 2791377 3195094 3099347 2701331 2302702
45487 2302702 2182974 2414605 2629593 2304843 1496611 956780 1238304 1973887 2357586
45478 2357586 2089982 1481903 829057 165593 -364980 -366121 324175 1236840 1694527 1612881
45468 1612881 1554390 1830822 1915351 1220518 252783 218074 1314122 2269475 2111181 1573313
45458 1573313 1850126 2604326 2468076 1228326 102049 -236701 -458121 -994702 -1079782
45449 -1079782 -179789 806245 861781 495846 905354 2103740 3053638 3245854 2982898
45440 2982898 2370545 1253342 129244 -38107 848296 1800228 2104607 2063805 2087607
45431 2087607 1871448 984170 -290399 -1224406 -1464653 -1234528 -939323 -806354 -764416
$$ packed form
45497A942476l9394j25396k59868P452N33441P32666M03717r5747l98016l98629
45487B302702j19728K31631K14988l24750q08232n39831K81524P35583L83699
45478B357586k67604o08079o52846o63464n30573j141O90296R12665M57687q1646
45468A612881n8491K76432Q4529o94833r67735l4709J096048R55353j58294n37868
45458A573313K76813P54200j36250j239750j126277l38750k21420n36581q5080
45449a079782Q99993R86034N5536l65935M09508J198386R49898J92216k62956
45440B982898o12353j117203j124098j67351Q86403R51932L04379m0802K3802
45431B087607k16159q87278j274569r34007k40247K30125K95205J32969M1938
$$ plain form
45422 -764416 -588778 -304266 -337211 -954905 -1676172 -1690062 -838168 257214 1012949 1350078
45412 1350078 1352360 1012280 430779 -176910 -745937 -1233112 -1306016 -730350 -4095 121785
45402 121785 -195527 -34304 802474 1363992 1043026 592148 968881 1897078 2412233 2304831
45392 2304831 2102747 1946210 1445857 600497 -7661 -67911 83727 133904 297996 922873
45382 922873 1940743 2874831 3153178 2466935 1188024 358642 738668 1795935 2189205
45373 2189205 1429761 502071 511170 1254636 1683175 1417189 1103237 1314067 1756028 1796120
45363 1796120 1322335 755357 472286 540222 864875 1279220 1526235 1430496 1120544 885716
45353 885716 792187 630254 282095 -34684 31515 607310 1425050 1922633 1640415 742458
$$ packed form
45422g64416J75638K84512l2945o17694p21267j3890Q51894J095382P55735L37129
45412A350078K282l40080n81501o07689n69027m87175p2904N75666P26255J25880
45402A21785l17312J61223Q36778N61518l20966m50878L76733R28197N15155j07402
45392B304831k02084j56537n00353q45360o08158o0250J51638N0177J64092O24877
45382I22873J017870R34088K78347o86243j278911q29382L80026J057267L93270
45373B189205p59444r27690R099P43466M28539k65986l13952K10830M41961M0092
45363A796120m73785n66978k83071O7936L24653M14345K47015r5739l09952k34828
45353H85716r3529j61933l48159l16779O6199N75795Q17740M97583k82218q97957
$$ plain form
45343 742458 18165 44887 469170 554370 305662 357585 702146 461608 -608313 -1272484
45333 -1272484 -331780 1594217 2803121 2725389 2367635 2622916 3193238 3398158 3149686
45324 3149686 2752614 2423196 2365663 2749444 3279569 3307525 2670663 1941977 1605129 1511754
45314 1511754 1407783 1397282 1526398 1479820 1123704 846443 923197 1041799 937276 981634
45304 981634 1536566 2150371 2125488 1650890 1632683 2408732 3253493 3325678 2700537 2220896
45294 2220896 2468840 3081353 3207759 2631260 2108570 2300455 2750288 2574585 1899928
45285 1899928 1670200 2055014 2170116 1620525 1105531 977699 494201 -619455 -1096655
45276 -1096655 105771 1926461 2570196 2095227 2027277 2788208 3240569 2797001 2320229
$$ packed form
45343G42458p24293K6722M24283Q5200k48708N1923L44561k40538j069921o64171
45333a272484R40704J925997J208904p7732l57754K55281N70322K04920k48472
45324C149686l97072l29418n7533L83781N30125K7956o36862p28686l36848r3375
45314A511754j03971j0501J29116m6578l56116k77261P6754J18602j04523M4358
45304I81634N54932O13805k4883m74598j8207P76049Q44761P2185o25141m79641
45294B220896K47944O12513J26406n76499n22690J91885M49833j75703o74657
45285A899928k29728L84814J15102n49591n14994j27832m83498j113656m77200
45276a096655J202426J820690O43735m74969o7950P60931M52361m43568m76772
$$ plain form
45267 2320229 2550064 3029943 3133213 3024345 3034016 2996018 2703321 2234294 1468435 131487
45257 131487 -1304500 -1667207 -532252 1133108 2214512 2592358 2651430 2504142 2241991
45248 2241991 2199997 2403016 2406999 2137412 2118008 2418102 2323630 1704650 1680810 2948820
45238 2948820 4320736 4152603 2671738 1619882 1869239 2603340 2797757 2396266 1855940
45229 1855940 1407247 1032291 628956 95629 -374856 -286146 406471 915577 680926 382699
45219 382699 963562 1977039 2089964 1157394 531826 1087731 2140477 2750288 2967907
45210 2967907 3158722 3099106 2569845 2074702 2087289 2155363 1612397 719813 243586 274621
45200 274621 363452 521575 1082880 1693569 1529254 688814 358697 1162986 2198783 2329942
$$ packed form
45267B320229K29835M79879J03270j08868R671l7998k92697m69027p65859j336948
45257A31487j435987l62707J134955J665360J081404L77846N9072j47288k62151
45248B241991m1994K03019L983k69587j9404L00094r4472o18980k3840J268010
45238B948820J371916j68133j480865j051856K49357P34101J94417m01491n40326
45229A855940m48693l74956m03335n33327m70485Q8710O92617N09106k34651k98227
45219C82699N80863J013477J12925r32570o25568N55905J052746O09811K17619
45210B967907J90815n9616n29261m95143J2587O8074n42966q92584m76227L1035
45200B74621Q8831J58123N61305O10689j64315q40440l30117Q04289J035797J31159
$$ plain form
45190 2329942 1796555 1768942 2660893 3697627 4113045 4066237 4159011 4535485 4814740 4722761
45180 4722761 4485185 4545853 5000202 5433945 5447218 5285141 5659446 6832017 8221135
45171 8221135 9180765 9768221 10237600 10156044 8895963 6968249 5867053 6215291 6919120
45162 6919120 6738125 5926581 5529821 5706057 5791021 5647463 5779997 6178952 6201916 5772179
45152 5772179 5602480 5876883 5758313 4766311 3696563 3418781 3567256 3355522 3065048
45143 3065048 3586223 4742777 5230302 4358847 2932676 2077998 1918794 1870784 1731434
45134 1731434 1860641 2400779 2851832 2670630 2082905 1908694 2435537 2823460 2096367
45125 2096367 561164 -415628 -131289 663356 984512 867310 832676 790044 340877 -214493
$$ packed form
45190B329942n33387k7613Q91951J036734M15418m6808R2774L76474K79255r1979
45180D722761k37576O0668M54349M33743J3273j62077L74305J172571J389118
45171H221135R59630N87456M69379q1556j260081j927714j101196L48238P03829
45162F919120j80995q11544l96760J76236Q4964j43558J32534L98955K2964m29737
45152E772179j69699K74403j18570r92002j069748k77782J48475k11734k90474
45143C065048N21175J156554M87525q71455j426171q54678j59204m8010j39350
45134A731434J29207N40138M51053j81202n87725j74211N26843L87923p27093
45125B096367j535203r76792K84339P94645L21156j17202l4634m2632m49167n55370
$$ plain form
45115 -214493 -134565 575631 1083853 933448 625535 832910 1601673 2505743 3105742 3078136
45105 3078136 2309992 1076461 -116910 -925619 -1213638 -880073 -18070 891310 1384322
45096 1384322 1520579 1598851 1590288 1359722 1183847 1381682 1642056 1485675 1215613 1498992
45086 1498992 2093078 2041162 1217112 548257 452743 257578 -341165 -452369 584350 1985525
45076 1985525 2705822 2988133 3657709 4535804 4739473 4159836 3499958 3055640 2513750
45067 2513750 1860869 1504071 1477124 1386428 1168959 1132101 1267543 1294466 1313498 1588406
45057 1588406 1770606 1318692 695456 1033963 2388255 3444306 3401276 3042405 3289240
45048 3289240 3715192 3409759 2536902 1975942 1904155 1793752 1548236 1608341 1970759 2023125
$$ packed form
45115b14493P9928P10196N08222j50405l07913K07375P68763R04070N99999k7606
45105C078136p68144j233531j193371q08709k88019L33565Q62003R09380M93012
45096A384322J36257P8272q563k30566j75875J97835K60374j56381k70062K83379
45086A498992N94086n1916q24050o68855r5514j95165n98743j11204J036719J401175
45076A985525P20297K82311O69576Q78095K03669n79637o59878m44318n41890
45067B513750o52881l56798k6947r0696k17469l6858J35442K6923J9032K74908
45057A588406J82200m51914o23236L38507J354292J056051m3030l58871K46835
45048C289240M25952l05433q72857n60960p1787j10403k45516O0105L62418N2366
$$ plain form
45038 2023125 1473322 694569 23453 -570058 -932331 -572601 561597 1692106 2019495
45029 2019495 1582020 988129 637016 544548 626654 748284 687946 423490 299636 557403
45019 557403 843164 608146 -42367 -340380 176636 1015758 1265346 640678 -158090 -94050
45009 -94050 1210328 3033450 4142451 3962905 3128912 2715878 3035683 3483751 3488452 3118988
44999 3118988 2626704 1938394 1028856 400140 581701 1282317 1637280 1352448 1049878
44990 1049878 1269459 1614848 1290104 226946 -733724 -737962 257327 1511496 2148340
44981 2148340 1827393 971948 332995 215903 222027 -100368 -522446 -401635 338182 938369
44971 938369 759300 161634 8675 443057 700955 257652 -371120 -369129 183521 416037
$$ packed form
45038B023125n49803p78753o71116n93511l62273L59730J134198J130509L27389
45029B019495m37475n93891l51113r2468Q2106J21630o0338k64456j23854K57767
45019E57403K85761k35018o50513k98013N17016Q39122K49588o24668p98768O4040
45009i4050J304378J823122J109001j79546q33993m13034L19805M48068M701l69464
44999C118988m92284o88310r09538o28716J81561P00616L54963k84832l02570
44990A049878K19581L45389l24744j063158r60670m238R95289J254169O36844
44981B148340l20947q55445o38953j17092O124l22395m22078J20811P39817O00187
44971I38369j79069n97666j52959M34382K57898m43303o28772J991N52650K32516
$$ plain form
44961 416037 -115814 -884213 -1171135 -891865 -405783 45421 366348 442734 363014 512785
44951 512785 985426 1155540 423042 -741481 -1145079 -328881 921538 1679150 1888731
44942 1888731 1965638 1946974 1608810 1142177 1088744 1575432 2077786 2128960 1967548 2193067
44932 2193067 2866514 3276426 2769972 1620134 747930 638006 943918 1235945 1572735
44923 1572735 1981963 1947965 1094546 26622 -318696 -14245 18086 -488225 -730424 -161677
44913 -161677 667243 1052870 1175030 1593664 2270223 2708316 2678888 2268220 1551000 725787
44903 725787 269157 453666 928360 1160894 1055563 851174 771939 1067530 1904617 2822559
44893 2822559 2838605 1623599 102993 -627419 -465664 139711 1083827 2219927 2701172
$$ packed form
44961D16037n31851p68399k86922K79270M86082M51204L20927P6386p9720J49771
44951E12785M72641J70114p32498j164523m03598Q16198J250419P57612K09581
44942A888731P6907j8664l38164m66633n3433M86688N02354N1174j61412K25519
44932B193067O73447M09912n06454j149838q72204j09924L05912K92027L36790
44923A572735M09228l3998q53419j067924l45318L04451L2331n06311k42199N68747
44913a61677Q28920L85627J22160M18634O76559M38093k9428m10668p17220q25213
44903G25787m56630J84509M74694K32534j05331k04389p9235K95591Q37087R17942
44893B822559J6046j215006j520606p30412J61755O05375R44116J136100M81245
$$ plain form
44884 2701172 1816758 220021 -674508 -366977 504059 1322540 1881799 1856384 1043399
44875 1043399 102279 -40424 446018 594561 290363 393800 1074782 1356320 731163
44866 731163 3068 -28597 408287 936793 1776436 2849852 3225385 2405548 1320273
44857 1320273 1087944 1520857 1777346 1757683 1821416 1762232 1203532 562886 497571 700273
44847 700273 333664 -533008 -957856 -504067 344336 1068140 1552359 1739956 1704234 1959079
44837 1959079 2823684 3613772 3434197 2666885 2548746 3237529 3548330 2898150 2223901
44828 2223901 2356392 2662180 2242911 1587608 1861328 3014394 3757787 3342033 2396644
44819 2396644 1871464 1933583 2194230 2396359 2434797 2092297 1289580 499002 444184 1262449
$$ packed form
44884B701172q84414j596737q94529L07531Q71036Q18481N59259k5415q12985
44875A043399r41120j42703M86442J48543l04198J03437O80982K81538o25157
44866G31163p28095l1665M36884N28506Q39643J073416L75533q19837j085275
44857A320273k32329M32913K56489j9663O3733n9184n58700o40646o5315K02702
44847G00273l66609q66672m24848M53789Q48403P23804M84219J87597l5722K54845
44837A959079Q64605P90088j79575p67312j18139O88783L10801o50180o74249
44828B223901J32491L05788m19269o55303K73720J153066P43393m15754r45389
44819B396644n25180O2119K60647K02129L8438l42500q02717p90578n4818Q18265
$$ plain form
44809 1262449 2267427 2728122 2637898 2446091 2264316 1809366 1088114 597698 683392 1163628
44799 1163628 1792517 2583794 3387235 3730779 3565962 3610632 4296147 4874098 4416841 3351130
44789 3351130 2990655 3659005 4314316 4137487 3490313 3023140 2780903 2656752 2925379
44780 2925379 3734628 4642947 5184228 5413279 5481898 5241114 4747149 4586160 5103445 5808162
44770 5808162 6172072 6538013 7504787 8841802 9914722 10948073 12864526 15824642 18871776
44761 18871776 21325288 23739274 27008784 31120064 35374504 39469716 43666537 47922071
44753 47922071 51440620 53318495 53325308 51800086 48990911 44871956 39634811 34014053
44745 34014053 28893299 24729075 21504137 19015302 16947917 14908071 12796408 11009656
$$ packed form
44809A262449J004978M60695r0224j91807j81775m54950p21252m90416Q5694M80236
44799A163628O28889P91277Q03441L43544j64817M4670O85515N77951m57257j065711
44789C351130l60475O68350O55311j76829o47174m67173k42237j24151K68627
44780B925379Q09249R08319N41281K29051O8619k40784m93965j60989N17285P04717
44770E808162L63910L65941R66774J337015J072920J033351J916453K960116L047134
44761A8871776K453512K413986L269510M111280M254440M095212M196821M255534
44753D7922071L518549J877875O813j525222k809175m118955n237145n620758
44745C4014053n120754m164224l224938k488835k067385k039846k111663j786752
$$ plain form
44737 11009656 9819446 8718527 7049320 5259345 4664734 5634480 6815796 6762077 5692414
44728 5692414 4888452 4836941 4880442 4471843 3817343 3229790 2683417 2202964 1973584 1805501
44718 1805501 1168876 138892 -310137 487764 1789518 2166051 1179293 -162423 -567313
44709 -567313 346835 1981738 3387536 3812346 3061035 1693734 722669 763340 1461850
44700 1461850 1984998 2061334 2223163 2922711 3789991 4094306 3677744 2985954 2329060 1670159
44690 1670159 1143459 1131549 1579102 1795854 1338172 640347 332253 348950 262878 142927
44680 142927 390339 893510 1081627 848843 752331 1114565 1498455 1364732 849635 583772
44670 583772 958301 1750877 2313993 2094412 1198301 432602 485566 1093020 1399552 1133107
$$ packed form
44737A1009656j190210j100919j669207j789975n94611R69746J181316n3719j069663
44728E692414q03962n1511M3501m08599o54500n87553n46373m80453k29380j68083
44718A805501o36625j029984m49029P97901J301754L76533r86758j341716m04890
44709e67313R14148J634903J405798M24810p51311j367301r71065M0671O98510
44700A461850N23148P6336J61829O99548Q67280L04315m16562o91790o56894o58901
44690A670159n26700j1910M47553K16752m57682o97825l08094J6697q6072j19951
44680A42927K47412N03171J88117k32784r6512L62234L83890j33723n15097k65863
44670E83772L74529P92576N63116k19581q96111p65699N2964O07454L06532k66445
$$ plain form
44660 1133107 920757 1322606 2074283 2558136 2607248 2524046 2616812 3004769 3602560 4034765
44650 4034765 3843791 3056326 2295282 2078320 2256498 2379544 2311225 2184473 2040429 1876216
44640 1876216 1831916 1975888 2085014 1969615 1842689 2036434 2506789 2924263 3087897 2959728
44630 2959728 2510224 1868421 1393419 1216886 966708 393439 -6643 397277 1300944
44621 1300944 1710505 1278624 720521 741158 1158319 1360733 1148062 811725 739232 1173525
44611 1173525 2045835 2883356 3222881 3213190 3360763 3580072 3133702 1833700 644283
44602 644283 511940 1072107 1189925 479206 -407801 -827428 -788425 -596823 -506393 -768456
44592 -768456 -1433203 -2001367 -1845974 -1137253 -780430 -1188995 -1672774 -1424371 -649001 -212912
$$ packed form
44660A133107k12350M01849P51677M83853M9112q3202R2766L87957N97791M32205
44650D034765j90974p87465p61044k16962J78178J23046o8319j26752j44044j64213
44640A876216m4300J43972J09126j15399j26926J93745M70355M17474J63634j28169
44630B959728m49504o41803m75002j76533k50178n73269m00082M03920R03667
44621A300944M09561m31881n58103K0637M17161K02414k12671l36337p2493M34293
44611A173525Q72310Q37521L39525r691J47573K19309m46370j300002j189417
44602F44283j32343N60167J17818p10719q87007m19627L9003J91602R0430k62063
44592g68456o64747n68164J55393P08721L56823m08565m83779K48403P75370M36089
$$ plain form
44582 -212912 -457547 -878636 -854972 -243210 708228 1632459 2193627 2284728 2150561 2095782
44572 2095782 2062102 1728119 1024247 273743 -212753 -389503 -251329 288115 1067310 1517545
44562 1517545 1200853 416192 -50418 216559 892102 1372154 1322850 759514 -54016 -612751
44552 -612751 -415640 459381 1205851 1075058 240264 -457711 -565318 -400499 -348145 -269904
44542 -269904 119259 670265 971720 873698 497830 -55999 -607679 -681226 79180 1253965
44532 1253965 1876975 1469764 536881 -57508 87886 741808 1322863 1284400 617255 52416
44522 52416 301688 992564 971045 -67120 -964030 -675529 192462 270740 -573347 -1140632
44512 -1140632 -676502 300097 1059953 1527136 1722729 1316649 364047 -277997 -30249
$$ packed form
44582b12912k44635m21089K3664O11762R51438R24231N61168R1101j34167n4779
44572B095782l3680l33983p03872p50504m86496j76750J38174N39444P79195M50235
44562A517545l16692p84661m66610K66977O75543M80052m9304n63336q13530n58735
44552f12751J97111Q75021P46470j30793q34794o97975j07607J64819N2354P8241
44542b69904L89163N51006L01455r8022l75868n53829n51680p3547P60406J174785
44532A253965O23010m07211r32883n94389J45394O53922N81055l8463o67145n64839
44522E2416K49272O90876k1519j038165q96910K88501Q67991P8278q44087n67285
44512a140632M64130R76599P59856M67183J95593m06080r52602o42044K47748
$$ plain form
44503 -30249 494717 470902 244422 741208 1783267 2158814 1449388 665867 674176 983634
44493 983634 760111 231825 180858 560815 681355 585715 1117389 2380398 3147730 2447139
44483 2447139 1074677 701467 1741363 2917060 2990919 2219909 1766470 2130311 2643036
44474 2643036 2401673 1345363 333449 295452 1352976 2742814 3576768 3599802 3135398
44465 3135398 2466728 1603146 659456 57896 108617 614078 1095187 1210732 809582 -75018
44455 -75018 -946977 -906993 444628 2266278 3186114 2801352 2002739 1743835 1987487 2040880
44445 2040880 1454778 308400 -1008923 -1976122 -2219330 -1956439 -1905715 -2402600 -2835234
44436 -2835234 -2355344 -1007186 256092 635651 215662 -360874 -605466 -486764 -260946
$$ packed form
44503c0249N24966k3815k26480M96786J042059L75547p09426p83521Q309L09458
44493I83634k23523n28286n0967L79957J20540r5640N31674J263009P67332p00591
44483B447139j372462l73210J039896J175697P3859p71010m53439L63841N12725
44474B643036k41363j056310j011914l7997J057524J389838Q33954K3034m64404
44465C135398o68670q63582r43690o01560N0721N05461M81109J15545m01150q84600
44455g5018q71959L9984J351621J821650R19836l84762p98613k58904K43652N3393
44445B040880n86102j146378j317323r67199k43208K62891N0724m96885m32634
44436b835234M79890J348158J263278L79559m19989n76536k44592J18702K25818
$$ plain form
44427 -260946 -143008 -99742 37104 268782 418483 494036 776339 1312023 1604468 1214613
44417 1214613 494640 223539 539898 777331 509195 233103 643206 1577236 2203908
44408 2203908 2158445 1959923 2129118 2322346 1776669 470609 -659726 -784375 -26100
44399 -26100 1012231 2099057 3219103 3929768 3721202 3017178 2910760 3581079 3801310
44390 3801310 2582516 611304 -675650 -908358 -857526 -1116995 -1633116 -2279441 -2913099
44381 -2913099 -2959464 -1946773 -512036 96005 -335505 -784301 -613746 -323054 -339786
44372 -339786 -229986 249393 417073 -99637 -346598 599413 1964977 2260894 1481541
44363 1481541 960469 1221147 1397854 933918 472566 575734 740242 396115 -67747
$$ packed form
44427b60946J17938M3266J36846K31678J49701P5553K82303N35684K92445l89855
44417A214613p19973k71101L16359K37433k68136k76092M10103R34030O26672
44408B203908m5463j98522J69195J93228n45677j306060j130335j24649P58275
44399b6100J038331J086826J120046P10665k08566p04024j06418O70319K20231
44390C801310j218794j971212j286954k32708N0832k59469n16121o46325o33658
44381b913099m6365J012691J434737O08041m31510m48796J70555K90692j6732
44372c39786J09800M79379J67680n16710k46961R46011J365564K95917p79353
44363A481541n21072K60678J76707m63936m61352J03168J64508l44127m63862
$$ plain form
44354 -67747 -114148 -135486 -722285 -1328432 -779873 934865 2360617 2332304 1342541 769228
44344 769228 1209138 2035275 2360248 1953324 1188176 471823 -34131 -284453 -252230 -42847
44334 -42847 104437 115619 257830 776800 1434902 1741388 1674105 1763246 2234655 2470677
44324 2470677 1798066 606908 63798 611557 1322122 1073409 -60239 -1060325 -1295763
44315 -1295763 -983748 -448733 308215 1088306 1260835 566074 -325011 -635330 -500130
44306 -500130 -511811 -580338 -118969 750840 1189106 1010495 1059019 1766986 2297274 1840850
44296 1840850 959479 699851 982263 970133 653971 817587 1485908 1666748 930396 162889
44286 162889 248108 857138 1103112 707525 -17200 -708977 -941085 -305529 860877 1415421
$$ packed form
44354f7747m6401k1338n86799o06147N48559J714738J425752k8313r89763n73313
44344G69228M39910Q26137L24973m06924p65148p16353n05954k50322L2223K09383
44334d2847J47284J1182J42211N18970O58102L06486o7283Q9141M71409K36022
44324B470677o72611j191158n43110N47759P10565k48713j133648j000086k35438
44315a295763L12015N35015P56948P80091J72529o94761q91085l10319J35200
44306e00130j1681o8527M61369Q69809M38266j78611M8524P07967N30288m56424
44296A840850q81371k59628K82412j2130l16162J63616O68321J80840p36352p67507
44286A62889Q5219O09030K45974l95587p24725o91777k32108O35556J166406N54544
$$ plain form
44276 1415421 771759 -197189 -360022 104316 251422 25441 214476 918713 1273225
44267 1273225 847238 247828 64059 214361 660996 1670992 2796912 2686099 819309
44258 819309 -1374188 -2152283 -1579526 -940274 -614447 90654 1216578 1765042 1287947
44249 1287947 568390 242198 -92124 -730045 -923539 -57751 1040740 1109957 307053
44240 307053 -75401 457205 1059159 996398 652156 790452 1548236 2478151 3047670 2871836
44230 2871836 1978519 1047677 860143 1301261 1448434 854236 132219 -26692 234395
44221 234395 449271 625342 937307 1139126 969976 772683 1006173 1445758 1610870 1729635
44211 1729635 2398231 3351858 3510037 2435664 946501 -15003 -392192 -528160 -387778
$$ packed form
44276A415421o43662r68948j62833M64338J47106k25981J89035P04237L54512
44267A273225m25987n99410j83769J50302M46635J009996J125920j10813j866790
44258H19309k193497p78095N72757O39252L25827P05101J125924N48464m77095
44249A287947p19557l26192l34322o37921j93494Q65788J098491O9217q02904
44240C07053l82454N32606O01954o2761l44242J38296P57784R29915N69519j75834
44230B871836q93317r30842j87534M41118J47173n94198p22017j58911K61087
44221B34395K14876J76071L11965K01819j69150j97293K33490M39585J65112J18765
44211A729635O68596R53627J58179j074373j489163r61504l77189j35968J40382
$$ plain form
44202 -387778 156450 778968 1089003 1252313 1637695 2081061 2094494 1649919 1147438 687328
44192 687328 36817 -622463 -623297 200497 1015836 925477 45110 -759716 -884694 -293845
44182 -293845 821278 2031404 2524655 1799888 593698 300981 1163028 1816212 1166588
44173 1166588 -33531 -290510 524601 1244107 1312152 1400992 1961643 2323114 1809983 925247
44163 925247 703585 1360936 2172482 2368681 1744443 732137 176278 571723 1244640
44154 1244640 928781 -462474 -1443865 -946526 189358 641887 671149 1401749 2594040
44145 2594040 2792545 1687027 720255 940372 1629485 1688206 1196209 819928 664427
44136 664427 607087 979366 1942869 2746189 2573020 1785414 1434956 1752350 1950669 1441654
$$ packed form
44202c87778N44228O22518L10035J63310L85382M43366J3433m44575n02481m60110
44192F87328o50511o59280q34Q23794Q15339r0359q80367q04826j24978N90849
44182b93845J115123J210126M93251p24767j206190k92717Q62047O53184o49624
44173A166588j200119k56979Q15111P19506O8045Q8840N60651L61471n13131q84736
44163I25247k21662O57351Q11546J96199o24238j012306n55859L95445O72917
44154A244640l15859j391255r81391M97339J135884M52529K9262P30600J192291
44145B594040J98505j105518r66772K20117O89113N8721m91997l76281j55501
44136F64427n7340L72279R63503Q03320j73169p87606l50458L17394J98319n09015
$$ plain form
44126 1441654 510161 -220416 -352226 291495 1610682 2983065 3544670 2994278 1916721
44117 1916721 1175126 1124767 1474588 1772189 1917885 2169632 2621372 2832456 2271514 1121034
44107 1121034 258581 291280 936855 1530046 1794505 1872407 1902330 1873752 1724105 1391079
44097 1391079 947010 743214 1092652 1708031 1855474 1233459 308130 -361377 -659050
44088 -659050 -622097 -203670 392707 714496 716491 834350 1109161 989996 451961 425751
44078 425751 1355496 2126628 1454733 -195622 -1159906 -711761 374867 1155306 1368484
44069 1368484 1102508 639871 629158 1481430 2592655 3029283 2882626 2940141 3101089 2360678
44059 2360678 569548 -1035221 -1515807 -1346950 -1266272 -1057198 -278137 641182 999869
$$ packed form
44126A441654r31493p30577j31810O43721J319187J372383N61605n50392j077557
44117A916721p41595n0359L49821K97601J45696K51747M51740K11084n60942j150480
44107A121034q62453L2699O45575N93191K64459P7902K9923k8578j49647l33026
44097A391079m44069k03796L49438O15379J47443o22015r25329o69507k97673
44088f59050L6953M18427N96377L21789J995J17859K74811j19165n38035k6210
44078D25751R29745P71132o71895j650355r64284M48145J086628P80439K13178
44069A368484k65976m62637j0713Q52272J111225M36628j46657N7515J60948p40411
44059B360678j791130j604769m80586J68857Q0678K09074P79061R19319L58687
$$ plain form
44050 999869 1008651 1443997 2366331 2982954 2746325 1993216 1440541 1439389 1797360 2113009
44040 2113009 2200389 2178266 2126692 1880204 1431726 1274024 1827219 2706644 3191634 3278142
44030 3278142 3476591 3647530 3073065 1880020 1287057 1922575 2860489 2983036 2434168
44021 2434168 1946202 1529331 817304 150360 249814 1071031 1867821 2208830 2160557 1721870
44011 1721870 954599 517213 1105172 2277567 2704555 1835060 629181 314854 964417
44002 964417 1687282 1866983 1786476 2109814 2997257 3829542 3841040 2975585 1916961 1253823
43992 1253823 946875 745150 674198 771116 742274 376819 36383 228024 864878 1431821
43982 1431821 1743826 2044469 2421401 2605737 2395311 1937250 1557642 1513992 1823499 2151711
$$ packed form
44050I99869Q782M35346R22334O16623k36629p53109n52675j152L57971L15649
44040B113009Q7380k2123n1574k46488m48478j57702N53195Q79425M84990Q6508
44030C278142J98449J70939n74465j193045n92963O35518R37914J22547n48868
44021B434168m87966m16871p12027o66944R9454Q21217P96790L41009m8273m38687
44011A721870p67271m37386N87959J172395M26988q69495j205879l14327O49563
44002I64417P22865J79701q0507L23338Q87443Q32285J1498q65455j058624o63138
43992A253823l06948k01725p0952R6918k8842l65455l40436J91641O36854N66943
43982A431821L12005L00643L76932J84336k10426m58061l79608m3650L09507L28212
$$ plain form
43972 2151711 2060807 1560903 1131503 985571 753708 273335 191250 1162306 2775517 3927259
43962 3927259 4056902 3446793 2578441 1856929 1713487 2196437 2589241 2211170 1507628
43953 1507628 1521782 2313721 2821753 2434621 1776269 1586481 1659037 1425528 956338 730814
43943 730814 751275 490126 -310301 -1132066 -1098443 86198 1643691 2438681 2320893 2277786
43933 2277786 2875330 3214876 2286993 801151 376618 1080309 1258119 107450 -1051620
43924 -1051620 -790444 393267 1056841 893739 716267 999238 1565231 2335549 3344667
43915 3344667 4196169 4391908 4064696 3638940 3019278 1960072 992436 959461 1656648
43906 1656648 1966114 1502518 1125158 1469921 1926054 1672153 979351 715870 1019669
$$ packed form
43972B151711r0904m99904m29400j45932k31863m80373q2085R71056J613211J151742
43962C927259J29643o10109q68352p21512j43442M82950L92804l78071p03542
43953A507628J4154P91939N08032l87132o58352j89788P2556k33509m69190k25524
43943G30814K0461k61149q00427q21765L3623J184641J557493P94990j17788m3107
43933B277786N97544L39546r27883j485842m24533P03691J77810j150669j159070
43924a051620K61176J183711O63574j63102j77472K82971N65993P70318J009118
43915C344667Q51502J95739l27212m25756o19662j059206r67636l2975O97187
43906A656648L09466m63596l77360L44763M56133k53901o92802k63481L03799
$$ plain form
43897 1019669 1260710 1118407 952335 1087787 1370726 1623484 2053413 2879858 3824346
43888 3824346 4311083 4091678 3426434 2687564 2021990 1436445 978272 680112 457273
43879 457273 233930 119448 299676 752703 1211146 1460010 1585930 1833609 2193505 2224217
43869 2224217 1487278 252678 -498293 -129145 765980 1087684 812361 1057511 2266717
43860 2266717 3228785 2702564 1354792 959076 1940050 2913135 2729647 1820391 1169408
43851 1169408 1007544 1092271 1404530 1845406 1893746 1318007 766478 957194 1650532 2058848
43841 2058848 1918668 1516462 1010029 464259 306306 940062 1975582 2563199 2493849
43832 2493849 2296096 2234717 1996607 1608126 1914233 3566018 5887898 7329449 7024677
$$ packed form
43897A019669K41041j42303j66072J35452K82939K52758M29929Q26445R44488
43888C824346M86737k19405o65244p38870o65574n85545m58173k98160k22839
43879D57273k23343j14482J80228M53027M58443K48864J25920K47679L59896L0712
43869B224217p36939j234600p50971L69148Q95125L21704k75323K45150J209206
43860B266717R62068n26221j347772l95716R80974R73085j83488r09256o50983
43851A169408j61864Q4727L12259M40876M8340n75739n51529J90716O93338M08316
43841B058848j40180m02206n06433n45770j57953O33756J035520N87617o9350
43832B493849j97753o1379k38110l88481L06107J651785K321880J441551l04772
$$ plain form
43823 7024677 5557296 4156174 3449164 3203044 3068283 3121347 3499158 3890998 3864502
43814 3864502 3548795 3469735 3713837 3799962 3459030 2960558 2511230 1969960 1425611 1363896
43804 1363896 1822719 2037382 1501163 809851 806913 1400037 1935090 2274040 2693382 3088827
43794 3088827 3155043 3105139 3354099 3685099 3593518 3284827 3407825 3908737 4140087 4093686
43784 4093686 4467805 5351249 5877167 5511429 4775626 4329149 4189238 4248543 4699633 5442589
43774 5442589 5853175 5689150 5513776 5668082 5569710 4723787 3755908 3600359 4127709 4413544
43764 4413544 4063937 3509386 3205564 3242039 3562667 3923340 3808629 3043557 2327421 2470169
43754 2470169 3201535 3469888 2926626 2363308 2509089 3079635 3352032 3176577 3013912
$$ packed form
43823G024677j467381j401122p07010k46120j34761N3064L77811L91840k6496
43814C864502l15707p9060K44102Q6125l40932m98472m49328n41270n44349o1715
43804A363896M58823K14663n36219o91312k938N93124N35053L38950M19342L95445
43794C088827O6216m9904K48960L31000r1581l08691J22998N00912K31350m6401
43784D093686L74119Q83444N25918l65738p35803m46477j39911N9305M51090P42956
43774E442589M10586j64025j75374J54306r8372q45923r67879j55549N27350K85835
43764D413544l49607n54551l03822L6475L20628L60673j14711p65072p16136J42748
43754B470169P31366K68353n43262n63318J45781N70546K72397j75455j62665
$$ plain form
43745 3013912 3240929 3732669 4004260 3629707 2667225 1714773 1348228 1515329 1761685
43736 1761685 2017289 2703687 3904822 4882571 4798985 3719887 2578136 2231283 2769786
43727 2769786 3625101 4106569 3903500 3296460 2869907 2903112 3171643 3481432 4082220 5123308
43717 5123308 5938669 5601557 4298826 3392220 3704655 4448716 4526298 4249130 4716346
43708 4716346 5831759 6291394 5699479 5322717 6103206 7127956 7094137 6370860 6305636
43699 6305636 7028484 7361853 6759358 5972958 5656515 5549091 5375325 5417700 5693644 5582118
43689 5582118 4908011 4504116 4921174 5324232 4591528 3026934 2046686 2392758 3472962
43680 3472962 4368802 4751178 4764409 4650307 4675602 5010863 5492857 5745422 5642747 5499672
$$ packed form
43745C013912K27017M91740K71591l74553r62482r52452l66545J67101K46356
43736A761685K55604O86398J201135R77749q3586j079098j141751l46853N38503
43727B769786Q55315M81468k03069o07040m26553L3205K68531L09789O00788J041088
43717E123308Q15361l37112j302731r06606L12435P44061P7582k77168M67216
43708D716346J115413M59635n91915l76762P80489J024750l3819p23277o5224
43699F305636P22848L33369o02495p86400l16443j07424j73766M2375K75944j11526
43689E582118o74107m03895M17058M03058p32704j564594r80248L46072J080204
43680C472962Q95840L82376J3231j14102K5295L35261M81994K52565j02675j43075
$$ plain form
43670 5499672 5731099 6357461 6844019 6530128 5405073 4339430 4196266 4793309 5212401
43661 5212401 5061894 4771825 4617598 4332232 3974580 4228340 5241858 6022658 5784132
43652 5784132 5186040 5325163 6095385 6571841 6518042 6346765 5951265 4920045 3826588
43643 3826588 3892626 5113587 6025904 5828994 5533837 6248593 7339875 7330796 6015852
43634 6015852 4627040 4154869 4442396 4919737 5393119 5842083 6013205 5648948 4931211
43625 4931211 4390101 4374267 4761277 5202609 5500948 5641026 5610841 5476778 5576431 6216626
43615 6216626 7088389 7489712 7384070 7637301 8682500 9532095 8962825 7354348 6385266
43606 6385266 6986056 8541662 10136662 11517850 12557402 12885513 12737652 13351241 15688407
$$ packed form
43670E499672K31427O26362M86558l13891j125055j065643j43164N97043M19092
43661E212401j50507k90069j54227k85366l57652K53760J013518P80800k38526
43652E784132n98092J39123P70222M76456n3799j71277l95500j031220j093457
43643C826588O6038J220961R12317j96910k95157P14756J091282r079j314944
43634F015852j388812m72171K87527M77341M73382M48964J71122l64257p17737
43625D931211n41110j5834L87010M41332K98339J40078l0185j34063R9653O40195
43615F216626Q71763M01323j05642K53231J045199Q49595n69270j608477r69082
43606F385266O00790J555606J595000J381188J039552L28111j47861O13589K337166
$$ plain form
43597 15688407 19211016 22604117 25379459 28201144 31987292 37268738 44026081 51314057
43589 51314057 57081615 59138487 56720354 51010146 44114578 37615065 31928625 26791737
43581 26791737 22250243 18981940 17373642 16557755 15124954 12870009 10967158 10125004
43573 10125004 9591360 8628334 7884305 8144464 8558997 7690988 5986486 5475801 6810556
43564 6810556 8211433 7995874 6759026 6067628 6073604 5680696 4474482 3218676 2605293
43555 2605293 2553264 2756545 3064630 3234169 3066417 2945865 3551089 4793457 5647959
43546 5647959 5351069 4288696 3401046 3155524 3427904 3940735 4362422 4307048 3754108
43537 3754108 3292804 3483786 4101286 4467716 4447021 4569323 5113397 5601680 5464600 4836201
$$ packed form
43597A5688407L522609L393101K775342K821685L786148N281446O757343P287976
43589E1314057N767558K056872k418133n710208o895568o499513n686440n136888
43581B6791737m541494l268303j608298q15887j432801k254945j902851q42154
43573A0125004n33644r63026p44029K60159M14533q68009j704502n10685J334755
43564F810556J400877k15559j236848o91398N976l92908j206214j255806o13383
43555B605293n2029K03281L08085J69539j67752j20552O05224J242368Q54502
43546E647959k96890j062373q87650k45522K72380N12831M21687n5374n52940
43537C754108m61304J90982O17500L66430k0695J22302N44074M88283j37080o28399
$$ plain form
43527 4836201 4366816 4443222 4881250 5306569 5599931 5909704 6289127 6413776 5860444 4799766
43517 4799766 4139178 4572449 5633520 6245593 6197172 6373921 7299233 8207649 8134366 7329628
43507 7329628 6813400 6887045 6971701 6816775 6948307 7703376 8563318 8833121 8485115 7975428
43497 7975428 7641646 7654514 8198350 9210611 10098569 10172236 9403749 8465041 7926276 7643953
43487 7643953 7140195 6482837 6421505 7384135 8590146 8745880 7716319 6857947 7289433
43478 7289433 8432686 8942134 8591893 8281573 8389166 8274083 7625874 7215997 7715950
43469 7715950 8565432 8765082 8299041 8014988 8344203 8838636 8950666 8721662 8547383
43460 8547383 8561627 8465308 7983872 7414016 7445842 8221176 8892389 8630633 7828969 7560265
$$ packed form
43527D836201m69385P6406M38028M25319K93362L09773L79423J24649n53332j060678
43517D799766o60588M33271J061071O12073m8421J76749R25312R08416p3283q04738
43507G329628n16228P3645Q4656j54926J31532P55069Q59942K69803l48006n09687
43497G975428l33782J2868N43836J012261Q87958P3667p68487r38708n38765k82323
43487G643953n03758o57358o1332R62630J206011J55734j029561q58372M31486
43478G289433J143253N09448l50241l10320J07593j15083o48209m09877M99953
43469G715950Q49482J99650m66041k84053L29215M94433J12030k29004j74279
43460H547383J4244r6319m81436n69856L1826P75334O71213k61756q01664k68704
$$ plain form
43450 7560265 7953030 8082332 7627823 7535574 8505186 9810551 10392333 10319967 10313342 10514061
43440 10514061 10695924 11110318 12049250 12975671 13161213 12873011 12844509 12879341 12247579 11330397
43430 11330397 11441271 12799609 14042919 14226707 14081867 14623386 15610381 16256300 16581631
43421 16581631 17053261 17517083 17572576 17651235 18648540 20553690 22384452 23585333 24664392
43412 24664392 26194558 27929465 29390427 30802312 32788683 35327975 37680590 39480687
43404 39480687 41339858 43995214 47277723 50522783 53788360 57859747 62927211 68129255
43396 68129255 72892192 77936751 84132254 90897735 96782039 101421501 105857233 110831413
43388 110831413 115713947 119331025 121017294 120599527 118195700 114432928 110122937 105286413
$$ packed form
43450G560265L92765J29302m54509r2249R69612J305365N81782p2366o625K00719
43440A0514061J81863M14394R38932R26421J85542k88202k8502L4832o31762r17182
43430A1330397J10874J358338J243310J83788j44840N41519R86995O45919L25331
43421A6581631M71630M63822N5493P8659R97305J905150J830762J200881J079059
43412B4664392J530166J734907J460962J411885J986371K539292K352615J800097
43404C9480687J859171K655356L282509L245060L265577M071387N067464N202044
43396F8129255M762937N044559O195503O765481N884304M639462M435732M974180
43388A10831413M882534L617078J686269m17767k403827l762772m309991m836524
$$ plain form
43380 105286413 99183075 91752078 84306829 78217722 73494436 69241225 64929990 60597299
43372 60597299 56355130 52444493 49314294 46909667 44318640 40915871 37447405 35088786
43364 35088786 33752692 32309648 30264166 28135659 26259478 24417208 22864189 22510928
43356 22510928 23494313 24497148 24220373 22898776 21684112 21076007 20706799 20277246 19886053
43347 19886053 19574806 19266920 19168042 19618257 20436404 20915074 20665745 20104088 19873435
43338 19873435 20048853 20175569 19982549 19800113 20171246 21109217 21881781 21679341 20482321
43329 20482321 19076766 18178430 17826899 17797282 18213526 19260763 20457899 20858991 20157387
43320 20157387 19101883 18535470 18451646 18398818 18401857 18809433 19375650 19292764 18368774 17507517
$$ packed form
43380A05286413o103338p430997p445249o089107m723286m253211m311235m332691
43372F0597299m242169l910637l130199k404627k591027l402769l468466k358619
43364C5088786j336094j443044k045482k128507j876181j842270j553019l53261
43356B2510928R83385J002835k76775j321597j214664o08105l69208m29553l91193
43347A9886053l11247l07886r8878M50215Q18147M78670k49329n61657k30653
43338A9873435J75418J26716j93020j82436L71133R37971P72564k02440j197020
43329B0482321j405555q98336l51531k9617M16244J047237J197136M01092p01604
43320B0157387j055504n66413q3824n2828L039M07576N66217q2886r23990q61257
$$ plain form
43310 17507517 17549814 18113309 18198429 17672789 17425046 18033122 18982725 19490916 19559041 19745923
43300 19745923 20221169 20586555 20574954 20452083 20593094 20988720 21401681 21830900 22518082
43291 22518082 23464818 24203737 24284919 23920944 23861063 24509722 25401246 25771006 25495788 25193102
43281 25193102 25456820 26259393 27065933 27272236 26588588 25323324 24274056 23985240 24122593
43272 24122593 23987639 23602983 23658058 24251311 24483027 23791035 22987542 23178776 24123149
43263 24123149 24620783 24330942 24147208 24649875 25218947 25129750 24665460 24468674 24442097 24137670
43253 24137670 23840092 24302116 25461932 26342912 26460270 26547453 27446440 28899264 30060418
43244 30060418 30793302 31697673 32985446 34131457 34825684 35589627 37029469 38964851 40840111
$$ packed form
43310A7507517M2297N63495Q5120n25640k47743O08076R49603N08191O8125J86882
43300A9745923M75246L65386j1601j22871J41011L95626M12961M29219O87182
43291B2518082R46736P38919Q1182l63975n9881O48659Q91524L69760k75218l02686
43281B5193102K63718Q02573Q06540K06303o83648j265264j049268k88816J37353
43272B4122593j34954l84656N5075N93253K31716o91992q03493J91234R44373
43263B4123149M97634k89841j83734N02667N69072q9197m64290j96786k6577l04427
43253B4137670k97578M62024J159816Q80980J17358Q7183Q98987J452824J161154
43244C0060418P32884R04371J287773J146011O94227P63943J439842J935382J875260
$$ plain form
43235 40840111 42698679 45117875 48239545 51477767 54351611 57143610 60480501 64596425
43227 64596425 69281753 74300494 79561654 85060619 90955504 97584957 105091223 113033545
43219 113033545 120620552 127340084 133157947 138103309 141932085 144336930 145306692 145063705
43211 145063705 143677207 140929659 136675959 131279709 125568401 120293791 115665741 111431936
43203 111431936 107326662 103354680 99716200 96632479 94277993 92722048 91796108 91058379
43195 91058379 90045140 88686372 87474257 87071338 87604290 88415792 88703671 88345384 87813239
43186 87813239 87318894 86506681 85146857 83606556 82247943 80820123 78999753 77160729
43178 77160729 75884553 74898353 73296864 70833372 68243736 66178741 64532018 62986236
$$ packed form
43235D0840111J858568K419196L121670L238222K873844K791999L336891M115924
43227F4596425M685328N018741N261160N498965N894885O629453P506266P942322
43219A13033545P587007O719532N817863M945362L828776K404845R69762k42987
43211A45063705j386498k747548m253700n396250n711308n274610m628050m233805
43203A11431936m105274l971982l638480l083721k354486j555945r25940p37729
43195I1058379j013239j358768j212115m02919N32952Q11502K87879l58287n32145
43186H7813239m94345q12213j359824j540301j358613j427820j820370j839024
43178G7160729j276176r86200j601489k463492k589636k064995j646723j545782
$$ plain form
43170 62986236 61462023 59739392 57409201 54666903 52486104 51438387 50876964 49858157
43162 49858157 48376712 47077291 46210346 45592006 45238684 45240114 45182618 44485489 43306648
43153 43306648 42454414 42362664 42750902 43353944 44345677 45779695 47085302 47507031 46906253
43144 46906253 45925025 45370888 45440501 45522588 44884693 43595694 42519809 42280736 42579930
43135 42579930 42781698 42781166 42883649 43140400 43320166 43378007 43472140 43594738 43598945 43548167 43704599
43124 43704599 44215524 45039418 46042258 46961616 47506036 47713674 47927074 48206022 48171740
43115 48171740 47693286 47211312 47011039 46743730 46126332 45475094 44970316 44107083 42631681
43106 42631681 41291350 40705742 40204372 38940362 37502119 37004497 37065690 36332672 34823579
$$ packed form
43170F2986236j524213j722631k330191k742298k180799j047717n61423j018807
43162D9858157j481445j299421q66945o18340l53322J430n7496o97129j178841
43153D3306648q52234r1750L88238O03042R91733J434018J305607M21729o00778
43144D6906253r81228n54137O9613Q2087o37895j288999j075885k39073K99194
43135D2579930K01768n32J02483K56751J79766N7841R4133J22598M207n0778J56432
43124D3704599N10925Q23894J002840R19358N44420K07638K13400K78948l4282
43115D8171740m78454m81974k00273k67309o17398o51238n04778q63233j475402
43106D2631681j340331n85608n01370j264010j438243m97622O1193p33018j509093
$$ plain form
43097 34823579 34000128 34389277 34859571 34642696 34410706 34728198 34987390 34708878 34536266
43088 34536266 35007520 35535859 35583281 35752138 36664079 37705711 37966200 37630047 37432652
43079 37432652 37482172 37591823 38007269 38774082 39141914 38719203 38525129 39680732 41632167
43070 41632167 42915679 43175596 43105430 42820498 41792567 40285968 39393584 39450883 39630462
43061 39630462 39383313 39219837 39721977 40695127 41706371 42764022 44085808 45670294 47305202
43052 47305202 48625915 49180171 48885597 48333785 48164624 48324150 48470076 48793383 49703960
43043 49703960 50971595 52046876 53080224 54722082 56993386 59279721 61428405 63902370
43035 63902370 66803819 69741861 72827625 76802315 81869210 87295250 92549334 98052678
$$ packed form
43097C4823579q23451L89149M70294k16875k31990L17492K59192k78512j72612
43088C4536266M71254N28339M7422J68857R11941J041632K60489l36153j97395
43079C7432652M9520J09651M15446P66813L67832m22711j94074J155603J951435
43070D1632167J283512K59917p0166k84932j027931j506599q92384N7299J79579
43061C9630462k47149j63476N02140R73150J011244J057651J321786J584486J634908
43052D7305202J320713N54256k94574n51812j69161J59526J45926L23307R10577
43043D9703960J267635J075281J033348J641858K271304K286335K148684K473965
43035F3902370K901449K938042L085764L974690N066895N426040N254084N503344
$$ plain form
43027 98052678 104422828 111695429 119691870 128523479 138338996 149059522 160560553 172535559
43019 172535559 184029546 193786368 201250842 206552795 209397436 208878991 204738121 197984583
43011 197984583 189875848 181037361 171946442 163391508 155854152 149107823 142916146 137445082
43003 137445082 132584007 127755815 123018026 119475280 117832998 117372608 117268528 118135375
42995 118135375 121123930 126033731 131595210 137419258 144507797 153831224 165395716 178799833
42987 178799833 193804140 210120055 227290100 244895650 262265639 277897798 289802611
42980 289802611 296606625 297923564 293788814 284490946 271080538 255287643 238544740
42973 238544740 221504646 204675306 188917727 174897811 162446188 150932310 140139314
$$ packed form
43027I8052678O370150P272601P996441Q831609R815517J0720526J1501031J1975006
43019A72535559J1493987R756822P464474N301953K844641n18445m140870o753538
43011A97984583q108735q838487r090919q554934p537356o746329o191677n471064
43003A37445082m861075m828192m737789l542746j642282m60390j04080Q66847
42995A18135375K988555M909801N561479N824048P088539R323427J1564492J3404117
42987A78799833J5004307J6315915J7170045J7605550J7369989J5632159J1904813
42980B89802611O804014J316939m134750r297868j3410408j5792895j6742903
42973B38544740j7040094j6829340j5757579j4019916j2451623j1513878j0792996
$$ plain form
42966 140139314 130478671 122416580 115865902 110127971 104454898 98798486 93904015 90397050
42958 90397050 87878797 85342213 82475873 80012647 78583153 77768786 76751010 75529042
42950 75529042 74864160 75089256 75582561 75598928 75140387 74677526 74387914 74173764 74241122 75005378
42940 75005378 76288951 77215816 77292565 77147960 77672583 78736888 79418808 79376637 79269468
42931 79269468 79714559 80516938 81230286 81907617 82847605 83952266 84773642 85036407 84858532
42922 84858532 84633946 84847980 85730629 86926746 87820474 88335489 89021505 90159481 91244780
42913 91244780 91623560 91137748 89800329 87422986 84126996 80737422 77992614 75696207
42905 75696207 73297401 70947884 69192597 67881217 66331931 64554581 63377403 63160004
$$ packed form
42966A40139314r660643q062091o550678n737931n673073n656412m894471l506965
42958I0397050k518253k536584k866340k463226j429494q14367j017776j221968
42950G5529042o64882K25096M93305J6367m58541m62861k89612k14150O7358P64256
42940G5005378J283573R26865P6749j44605N24623J064305O81920m2171j07169
42931G9269468M45091Q02379P13348O77331R39988J104661Q21376K62765j77875
42922H4858532k24586K14034Q82649J196117Q93728N15015O86016J137976J085299
42913I1244780L78780m85812j337419k377343l295990l389574k744808k296407
42905G5696207k398806k349517j755287j311380j549286j777350j177178k17399
$$ plain form
42897 63160004 63194649 62703537 61739423 60736610 59818276 59016644 58601670 58562116 58140626
42888 58140626 56605234 54396030 52864391 52712165 53113615 52634575 50788796 48422015
42880 48422015 46656053 45763632 45207924 44535374 43839644 43315194 42801825 42144163 41776942
42871 41776942 42437768 44193689 46103092 47068782 46891674 46345522 46312977 46975370 47808439
42862 47808439 48242985 48226732 48103492 48051647 47862047 47332200 46673851 46361411 46669704 47454471
42852 47454471 48241338 48413155 47498270 45502583 42913358 40277109 37871811 35822930
42844 35822930 34280589 33306761 32787869 32621681 32780969 33057662 33047835 32610229 32039657
42835 32039657 31560368 31035885 30499523 30486140 31265956 32123697 32142487 31536690 31416527 32204224
$$ packed form
42897F3160004L4645m91112r64114j002813r18334q01632m14974l9554m21490
42888E8140626j535392k209204j531639j52226M01450m79040j845779k366781
42880D8422015j765962q92421n55708o72550o95730n24450n13369o57662l67221
42871D1776942O60826J755921J909403R65690j77108n46152l2545O62393Q33069
42862D7808439M34546j6253j23240n1845j89600n29847o58349l12440L08293P84767
42852D7454471P86867J71817r14885j995687k589225k636249k405298k048881
42844C5822930j542341r73828n18892j66188J59288K76693r827m37606n70572
42835C2039657m79289n24483n36362j3383P79816Q57741J8790o05797j20163P87697
$$ plain form
42825 32204224 33067459 33159018 32732809 32611627 33027498 33481373 33520619 33239676 33057587 33234148
42815 33234148 33603048 33723203 33366269 32812599 32462630 32205843 31545250 30476018 29862589
42806 29862589 30584035 32441274 34260094 35107658 35124919 35022283 35045590 34869904 34485113
42797 34485113 34580895 35629094 37024716 37843789 38249763 39261865 41060555 42518860 42810838
42788 42810838 42507928 42387076 42059887 40829557 39261121 38601906 38853430 38677381 37329149
42779 37329149 35594102 34517566 34129220 33810252 33151330 32003560 30300708 28300460
42771 28300460 26570881 25369755 24375981 23265410 22167419 21330044 20705635 20086068 19341725
42762 19341725 18400585 17311051 16374501 15826193 15347579 14338718 12743836 11181228 10217734
$$ packed form
42825C2204224Q63235R1559m26209j21182M15871M53875L9246k80943j82089J76561
42815C3234148L68900J20155l56934n53670l49969k56787o60593j069232o13429
42806B9862589P21446J857239J818820Q47564J7261j02636K3307j75686l84791
42797C4485113R5782J048199J395622Q19073M05974J012102J798690J458305K91978
42788D2810838l02910j20852l27189j230330j568436o59215K51524j76049j348232
42779C7329149j735047j076536l88346l18968o58922j147770j702852k000248
42771B8300460j729579j201126r93774j110571j097991q37375o24409o19567p44343
42762A9341725r41140j089534r36550n48308m78614j008861j594882j562608r63494
$$ plain form
42753 10217734 9944711 10225380 10802562 11151843 10836028 10096755 9564484 9382090 9200199
42744 9200199 8956486 8906286 8918461 8616203 8247024 8422822 8880523 8646098 7743550 7507957
42734 7507957 8609199 9933945 10229316 9784035 9502104 9284037 8555757 7716194 7727433
42725 7727433 8592147 9422269 9847925 10267433 10745639 10701099 9872481 8835594 8355859
42716 8355859 8715182 9674415 10603935 10735678 9859943 8784308 8626498 9635083 11054591
42707 11054591 12045628 12363957 12264164 12129841 12158818 12216872 12164626 12350076 13263182 14562609
42697 14562609 15233537 15159180 15677807 17801321 20626369 22545112 23521903 25021569 27921010
42688 27921010 31612202 35145268 38213674 40801288 42654490 43425027 42961260 41448221
$$ packed form
42753A0217734k73023K80669N77182L49281l15815p39273n32271j82394j81891
42744I200199k43713n0200J2175l02258l69179J75798M57701k34425r02548k35593
42734G507957J101242J324746K95371m45281k81931k18067p28280q39563J1239
42725G727433Q64714Q30122M25656M19508M78206m4540q28618j036887m79735
42716H355859L59323R59233R29520J31743q75735j075635j57810J008585J419508
42707A1054591R91037L18329r9793j34323K8977N8054n2246J85450R13106J299427
42697A4562609O70928p4357N18627K123514K825048J918743R76791J499666K899441
42688B7921010L691192L533066L068406K587614J853202P70537m63767j513039
$$ plain form
42680 41448221 39531684 37971856 36739111 34934337 32193727 29548765 28031168 27043380
42672 27043380 25267707 22762821 20858523 20186639 20139983 20201391 20443893 20648325 20317315
42663 20317315 19816641 20182540 21440122 22365856 22318723 22048198 22205941 22356377 22119551
42654 22119551 22035489 22450642 22677061 22217970 21816216 22198544 22628371 21907563 20209496
42645 20209496 18705277 17752731 16642794 15017078 13483130 12712522 12681890 12928101 13013841
42636 13013841 12681393 11965298 11189632 10617112 10215325 9913914 9760058 9599481 9064181
42627 9064181 8235782 7838253 8279618 8921461 8866771 8139410 7477162 7196337 6909625 6315742
42617 6315742 5706044 5552919 5895795 6286180 6332051 6302262 6969994 8527489 9902161
$$ packed form
42680D1448221j916537j559828j232745j804774k740610k644962j517597r87788
42672B7043380j775673k504886j904298o71884m6656O1408K42502K04432l31010
42663B0317315n00674L65899J257582R25734m7133k70525J57743J50436k36826
42654B2119551q4062M15153K26419m59091m01754L82328M29827p20808j698067
42645B0209496j504219r52546j109937j625716j533948p70608l0632K46211Q5740
42636A3013841l32448p16095p75666n72520m01787l01411j53856j60577n35300
42627I064181q28399l97529M41365O41843n4690p27361o62248k80825k86712n93883
42617F315742o09698j53125L42876L90385M5871k9789O67732J557495J374672
$$ plain form
42608 9902161 9802766 8366874 6972147 6390092 6119479 5744876 5724890 6222523 6357025
42599 6357025 5616122 5040571 5782324 7180813 7607112 6817247 6139245 6479605 7395808
42590 7395808 8172595 8647969 8757122 8271683 7358173 6659814 6523380 6711888 7019108
42581 7019108 7551791 8254907 8759868 8901371 8906676 8966690 9072753 9286069 9648758 9836038
42571 9836038 9473829 8810154 8450216 8393386 8030019 7226432 6680692 6898131 7450354 7659468
42561 7659468 7515969 7453610 7558083 7488585 7075020 6635225 6632136 7102940 7465703 7017745
42551 7017745 5759137 4573672 4362487 5099477 5938583 6082390 5333478 4076193 3076981
42542 3076981 3057625 4035379 5229120 5918423 6105717 6020156 5503550 4506809 3689559 3642270
$$ packed form
42608I902161r9395j435892j394727n82055k70613l74603j9986M97633J34502
42599F357025p40903n75551P41753J398489M26299p89865o78002L40360R16203
42590G395808P76787M75374J09153m85439r13510o98359j36434J88508L07220
42581G019108N32683P03116N04961J41503N305O0014J06063K13316L62689J87280
42571I836038l62209o63675l59938n6830l63367q03587n45740K17439N52223K09114
42561G659468j43499o2359J04473o9498m13565m39795l089M70804L62763m47958
42551G017745j258608j185465k11185P36990Q39106J43807p48912j257285r99212
42542C076981j9356R77754J193741O89303J87294q5561n16606r96741q17250m7289
$$ plain form
42532 3642270 3811198 3156333 1730804 609031 275196 146829 -148392 -106721 634328
42523 634328 1533937 1955056 2049640 2309452 2767060 3120705 3244446 3202132 3096967 3137940
42513 3137940 3488561 3927268 4091170 4085699 4286895 4544100 4331429 3783280 3711066 4352039
42503 4352039 4995493 5189017 5369435 5814398 5945893 5376021 4769828 4820971 5099664 4838246
42493 4838246 4247843 4056598 4204357 4046951 3592194 3526183 4104766 4888377 5527770 6030512
42483 6030512 6303017 6205604 6059699 6360595 6961361 7257810 7207662 7378350 7836465 7801888
42473 7801888 6780792 5411398 4724224 4993199 5728113 6420211 6808465 6653624 5823735
42464 5823735 4672638 3934617 4019989 4587878 5009744 5119348 5210387 5353660 5219985 4821811
$$ packed form
42532C642270J68928o54865j425529j121773l33835j28367k95221M1671P41049
42523F34328Q99609M21119R4584K59812M57608L53645J23741m2314j05165M0973
42513C137940L50621M38707J63902n471K01196K57205k12671n48149p2214O40973
42503D352039O43454J93524J80418M44963J31495n69872o06193N1143K78693k61418
42493D838246n90403j91245J47759j57406m54757o6011N78583P83611O39393N02742
42483F030512K72505r7413j45905L00896O00766K96449n0148J70688M58115l4577
42473G801888j021096j369394o87174K68975P34914O92098L88254j54841q29889
42464E823735j151097p38021Q5372N67889M21866J09604R1039J43273j33675l98174
$$ plain form
42454 4821811 4878377 5824459 6840292 6770809 5901248 5730627 6731388 7482945 6709223
42445 6709223 5191618 4637936 5307385 5931351 5689800 5086398 4816255 4792422 4614341
42436 4614341 4288772 4115791 4272716 4729344 5272422 5528651 5247713 4596614 3975168
42427 3975168 3649440 3744706 4288354 4946046 5120438 4777599 4745787 5593437 6645864 6862623
42417 6862623 6286161 5736894 5454877 5140265 5077377 5881007 7077651 7330291 6432166
42408 6432166 5770358 6244656 6969551 6833251 6200328 5994857 5991289 5319666 4200934 3881957
42398 3881957 4864471 6191185 6655797 6064758 5181730 4901883 5548384 6652336 7433734
42389 7433734 7658870 7785159 8116995 8334275 8215818 8221605 8748600 9349468 9454569 9409847
$$ packed form
42454D821811N6566R46082J015833o9483q69561j70621J000761P51557p73722
42445F709223j517605n53682O69449O23966k41551o03402k70143k3833j78081
42436D614341l25569j72981J56925M56628N43078K56229k80938o51099o21446
42427C975168l25728R5266N43648O57692J74392l42839l1812Q47650J052427K16759
42417F862623n76462n49267k82017l14612o2888Q03630J196644K52640q98125
42408F432166o61808M74298P24895j36300o32923k05471l568o71623j118732l18977
42398C881957R82514J326714M64612n91039q83028k79847O46501J103952P81398
42389G433734K25136J26289L31836K17280j18457N787N26995O00868J05101m4722
$$ plain form
42379 9409847 9887609 10597561 10609865 9813338 9001389 8515125 7884448 6966933 6336779 6188400
42369 6188400 5895406 5163459 4646552 4780034 4925772 4482177 3991221 4120553 4255416
42360 4255416 3395433 2083866 2010849 3580995 5145975 5104895 3790830 2709768 2676368
42351 2676368 3346496 4033026 4303366 4085173 3733939 3788587 4281644 4585481 4291950 3826688
42341 3826688 3717701 3711729 3286523 2676219 2555834 2892443 3020819 2856173 3059151 3757665
42331 3757665 4055557 3333599 2292543 2051668 2730110 3553193 3954778 3948390 3733455 3548931
42321 3548931 3659121 3930724 3745342 2954902 2544828 3499735 5246614 6218951 5937099
42312 5937099 5454948 5543823 5584397 4843254 3848611 3579080 3922356 3950574 3425645 3074395
$$ packed form
42379I409847M77762P09952J2304p96527q11949m86264o30677r17515o30154j48379
42369F188400k92994p31947n16907J33482J45738m43595m90956J29332J34863
42360D255416q59983j311567p3017J570146J564980m1080j314065j081062l3400
42351B676368O70128O86530K70340k18193l51234N4648M93057L03837k93531m65262
42341C826688j08987n972m25206o10304j20385L36609J28376j64646K02978O98514
42331C757665K97892p21958j041056k40875O78442Q23083M01585o388k14935j84524
42321C548931J10190K71603j85382p90440m10074R54907J746879R72337k81852
42312E937099m82151Q8875M0574p41143r94643k69531L43276K8218n24929l51250
$$ plain form
42302 3074395 3423761 4201210 4986721 5730059 6411467 6802080 6846606 6803451 6742108 6374526
42292 6374526 5702188 5345434 5749274 6430429 6605554 6351303 6466793 7205129 7846569
42283 7846569 7752316 7229246 6960901 7076992 7290612 7555006 7928567 8019680 7336126 6214082
42273 6214082 5659962 6032451 6517078 6275445 5585322 5364595 5936589 6759736 7151660
42264 7151660 6870544 6182176 5710604 5998115 6866165 7468486 7317267 6905926 6894022 7125538
42254 7125538 7095917 6985681 7351020 7971417 7967628 7129879 6240240 5889965 5811098 5648275
42244 5648275 5573669 5752871 5965437 6224072 7033434 8427829 9405486 9092106 8038081
42235 8038081 7561302 8022041 8508209 8218478 7521260 7445594 8438164 9793832 10299063
$$ packed form
42302C074395L49366P77449P85511P43338O81408L90613M4526m3155o1343l67582
42292F374526o72338l56754M03840O81155J75125k54251J15490P38336O41440
42283G846569r4253n23070k68345J16091K13620K64394L73561R1113o83554j122044
42273F214082n54120L72489M84627k41633o90123k20727N71994Q23147L91924
42264G151660k81116o88368m71572K87511Q68050O02321j51219m11341j1904K31516
42254G125538k9621j10236L65339O20397l789q37749q89639l50275p8867j62823
42244E648275p4606J79202K12566K58635Q09362J394395R77657l13380j054025
42235H038081m76779M60739M86168k89731o97218p5666R92570J355668N05231
$$ plain form
42226 10299063 9507548 8292677 7825649 8109352 8120424 7424411 6768012 6700052 6556662
42217 6556662 5581610 4282448 3679578 3757665 3764843 3664945 4046718 4723073 4743756 3991458
42207 3991458 3522787 3888532 4249818 3826299 3234636 3468409 4233034 4342670 3462284
42198 3462284 2478276 2176583 2402744 2690437 2986757 3363932 3506685 3017834 2076711
42189 2076711 1347751 1206484 1404068 1609940 1922547 2523406 3091270 3074665 2500594 1957086
42179 1957086 1682020 1299872 723430 590719 1235737 1877328 1691622 1248671 1825033
42170 1825033 3441194 4712473 4795006 4385340 4381465 4556498 4248648 3614102 3354347 3603759
42160 3603759 3831181 3647967 3156410 2671135 2543182 3043838 3989906 4704568 4758974 4500330
$$ packed form
42226A0299063p91515j214871m67028K83703J1072o96013o56399o7960j43390
42217F556662r75052j299162o02870P8087P178r9898L81773O76355K0683p52298
42207C991458m68671L65745L61286m23519n91663K33773P64625J09636q80386
42198C462284r84008l01693K26161K87693K96320L77175J42753m88851r41123
42189B076711p28960j41267J97584K05872L12607O00859N67864j6605n74071n43508
42179A957086k75066l82148n76442j32711O45018O41591j85706m42951N76362
42170A825033J616161J271279Q2533m09666l875J75033l07850o34546k59755K49412
42160C603759K27422j83214m91557m85275j27953N00656R46068P14662N4406k58644
$$ plain form
42150 4500330 4439979 4463327 4184243 3742778 3536845 3358535 2612208 1406459 633491 768448
42140 768448 1296667 1621679 1865705 2328621 2748632 2726680 2503195 2628104 3046549 3206536
42130 3206536 3055942 3222006 3989398 4727637 4744221 4229453 3810741 3502327 2805832 1796666
42120 1796666 1361809 2064764 3285608 3876651 3373388 2259886 1338266 1147884 1695399
42111 1695399 2374371 2404282 1726003 1197112 1517170 2321280 2853777 3117593 3589219 4120734
42101 4120734 4130523 3801622 3974620 4661519 4799691 3949030 3179630 3554535 4596972 5122589
42091 5122589 4923000 4707610 4884264 5346090 6118077 7275737 8417805 9067321 9451481
42082 9451481 10106655 10879863 11119710 10690300 9959228 8969215 7607390 6496082 6549210
$$ packed form
42150D500330o0351K3348k79084m41465k05933j78310p46327j205749p72968J34957
42140G68448N28219L25012K44026M62916M20011k1952k23485J24909M18445J59987
42130C206536j50594J66064P67392P38239J6584n14768m18712l08414o96495j009166
42120A796666m34857P02955J220844N91043n03263j113502r21620j90382N47515
42111A695399O78972K9911o78279n28891L20058Q04110N32497K63816M71626N31515
42101D120734R789l28901J72998O86899J38172q50661p69400L74905J042437N25617
42091E122589j99589k15390J76654M61826P71987J157660J142068O49516L84160
42082I451481O55174P73208K39847m29410p31072r90013j361825j111308N3128
$$ plain form
42073 6549210 7457292 7747220 6766070 5601218 5479450 6142807 6487612 6082703 5314722
42064 5314722 4593428 4153334 4220259 4682346 4920191 4562581 4074191 4015733 4115878 3771796
42054 3771796 3140447 2935138 3313171 3759116 3996785 4204251 4283263 3778737 2805421 2282795
42044 2282795 2733755 3383961 3080604 1852740 947620 1309700 2520499 3454737 3643801
42035 3643801 3586304 3775924 3919791 3451939 2507394 1801355 1554920 1202023 450313 16878
42025 16878 711429 2143017 3044483 2819933 2162967 2057707 2656026 3290969 3225471 2233717
42015 2233717 738021 -459838 -735716 -6538 1472760 3405929 5277066 6222070 5705210
42006 5705210 4291165 3177335 2901211 3014590 3031758 3021043 3075936 2901940 2342073 1800909
$$ packed form
42073F549210R08082K89928r81150j164852j21768O63357L44805m04909p67981
42064E314722p21294m40094O6925M62087K37845l57610m88390n8458J00145l44082
42054C771796o31349k05309L78033M45945K37669K07466P9012n04526r73316n22626
42044B282795M50960O50206l03357j227864r05120L62080J210799R34238J89064
42035C643801n7497J89620J43867m67852r44545p06039k46435l52897p51710m33435
42025A6878O94551J431588R01466k24550o56966j05260N98319O34943o5498r91754
42015B233717j495696j197859k75878P29178J479298J933169J871137R45004n16860
42006E705210j414045j113830k76124J13379J7168j0715N4893j73996n59867n41164
$$ plain form
41996 1800909 1717632 2006692 2364655 2704283 2937303 2831692 2541459 2752250 3685051 4421603
41986 4421603 4004125 2904105 2519161 3294834 4210289 4224456 3433361 2559514 2022363
41977 2022363 1903114 2249788 2911719 3391032 3275421 2661933 1938684 1367396 1046147
41968 1046147 1006667 1148423 1305773 1502405 1856775 2166568 2019729 1485959 1188107 1365173
41958 1365173 1373447 616898 -431899 -769550 -208391 442031 478069 14894 -432553 -552910
41948 -552910 -290624 267117 846338 1109010 983461 696246 436934 209734 22389 -46735
41938 -46735 -965 116169 422740 1050325 1760511 2068261 1875016 1653473 1816660 2171046
41928 2171046 2210901 1759540 1111015 655864 512420 453037 167379 -269558 -265322 639563
$$ packed form
41996A800909q3277K89060L57963L39628K33020j05611k90233K10791R32801P36552
41986D421603m17478j100020l84944P75673R15455J4167p91095q73847n37151
41977B022363j19249L46674O61931M79313j15611o13488p23249n71288l21249
41968A046147l9480J41756J57350J96632L54370L09793j46839n33770k97852J77066
41958A365173Q274p56549j048797l37651N61159O50422L6038m63175m47447j20357
41948e52910K62286N57741N79221K62672j25549k87215k59312k27200j87345o9124
41938d6735M5770J17134L06571O27585P10186L07750j93245k21543J63187L54386
41928B171046L9855m51361o48525m55151j43444n9383k85658m36937M236R04885
$$ plain form
41918 639563 1989352 2714225 2368373 1634842 1337040 1398813 1226318 761670 545018 842329
41908 842329 1289757 1460620 1323650 1048128 780331 751218 1193593 1923255 2346726 2169970
41898 2169970 1821654 1844526 2096789 1978831 1351329 763394 704573 1051166 1425567 1704388
41888 1704388 1861390 1659080 990269 341641 321941 720645 674865 -25190 -459055 150054
41878 150054 1272280 1863347 1882671 2122399 2702073 2773572 1914799 855640 363889 219688
41868 219688 -91823 -363535 -136248 301305 276032 -141116 -231823 216509 677555 863939
41858 863939 1138134 1725007 2231602 2318434 2274692 2484338 2751020 2622971 2090944 1502309
41848 1502309 974069 351804 -304109 -607751 -330683 240205 565267 409027 77580
$$ packed form
41918F39563J349789P24873l45852p33531k97802O1773j72495m64648k16652K97311
41908H42329M47428J70863j36970k75522k67797k9113M42375P29662M23471j76756
41898B169970l48316K2872K52263j17958o27502n87935n8821L46593L74401K78821
41888A704388J57002k02310o68811o48628j9700L98704m5780p00055m33865O09109
41878A50054J122226N91067J9324K39728N79674P1499q58773j059159m91751j44201
41868B19688l11511k71712K27287M37553k5273m17148r0707M48332M61046J86384
41858H63939K74195N86873N06595Q6832m3742K09646K66682j28049n32027n88635
41848A502309n28240o22265o55913l03642K77068N70888L25062j56240l31447
$$ plain form
41839 77580 86643 569390 1060359 973851 275161 -463097 -675118 -333796 125276 256917
41829 256917 -22699 -388419 -461137 -315077 -459679 -1082162 -1554222 -1166483 -219059 258752
41819 258752 -67003 -409258 -141194 226413 -77540 -796988 -1024119 -578384 -181773 -279067
41809 -279067 -451621 -197815 340371 760795 1030092 1316714 1496779 1253841 564344 -222059
41799 -222059 -725784 -754530 -318567 279551 474938 -40217 -775173 -838398 -104571 402750
41789 402750 -265006 -1619891 -2217856 -1493924 -411448 -18776 -113149 18966 171889
41780 171889 -388841 -1294667 -1085942 740241 2697172 3038750 1844499 590985 154454
41771 154454 176215 179664 307489 777859 1367454 1747557 1832722 1561085 799579 -251783
$$ packed form
41839G7580R063M82747M90969q6508o98690p38258k12021L41322M59072J31641
41829B56917k79616l65720p2718J46060j44602o22483m72060L87739R47424M77811
41819B58752l25755l42255K68064L67607l03953p19448k27131M45735L96611r7294
41809b79067j72554K53806N38186M20424K69297K86622J80065k42938o89497p86403
41799b22059n03725k8746M35963N98118J95387n15155p34956o3225P33827N07321
41789D02750o67756j354885n97965P23932J082476L92672r4373J32115J52923
41780A71889n60730r05826K08725J826183J956931L41578j194251j253514m36531
41771A54454K1761L449J27825M70370N89595L80103Q5165k71637p61506j051362
$$ plain form
41761 -251783 -958483 -880343 -244267 439907 935317 1179023 957280 149528 -795669 -1092526
41751 -1092526 -483029 387472 673381 309910 66011 561358 1433761 1728145 1050811
41742 1050811 -10193 -725613 -1090772 -1512518 -1954301 -1968462 -1523407 -1195901 -1355610
41733 -1355610 -1644802 -1563603 -1181066 -881546 -694461 -354793 84507 200171 -147519 -503869
41723 -503869 -392203 50422 295855 165959 25011 189668 458700 444815 168512 5044
41713 5044 115310 276021 298247 250077 155295 -141709 -590449 -777932 -471467 -18293
41703 -18293 127083 -33400 -316836 -809835 -1490743 -1747846 -1035992 134494 684347 445675
41693 445675 306181 742120 1142046 986131 810781 1315267 2138644 2304879 1532106 427117
$$ packed form
41761b51783p06700P8140O36076O84174M95410K43706k21743q07752r45197k96857
41751a092526O09497Q70501K85909l63471k43899M95347Q72403K94384o77334
41742A050811j061004p15420l65159m21746m41783j4161M45055L27506j59709
41733a355610k89192Q1199L82537K99520J87085L39668M39300J15664l47690l56350
41723e03869J11666M42625K45433j29896j40948J64657K69032j3885k76303j63468
41713E044J10266J60711K2226m8170r4782k97004m48740j87483L06465M53174
41703a8293J45376j60483k83436m92999o80908k57103P11854J170486N49853k38672
41693D45675j39494M35939L99926j55915j75350N04486Q23377J66235p72773j104989
$$ plain form
41683 427117 -367609 -634475 -437565 -96599 -91496 -451342 -489722 253092 1072462 848000
41673 848000 -408631 -1553169 -1844994 -1648485 -1466297 -1161837 -565950 -120853 -291096
41664 -291096 -781574 -961768 -797799 -759923 -916029 -715747 182042 1271273 1654070 993346
41654 993346 -180538 -1074025 -1363866 -1257256 -1007475 -672991 -373366 -400980 -823296 -1252677
41644 -1252677 -1332422 -1205643 -1128006 -900953 -242366 476654 556499 -1634 -497260 -597417
41634 -597417 -609890 -562039 15272 937348 993071 -428785 -2056945 -2109889 -542031 1099981
41624 1099981 1795698 1903652 1923421 1606876 721300 -214774 -571295 -453054 -428743 -806852
41614 -806852 -1519996 -2315761 -2743561 -2378439 -1394025 -505642 -45728 404381 1092819 1414819
$$ packed form
41683D27117p94726k66866J96910L40966N103l59846l8380P42814Q19370k24462
41673H48000j256631j144538k91825J96509J82188L04460N95887M45097j70243
41664b91096m90478j80194J63969L7876j56106K00282Q97789J089231L82797o60724
41654I93346j173884q93487k89841J06610K49781L34484K99625k7614m22316m29381
41644a252677p9745J26779P7637K27053O58587P19020P9845n58133m95626j00157
41634e97417j2473M7851N77311R22076N5723j421856j628160n2944J567858J642012
41624A099981O95717J07954J9769l16545q85576r36074l56521J18241K4311l78109
41614h06852p13144p95765m27800L65122R84414Q88383M59914M50109O88438L22000
$$ plain form
41604 1414819 770659 -375506 -1049755 -1068845 -997265 -1017637 -730018 -71493 438320 550664
41594 550664 610222 764465 595945 -72594 -688923 -796078 -765354 -1083664 -1348836 -706112
41584 -706112 882561 2431496 2981404 2435735 1426131 735402 762938 1184701 1226706
41575 1226706 593335 -65374 -1651 568558 814221 529801 334270 618711 1008976 1083748
41565 1083748 1008251 1127066 1402232 1604278 1711947 1829947 1997577 2272094 2662383 2827598
41555 2827598 2303891 1280896 644740 854324 1232144 879480 -63493 -660310 -472524
41546 -472524 -14495 62120 -242692 -400060 -3337 751293 1173372 839974 288060 532672
41536 532672 1699360 2664803 2448526 1423429 603408 289938 184032 335930 947700
$$ packed form
41604A414819o44160j146165o74249j9090P1580k0372K87619O58525N09813J12344
41594E50664N9558J54243j68520o68539o16329j07155L0724l18310k65172O42724
41584g06112J588673J548935N49908n45669j009604o90729K7536M21763M2005
41575A226706o33371o58709O3723N70209K45663k84420j95531K84441L90265P4772
41565A083748p5497J18815K75166K02046J07669J18000J67630K74517L90289J65215
41555B827598n23707j022995o36156K09584L77820l52664r42973n96817J87786
41546d72524M58029P6615l04812j57368L96723P54630M22079l33398n51914K44612
41536E32672J166688R65443k16277j025097q20021l13470j05906J51898O11770
$$ plain form
41527 947700 1469340 1029509 -157557 -839801 -394053 471807 915583 912857 675778 99217
41517 99217 -672275 -991177 -665524 -418882 -722979 -915205 -277577 684283 989279 676644
41507 676644 516258 610256 429117 82736 358055 1333910 2007857 1648447 676268 -167867
41497 -167867 -742874 -1119373 -989395 -161168 753959 836744 -50220 -1126062 -1602145 -1386563
41487 -1386563 -899371 -497329 -210402 68754 306233 385795 430151 771966 1401389 1756042
41477 1756042 1473906 1097490 1409790 2168201 2275095 1380171 526938 749774 1665851
41468 1665851 2092616 1619880 851735 350209 116631 80613 331770 653504 465258 -372351
41458 -372351 -1117047 -970048 -119310 490431 353322 -69912 -96881 310224 696139 861547
$$ packed form
41527I47700N21640m39831j187066o82244M45748Q65860M43776k726k37079n76561
41517I9217p71492l18902L25653K46642l04097j92226O37628R61860L04996l12635
41507F76644j60386R3998j81139l46381K75319R75855O73947l59410r72179q44135
41497a67867n75007l76499J29978Q28227R15127Q2785q86964j075842m76083K15582
41487a386563M87192M02042K86927K79156K37479P9562M4356L41815O29423L54653
41477A756042k82136l76416L12300P58411J06894q94924q53233K22836R16077
41468A665851M26765m72736p68145n01526k33578l6018K51157L21734j88246q37609
41458c72351p44696J46999Q50738O09741j37109m23234k6969M07105L85915J65408
$$ plain form
41448 861547 1036801 1337139 1469819 1157274 522231 -205535 -1059791 -2021747 -2581741 -2206141
41438 -2206141 -1218422 -572161 -550308 -321851 777572 2058557 2236319 1108779 -231798
41429 -231798 -806550 -668428 -298280 202301 900229 1501862 1581142 1158177 652884 379800
41419 379800 391942 655199 1024464 1192353 1040887 897425 1002904 909523 61332 -1065328
41409 -1065328 -1247180 -225976 691295 319524 -813132 -1341272 -972833 -528262 -396458
41400 -396458 -116391 469945 777007 506290 165659 155885 208143 175095 477359 1173863
41390 1173863 1489555 1034707 640534 1037627 1500035 986496 -11960 -184589 391344
41381 391344 293284 -995797 -2360427 -2825987 -2671537 -2353373 -1668286 -648641 -80871
$$ packed form
41448H61547J75254L00338J32680l12545o35043p27766q54256r61956n59994L75600
41438b206141R87719O46261K1853K28457J099423J280985J77762j127540j340577
41429b31798n74752J38122L70148N00581O97928O01633P9280m22965n05293k73084
41419C79800J2142K63257L69265J67889j51466j43462J05479r3381q48191j126660
41409a065328j81852J021204R17271l71771j132656n28140L68439M44571J31804
41400c96458K80067N86336L07062k70717l40631r774N2258l3048L02264O96504
41390A173863L15692m54848l94173L97093M62408n13539r98456j72629N75933
41381C91344r8060j289081j364630m65560J54450L18164O85087J019645N67770
$$ plain form
41372 -80871 -283635 -368527 376954 1247904 1248507 699581 613386 1017420 1073209 576526 230169
41361 230169 477753 979174 1264811 1174967 673553 -110688 -718558 -854318 -916609 -1398973
41351 -1398973 -1959058 -1860676 -1226618 -993934 -1571607 -2325090 -2493476 -1889805 -625495
41342 -625495 1029459 2312185 2343530 1250322 250507 199394 623506 620501 156520 -91585
41332 -91585 185383 582068 579939 104678 -472998 -701530 -494198 -256451 -387500 -700564
41322 -700564 -680868 -300670 -110218 -429267 -936655 -1227385 -1296629 -1263295 -1102107 -920644
41312 -920644 -1029807 -1404763 -1496341 -942351 -109031 411119 480401 265436 -178589 -728119
41302 -728119 -938175 -486619 310396 849757 950223 854349 729406 570063 437531 381572
$$ packed form
41372h0871k02764q4892P45481Q70950O03n48926q6195M04034N5789m96683l46357
41361B30169K47584N01421K85637q9844n01414p84241o07870j35760o2291m82364
41351a398973n60085R8382O34058K32684n77673p53483j68386O03671J264310
41342f25495J654954J282726L1345j093208r99815n1113M24112l005m63981k48105
41332i1585K76968L96685k129m75261n77676k28532K07332K37747j31049l13064
41322g00564J9696L80198J90452l19049n07388k90730o9244L3334J61188J81463
41312i20644j09163l74956r1578N53990Q33320N20150O9282k14965m44025n49530
41302g28119k10056M51556P97015N39361J00466r5874j24943j59343j32532n5959
$$ plain form
41292 381572 213300 -277368 -924693 -1300906 -1183096 -701715 -139312 231353 288280 247511
41282 247511 500144 1055603 1421911 1289622 995511 956841 999848 728026 263210 44474
41272 44474 75691 -4990 -172365 39055 761149 1515920 1861904 1862433 1766546 1665390 1649546
41261 1649546 1870417 2159013 1947596 964516 -185313 -545877 70417 787446 620391
41252 620391 -432748 -1423661 -1510280 -745942 243965 1047481 1600151 1775912 1437768 953259
41242 953259 1035254 1754434 2225620 1720555 672842 42044 21491 32925 -188152 -248579
41232 -248579 102735 494376 508807 275877 183780 296910 376836 346559 443638 838434
41222 838434 1231542 1049916 185276 -646596 -636449 96021 678028 682345 507157 411434
$$ packed form
41292C81572j68272m90668o47325l76213J17810M81381N62403L70665N6927m0769
41282B47511K52633N55459L66308j32289k94111l8670M3007k71822m64816k18736
41272D4474L1217q0681j67375K11420P22094P54771L45984N29r5887j01156j5844
41261A649546K20871K88596k11417r83080j149829l60564O16294P17029j67055
41252F20391j053139r90913q6619P64338R89907Q03516N52670J75761l38144m84509
41242I53259Q1995P19180M71186n05065j047713o30798k0553J1434k21077o0427
41232b48579L51314L91641J4431k32930r2097J13130P9926l0277R7079L94796
41222H38434L93108j81626q64640q31872J0147P32470N82007M317j75188r5723
$$ plain form
41212 411434 11366 -786356 -1196871 -691282 -9237 -61352 -426445 -140561 470002 207595
41202 207595 -872885 -1350955 -712479 -163705 -554790 -966999 -378945 484683 306895
41193 306895 -617843 -801873 128343 914660 543001 -474237 -1010499 -712042 -69815
41184 -69815 354471 365995 98485 -127783 -11807 468555 980581 1045799 397241 -712112
41174 -712112 -1577859 -1705437 -1468658 -1740011 -2683875 -3331905 -2709987 -1060420 481688
41165 481688 1177951 1166946 828902 290469 -301498 -507869 -4981 844255 1178132 578676
41155 578676 -320584 -485639 226201 858356 706446 359852 750864 1544815 1463325 212207
41145 212207 -964278 -991347 -269364 269860 528701 875540 1090452 642988 -309768 -1059091
$$ packed form
41212D11434m00068p97722m10515N05589O82045n2115l65093K85884O10563k62407
41202B07595j080480m78070O38476N48774l91085m12209N88054Q63628j77788
41193C06895r24738j84030R30216P86317l71659j017238n36262K98457O42227
41184f9815M24286J1524k67510k26268J15976M80362N12026O5218o48558j109353
41174g12112q65747j27578K36779k71353r43864o48030O21918J649567J542108
41165D81688O96263j1005l38044n38433n91967k06371N02888Q49236L33877n99456
41155E78676q99260j65055P11840O32155j51910l46594L91012P93951q1490j251118
41145B12207j176485k7069P21983N39224K58841L46839K14912m47464r52756p49323
$$ plain form
41135 -1059091 -1300184 -1222926 -819963 122718 1345294 2106053 2010399 1423462 978057 966059
41125 966059 1178434 1094513 364563 -658846 -1116419 -647943 116591 401282 222231 49776
41115 49776 -24667 -180377 -262392 39604 584457 933774 964640 851284 680604 577880
41105 577880 896003 1709286 2427662 2495424 2135291 1818883 1461505 863637 449470 665785
41095 665785 1070705 997304 722215 890457 1159118 678455 -312257 -727132 -388541 -158197
41085 -158197 -296318 -125430 516897 940661 968636 1165269 1381305 654890 -920137 -1844499
41075 -1844499 -1451289 -916659 -1178040 -1455714 -946285 -397443 -584970 -634557 493161
41066 493161 2008035 2535918 2384047 2687748 3089782 2350849 833052 216428 765252
$$ packed form
41135a059091k41093P7258M02963R42681J222576P60759r5654n86937m45405j1998
41125I66059K12375q3921p29950j023409m57573M68476P64534K84691j79051j72455
41115D9776p4443j55710q2015L01996N44853L49317L0866j13356j70680j02724
41105E77880L18123Q13283P18376O7762l60133l16408l57378n97868m14167K16315
41095F65785M04920p3401k75089J68242K68661m80663r90712m14875L38591K30344
41085a58197j38121J70888O42327M23764K7975J96633K16036p26415j575027r24362
41075a844499L93210N34630k61381k77674N09429N48842j87527m9587J127718
41066D93161J514874N27883j51871L03701M02034p38933j517797o16624N48824
$$ plain form
41057 765252 933892 354 -816139 -480764 271292 320355 -188836 -522183 -669658 -1020414
41047 -1020414 -1410109 -1371256 -950900 -635127 -705368 -1069000 -1475120 -1640183 -1427217 -1051330
41037 -1051330 -840228 -787468 -692051 -637477 -832793 -1069073 -929836 -509470 -308924 -432753
41027 -432753 -517822 -438919 -423495 -488701 -471293 -593501 -1215272 -1992634 -2110230 -1458770
41017 -1458770 -776920 -515251 -391549 -181654 -39312 140032 706462 1355717 1231922
41008 1231922 257358 -630968 -921613 -1117941 -1439594 -1167117 -43407 817397 442332
40999 442332 -485629 -718195 -314300 -273215 -839880 -1333447 -1335183 -1009897 -497707 60394
40989 60394 122611 -685183 -1750049 -2080992 -1599533 -1021772 -647494 -148273 552218 1086844
$$ packed form
41057G65252J68640r33538q16493L35375P52056M9063n09191l33347j47475l50756
41047a020414l89695L8853M20356L15773p0241l63632m06120j65063K12966L75887
41037a051330K11102N2760R5417N4574j95316k36280J39237M20366K00546j23829
41027d32753q5069P8903J5424o5206J7408j22208o21771p77362j17596O51460
41017a458770O81850K61669J23702K09895J42342J79344N66430O49255j23795
41008A231922r74564q88326k90645j96328l21653K72477J123710Q60804l75065
40999D42332r27961k32566M03895M1085n66665m93567j736L25286N12190N58101
40989F0394O2217q07794j064866l30943M81459N77761L74278M99221P00491N34626
$$ plain form
40979 1086844 1337058 1511575 1531987 1128271 569813 500752 934796 1139757 667529 -135763
40969 -135763 -745435 -966982 -764135 -215978 270053 323710 257658 698592 1491400 1669358
40959 1669358 702854 -838727 -2039782 -2458652 -2076495 -1120977 -196652 27548 -417592
40950 -417592 -795315 -581090 83698 871493 1532519 1614934 754187 -507083 -1013744 -468199
40940 -468199 193707 272290 228345 566068 759602 202790 -513468 -352479 581246 1242494
40930 1242494 1151205 704034 177792 -532464 -1179594 -1164146 -455655 304161 804334 1388443
40920 1388443 2163834 2606321 2421946 2067497 1952817 1792702 1304952 930493 1125938
40911 1125938 1394080 893610 -173623 -685780 -203538 369997 76048 -799819 -1242315
$$ packed form
40979A086844K50214J74517K0412m03716n58458o9061M34044K04961m72228q03292
40969a35763o09672k21547K02847N48157M86031N3657o6052M40934P92808J77958
40959A669358r66504j541581j201055m18870L82157R55518R24325K24200m45140
40950d17592l77723K14225O64788P87795O61026Q2415q60747j261270n06661N45545
40940d68199O61906P8583m3945L37723J93534n56812p16258J60989R33725O61248
40930A242494r1289m47171n26242p10256o47130J5448P08491P59816N00173N84109
40920A388443P75391M42487j84375l54449j14680j60115m87750l74459J95445
40911A125938K68142n00470j067233n12157M82242N73535k93949q75867m42496
$$ plain form
40902 -1242315 -910000 -409007 -318824 -537588 -654205 -465648 69365 956021 1896710 2202129
40892 2202129 1446026 149516 -620864 -441121 13442 -129833 -854421 -1347453 -1038544
40883 -1038544 -201808 550823 1093613 1819548 2901959 3868825 4140078 3775820 3315282
40874 3315282 2951447 2385313 1643881 1440350 2219000 3246348 3336575 2352140 1331799
40865 1331799 1118693 1472750 1628525 1137232 19532 -1296710 -1971923 -1331456 209438
40856 209438 1378376 1565545 1474829 1804344 2048360 1424888 371673 -8727 256181
40847 256181 -12489 -1215214 -2146550 -1642376 -249257 490543 3573 -792716 -850106
40838 -850106 -281296 -75573 -789760 -1830430 -2134529 -1395790 -317425 348065 549967
$$ packed form
40902a242315L32315N00993R0183k18764j16617J88557N35013Q86656R40689L05419
40892B202129p56103j296510p70380J79743M54563j43275p24588m93032L08909
40883a038544Q36736P52631N42790P25935J082411R66866K71253l64258m60538
40874C315282l63835n66134p41432k03531P78650J027348R0227r84435j020341
40865A331799k13106L54057J55775m91293j117700j316242o75213O40467J540894
40856B09438J168938J87169r0716L29515K44016o23472j053215l80400K64908
40847B56181k68670j202725r31336N04174J393119P39800m86970p96289n7390
40838h50106N68810K05723p14187j040670l04099P38739J078365O65490K01902
$$ plain form
40829 549967 503702 69463 -823577 -1522048 -1283023 -503375 -439361 -1506522 -2638206 -2674772
40819 -2674772 -1711232 -635859 56860 434291 568551 437089 157889 -156584 -611741
40810 -611741 -1233810 -1675893 -1576075 -1011190 -304282 355128 810315 810013 369583 -65038
40800 -65038 -219436 -405345 -878055 -1181279 -747477 150537 712909 653872 269489 -286421
40790 -286421 -1004612 -1462957 -1171033 -486347 -290985 -633844 -603858 213763 1095672 1383736
40780 1383736 1396471 1545758 1399440 456949 -743443 -1198890 -787122 -236459 1191
40771 1191 77896 119417 42942 -20025 193869 524160 498160 46168 -435084 -761690 -1134537
40760 -1134537 -1558331 -1690007 -1459700 -1298991 -1473937 -1653041 -1473340 -1162517 -1196791 -1550171
$$ packed form
40829E49967m6265m34239q93040o98471K39025P79648O4014j067161j131684l6566
40819b674772R63540J075373O92719L77431J34260j31462k79200l14473m55157
40810f11741o22069m42083R9818N64885P06908O59410M55187l02m40430m34621
40800f5038j54398j85909m72710l03224M33802Q98014N62372n9037l84383n55910
40790b86421p18191m58345K91924O84686J95362l42859K9986Q17621Q81909K88064
40780A383736J2735J49287j46318r42491j200392m55447M11768N50663K37650
40771A191P6705M1521p6475o2967K13894L30291k6000m51992m81252l26606l72847
40760a134537m23794j31676K30307J60709j74946j79104J79701L10823l4274l53380
$$ plain form
40750 -1550171 -1668330 -1171254 -361832 28237 -393364 -1140796 -1239739 -366505 585064 475420
40740 475420 -631658 -1515368 -1351241 -636378 -318943 -556928 -783438 -610502 -136897
40731 -136897 437318 993141 1345707 1328000 1034429 684673 273450 -355324 -1119264 -1693585
40721 -1693585 -1909801 -1866406 -1612727 -1052554 -301136 155493 -65232 -724130 -1186522 -1189294
40711 -1189294 -1158122 -1609056 -2362421 -2622159 -1919054 -754424 -89560 -305835 -919565
40702 -919565 -1272566 -1197969 -939886 -698292 -429982 27471 723077 1386939 1496700 774358
40692 774358 -394300 -1310989 -1724281 -1885121 -1850711 -1266098 -53981 1173235 1737938
40683 1737938 1558254 898717 -53337 -944144 -1116733 -373232 487658 603070 234633
$$ packed form
40750a550171j18159M97076Q09422L90069m21601p47432r8943Q73234R51569j09644
40740D75420j107078q83710J64127P14863L17435k37985k26510J72936M73605
40731a36897N74215N55823L52566j7707k93571l49756m11223o28774p63940n74321
40721a693585k16216M3395K53679N60173P51418M56629k20725o58898m62392k772
40711a189294L1172m50934p53365k59738P03105J164630O64864k16275o13730
40702i19565l53001P4597K58083K41594K68310M57453O95606O63862J09761p22342
40692G74358j168658r16689m13292j60840L4410N84613J212117J227216N64703
40683A737938j79684o59537r52054q90807j72589P43501Q60890J15412l68437
$$ plain form
40674 234633 244618 611687 440367 -517393 -1351012 -1307642 -757739 -416309 -373441 -449341
40664 -449341 -823238 -1597767 -2236927 -2197379 -1779775 -1591626 -1428127 -579295 770837 1390836
40654 1390836 602351 -669130 -1015332 -336138 119051 -549596 -1704922 -1962265 -900212
40645 -900212 425265 729110 -99437 -1122835 -1609160 -1628981 -1441757 -979799 -294031
40636 -294031 46740 -400974 -1223990 -1688866 -1806698 -2148765 -2661810 -2515207 -1387360
40627 -1387360 -129462 384534 492635 1125549 2277565 2892788 2287888 1007448 43187
40618 43187 -281885 -316919 -332461 -206485 210669 720837 847787 250642 -850759 -1669372
40608 -1669372 -1522720 -651055 -101462 -543703 -1442866 -1781575 -1415813 -1167733 -1545029
$$ packed form
40674B34633R985L67069j71320r57760q33619M3370N49903L41430M2868p5900
40664d49341l73897p74529o39160L9548M17604J88149J63499Q48832J350132O19999
40654A390836p88485j271481l46202O79194M55189o68647j155326k57343J062053
40645i00212J325477L03845q28547j023398m86325j9821J87224M61958O85768
40636b94031L40771m47714q23016m64876j17832l42067n13045J46603J127847
40627a387360J257898N13996J08101O32914J152016O15223o04900j280440r64261
40618D3187l25072l5034j5542J25976M17154N10168J26950n97145j101401q18613
40608a669372J46652Q71665N49593m42241q99163l38709L65762K48080l77296
$$ plain form
40599 -1545029 -1966236 -1580475 -442981 567178 792472 331598 -382616 -1093983 -1684585
40590 -1684585 -1922360 -1527227 -537011 482261 777580 142690 -780552 -1223340 -1260196
40581 -1260196 -1610279 -2410397 -2827371 -2262956 -1317201 -889215 -789252 -116644 1209487
40572 1209487 2250649 2387448 1924158 1190176 -2483 -1588885 -2789021 -3029880 -2712164
40563 -2712164 -2459344 -2160155 -1430095 -563712 -261829 -662209 -1317067 -1938817 -2520236
40554 -2520236 -2865710 -2671188 -2046489 -1401672 -844391 -204948 398645 575606 250043
40545 250043 -265208 -776123 -1298912 -1680016 -1676815 -1434250 -1317889 -1227169 -680369 297603
40535 297603 997243 960480 530816 212065 42194 -64365 76498 468874 523807 -307295
$$ packed form
40599a545029m21207L85761J137494J010159K25294m60874p14214p11367n90602
40590a684585k37775L95133R90216J019272K95319o34890r23242m42788l6856
40581a260196l50083q00118m16974N64415R45755M27986R9963O72608J326131
40572A209487J041162J36799m63290p33982j192659j586402j200136k40859L17716
40563b712164K52820K99189P30060Q66383L01883m00380o54858o21750n81419
40554b520236l45474J94522O24699O44817N57281O39443O03593J76961l25563
40545B50043n15251n10915n22789l81104L201K42565J16361R0720N46800R77972
40535B97603O99640l6763m29664l18751j69871j06559J40863L92376N4933q31102
$$ plain form
40525 -307295 -1683351 -2675673 -2855208 -2671243 -2748402 -3127408 -3273837 -2674507 -1387835
40516 -1387835 -56488 663390 677262 355272 -41239 -547660 -1131195 -1534194 -1614381 -1496268
40506 -1496268 -1229690 -663884 121725 632069 522619 90226 -100737 124481 499565
40497 499565 672819 386707 -391504 -1234931 -1475866 -1007083 -554439 -760431 -1325680 -1548585
40487 -1548585 -1391502 -1348489 -1439763 -1128892 -321427 293500 203494 -189971 -199080 181199
40477 181199 393422 210291 50900 349838 879867 900868 22883 -1173300 -1615974 -967482
40467 -967482 -91957 16172 -503384 -741623 -501549 -590034 -1401935 -2075812 -1731918 -936810
40457 -936810 -986018 -1979098 -2655170 -2260967 -1564072 -1546100 -1981879 -2099490 -1982677 -2251863
$$ packed form
40525c07295j376056r92322j79535J83965p7159l79006j46429N99330J286672
40516a387835J331347P19878J3872l21990l96511n06421n83535m02999q0187J18113
40506a496268K66578N65806P85609N10344j09450m32393j90963K25218L75084
40497D99565J73254k86112p78211q43427k40935M68783M52644k05992n65249k22905
40487a548585J57083M3013r1274L10871Q07465O14927r0006l93465r109L80279
40477A81199K12223j83131j59391K98938N30029K1001q77985j196183m42674O48492
40467i67482Q75525J08129n19556k38239K40074q8485q11901o73877L43894P95108
40457i36810m9208r93080o76072L94203O96895J7972m35779j17611J16813k69186
$$ plain form
40447 -2251863 -2661477 -2236029 -942073 -68019 -432602 -1197124 -1219343 -769849 -866284 -1438598
40437 -1438598 -1401639 -439833 487360 631626 386255 320515 209568 -369653 -1172046 -1665177
40427 -1665177 -1775451 -1674101 -1282733 -594396 -76153 -107506 -342849 -276957 -155905 -614022
40417 -614022 -1574573 -2236210 -2137329 -1613860 -1172865 -958955 -877751 -745723 -283039 566142
40407 566142 1284871 1243895 563094 35588 107857 389358 291176 -270438 -953260 -1408350
40397 -1408350 -1469409 -1206365 -900438 -756337 -631886 -260131 351966 996243 1564094 1961144
40387 1961144 1966615 1608037 1412264 1733589 2073275 1715113 820861 139379 -181859 -570502
40377 -570502 -882683 -369296 977281 2042236 1974416 1157686 430493 104623 102653 262170
$$ packed form
40447b251863m09614M25448J293956Q74054l64583p64522k2219M49494r6435n72314
40437a438598L6959R61806R27193J44266k45371o5740j10947n79221q02393m93131
40427a665177j10274J01350L91368O88337N18243l1353k35343O5892J21052m58117
40417f14022r60551o61637R8881N23469M40995K13910Q1204J32028M62684Q49181
40407E66142P18729m0976o80801n27506P2269K81501r8182n61614o82822m55090
40397a408350o1059K63044L05927J44101J24451L71755O12097O44277N67851L97050
40387A961144N471l58578j95773L21325L39686l58162q94252o81482l21238l88643
40377e70502l12181N13387J346577J064955o7820q16730p27193l25870j970J59517
$$ plain form
40367 262170 127770 -727333 -1792273 -1956482 -1195940 -860397 -1664330 -2556485 -2492258 -2175012
40357 -2175012 -2762893 -3756982 -3688409 -2371653 -979850 -178291 353608 651681 183646
40348 183646 -966903 -1860743 -1981272 -1835125 -2059974 -2720618 -3557578 -4155433 -3940345
40339 -3940345 -2882696 -2024153 -2248098 -2718767 -1862753 128375 1289546 617698 -742414
40330 -742414 -1531556 -1996759 -2660726 -2970954 -2362383 -1536842 -1427085 -1719808 -1575452 -1087013
40320 -1087013 -870021 -844336 -582535 -313332 -424172 -478445 69533 629294 229643 -793499
40310 -793499 -1181942 -655417 -109403 25693 262214 763549 910205 499216 182763 263242
40300 263242 136283 -530662 -1049841 -772683 -69502 386080 578743 749403 704156 244664
$$ packed form
40367B62170j34400q55103j064940j64209P60542L35543q03933q92155O4227L17246
40357b175012n87881r94089O8573J316756J391803Q01559N31899K98073m68035
40348A83646j150549q93840j20529J46147k24849o60644q36960n97855K15088
40339c940345J057649Q58543k23945m70669Q56014J991128J161171o71848j360112
40330g42414p89142m65203o63967l10228O08571Q25541J09757k92723J44356M88439
40320a087013K16992K5685K61801K69203j10840n4273N47978N59761l99651j023142
40310g93499l88443N26525N46014J35096K36521N01335J46656m10989l16453Q0479
40300B63242j26959o66945n19179K77158P03181M55582J92663J70660m5247m59492
$$ plain form
40290 244664 -236176 -293382 -154256 -260652 -467397 -349229 8891 183376 132322 109953
40280 109953 54542 -291607 -759188 -879835 -612520 -357521 -242572 -20060 208880 -161741
40270 -161741 -1288373 -2254116 -1971730 -567188 630717 533572 -656076 -1971071 -2850280
40261 -2850280 -3373323 -3560183 -3123532 -2154412 -1466908 -1674098 -2205196 -1922341 -671986
40252 -671986 470360 662007 333186 391995 943273 1375180 1412219 1429736 1715280 1934861
40242 1934861 1563053 618391 -247927 -401891 102648 584744 514044 89434 -145476 -108236
40232 -108236 -213024 -624915 -975121 -999890 -990018 -1247324 -1446741 -1009080 34959 969942
40222 969942 1184521 765962 301191 266923 613800 849859 562227 -131993 -765531 -1106102
$$ packed form
40290B44664m80840n7206J39126j06396k06745J18168L58120J74485n1054k2369
40280A09953n5411l46149m67581j20647K67315K54999J14949K22512K28940l70621
40270a61741j126632r65743K82386J404542J197905r7145j189648j314995q79209
40261b850280n23043j86860M36651R69120O87504k07190n31098K82855J250355
40252f71986J142346J91647l28821N8809N51278M31907L7039J7517K85544K19581
40242A934861l71808r44662q66318j53964N04539M82096p0700m24610k34910L7240
40232a08236j04788m11891l50206k4769R872k57306j99417M37661J044039R34983
40222I69942K14579m18559m64771l4268L46877K36059k87632o94220o33538l40571
$$ plain form
40212 -1106102 -1315652 -1537762 -1684084 -1722085 -1794316 -1885254 -1737437 -1294562 -854641 -563304
40202 -563304 -145175 608099 1467453 2112702 2404121 2114856 1059065 -119568 -75283
40193 -75283 1574051 3319515 3410720 2007168 722762 378303 348085 19117 -361549
40184 -361549 -557893 -954801 -1761368 -2388526 -2185819 -1295592 -374989 104124 25215 -419269
40174 -419269 -717775 -464799 53733 249554 269238 852077 1940363 2383216 1548973 362763
$$ packed form
40212a106102k09550k22110j46322l8001p2231r0938J47817M42875M39921K91337
40202e63304M18129P53274Q59354O45249K91419k89265j055791j178633M4285
40193g5283J649334J745464R1205j403552j284406l44459l0218l28968l80666
40184c61549j96344l96908q06567o27158K02707Q90227R20603M79113p8909m44484
40174d19269k98506K52976N18532J95821J9684N82839J088286M42853q34243j186210
$$ [...]
##END NTUPLES=NMR SPECTRUM
##END=
