##TITLE=31Pdec_LR-685A-1(R)
 , 24 sc
 24.7.2019
##JCAMPDX= 6.0         $$ Bruker NMR JCAMP-DX V2.0
##DATA TYPE= NMR SPECTRUM
##DATA CLASS= NTUPLES
##ORIGIN= UXNMR, Bruker Analytische Messtechnik GmbH
##OWNER= root
$$ XWIN-NMR		Version 3.5
$$ Wed Jul 24 15:04:37 2019 Russian Standard Time (UT+4h)  she@DPX200
##.OBSERVE FREQUENCY= 81.014009
##.OBSERVE NUCLEUS= ^31P
##.ACQUISITION MODE= SIMULTANEOUS
##.ACQUISITION SCHEME= undefined
##.AVERAGES= 24
##.DIGITISER RES= 16
##SPECTROMETER/DATA SYSTEM= spect
##.PULSE SEQUENCE= zgpg30
##.SOLVENT NAME= CDCl3
##.SHIFT REFERENCE= (INTERNAL, CDCl3, 0, 250.885)
##AUDIT TRAIL= $$ (NUMBER, WHEN, WHO, WHERE, WHAT)
$$ ##TITLE= Audit trail, XWIN-NMR		Version 3.5
$$ ##JCAMPDX= 5.01
$$ ##ORIGIN= Bruker BioSpin GmbH
$$ ##OWNER= she
$$ F:/spectra/data/she/nmr/P31/1/pdata/1/auditp.txt
$$ ##AUDIT TRAIL=  $$ (NUMBER, WHEN, WHO, WHERE, WHAT)
(   1,<2019-07-24 15:02:56.82 +0400>,<she>,<DPX200>,
      <created by zg, POWCHK disabled, PULCHK disabled
       configuration hash MD5:
       00 E9 B6 7A A2 85 ED C7 34 08 36 98 17 FE 4E 26
       data hash MD5: 32K
       7C 30 7A 12 AB 03 C5 C8 87 31 A4 16 08 93 66 04>)
(   2,<2019-07-24 15:03:19.81 +0400>,<she>,<DPX200>,
      <Start of raw data processing
       ef BC_mod = 2 LB = 1 FT_mod = 6 PKNL = 1 SI = 64K 
       data hash MD5: 64K
       C6 05 A8 0A 1C C0 E3 7B BE E2 45 BE 4B 18 73 85>)
(   3,<2019-07-24 15:03:52.81 +0400>,<she>,<DPX200>,
      <pk PHC0 = -201.089 PHC1 = 93.79999 
       data hash MD5: 64K
       24 68 61 55 7B 24 72 B9 CE C6 D2 56 BE 6A 53 3E>)
$$ ##END=
$$ 
$$ hash MD5
$$ E5 F2 D6 FE FC D3 08 24 BE 2F 80 D0 81 9A 51 7E
##$RELAX= 
##$RELAX= 
##$RELAX= 
##$RELAX= 
##$RELAX= 
##$RELAX= 
##$RELAX= 
##$RELAX= 
$$ Bruker specific parameters
$$ --------------------------
##$DU= <F:/spectra>
##$EXPNO= 1
##$NAME= <P31>
##$PROCNO= 1
##$TYPE= <nmr>
##$USER= <she>
##$AMP= (0..31)
100 100 100 100 100 100 100 100 100 100 100 100 100 100 100 100 100 100 
100 100 100 100 100 100 100 100 100 100 100 100 100 100 
##$AQSEQ= 0
##$AQ_mod= 1
##$AUNM= <au_zg>
##$AUTOPOS= <>
##$BF1= 81.014009
##$BF2= 200.13
##$BF3= 200.13
##$BF4= 200.13
##$BF5= 200.13
##$BF6= 200.13
##$BF7= 200.13
##$BF8= 200.13
##$BYTORDA= 1
##$CFDGTYP= 0
##$CFRGTYP= 5
##$CHEMSTR= <none>
##$CNST= (0..31)
1 1 145 1 1 1 1 1 1 1 1 1 1 1 1 1 1 1 1 1 1 1 1 1 1 1 1 1 1 1 1 1 
##$CPDPRG= <waltz16>
##$CPDPRG1= <>
##$CPDPRG2= <waltz16>
##$CPDPRG3= <>
##$CPDPRG4= <mlev>
##$CPDPRG5= <mlev>
##$CPDPRG6= <mlev>
##$CPDPRG7= <mlev>
##$CPDPRG8= <mlev>
##$CPDPRGB= <>
##$CPDPRGT= <>
##$D= (0..31)
0 1 0 0 0 0 0 0 0 0 0 0.03 2e-05 3e-06 0 0 0 0 0 0 0 0 0 0 0 0 0 0 0 0 
0 0 
##$DATE= 1563966176
##$DBL= (0..7)
120 120 120 11 120 120 24 19 
##$DBP= (0..7)
150 150 150 150 150 150 150 150 
##$DBP07= 0
##$DBPNAM0= <>
##$DBPNAM1= <>
##$DBPNAM2= <>
##$DBPNAM3= <>
##$DBPNAM4= <>
##$DBPNAM5= <>
##$DBPNAM6= <>
##$DBPNAM7= <>
##$DBPOAL= (0..7)
0.5 0.5 0.5 0.5 0.5 0.5 0.5 0.5 
##$DBPOFFS= (0..7)
0 0 0 0 0 0 0 0 
##$DE= 6
##$DECBNUC= <off>
$$ [...]
##$SUBNAM2= <"">
##$SUBNAM3= <"">
##$SUBNAM4= <"">
##$SUBNAM5= <"">
##$SUBNAM6= <"">
##$SUBNAM7= <"">
##$SUBNAM8= <"">
##$SUBNAM9= <"">
##$SW= 501.770088973933
##$SWIBOX= (0..15)
0 1 3 0 0 0 0 0 0 0 0 0 0 0 0 0 
##$SW_h= 40650.406504065
##$TD= 32768
##$TD0= 1
##$TE= 0
##$TE2= 300
##$TE3= 300
##$TEG= 300
##$TL= (0..7)
0 120 53 12 22 120 120 120 
##$TP= (0..7)
150 150 150 150 150 150 150 150 
##$TP07= 0
##$TPNAME0= <>
##$TPNAME1= <>
##$TPNAME2= <>
##$TPNAME3= <>
##$TPNAME4= <>
##$TPNAME5= <>
##$TPNAME6= <>
##$TPNAME7= <>
##$TPOAL= (0..7)
0.5 0.5 0.5 0.5 0.5 0.5 0.5 0.5 
##$TPOFFS= (0..7)
0 0 0 0 0 0 0 0 
##$TUNHIN= 0
##$TUNHOUT= 0
##$TUNXOUT= 0
##$USERA1= <user>
##$USERA2= <user>
##$USERA3= <user>
##$USERA4= <user>
##$USERA5= <user>
##$V9= 5
##$VALIST= <valist>
##$VCLIST= <CCCCCCCCCCCCCCC>
##$VD= 0
##$VDLIST= <DDDDDDDDDDDDDDD>
##$VPLIST= <PPPPPPPPPPPPPPP>
##$VTLIST= <TTTTTTTTTTTTTTT>
##$WBST= 1024
##$WBSW= 4
##$XGAIN= (0..3)
0 0 0 0 
##$XL= 0
##$YL= 0
##$YMAX_a= 49864
##$YMIN_a= -63060
##$ZGOPTNS= <>
##$ZL1= 120
##$ZL2= 120
##$ZL3= 120
##$ZL4= 120
##$ABSF1= 0
##$ABSF2= 0
##$ABSG= 0
##$ABSL= 0
##$ALPHA= 0
##$AQORDER= 0
##$ASSFAC= 0
##$ASSFACI= 0
##$ASSFACX= 0
##$ASSWID= 0
##$AUNMP= <proc_1d>
##$AZFE= 0.1
##$AZFW= 0.5
##$BCFW= 0
##$BC_mod= 2
##$BYTORDP= 0
##$COROFFS= 0
##$CY= -3
##$DATMOD= 1
##$DC= 0
##$DFILT= <>
##$DTYPP= 0
##$F1P= 0
##$F2P= 0
##$FCOR= 1
##$FTSIZE= 65536
##$FT_mod= 6
##$GAMMA= 0
##$GB= 0
##$INTBC= 1
##$INTSCL= 5.30512e-09
##$ISEN= 30
##$LB= 1
##$LEV0= 0
##$LPBIN= 0
##$MAXI= 10000
##$MC2= 0
##$MEAN= 0
##$ME_mod= 0
##$MI= 50
##$NCOEF= 0
##$NC_proc= -5
##$NLEV= 6
##$NOISF1= 182.463
##$NOISF2= 159.3651
##$NSP= 0
##$NTH_PI= 0
##$NZP= 0
##$OFFSET= 250.885
##$PC= 4
##$PHC0= -201.089
##$PHC1= 93.79999
##$PH_mod= 1
##$PKNL= yes
##$PPARMOD= 0
##$PSCAL= 0
##$PSIGN= 0
##$REVERSE= no
##$SF= 81.0140089999434
##$SI= 65536
##$SIGF1= 159.3651
##$SIGF2= -187.1042
##$SINO= 113.3802
##$SIOLD= 16384
##$SREGLST= <1H.CDCl3>
##$SSB= 0
##$STSI= 65536
##$STSR= 0
##$SW_p= 40650.406504065
##$SYMM= 0
##$S_DEV= 0
##$TDeff= 32768
##$TDoff= 0
##$TI= <>
##$TILT= no
##$TM1= 0
##$TM2= 0
##$TOPLEV= 0
##$USERP1= <user>
##$USERP2= <user>
##$USERP3= <user>
##$USERP4= <user>
##$USERP5= <user>
##$WDW= 1
##$XDIM= 65536
##$YMAX_p= 518570432
##$YMIN_p= -93488018
$$ End of Bruker specific parameters
$$ ---------------------------------
##NTUPLES= NMR SPECTRUM
##VAR_NAME=  FREQUENCY,     SPECTRUM/REAL,   SPECTRUM/IMAG
##SYMBOL=    X,             R,               I
##VAR_TYPE=  INDEPENDENT,   DEPENDENT,       DEPENDENT
##VAR_FORM=  AFFN,          ASDF,            ASDF
##VAR_DIM=   65536,         65536,           65536
##UNITS=     HZ,            ARBITRARY UNITS, ARBITRARY UNITS
##FACTOR=    0.620285442955139, 1,           1
##FIRST=     20325.1992029276, 0,            0
##LAST=      -20325.2073011374, 0,           0
##MIN=       -20325.2073011374, -93488018,   0
##MAX=       20325.1992029276, 518570432,    0
$$ Real data points
##PAGE= N=1
##DATA TABLE= (X++(R..R)), XYDATA
$$ [...]
41728 2324421 813514 -765042 -1158339 4163 1927173 3502103 4017104 3150184 1105326
41719 1105326 -1026258 -1908992 -1411659 -703825 -575539 -567987 -209252 41106 -109285 118410
41709 118410 1229665 2173535 1776952 688511 353413 657321 363004 -414286 -142408
41700 -142408 1509510 2835617 2491552 1205260 347292 118737 24100 -12964 -11818 -486126
41690 -486126 -1563675 -2235543 -1545562 -61718 853340 937613 1198476 2257665 3421399
41681 3421399 3591149 2508544 873992 -401165 -874879 -722076 -366698 7279 496957
41672 496957 1061938 1338494 1041318 402908 78192 642659 2068485 3492456 3715309
41663 3715309 2394619 654652 -27946 496967 1118387 1159105 1083032 1265993 1133275
41654 1133275 264356 -475069 51571 1523600 2473001 2163551 1239775 567767 382632
41645 382632 679148 1420254 1945604 1123025 -1134045 -3138488 -3186267 -1760774 -949324
41636 -949324 -1618514 -2297048 -1419945 308440 892710 -119550 -1153570 -1018851 -387801
41627 -387801 -243619 -151976 696627 1582027 1006368 -845324 -1972498 -1200901 365277
41618 365277 1093607 895637 780921 1230148 1899053 2332807 2160015 1095358 -445958
41609 -445958 -1209216 -436418 1017874 1732007 1494161 1110089 838082 249638 -447206
41600 -447206 -324018 681450 1320768 820300 101572 366414 1242294 1397084 590174
41591 590174 -4507 477672 1500788 2043898 1888923 1542001 1338906 1184745 1013349
41582 1013349 981883 1125420 1213155 1193185 1516507 2607656 4031223 4634502 3786328 2197944
41572 2197944 1167842 1192582 1731464 2195586 2552353 2839667 2756034 2193663 1707518 1831244
41562 1831244 2182187 1935512 1104839 583056 768621 972302 650540 476399 1337387
41553 1337387 2696506 3025269 1916825 764413 917768 1945897 2369635 1605626 454052
41544 454052 -106794 69195 465593 574419 346976 258634 813805 1741666 2013735 1102266
41534 1102266 -152104 -577127 -252307 -208851 -741667 -1080366 -842254 -693551 -1115771
41525 -1115771 -1474050 -983977 75610 777707 685004 48771 -656337 -962724 -694680
41516 -694680 -369902 -640691 -1017984 -171934 1867708 3007573 1718548 -643096 -1599936
41507 -1599936 -872512 -209785 -347651 -121042 1229878 2691745 3019547 2265756 1173676
41498 1173676 238530 -64860 725982 2185868 3098008 2984326 2584774 2382405 1840819
41489 1840819 726554 -72686 75031 484646 424558 364992 919223 1613679 1876893 2171006
41479 2171006 2794459 2684735 1145800 -180469 775775 3087139 3629063 1413817 -1090864
41470 -1090864 -1531725 -513410 119858 98582 379314 1089788 1357158 799612 60503
41461 60503 -91963 413240 918942 562549 -820770 -2136586 -1930255 -108601 1835615
41452 1835615 2576848 2237000 1626029 1083069 628825 455224 513594 252078 -465170 -752056
41442 -752056 119165 1383948 1605634 629125 -208358 159388 1309004 2006215 1547343
41433 1547343 292696 -723374 -615115 611406 2056406 2801168 2682080 2103774 1438919
41424 1438919 922193 779940 986529 1115140 906074 804685 1427561 2585711 3332048
41415 3332048 2993905 1790043 457156 -373097 -470340 -84042 217864 90788 -167614
41406 -167614 2921 618547 1006900 555821 -599377 -1758636 -2413704 -2661568 -2803810
41397 -2803810 -2667442 -1668891 234095 1966470 2206634 804045 -1080372 -2244149 -2483597
41388 -2483597 -2436307 -2815463 -3726476 -4351026 -3593703 -1618964 -258908 -875344 -2250341
41379 -2250341 -2099016 -516729 58768 -1243108 -2081723 -474071 1916388 2040132 -229166
41370 -229166 -2203528 -2149187 -874571 200343 628991 492219 8451 -151265 547848
41361 547848 1475765 1583194 1130865 1352545 2374791 2874354 2013246 443483 -845070
41352 -845070 -1516528 -1577628 -1225098 -1102408 -1579377 -1825027 -857527 631208 1001449 112306
41342 112306 -646825 -700161 -686862 -453238 998903 3035183 3340110 1366817 -495249
41333 -495249 -470941 199612 -14502 -183215 939024 2076762 1411614 -73184 -48330
41324 -48330 1309765 1758887 809201 348326 1446839 2996422 3803665 3893972 3381198
41315 3381198 2032678 467179 40212 963101 1977802 2294629 2435315 2820430 2984255
41306 2984255 2618737 2051966 1327772 159025 -891656 -667813 678775 1496061 919668
41297 919668 -33842 -285651 -195301 -432540 -648896 -271907 366819 608153 365170 -232546
41287 -232546 -1181412 -1923406 -1348764 660625 2565442 2924756 2083924 1354927 1322618
41278 1322618 1789624 2594203 3509236 3953309 3756367 3747561 4775079 6607467 8512082
41269 8512082 10325169 12112720 13320797 13231974 11967561 10229498 8323018 6174309
41261 6174309 4050746 2508697 1716283 1358558 1115621 924252 1006380 1799987 3388660
41252 3388660 4866374 5002670 3808326 2594107 2143236 1858988 1200436 699914 723156
41243 723156 506572 -384978 -807362 277896 1807529 1978532 948856 446553 1125958
41234 1125958 2076259 2677244 3082911 2919930 1471330 -526530 -1133473 110356 1343447
41225 1343447 972888 -305799 -891087 -390936 533201 1267490 1235279 -110150 -2157817
41216 -2157817 -2922599 -1211992 1611928 3209131 3068151 2522066 2418364 2261390 1701723
41207 1701723 1434703 2049081 2972507 3284347 2974355 2694010 2628955 2339547 1611206 788474
41197 788474 151399 -436750 -965809 -941336 -179246 519149 354001 -24126 804245 2704649
41187 2704649 3638812 2370319 360317 -212799 562268 820777 -158269 -1272781 -1731198
41178 -1731198 -2016029 -2320125 -1781044 -163521 1114647 796230 -369978 -727269 121961
41169 121961 1327389 2229341 2549244 1729408 -429054 -2600858 -2863557 -1111732 599781
41160 599781 613554 -394087 -719550 -72089 358018 -28465 -366346 25475 187765 -1097828
41150 -1097828 -2896210 -2708347 45154 2659228 2477061 387134 -757981 -368610 -415608
41141 -415608 -1669171 -2372525 -1466016 -529270 -933269 -1315887 -69782 1490641 1161578
41132 1161578 -190641 204349 2398406 3516647 2432028 1427224 2124757 2726895 1203288
41123 1203288 -1103904 -1509186 -158769 401384 -802451 -2034496 -1712059 -369582 738223
41114 738223 1425402 2152840 2802338 2750429 1827804 683876 217335 689896 1323272 996883
41104 996883 -431557 -1840286 -2185065 -1642190 -951493 -267954 499494 750203 -227348
41095 -227348 -1879252 -2735091 -2229330 -1177916 -358938 273643 730456 559114 -157592
41086 -157592 -438432 202222 857531 540041 -362424 -831324 -741283 -607775 -342278 534346
41076 534346 1637538 1849687 801633 -696851 -1800429 -2346666 -2355828 -1769778 -982699
41067 -982699 -774420 -1277234 -1679659 -1369561 -754332 -519000 -661067 -760429 -714909 -698036
41057 -698036 -778685 -1022097 -1578971 -2285643 -2640256 -2591561 -2777604 -3408690 -3528913 -2238871
41047 -2238871 -238351 818219 330993 -803501 -1662036 -2172935 -2365741 -1790450 -274480
41038 -274480 1367963 2003798 1311286 -87331 -1356624 -2041645 -2176103 -2068087 -1900649
41029 -1900649 -1520622 -791929 -42190 209322 -84841 -526748 -911321 -1333120 -1668001
41020 -1668001 -1554640 -1015223 -515573 -240275 114741 638934 928249 793977 630931
41011 630931 713516 705940 285526 -298401 -727918 -1127969 -1596080 -1793952 -1581050 -1498505
41001 -1498505 -1945328 -2389051 -2184927 -1724845 -1834253 -2345761 -2361364 -1877049 -2008366 -3296468
40991 -3296468 -4734543 -4995779 -3962116 -2509360 -1341601 -706385 -907976 -2243602 -4242091
40982 -4242091 -5538720 -4999820 -2889575 -593386 805167 1295587 1235077 544356 -779052
40973 -779052 -1828663 -1509848 -94575 984076 1146867 1406775 2583477 3879963 4111822
40964 4111822 3429735 2712857 1974910 673649 -838714 -1548248 -1330053 -1034522 -1057892
40955 -1057892 -993419 -721704 -667961 -855716 -843374 -753082 -1207933 -2059357 -2393292 -2049822
40945 -2049822 -1816230 -1761508 -910299 734979 1442250 204563 -1370837 -1136821 539274
40936 539274 1427288 637057 -458226 -416087 586235 1460784 1495017 657315 -508375
40927 -508375 -1038451 -314414 1107129 1982740 1768098 967813 178603 -475210 -910192
40918 -910192 -888678 -480926 -61047 358698 1112951 1976233 2051595 1036909 -61218 -128154
40908 -128154 575587 799650 -83926 -1491378 -2493853 -2605944 -1727338 -39578 1729858
40899 1729858 2501498 1827037 462635 -445795 -589352 -511896 -571513 -470660 89886 825341
40889 825341 1210576 1066968 608238 247151 469569 1356950 2013642 1219906 -804742
40880 -804742 -2047661 -986112 1343581 2590260 1960038 659914 -172938 -501535 -401829
40871 -401829 272212 838996 49938 -1822252 -2648736 -1266227 667488 949346 -106623
40862 -106623 -407554 850274 2454413 3136910 2746756 1618021 186931 -733158 -584549
40853 -584549 -101245 -539335 -1734681 -2139853 -1087190 190042 334184 -360652 -642192
40844 -642192 -1316 1056908 1913774 2285104 2045352 1221385 133613 -796089 -1380624
40835 -1380624 -1681657 -1748753 -1416252 -393950 1258163 2702308 2816973 1491803 38243
40826 38243 -234496 433454 712032 -82049 -1379928 -2285802 -2372314 -1661938 -552721 250858
40816 250858 367094 236859 431244 719593 569450 262731 524860 1212108 1465367 1141571
40806 1141571 953167 1121907 1102802 816043 846174 1060183 400838 -1286258 -2458292
40797 -2458292 -1780090 124707 1630543 1956390 1326079 233473 -574351 -263729 942719
40788 942719 1534980 617769 -665814 -662554 510153 1391667 1365047 1165236 1498881 2312817
40778 2312817 3242336 3758717 3144853 1431109 97018 595683 2277642 3053822 2140841
40769 2140841 821458 316069 339890 275410 415105 1171980 2075109 2511521 2719551 3089433
40759 3089433 3077241 1884099 -66300 -1329739 -1119225 -24750 957933 1399924 1319873
40750 1319873 788363 25367 -514182 -522512 -119647 441163 1089439 1717078 1933045 1473767
40740 1473767 757485 551801 1010367 1484586 1480119 1336413 1591770 2095361 2299877 2127212
40730 2127212 1864484 1424814 581783 -120217 226817 1318221 1647497 737634 190674
40721 190674 1393139 3120380 2982001 780494 -1315184 -1942735 -2052497 -2691879 -3064417
40712 -3064417 -2051333 -426181 42728 -875206 -1727811 -1558814 -848272 -213205 514655
40703 514655 1505723 2280616 2413631 2153741 1888175 1680600 1732023 2448034 3454549 3432335
40693 3432335 1818205 -59340 -600426 -83206 61069 -343655 -110843 1060160 1929305
40684 1929305 1759445 1458332 1879065 2327382 1820220 742282 63122 -210994 -538642
40675 -538642 -561521 241687 1144590 954303 -38009 -410641 124508 357998 -288036 -766796
40665 -766796 -100018 1174595 1943943 1934645 1502349 823834 457 -650554 -1013610 -1386652
40655 -1386652 -1832878 -1859342 -1156133 -119025 752316 1444282 2064967 2447521 2488721 2382922
40645 2382922 2232187 1947703 1724293 1940244 2355322 2159854 1123777 -41962 -709866
40636 -709866 -856325 -343123 1158621 3015078 3636825 2504063 1136811 1062267 1783997
40627 1783997 1920485 1485225 1606335 2494804 3174566 3125479 2913157 3054571 3278961 3178955
40617 3178955 2897623 2925808 3568974 4579712 5074461 4159604 2037625 91291 -572489
40608 -572489 -215306 289473 625949 844936 758745 423419 656901 2078186 3962248
40599 3962248 4928775 4511956 3347855 2218483 1653655 1986712 2940812 3574356 3436999
40590 3436999 3276691 3783666 4315286 3941000 3116929 3021268 3648644 3912762 3404634 2749214
40580 2749214 2337886 1933907 1500243 1330121 1414582 1620241 2219818 3230785 3681141
40571 3681141 2812642 1613247 1692381 2918556 3748276 3710759 3828249 4539685 5011320
40562 5011320 4809252 4552675 4472638 3960986 3095239 2989624 3867955 4242084 2935270
40553 2935270 794786 -428515 46805 1881842 4284554 6164236 6589340 5773845 4877011
40544 4877011 4475278 4113258 3544253 3226980 3283133 3231271 3112395 3504257 4016134 3354688
40534 3354688 1541939 445640 1187618 2532887 2887871 2440100 2137966 1950842 1528761
40525 1528761 1396213 2026647 2688334 2578992 2221741 2437945 2862408 2832213 2810064 3441895
40515 3441895 4065118 3742875 3018393 2959896 3131518 2360198 1064203 837866 1818297
40506 1818297 2390592 1736172 926505 1028003 1640871 1923374 1785792 1391836 544836
40497 544836 -689031 -1548520 -1453695 -731685 61863 983577 2302179 3686707 4397238
40488 4397238 4151742 3431029 3002104 3357653 4490360 5933055 6988198 7151354 6560122
40479 6560122 6025548 6323772 7291347 7941444 7738072 7292954 7303733 7387491 6871932 6231544
40469 6231544 6386048 6756220 5677729 3081313 1096265 1200477 2238476 2343707 1573628
40460 1573628 1305060 1924443 2573326 2746362 2873892 3403649 4137399 4448384 3805194
40451 3805194 2402446 1364511 1578193 2256418 1830206 485535 242926 1922124 3810687
40442 3810687 4372069 4399923 4959988 5032952 3384364 1423383 1631565 3757380 5013361
40433 5013361 3965582 2116198 1451307 2217598 3496885 4585577 5358254 6073597 6920627
40424 6920627 7380612 6680022 5391035 5355645 7049032 8509939 8323106 8053249 9819470
40415 9819470 13088173 16264438 19935977 25726154 33404182 42454573 54874927 71588618
40407 71588618 86411346 89213567 77109494 58426503 43367951 34313766 27682846
40400 27682846 21463722 16824524 14377930 13017296 12080671 11775727 11601804 10571945
40392 10571945 8918888 7844336 7696600 7743905 7453498 6831012 5930037 5070974 4964728
40383 4964728 5619342 5847766 4910249 3837914 3955991 4858343 5094531 4219345 2953530
40374 2953530 1914993 1372907 1680564 2743109 3511965 3124137 2167653 1894489 2658943
40365 2658943 3970845 5434076 6686592 7092111 6525196 5875058 5839255 5899211 5418782
40356 5418782 4920095 5156126 5727498 5860060 5837140 6376060 7227764 7676090 7802236 7979446
40346 7979446 7804646 6930325 6284213 6923053 8235929 8861749 8847060 9198954 9814299
40337 9814299 9789815 9468894 10035574 11050453 10629510 8556475 7112029 7913939 9714349
40328 9714349 10457826 10064434 9861677 10302921 10622947 10233335 9348428 8447837 7879512
40319 7879512 7858682 8371094 9179837 10084369 10874778 11057552 10289941 9251462 9286589 10713136
40309 10713136 12141017 12117523 11034443 10680429 11987648 13852598 14440997 13329049 11906384
40300 11906384 11599761 12202341 12509030 12299934 12701164 14361090 16329823 17469058 18160809
40291 18160809 19651242 22194758 24811634 26604911 27510442 28043102 29058466 31393840
40283 31393840 34948696 38534628 41460491 44725379 49638676 55840422 61940659 67640185
40275 67640185 73779965 80638131 87818693 95735627 105462268 116846793 128345276 139050816
40267 139050816 149329266 159009810 166535922 170550808 170864557 167250386 159000978 146763219
40259 146763219 133335715 121289545 110814197 100977287 91836404 83885504 76572423
40252 76572423 69177817 62487657 57782893 54534102 50906073 46506012 42877822 40974133
40244 40974133 39755105 37946092 35855178 34521818 33965111 33281598 32036311 30719177
40236 30719177 29977758 29978529 30455051 30968168 31140940 30916969 30580526 30390627 30299342 30138840
40226 30138840 29896103 29616875 29216902 28644077 28109560 27857299 27739172 27338335 26558745
40217 26558745 25754041 25151675 24557732 23919364 23717961 24210804 24617518 23956162 22671357
40208 22671357 22376884 23596025 24812236 24581806 23735830 24300827 26667161 29110169 30104612
40199 30104612 29990097 30163231 31580754 34277617 37431148 39611719 39914810 39273171 39739804
40190 39739804 41911446 43937966 43831469 41973615 40350953 39854785 39523930 38334932
40182 38334932 36577813 35136023 34275995 33711663 33322318 33126353 32753805 31662921 30058555
40173 30058555 29031474 29342266 30425857 31186688 31523044 32227957 33442366 34354632 34796935
40164 34796935 35832979 37857764 39384532 39211932 38810767 40555738 44071857 46660027
40156 46660027 47468011 48789741 52467187 57388022 61934639 66761691 73163216 80396617
40148 80396617 87099027 94307109 104356978 117062088 129563572 140290577 150762491
40141 150762491 162710151 175388856 186824255 196089326 202974382 206582925 205877010 201232338
40133 201232338 194264360 186237317 177463036 168127800 158947244 150876945 144506242 139718869
40125 139718869 135845713 132399542 129705024 128348128 127954462 127256182 125679031 124045827
40117 124045827 123128157 122275168 120332310 117348229 114355739 111753474 108915815 105337106
40109 105337106 101257803 97137017 93337489 90361244 88499424 87082022 84958687 82019264
40101 82019264 79411513 77888603 76778055 75092489 72868020 70760157 69031865 67698484
40093 67698484 67025785 66987321 66760851 65770786 64810226 64987811 65829939 65733943 64332776
40084 64332776 63096736 63291942 64549962 65875363 66839459 67140932 66199812 64160777 62382271
40075 62382271 61926607 62327278 62767645 63508148 64869915 65732850 64826090 63063729 62657996
40066 62657996 63885744 64642025 63576408 61767523 60501190 59244850 57206753 55463911
40058 55463911 55722250 57658391 59186505 59098754 57958795 56488656 54634929 52611487
40050 52611487 51540892 52224940 53952711 55242245 55448799 55167205 55282192 56057059 57144541
40041 57144541 58244239 59557189 61391888 63315061 64182820 63471821 62193502 61714585
40033 61714585 61794409 60764026 57946559 54958862 53850562 54535809 55066258 54304517 53245342
40024 53245342 53271837 53991753 53813483 52454137 51717773 53214313 56091702 58087208 58624200
40015 58624200 59635896 62864420 67385659 70780198 72149905 72764067 73866292 75158572
40007 75158572 75897965 76440372 77851928 80543318 84139212 88474207 93938920 100791498
39999 100791498 108731842 117404834 127034882 138375188 152112080 168301089 186264625
39992 186264625 205071254 224103013 242820529 259740324 272068441 277039236 273791913
39985 273791913 263711172 249061681 231730532 213244771 195321269 179822971 168076624
39978 168076624 160214477 155136784 151388757 148487140 147364960 149272963 154506602 162660933
39970 162660933 173772307 188396971 206757335 228841387 255302418 286809781 321780373
39963 321780373 355699971 383358283 400977884 406026777 397071968 375711926 347467293
39956 347467293 318344057 290481278 262765521 235282720 210832496 191674674 177031614
39949 177031614 164889484 154547772 146087042 138713088 131294304 123939972 117745797 113260108
39941 113260108 110079922 107637048 105669838 104203808 103502054 103604345 103721329 102902359
39933 102902359 101559059 101187052 102092149 102733532 102101877 101297286 101620045 102550832 103109862
39924 103109862 103824986 105424305 106700804 105995135 104201455 103907940 105674635 107420462
39916 107420462 107656152 107151811 106956400 106794933 106165189 105296736 104176892 102053368 98719526
39907 98719526 95122545 92076107 89479825 87223498 85577487 84247893 82436632 80366806
39899 80366806 79317021 79562700 79825132 79480592 79623950 80847029 81547716 79931678 76570549
39890 76570549 73508968 71642693 70292770 68709699 66783726 64751051 63167420 62710680
39882 62710680 63315761 64141963 64900238 66200933 67983848 68964883 68644664 68478783 69689585
39873 69689585 71145146 70997364 69373499 67668461 65995818 63307206 59644503 56412163
39865 56412163 54450024 53316628 52423832 51595265 50631000 49473458 48559084 47973916 46815774
39856 46815774 44607269 42614246 42227930 42716109 42359599 41233315 40806489 41173705 41020094
39847 41020094 40346205 40790175 42752914 44466528 44704929 44369781 44441653 44300198 43272455
39838 43272455 42130284 41664467 41178604 39817668 38205896 37311049 36668758 35272733 33557460
39829 33557460 32968601 33817609 34799426 34608877 33185981 31436449 30365402 30402603 31177901
39820 31177901 32127533 33417379 35705119 38835540 41616712 43302155 44454983 45831696
39812 45831696 47299142 48537568 49946118 51915366 53750656 54172615 52579587 49332781
39804 49332781 45344860 41858623 39857435 38950378 37445506 34244392 30148703 26747613
39796 26747613 24709454 23752589 23430773 23156630 22285603 21022907 20363365 20267006 19088584
39787 19088584 16148006 13663679 14174279 16742851 17944214 16491770 14665623 14777263
39779 14777263 16301242 17368419 17349151 16748563 15826834 14689872 14019402 14499715 15809042
39770 15809042 16932153 17157674 16302281 14563690 12790109 12270288 13410117 14979996
39762 14979996 15410684 14532496 13396947 12796838 12752080 13105806 13709735 14222030 14677887
39753 14677887 16116648 19491688 23857344 26958981 28195349 29780507 33965898 40046189
39745 40046189 45431840 49065807 52099754 55203743 57013041 56069634 53028915 49799357
39737 49799357 47245012 44851888 42159782 39354703 36651130 34163606 32343610 31552271
39729 31552271 31182069 30209873 28761054 28117456 28892019 30163404 30818525 30820160 30623880
39720 30623880 30234075 29533229 28815605 28246601 27376292 25885880 24243965 22904379 21442543
39711 21442543 19317035 16957296 15163973 13864822 12479170 11183545 10686685 10872229
39703 10872229 10799423 10122788 9440049 9025384 8257312 6722856 5037429 4066885 3976226
39694 3976226 4456967 5252622 5999595 6159455 5690692 5362905 5871827 6972996 7933045
39685 7933045 8441287 8536405 8012441 6653567 4977893 4033122 4271109 5116838 5854360
39676 5854360 6484105 7350089 8263057 8579681 8199364 7961556 8667749 9961175 10711512
39667 10711512 10562554 10551352 11801363 13917877 15224432 14596342 12629741 10840608 10010725
39658 10010725 9588258 8618001 6976896 5494013 4886861 4897115 4792213 4505740 4637407
39649 4637407 5202174 5179580 3939880 2544817 2648023 4227622 5421648 4871441 3363335
39640 3363335 2637000 3248767 4330896 5027863 5275788 5192368 4555359 3289552 1959903
39631 1959903 1242100 1089505 917364 591411 707577 1635373 2682309 2702541 1468216
39622 1468216 15743 -465533 193930 1173087 1615510 1429236 1274915 1803168 2823825
39613 2823825 3403716 3048363 2528289 2996238 4429337 5670839 6047609 6093844 6411419
39604 6411419 6720075 6579621 6252975 6140686 6029646 5683567 5540462 5896707 5968662 4906079
39594 4906079 3409335 3129171 4512403 6319176 7285943 7244809 6603230 5848624 5692430
39585 5692430 6510486 7327052 6528877 4087005 1984901 1808585 2897025 3613787 3515049
39576 3515049 3295430 3270121 3017024 2323140 1683584 1842434 3128170 4975564 5990831
39567 5990831 5138883 3137290 1868190 2016466 2284211 1573048 784921 1362916 3025940
39558 3025940 4359478 4959091 5407923 5553166 4583746 2891567 2202202 3375649 5322642
39549 5322642 6574150 6852550 6658655 6361908 6248739 6584956 7100696 7144734 6684720
39540 6684720 6330087 6128875 5421839 4275904 3814922 4457189 5065454 4747665 4281521
39531 4281521 4583187 4929083 4266931 3445897 4303028 6861025 9183302 9998866 9879675
39522 9879675 9712750 9618466 9726486 10449309 11343684 11071274 9297139 7475701 6908645
39513 6908645 7083763 6874415 6359876 6240397 6186273 5171901 3236246 1744735 1807024
39504 1807024 3157956 4592718 4985903 4068710 2698659 2087688 2348486 2330211 1412636
39495 1412636 642341 1135364 2149314 2151211 1318186 1292005 2489179 3410050 3035480 2266785
39485 2266785 2178857 2258411 1531573 447395 355485 1609690 3262004 4355250 4662845
39476 4662845 4402704 4029027 4186019 5199552 6645066 7816677 8405684 8372266 7608082
39467 7608082 6317797 5349141 5418184 6186393 6726328 6733850 6678493 6921018 7342916 7809647
39457 7809647 8393903 9062949 9582875 9798389 9739497 9528633 9388035 9482541 9503767 8830130
39447 8830130 7501431 6530676 6629901 7084049 6706059 5620132 5176400 6128808 7711450
39438 7711450 8618487 8261772 7006891 5750665 5310129 5734177 6254414 6320927 6387934
39429 6387934 7071913 7931728 7982452 7160604 6253938 5536011 4657201 3918267 4316942 5928131
39419 5928131 7419060 7764116 7449455 7346751 7338342 6870021 6143572 5892456 6397434 7373936
39409 7373936 8426685 9072191 8776692 7557684 6174794 5250974 4626654 3985434 3503080
39400 3503080 3274294 2701840 1293995 -277495 -742234 288021 2067809 3775163 5077801
39391 5077801 5660458 5011271 3153273 1244728 860683 2391293 4340180 4730870 3410904
39382 3410904 2357076 3121574 4622566 4580594 2797781 1509662 2293560 4154151 5282982
39373 5282982 5285848 4718050 3686019 2217206 1154728 1315073 2217421 2756670 2703132
39364 2703132 2544048 2369096 2014525 1860955 2348024 3043166 3262467 3224081 3475068 3643124
39354 3643124 3088531 2432463 2889791 4144480 4459201 3158821 1624079 1409446 2535351
39345 2535351 4019196 4990252 4890151 3668758 2279127 2013196 2867690 3462948 2985493
39336 2985493 2222085 2161834 2589525 2762770 2600193 2396034 2077614 1600604 1540355 2420871
39326 2420871 3756248 4489428 4215752 3411835 2615556 1921356 1294974 1011109 1577003
39317 1577003 3132159 4902875 5608445 4812830 3577375 3213566 3713765 4182752 4462113
39308 4462113 5176036 6264463 6842581 6806061 7230390 8604944 9927551 10344852 10529606
39299 10529606 11379475 12298690 12044903 10714514 9614862 9375095 9282154 8523625 7245081
39290 7245081 6207322 5906075 6142972 6251629 5872506 5579689 6267932 7695310 8306279
39281 8306279 7030838 4701492 3054716 2786501 3268325 3777964 4192692 4583553 4822608
39272 4822608 4724599 4285041 3786809 3732722 4394673 5362148 5929489 5921850 5564385 4654096
39262 4654096 2872340 1035210 709217 1999561 3016813 2463552 1560990 2194179 4138938
39253 4138938 5565286 5589371 4832839 3927077 2985080 2332014 2317933 2437185 1896536 1040962
39243 1040962 1015586 1990461 2856248 2733173 1761081 470942 -525438 -349100 1350191
39234 1350191 3365359 3968772 3090713 2215465 2042473 1720277 699923 -203842 -231840
39225 -231840 206018 582722 1176056 2105755 2621957 2347599 2222511 3102728 4214910
39216 4214910 4158496 2897611 1685687 1397543 1876820 2587573 3010335 2681586 1703762
39207 1703762 983734 1161206 1546438 963388 -557098 -1824530 -2102592 -1694852 -889665
39198 -889665 573615 2553642 3954842 3888623 2868549 2084965 1793550 1260098 256523
39189 256523 -327342 228593 1320653 1871254 1860772 2118703 2834916 3372512 3601920 4114203
39179 4114203 4614916 3519993 329971 -2653170 -2627812 109980 2483337 2475949 1066777
39170 1066777 108356 -89338 -311335 -869044 -1508649 -2096063 -2463782 -2110991 -877783
39161 -877783 444254 873803 378809 -267089 -514874 -440523 -321886 -315631 -570725 -1357580
39151 -1357580 -2875320 -4779968 -5969935 -5393718 -3445640 -1938503 -1959312 -2352911 -1402040
39142 -1402040 519447 1463007 860477 195826 476352 852703 459546 -66973 12489
39133 12489 54882 -740501 -1699943 -1632419 -680709 -796 -153760 -809858 -1455441 -1514733
39123 -1514733 -489341 1124794 1866834 1192896 394951 581057 838925 -163002 -1755777
39114 -1755777 -2214847 -1432007 -799547 -894109 -1164573 -1611021 -2721250 -3717034 -2952716
39105 -2952716 -526057 1302189 929219 -817582 -2220885 -2496383 -1577747 278119 1864732
39096 1864732 1548657 -496887 -1848459 -778739 1447400 2457515 1964979 1575724 2005867
39087 2005867 2154552 1027791 -719518 -1660168 -1312894 -503536 -262112 -679456 -958962
39078 -958962 -577361 -73652 -275941 -992925 -1210875 -586974 101765 188983 -82145 -319222
39068 -319222 -627117 -1021606 -1123690 -1029700 -1469409 -2277071 -1830350 666249 3229834
39059 3229834 3185826 832529 -879245 -438262 443987 -139218 -1373279 -1311639 -69715
39050 -69715 484015 -302740 -1110629 -929487 -365009 -162362 58308 721169 1188221 871926
39040 871926 539194 1223204 2466242 3005470 2788853 2833214 3240802 2942761 1629786
39031 1629786 452256 308848 697021 786670 454783 -257531 -1465854 -2624598 -2709312
39022 -2709312 -1920373 -1775570 -2642369 -2815929 -1321946 58263 -613539 -2241295 -2365998
39013 -2365998 -1067796 -710104 -2176927 -3757975 -3807219 -2415264 -375700 1471488 1797905
39004 1797905 -109283 -2469710 -2414356 188041 2408841 2385683 1533394 1683209 2295421
38995 2295421 2036978 1255691 1067368 1285410 981356 203075 -296006 -268738 222028 1316688
38985 1316688 2615721 2942445 1959994 956317 865986 712126 -607389 -2191919 -2472653
38976 -2472653 -1695423 -1272077 -1408994 -1232925 -724348 -638899 -830986 -494981 83770 -182145
38966 -182145 -1139750 -1396410 -577270 43794 -430532 -1286451 -1502463 -1120920 -802001 -924446
38956 -924446 -1519593 -2324676 -2669276 -2043157 -883607 -80056 243228 610837 994140
38947 994140 761613 -132833 -919122 -1107161 -955478 -793232 -693639 -768883 -962148 -756703
38937 -756703 -40469 118279 -1164304 -2769178 -2723962 -1105266 880 -321288 -613071
38928 -613071 291799 1273242 813533 -562513 -1156225 -448226 727549 1662025 2203751
38919 2203751 2198151 1600729 910310 686180 852628 992790 897764 381466 -773413 -2084708
38909 -2084708 -2327731 -1009591 742857 1567016 1505584 1411706 1416218 1115662 784666 1105687
38899 1105687 1848902 2024892 1401160 806073 791620 984857 978396 881028 615383 -361095
38889 -361095 -1960582 -2822205 -1682570 870983 2824197 2926586 1811691 823471 444964
38880 444964 371812 559059 1252161 2024965 1806559 342529 -1165095 -1597298 -1449295
38871 -1449295 -1863725 -2625221 -2404452 -925510 470270 753266 465887 487593 675633
38862 675633 575396 548603 1111591 1718438 1314959 -88212 -1299031 -1382021 -554429 344263
38852 344263 749986 707608 649523 865054 1115379 977444 524124 167615 -159100 -891475
38842 -891475 -1767447 -1871787 -1153169 -805100 -1455447 -2092803 -1740579 -1077147 -1091955 -1123693
38832 -1123693 74186 1921551 2522387 1431904 165970 -150196 6752 -27811 -78062
38823 -78062 -31809 -361802 -1085612 -1384474 -898159 -350511 -326804 -489304 -552693 -893492
38813 -893492 -1529436 -1653220 -984144 -479061 -815343 -1274193 -1151810 -1148194 -2043153 -2959458
38803 -2959458 -2506521 -1014165 -8573 164395 543193 1464668 1904644 1202251 89494
38794 89494 -474014 -446892 -250014 -84437 -163206 -832948 -1966972 -2824557 -2915040 -2534001
38784 -2534001 -2205450 -2116988 -2317151 -2882078 -3549936 -3637847 -2674971 -928293 764531
38775 764531 1483619 766813 -878808 -2216200 -2563802 -2536805 -2841245 -2837875 -1468607 656784
38765 656784 1589639 665065 -615714 -767476 -29958 720971 1392854 2058200 2098218 1157778
38755 1157778 141452 112771 791239 1128448 797682 181374 -501730 -1094529 -1165373 -789390
38745 -789390 -1013298 -2432685 -3957429 -4226067 -3601974 -3327976 -3271012 -2252916 -398748
38736 -398748 691773 315870 -441784 -584213 -488875 -794836 -1298637 -1565039 -1604834 -1490794
38726 -1490794 -1250223 -1357545 -2185288 -2809552 -1833952 231233 1107396 -7662 -1097915
38717 -1097915 -408025 807590 325178 -1507756 -2351295 -1422348 -402872 -732510 -1736367
38708 -1736367 -1978300 -1252023 -507231 -434944 -721648 -561213 287655 1019575 660781 -495120
38698 -495120 -970000 -43757 1060459 659246 -1209137 -2894727 -3111119 -2023854 -594234
38689 -594234 392509 699232 615831 559745 467420 -54387 -755515 -674745 403958 1259893
38679 1259893 861132 -70570 -199459 361281 435720 -156394 -354170 364813 1230208 1349563
38669 1349563 609141 -652599 -1882519 -2227892 -1268703 125783 718844 664839 1156103
38660 1156103 2299413 2789383 2025574 1080425 928878 1101877 982328 1153984 2235683
38651 2235683 3321269 2989757 1379744 -34316 -472494 -421882 -250289 459345 1807877
38642 1807877 2859221 2758100 1991548 1747278 2247783 2541324 2088846 1767670 2656676
38633 2656676 4258058 4859973 3742140 2135584 1573705 2046387 2454867 2309636 2089815
38624 2089815 2166315 2220407 1786774 854066 -67050 -215998 718865 1848720 1705049 226895
38614 226895 -711492 225830 1692690 1510589 46307 -274825 1195133 2195344 985498
38605 985498 -1077955 -1704548 -909831 -461784 -1035389 -1686298 -1838180 -2136776 -3033770
38596 -3033770 -3749384 -3317102 -2028735 -1118746 -1133154 -1232629 -455216 711550 783535 -597242
38586 -597242 -1911680 -1732443 -597211 43130 -7585 86234 336953 -17844 -745966 -690280
38576 -690280 171254 508906 -70402 -348421 163384 100880 -1361910 -2722254 -2306274
38567 -2306274 -837401 -97503 -89714 526894 1808396 2325548 1530230 673689 1091114
38558 1091114 2669810 4183615 4385375 2906332 799788 -156963 513173 1188717 319199
38549 319199 -1281718 -1624873 -510921 278645 -393145 -1772618 -2688792 -2752626 -1795972
38540 -1795972 356790 2876896 3927453 2605451 195120 -1225230 -941023 105836
38532 105836 676202 415090 10207 474362 2024727 3636168 4067577 3225788 2002910
38523 2002910 992251 176430 -244297 199332 1246128 1861119 1592301 1096974 923045
38514 923045 732821 321757 416360 1535877 2797040 2932858 2069172 1418939 1455663 1485511
38504 1485511 998650 340647 -167624 -718431 -1187131 -822336 491777 1503915 1148801
38495 1148801 255070 478423 1842333 2801083 2819478 3200681 4657061 5709287 4883187
38486 4883187 3254794 2985503 4054145 4498666 3677902 3102487 3684805 4301974 3975764
38477 3975764 3588860 4132429 4772360 4212654 2877689 2146201 2224270 2370069 2634026
38468 2634026 3704633 5250384 5947730 5251423 4006049 3299945 3674045 5252406 7512365
38459 7512365 9013608 8524333 6542216 4812998 4391066 5021060 6118781 7166840 7323221
38450 7323221 6069015 4419032 4165416 5576496 7029628 7283483 6909143 6991220 7639551
38441 7639551 8520708 9779826 11464709 12791983 13005298 12579020 12764491 14186419 16484492
38432 16484492 19039359 21426765 23378081 24966159 26848274 29800301 33836408 38107153
38424 38107153 41916488 45731516 50921263 58448746 68203091 80012630 94924620 114565870
38416 114565870 139241195 167820862 199739842 235162001 271319670 299742821 309976643
38409 309976643 297432334 267060778 229201462 192596901 161007250 134401725 111677954
38402 111677954 92369177 76648546 64282428 54147677 45222943 37623355 31919139
38395 31919139 27812592 24453087 21740462 20093589 19053094 17503186 15421711 13991815
38387 13991815 13603759 13130193 11747910 10141434 9132491 8352292 7243167 6322789 6316473
38378 6316473 6781723 6707563 5975466 5247158 4808462 4425261 4035507 3774369 3549378 3270879
38368 3270879 3243202 3688907 4148735 3985183 3273219 2633524 2403378 2499818 2841282 3285610
38358 3285610 3297080 2327467 636801 -688663 -747769 233366 1025495 557641 -888592
38349 -888592 -1789294 -1014590 777058 1846846 1378890 193788 -498654 -371130 84021
38340 84021 219723 -298792 -1079468 -1022117 516078 2537146 3247225 2197913 654359
38331 654359 -298803 -882864 -1529013 -1903449 -1695830 -1325519 -1110985 -679792 45947 276211
38321 276211 -324740 -716719 -25588 794199 176124 -1656927 -2871730 -2479126 -1408175
38312 -1408175 -1013951 -1479764 -1969816 -1699295 -577744 802012 1619766 1476613 674459
38303 674459 -141510 -465240 -134717 562572 1017068 985836 1035307 1657027 2170876 1561648
38293 1561648 363609 317832 1772240 2870385 2106851 404597 -345509 297536 1467988
38284 1467988 2556844 3377170 3514011 2770299 1792344 1247063 869942 166539 -613732
38275 -613732 -1061119 -1350502 -1468723 -662430 1168561 2479496 1892310 230704 -680947
38266 -680947 -507972 -183363 49469 618481 1183279 1045868 694454 1168114 2092915 2103636
38256 2103636 1083633 227948 -51942 -505777 -1324592 -1835269 -1995527 -2413534 -2787197
38247 -2787197 -2200516 -1136590 -1182379 -2381333 -2946284 -2133805 -1296234 -1354147 -1392346 -795510
38237 -795510 -668689 -1777348 -2944146 -2997381 -2643904 -2848363 -2966536 -2230988 -1588251
38228 -1588251 -2077701 -2656918 -1798561 -232578 225708 -151942 451072 1922607 1919563
38219 1919563 -494448 -3189298 -3888040 -2981439 -2288532 -2337684 -2193260 -1243935 45281
38210 45281 940067 1165777 847584 235166 -413234 -854428 -863017 -372377 236142 246454
38200 246454 -594026 -1543014 -1599318 -741937 -22104 -391072 -1720714 -2934067 -2875281 -1254967
38190 -1254967 914214 2000124 1252268 -483296 -1769722 -1982171 -1427448 -619357 -64296
38181 -64296 -310298 -1332015 -2057716 -1412377 147839 984905 338187 -701798 -582596
38172 -582596 895881 2474507 2786487 1605042 -20048 -823817 -697319 -756664 -1704813
38163 -1704813 -2621695 -2187605 -728925 152282 -21480 58568 1312493 2762690 3065411
38154 3065411 2454986 2002285 1761079 1075505 298932 616289 2020523 2859737 1904746
38145 1904746 -183267 -1999583 -3043171 -3499331 -3255757 -2188189 -966843 -512496 -776825
38136 -776825 -956645 -837718 -978652 -1484571 -1600544 -872510 160992 886845 1380788
38127 1380788 1678777 1197388 -203351 -1346147 -1142354 -373018 -637468 -1724431 -1688367
38118 -1688367 160371 2022114 2184453 1359308 1198437 1626017 1258098 -157141 -1408054
38109 -1408054 -1751924 -1620253 -1325288 -576284 375981 539987 -264441 -876802 -517495
38100 -517495 101601 193628 268363 1000999 1748908 1557776 893630 861225 1219892 849172
38090 849172 -66323 -172575 590534 593907 -774474 -1848703 -1273971 -285617 -796390 -2301509
38080 -2301509 -2597320 -1136182 225757 -41160 -1293692 -2104616 -2171419 -2047345 -1914201
38071 -1914201 -1583269 -1242484 -1315068 -1678795 -1700467 -1154058 -636128 -797352 -1383215 -1420128
38061 -1420128 -460360 693744 900507 133662 -571134 -631311 -591307 -978896 -1346784 -1109108
38051 -1109108 -605216 -483715 -640120 -733654 -1155498 -2247763 -3029728 -2235609 -476672
38042 -476672 308855 -230823 -243749 1394147 3171152 3039088 1161835 -642883 -1251947
38033 -1251947 -805769 280366 1543164 2188512 1824109 1198618 1154861 1203912 353059
38024 353059 -858236 -572140 1841747 4661968 5918729 5860111 6498219 8968803 12096870
38015 12096870 13786526 13357536 11959442 10762851 9557311 7666401 5511978 4174860
38007 4174860 3749139 3464256 3376719 4329347 5857595 5916802 3698625 1195487 599616
37998 599616 1364033 1399289 217690 -848023 -929028 -392064 304680 899805 733247 -521176
37988 -521176 -1656771 -1064513 919776 2295212 2046703 996947 -29206 -1180647 -2374511
37979 -2374511 -2775918 -2139169 -1328846 -893662 -371240 408794 649458 -353 -526584
37970 -526584 32344 1143317 1620418 1207252 580551 363722 725329 1436382 1944068
37961 1944068 1949827 2041318 2904693 3840151 3299173 1261317 -289901 53959 1374789
37952 1374789 2152179 2479505 3306456 4388563 4435966 3000447 1163982 430589 1430722
37943 1430722 3364545 4453480 3652394 2167403 2212580 3898509 4850571 3715022 2286109
37934 2286109 2633093 3703802 3008880 721604 -484056 436898 1395490 414144 -1586109
37925 -1586109 -2324209 -1236862 117717 189832 -827630 -1330112 -166992 1862452 2820009
37916 2820009 2158905 1484623 1982127 2297976 667838 -1736987 -1997055 94779 1353080
37907 1353080 -247853 -2697657 -3049230 -1503721 -533882 -1170705 -2137359 -2083010 -962881
37898 -962881 531178 1511917 1109477 -579736 -1978768 -1671622 -310089 333271 -129024
37889 -129024 -591449 -582499 -722629 -982790 -448564 634185 554119 -1084946 -2109505 -841752
37879 -841752 1085219 943553 -1048201 -2102425 -912356 825258 1100117 -78142 -1494702
37870 -1494702 -2284296 -2086457 -1005074 4027 -74474 -684220 -218714 1374014 2212555
37861 2212555 1530192 1177540 2582067 3954729 2716800 -404822 -2188874 -1403124 -35723
37852 -35723 79889 -459371 -435378 -123726 -400329 -1007671 -940003 61830 1205674 1428895
37842 1428895 130928 -2271054 -4250514 -4347003 -2725793 -914175 101109 618797 978938
37833 978938 797328 -73661 -944178 -1336977 -1702798 -2393843 -2838410 -2543382 -2079503 -2135180
37823 -2135180 -2277182 -1672260 -558341 40326 -182364 -543890 -561063 -605676 -1210118 -2218770
37813 -2218770 -2853737 -2494250 -1350147 -291094 144502 333764 758742 986430 312149
37804 312149 -769780 -896935 205898 1289103 1446791 1202322 1207729 1168779 890421 1134595
37794 1134595 2284392 3161106 2483453 791053 -371025 -620776 -796508 -1259416 -1468432
37785 -1468432 -1125263 -621474 -352626 -432516 -947306 -1731599 -2166406 -1957176 -1693638 -1803131
37775 -1803131 -1552291 -236039 1196180 1179798 -49081 -665672 52295 835455 585941
37766 585941 -106431 -323078 -379959 -1035939 -2060640 -2650638 -2705078 -2709385 -2694466 -2237683
37756 -2237683 -1402080 -877981 -1074915 -1641144 -2035587 -2096776 -1816875 -1013721 276395
37747 276395 1287540 1066722 -281147 -1445480 -1419160 -688892 -332693 -382949 -20227
37738 -20227 798740 1071801 330420 -606873 -934592 -939641 -1161780 -1357845 -1071702 -544544
37728 -544544 -314980 -513591 -1171692 -2464908 -3921682 -4271870 -3066908 -1638132 -1286160
37719 -1286160 -1281247 -92873 1948452 2898989 2000481 622058 185646 582862 1091485
37710 1091485 1592019 2163938 2359921 1637363 90878 -1631823 -2768128 -2699189 -1403029
37701 -1403029 123635 526808 -444030 -1556827 -1485126 -255983 921566 1013491 142521
37692 142521 -646296 -481808 482983 1393843 1750831 1722856 1410976 528813 -810477 -1705138
37682 -1705138 -1512646 -779108 -468648 -707380 -939697 -883725 -619023 -98987 719068 1535390
37672 1535390 2036197 2209534 1987315 1248253 574407 957360 2007443 1670691 -1048542
37663 -1048542 -4139259 -4861153 -3147527 -1140023 -94158 384958 552681 88591 -575656
37654 -575656 -421439 437368 828936 448921 96546 -94237 -883947 -2112809 -2425661
37645 -2425661 -1291539 269438 1370727 2064523 2118451 840260 -1234550 -2308630 -1845242
37636 -1845242 -1414435 -2063175 -2605704 -1807038 -623253 -612236 -1340670 -1174958 75008
37627 75008 995550 737590 -61377 -484291 -436825 -459315 -1007645 -1896869 -2314472 -1798901
37617 -1798901 -1188225 -1706689 -2975893 -3181224 -1711713 -279762 -526225 -1742053 -2144458
37608 -2144458 -1440700 -814230 -1030049 -1798171 -2557718 -2810659 -2109586 -728093 79373
37599 79373 -522735 -1691549 -2014211 -1460265 -1175178 -1639158 -2142972 -2009538 -1371803 -730908
37589 -730908 -516894 -1012323 -1973561 -2471804 -1921886 -1149752 -1492780 -2752270 -3032252
37580 -3032252 -1093767 1823412 3219122 2138917 163978 -484500 642920 2082753
37572 2082753 2433286 1736404 749393 -246229 -1152455 -1271558 -27415 1737985 2445358
37563 2445358 1872901 1390172 1842661 2452441 2372665 2123591 2544558 3192410 2916022 1650129
37553 1650129 652971 942385 2079809 2623384 1605952 -406107 -1759754 -1410219 691
37544 691 1080730 1340030 1292349 1276695 1094153 680828 238953 -234518 -748728 -902642
37534 -902642 -584852 -677392 -1891843 -3340686 -3648080 -2980806 -2294483 -1152596 1421145
37525 1421145 4195537 4612355 2771978 1696262 2770604 3771269 2729477 940136
37517 940136 295445 222724 -425876 -666890 756000 2473280 2214872 361463 -707449
37508 -707449 22140 1675180 3418698 4724558 4607038 2900060 1543506 2290244 3811597
37499 3811597 3473719 1402848 170812 670881 988943 -308521 -2094923 -2516209 -1159376
37490 -1159376 1088927 2959865 3374992 2336602 1178116 821633 387176 -1006005 -1973247
37481 -1973247 -570925 2300311 3680203 2614326 977635 182712 -288633 -600176 452871
37472 452871 2990506 4813260 4152288 2124498 1066848 1553437 2258977 1965398 739027
37463 739027 -388280 -419371 474614 856985 -179761 -1443488 -1073974 749869 2098196
37454 2098196 2192189 2230119 3084301 3978818 4031608 3564125 3227422 3099682 3131970 3302559
37444 3302559 3090143 2126689 1479264 2647820 5032871 6185296 5058831 3265813 2528620
37435 2528620 2664999 2808557 2830402 2652416 1839714 850049 1063935 2542001 3362673
37426 3362673 2331102 764733 298225 471638 83828 -382318 436743 2318684 3559234
37417 3559234 3294297 2378447 1982139 2215266 2178206 993882 -1032427 -2307794 -1647456
37408 -1647456 39977 809428 348596 150985 881466 1346305 705719 -35225 280775
37399 280775 1277558 2073582 2600682 2850549 2193657 634507 -510805 -413945 -73445
37390 -73445 -659581 -1614418 -1649610 -712935 186657 317900 -474025 -1861597 -2729823 -1990013
37380 -1990013 -376762 82468 -846198 -973133 697448 1907632 559305 -1772919 -2123041
37371 -2123041 -485111 653748 151127 -923807 -1644150 -2064922 -2012285 -1145178 -77307
37362 -77307 312174 376209 903859 1410150 980338 159068 37131 79260 -965914 -2455142
37352 -2455142 -2478643 -915634 409163 586990 431452 420825 132443 -94984 725918
37343 725918 2057300 2056104 547111 -423560 273066 1301391 1324291 895791 769470 322787
37333 322787 -883897 -1652315 -863424 612432 1268613 1217650 1593757 2485202 2976270
37324 2976270 2847900 2910990 3702803 4768584 5286767 4918131 4125637 3890498 4835179
37315 4835179 6496354 7834792 8429960 8643920 8835161 9312449 10903004 14348067 19059849
37306 19059849 23847927 29180147 37135792 48174063 59045963 64961339 63343053 55146379
37298 55146379 43625335 32542004 24457158 19491712 15975171 12729655 10086543 8433198
37290 8433198 7061305 5354551 3991611 3715013 3704464 2609193 808393 190079 1570649
37281 1570649 3488117 3974360 2785707 1354586 872553 988771 608165 -344656 -670752
37272 -670752 278870 1304225 832020 -770770 -1626681 -977604 16248 286259 190829
37263 190829 359756 639927 912319 1608026 2544212 2584540 1524169 998546 2165471
37254 2165471 3638602 3334458 1515609 303170 770033 2206551 3767694 4983684
37246 4983684 4876607 2624752 -573016 -2111105 -1120604 433760 508735 -452846 -611490
37237 -611490 633943 2172083 2799034 2385203 1607737 1143807 1140802 1259817 1267720 1437977
37227 1437977 2039936 2688049 2819444 2631703 2751526 3090614 3014532 2670771 2978019 3977119
37217 3977119 4371586 3315914 1658350 718034 739127 1263564 2053599 2743166 2533693
37208 2533693 1373693 624619 1275223 2215415 1764199 332703 -168814 723233 1592445
37199 1592445 1706136 1978548 2878372 3386355 3000674 2962573 4147717 5262802 4722898
37190 4722898 3115920 2132759 2093843 2364134 3280144 5444139 7612459 7716083 6050749
37181 6050749 5147289 6065823 7061453 6660862 5837341 5924928 6381180 6259562 6275967 7461316
37171 7461316 8884421 8772947 7281313 6181764 6070175 5767997 4624799 3690565 4020090
37162 4020090 5054503 5436753 4741545 3789908 3555986 4113344 4638564 4488030 4166293
37153 4166293 4686971 5888479 6329454 5396765 4483445 5073235 6508977 6950777 5974109
37144 5974109 4813947 4344248 4239109 4083555 3988561 3952698 3718055 3443691 3621332 4234123
37134 4234123 4783989 5090251 5286721 5211899 4597551 3597996 2430799 1074163 111222
37125 111222 819382 3077975 4367296 2830150 349467 111169 1832631 2440235 1266932
37116 1266932 1033937 2983416 4638375 4020896 2875333 3413550 4552703 4147787 2895248
37107 2895248 2958635 4029878 3811415 1826918 48665 -116396 789975 1882577 2960864
37098 2960864 3824807 4167381 4262386 4580751 4958289 5219144 5969941 7419771 8212736
37089 8212736 7154441 5422289 5104865 6032450 6181442 4963685 3833422 3540242 3077671
37080 3077671 1844377 740193 365252 -17606 -846861 -1209763 -374459 987621 1992668
37071 1992668 2716519 3357022 3469877 2966074 2747365 3348793 3903890 3463614 2516272
37062 2516272 2160217 2420872 2445000 1969079 1630763 1925337 2515973 2620050 1842856 737186
37052 737186 476223 1539135 2826478 2794173 1481491 545700 1082514 2283181 2601584
37043 2601584 1501919 -282303 -1529382 -1320231 198908 1609210 1554005 461868 59963
37034 59963 1033503 2286672 2825718 3063668 3597157 3948690 3549820 3044356 3460891 4608037
37024 4608037 5264426 4663222 3107172 1465174 638921 1150533 2714947 4471520 5863454
37015 5863454 6836851 7144570 6355300 4848528 3809635 3737990 3886543 3667671 3530603
37006 3530603 3767748 3599651 2426346 1044544 570673 944555 1513688 2290792 3477775
36997 3477775 4428237 4346626 3609933 3288972 3675699 4228912 4628043 4998798 5414053 5866202
36987 5866202 6289191 6110652 4648853 2633828 2159586 4016045 6212339 6544825 5545738
36978 5545738 5215846 5855157 6241087 6289315 7186896 8985817 10292151 10609661 11007165
36969 11007165 12048102 12916919 13190761 13772613 15271480 16881879 17772766 18528921 20363798
36960 20363798 23561041 27253569 30356584 32622096 35120977 39307672 45175031 51308741
36952 51308741 57618476 66524247 79849296 96293737 114555624 137421755 169492804
36945 169492804 212286165 265614245 331508169 408618476 480609700 518570432 502919425
36938 502919425 441438599 361514133 286934066 226039905 177972150 141250432 114346159
36931 114346159 94122038 77809014 64605028 53959138 44615829 36434536 30762260
36924 30762260 27809401 25688516 22987835 20264536 18133714 16006350 13720166 12334662
36916 12334662 12122154 11636324 9944837 8023558 6814515 5728342 4339770 3749263
36908 3749263 4711699 5925180 5742550 4341679 2850241 1618290 690986 610371 1277328
36899 1277328 1340702 235466 -504515 416824 1769984 1668019 457832 -220758 -85592
36890 -85592 181027 809564 2036246 2365038 503905 -1690905 -1302568 886242 1099429
36881 1099429 -1551764 -3340119 -1373169 2238831 3591734 2043845 -80364 -1104294
36873 -1104294 -1091159 -483216 247073 256750 -619888 -1027171 215274 2160422 2943501 2346428
36863 2346428 1606398 1215962 676619 153250 458494 1241441 1023743 -412687 -1275652
36854 -1275652 -262356 1438981 1687220 91625 -1835634 -2680712 -2313489 -1355271 -359661
36845 -359661 409420 933852 1327347 1607106 1697535 1749673 2066276 2441701 2075760 692296
36835 692296 -665056 -757539 67788 148657 -1220465 -2668271 -2490990 -887565 369624
36826 369624 199006 -750552 -1334089 -1284156 -992064 -664438 -348754 -360709 -927083 -1520221
36816 -1520221 -1253893 -77806 965819 943047 118348 -463028 -266208 186991 40629
36807 40629 -860115 -1783415 -1919525 -1232430 -382257 91598 214339 182305 -64691 -625929
36797 -625929 -1306329 -1804361 -1976817 -1669890 -714085 478995 811230 -253998 -1623496
36788 -1623496 -1643410 -187137 1197456 1290489 438398 -408915 -915364 -1131831 -922368
36779 -922368 -343769 -33385 -498320 -1350262 -1809114 -1670559 -1309693 -1069007 -1121684 -1605290
36769 -1605290 -2385053 -2944514 -2933166 -2539904 -1986970 -1107410 99758 961636 797950
36760 797950 -220296 -1407796 -2393628 -3082833 -3265845 -2966839 -2779611 -3102256 -3413165
36751 -3413165 -3116113 -2682715 -2915045 -3337475 -2547616 -270211 2028871 2885600 2353595
36742 2353595 1505604 1167703 1424375 1753853 1436949 332240 -756120 -1042851 -870458
36733 -870458 -1034169 -1297932 -797889 156068 167636 -1042818 -1999620 -1641114 -733596 -310770
36723 -310770 -44418 760699 1718025 2136712 2268953 2497011 2191712 842721 -455150
36714 -455150 -328475 560601 320333 -1230213 -2251336 -1679441 -580556 -203291 -252057
36705 -252057 92064 689747 942567 871875 783646 522534 -103321 -661918 -619251 -141383
36695 -141383 258029 503211 782809 938017 675886 176204 -128232 -266648 -672400 -1423968
36685 -1423968 -2021061 -2017949 -1554339 -1116811 -951985 -867213 -597203 -238596 -111026 -136310
36675 -136310 297040 1512181 2862946 3401596 3095214 2768778 2852559 2859707 2245772 1132560
36665 1132560 -55205 -1039255 -1475701 -961087 263981 1137774 844285 -298633 -1437012
36656 -1437012 -2218694 -2700217 -2651991 -1730751 -262898 803029 873483 271947 -256363
36647 -256363 -315947 -50704 217470 346045 334166 77757 -490937 -891491 -247663 1497229
36637 1497229 2950653 2731455 1333700 462949 574228 414512 -695182 -1638292 -1356805
36628 -1356805 -537660 -265889 -139244 818009 2192441 2719038 2251882 1623124 930354
36619 930354 -324662 -1535916 -1271355 453368 1820318 1643538 723370 192823 -85680
36610 -85680 -679224 -1365303 -1689682 -1796591 -1861189 -1585124 -1065150 -1204571 -2283570 -3016818
36600 -3016818 -2207837 -649884 -121887 -969519 -1942068 -2102639 -1616208 -826525 88070
36591 88070 474033 -416614 -2011907 -2563941 -1315772 401513 899878 148849 -739910
36582 -739910 -1341539 -2108531 -2954299 -2832459 -1167754 983355 1832982 753586 -1142369
36573 -1142369 -2279903 -2156319 -1532280 -1365532 -1798629 -2174209 -1876601 -1047939 -449717
36564 -449717 -635962 -1355694 -1872571 -1776058 -1236437 -504156 412486 1366913 1802868 1339127
36554 1339127 441374 28205 414149 988629 932259 4102 -1253667 -1831226 -1037463
36545 -1037463 620853 1644157 1158139 876 -490698 -377927 -741030 -1595861 -1594788
36536 -1594788 -151330 1476030 1976218 1763799 1972328 2505345 2285291 1031518 -342876
36527 -342876 -1030694 -1127582 -1068811 -972294 -727198 -331837 13617 76801 -26100 320110
36517 320110 1532231 2947441 3332852 2453466 1294029 457302 -519633 -1658263 -1697647
36508 -1697647 39228 2025462 2319897 1240462 601371 850242 887389 532396 1016427
36499 1016427 2571414 3489895 2555256 937041 543773 1539081 2584139 2777530 2315461
36490 2315461 1741477 1458725 1667519 2047063 1723419 159601 -2010174 -3375726 -2915551
36481 -2915551 -811760 1489047 2129704 501233 -1828572 -2600159 -1418232 34310
36473 34310 473877 525583 1229885 2227921 2396902 1503816 276406 -600127 -743853 70478
36463 70478 1461892 2350221 2113973 1361233 860003 399460 -417451 -1049083 -880624 -559474
36453 -559474 -1032155 -1672383 -1000494 799112 1776788 992486 -160274 -108020 744473
36444 744473 1018981 572800 466899 1106335 1552970 863553 -577009 -1430900 -895974
36435 -895974 476014 1511032 1730932 1576834 1389540 868892 -71539 -619456 -19709
36426 -19709 1225956 1993851 2070044 2112316 2335231 2341728 2231235 2761295 4268694 6400669
36416 6400669 8950975 11953760 15173872 19002969 25637719 36877101 49749267 56751472
36408 56751472 52742464 40565804 27959209 19795761 15319499 12025934 9256860 7421963
36400 7421963 6116986 4527078 2642501 1060055 183593 108021 606635 916247 306057
36391 306057 -891222 -1636420 -1689588 -1706120 -1694341 -812400 734508 1115543 -695392 -3081055
36381 -3081055 -3700941 -2433567 -1069684 -721334 -987721 -1309571 -1610132 -1577444 -703355
36372 -703355 647175 1295475 766317 -96583 -365049 -127847 -21052 -318945 -854812
36363 -854812 -1310710 -1257828 -374910 1034010 2065163 2030531 1081513 -27489 -595437
36354 -595437 -506041 -413752 -1211359 -2893449 -4189653 -3901944 -2422201 -1272603 -1275376 -1865416
36344 -1865416 -2082956 -1474071 -111838 1392917 1912111 782544 -1102701 -2070756 -1652089
36335 -1652089 -873795 -522678 -276292 175048 412068 261148 332627 854370 987738 134541
36325 134541 -965858 -1321065 -1093789 -1053563 -1326193 -1576431 -1812218 -2143164 -2316679 -2302508
36315 -2302508 -2699495 -3691418 -4254969 -3401384 -1670357 -415416 -122409 -424669 -1216015
36306 -1216015 -2542667 -3726988 -3823422 -2910591 -2009466 -1786433 -2060801 -2362374 -2266881
36297 -2266881 -1497199 -381231 179805 -190473 -837513 -1203984 -1527625 -1680772 -617810
36288 -617810 1762255 3520828 3162130 2032769 2167341 2796034 1616003 -1023932 -2150836
36279 -2150836 -519285 1850281 3031521 3451616 3910071 3843814 2887035 2101070 2228919
36270 2228919 2393567 1786471 1042863 728619 127826 -1082939 -1553954 -270966 1461390
36261 1461390 1691059 456976 -736489 -1144146 -1029060 -520090 357019 1106479 1330840
36252 1330840 1232512 788226 -479767 -2032877 -2076356 -111502 1673869 1162015 -807953
36243 -807953 -2026245 -2129516 -2229540 -2423718 -1980701 -1301244 -1345641 -1518538 -453147
36234 -453147 1289634 1661355 358126 -690025 -446162 -171469 -956386 -1789671 -1172633
36225 -1172633 723211 2505741 3174481 2571009 1135419 -169837 -474737 -25355 50067
36216 50067 -781258 -1930280 -2717796 -3091542 -3224316 -3231720 -3328936 -3479171 -3057460 -1809143
36206 -1809143 -826202 -1314458 -2623812 -2990351 -2166479 -1660126 -2221630 -2885771 -2955934
36197 -2955934 -3109439 -3700084 -3631074 -2082977 -71573 935081 936286 752431 340516
36188 340516 -925692 -2771604 -4003092 -3864080 -2670039 -1240757 -239784 111035 51358
36179 51358 -139087 -635752 -1674418 -2652639 -2419911 -761648 1118072 1952432 1646943
36170 1646943 923630 427726 452975 848566 927237 136571 -1018634 -1479077 -1119058 -792005
36160 -792005 -836196 -732313 -460139 -785080 -1661857 -1778827 -539685 762496 759333 -95479
36150 -95479 -535649 -449292 -660843 -1441431 -2309932 -2773238 -2436541 -1086343 528937 914220
36140 914220 -184973 -1002978 -202116 904184 214311 -1817420 -2673401 -1424292 64485
36131 64485 -89030 -1465355 -2455231 -2378411 -1664837 -839786 -200195 -7426 -298947 -699714
36121 -699714 -811159 -653139 -553166 -771497 -1293501 -1809516 -1945888 -1718830 -1604596 -1895372
36111 -1895372 -2224474 -2089573 -1561110 -992944 -322425 697499 1743449 2135315 1810796
36102 1810796 1373992 1041632 264105 -1233929 -2604963 -2656064 -1286709 328733 1008639
36093 1008639 669502 69057 -212834 -187243 -2057 382881 874894 1103500 1024775 1263863
36083 1263863 2247385 3266902 3123861 1597193 -401817 -1972413 -2731670 -2406658 -1072983
36074 -1072983 115579 -273174 -1932619 -2743369 -1429167 666665 1289892 -950 -1691096
36065 -1691096 -2306650 -1674140 -535398 330420 694502 940390 1364300 1481365 678418
36056 678418 -530743 -977333 -661208 -715122 -1191194 -603218 1425378 2826788 1912334
36047 1912334 100984 -22238 1636533 2915615 2618181 1532270 612501 61949 114126
36038 114126 941780 1699090 1209299 -301507 -1526757 -2016841 -2302958 -2297469 -1398825 -246234
36028 -246234 -386353 -1741042 -2285849 -979892 681846 950434 153930 -295110 48357
36019 48357 703985 1326562 1652335 1225942 164711 -518773 -215675 356581 312232 -86685
36009 -86685 -124226 105187 95831 -8593 239809 604813 453171 -257119 -1040921 -1603379
35999 -1603379 -1772551 -1154402 248304 1384331 1119128 -215973 -1155212 -1029869 -657092
35990 -657092 -847889 -1132529 -641749 288988 315371 -1091294 -2809526 -3483125 -3180138
35981 -3180138 -2893387 -2763516 -1961001 -469423 376195 -72494 -391827 941494 2996066
35972 2996066 3420150 1686002 -348866 -1088241 -768710 -210665 316487 526531 57955
35963 57955 -340272 814110 3247511 4417546 2780419 171875 -670998 163245 412367
35954 412367 -673470 -1440805 -690043 476175 364608 -976175 -1982442 -1547153 -134515
35945 -134515 887837 733773 -533 -105691 713818 1560055 1737620 1661279 1839541 1771046
35935 1771046 824663 -315184 -254258 1185477 2659365 2963814 2192963 1227014 844948
35926 844948 1358575 2358319 2776018 1936486 574050 35130 459459 684016 140547
35917 140547 -194324 681126 2145026 2666701 1782921 550635 64775 171000 -100381
35908 -100381 -1170531 -2364162 -2732633 -2122049 -1185789 -541721 -347152 -618632 -1318698
35899 -1318698 -1948744 -1775102 -879421 -282493 -439434 -382050 738209 1969726 1742645
35890 1742645 357869 -276823 487885 1032813 -66000 -1949477 -2843641 -2479163 -1937019
35881 -1937019 -1737271 -1404551 -727317 -212894 -122137 -53027 139309 -193241 -1527922 -3159549
35871 -3159549 -3810422 -3119630 -2007133 -1525919 -1786621 -2194327 -2371073 -2418758 -2376057 -1925232
35861 -1925232 -892672 244275 709704 240867 -689558 -1418734 -1627951 -1356772 -763231
35852 -763231 109 777744 1358295 1444671 799568 -457903 -1808018 -2744427 -3160142
35843 -3160142 -3219611 -3043745 -2738682 -2530848 -2544735 -2578264 -2434164 -2326243 -2538646 -2810244
35833 -2810244 -2603103 -1975551 -1574899 -1606566 -1422638 -472227 839044 1660077 1683525 1205706
35823 1205706 564513 25285 -67231 367947 786278 586798 -23294 -346351 -362087 -832074
35813 -832074 -2027987 -3125058 -3352929 -3100046 -3167409 -3421201 -3124669 -2397522 -2270074
35804 -2270074 -3108520 -3974358 -3978208 -3378282 -2718058 -1767782 -325553 597510 -234105 -2242603
35794 -2242603 -3345276 -2555088 -1052930 -205643 228167 1024199 1714488 1279279 112105
35785 112105 -232476 630873 1178653 156660 -1478646 -1713552 -131225 1551891 1696260
35776 1696260 717670 319673 1107636 1788294 1023564 -622289 -1401172 -751906 133656
35767 133656 290625 314508 939620 1323267 121840 -2150662 -3369694 -2587029 -1232799
35758 -1232799 -985174 -1581399 -1667097 -1043719 -875902 -1823300 -2996745 -3065821 -1819420
35749 -1819420 -297741 312447 -333019 -1613246 -2523588 -2462855 -1701507 -1129816 -1391852
35740 -1391852 -2200687 -2664642 -2389848 -2001313 -2254052 -2856856 -2780507 -1758572 -760636
35731 -760636 -664100 -1173135 -1609080 -2070634 -2922811 -3636597 -3291610 -2120242 -1416660 -1760055
35721 -1760055 -2358080 -2414453 -2119856 -1867629 -1517723 -1106907 -1390615 -2793968 -4438255
35712 -4438255 -5088835 -4632583 -3807919 -2907420 -1704624 -450728 45028 -548818 -1648241
35703 -1648241 -2483325 -2798303 -2790705 -2730305 -2617130 -2027499 -638314 816929 773770 -1270242
35693 -1270242 -3648365 -4270613 -3079749 -1690841 -964253 -390636 143482 -275766 -1775525
35684 -1775525 -2715691 -1696241 310765 997030 -535021 -2956732 -4313705 -3683636 -1573615
35675 -1573615 541337 1238195 355238 -898703 -1405387 -1329575 -1408054 -1654112 -1586354 -1312945
35665 -1312945 -1396164 -1808182 -1972809 -1803854 -1779556 -1933638 -1697662 -935622 -273470 -122375
35655 -122375 -174282 -194985 -507717 -1210445 -1649502 -1312638 -695710 -581720 -829108 -609213
35645 -609213 287875 1040866 787203 -376724 -1523547 -1843587 -1398246 -961489 -1075709
35636 -1075709 -1342493 -871566 602244 2366027 3522709 3802671 3521086 3077408 2615874
35627 2615874 1939802 788900 -529474 -1049431 -276789 821582 827709 -207777 -934501
35618 -934501 -887781 -1153079 -2334211 -3282253 -2860805 -1764050 -1250355 -1043973 -100732
35609 -100732 1193765 1409793 469608 -124302 326454 701291 -63913 -1405489 -2080964
35600 -2080964 -1691886 -708286 167386 233677 -725703 -1770013 -1510969 73282 1444477
35591 1444477 1547872 1026550 856671 897643 614892 213968 20470 -446818 -1651423
35582 -1651423 -2884814 -3052904 -2196245 -1196926 -346766 727700 1945253 2614842 2378173
35573 2378173 1534875 531193 -217843 -250786 481209 1342822 1845730 2282866 2766120
35564 2766120 2341868 343712 -1820878 -1816105 596072 3027540 3243717 1374086 -848091
35555 -848091 -1940628 -1524572 -405775 -92993 -1271892 -2661058 -2499183 -1129436 -566449
35546 -566449 -1319205 -1564372 -194923 1291526 1242954 442081 520487 1176139 1025937 328074
35536 328074 642865 2092087 2992377 2332015 959025 107681 129528 805426 1611597
35527 1611597 1621880 442346 -788674 -715194 69424 -133370 -1174744 -1081306 558069
35518 558069 1555892 518805 -913806 -783114 159853 149739 -404041 145881 1459746
35509 1459746 1498645 -145499 -1547588 -1363256 -457685 -123085 -413947 -944823 -1830673
35500 -1830673 -2950219 -3437305 -2808999 -1782792 -1279582 -1340344 -1555811 -1769796 -1826807
35491 -1826807 -1449683 -939188 -1160996 -2205611 -2896195 -2360053 -1297487 -859447 -1000758
35482 -1000758 -917969 -532717 -454088 -781400 -950434 -668901 -219909 98282 258798 398150
35472 398150 834152 1773963 2579451 2052488 154959 -1419925 -1437610 -989750 -1701930
35463 -1701930 -2859071 -2377826 -418303 365229 -1225339 -2954197 -2383214 -302665 741338
35454 741338 97304 -713022 -701238 -480839 -685970 -954953 -852350 -641739 -704608 -974653
35444 -974653 -1240997 -1390016 -1232335 -735268 -433317 -818997 -1298302 -745340 651182
35435 651182 1196416 -26713 -1647142 -1735876 -383654 597227 242651 -534533 -625460
35426 -625460 -273456 -323185 -715544 -624083 179101 916326 861491 212538 -338130 -472214
35416 -472214 -334339 -61168 283227 383822 -158108 -1133224 -1659975 -1217169 -427859 -268614
35406 -268614 -672521 -652722 72490 405426 -642955 -2399332 -3232966 -2494633 -966293
35397 -966293 404344 1284371 1487855 791823 -423133 -1231942 -1322745 -1317688 -1537843 -1439384
35387 -1439384 -921994 -1057007 -2398367 -3554835 -2948935 -1347423 -942745 -2248389 -3695543
35378 -3695543 -4207949 -4218891 -3923261 -2647999 -671542 349943 -164369 -688100 -239107
35369 -239107 -151695 -1548034 -2896185 -2332302 -947435 -1086297 -2334743 -2198561 -458759
35360 -458759 304184 -1010360 -2203654 -1396522 67938 -11597 -1369812 -2168426 -1837334
35351 -1837334 -1163035 -463771 518640 1383210 1319936 463528 -222546 -339217 -337598 -508048
35341 -508048 -606717 -508168 -463125 -596146 -680321 -507855 -179131 -31513 -383338 -1107634
35331 -1107634 -1415517 -565995 1023607 1958158 1456483 207710 -645406 -734124 -326300
35322 -326300 322034 963660 1291524 1352858 1537185 1868877 1962129 1861089 1981317 1960034
35312 1960034 844467 -1001122 -1647105 -291207 1200105 861116 -494079 -740878 150519
35303 150519 301975 -876938 -1851293 -1502886 -645793 -518706 -1256282 -2384414 -3557802
35294 -3557802 -4252985 -3818234 -2394436 -967428 -181667 90595 -83824 -863301 -1741701
35285 -1741701 -1700085 -703855 23177 -305183 -1110015 -1670304 -2082960 -2329697 -1625309 232166
35275 232166 1803951 1574248 60672 -802281 -122693 1146122 1756997 1548742 1113452
35266 1113452 817183 512777 -53189 -752149 -999789 -320376 960197 1899217 1993377
35257 1993377 1727740 1851275 2441907 2963916 2954382 2366912 1465775 603926 -60686 -650645
35247 -650645 -1088263 -725009 832235 2540286 2595828 715168 -1250487 -1686649 -1275998
35238 -1275998 -1658086 -2772555 -2933943 -1338193 858003 2132188 2145676 1387447 301209
35229 301209 -676554 -967590 -390569 543543 1240452 1499237 1176903 80851 -1366382
35220 -1366382 -2080530 -1616591 -949077 -1195589 -2062785 -2431009 -2038020 -1532448 -1163504
35211 -1163504 -628365 -91384 -11348 84730 1123027 2502301 2377358 651450 -238756
35202 -238756 1140329 2751069 2108881 167795 -421438 193812 -461660 -2535217 -3208985
35193 -3208985 -1440861 38707 -942661 -2603690 -2333868 -826135 -487513 -1486178 -2137042
35184 -2137042 -2004822 -1891323 -1603865 -468596 520685 -180487 -1742283 -1940120 -906279
35175 -906279 -915628 -2233454 -2424827 -650169 595117 -398073 -1641316 -858996 651959
35166 651959 300019 -1424909 -1864299 -514566 548705 292085 -48408 302639 241842
35157 241842 -960558 -1991742 -1388523 247337 1248085 1187750 889940 697240 91850
35148 91850 -1029337 -1885957 -1937439 -1614253 -1465239 -1253927 -546259 275361 405242 -145895
35138 -145895 -526177 -284165 172093 472391 722640 759224 22691 -1205923 -1470771 15273
35128 15273 1998507 2676340 1857898 611227 -417816 -1059147 -848543 146799 394759
35119 394759 -1302267 -3503687 -3723858 -2089589 -1024463 -1205935 -582974 1791534 3660140
35110 3660140 2822505 352253 -1189816 -1068334 -227188 598511 857094 -305169 -2605306
35101 -2605306 -3894784 -2746316 -651196 249247 375074 1380925 2730657 2389903 471612
35092 471612 -675868 -161463 318501 -448546 -1446893 -1620616 -1622144 -2219068 -2769627 -2590210
35082 -2590210 -2381018 -2932222 -3550596 -3124064 -1918376 -1061431 -842143 -647244 -162028
35073 -162028 341803 605739 485928 -209726 -1266900 -1803130 -1213733 -129132 256790
35064 256790 -391764 -1407609 -2123872 -2312461 -1813632 -565833 889882 1625020 1309012
35055 1309012 534809 -18109 -296284 -523231 -620837 -431673 -245491 -571136 -1395728 -2089169
35045 -2089169 -2130411 -1617678 -1004783 -678982 -876327 -1579509 -2297455 -2376357 -1792205 -1179637
35035 -1179637 -800164 -136433 978214 1597209 933180 -215123 -450498 233039 744243
35026 744243 862484 1334299 2019723 1719797 309639 -633048 -101481 914979 1172108
35017 1172108 955547 1095725 1479212 1688968 1963704 2310721 1773220 -105739 -2088433
35008 -2088433 -2828657 -2667269 -2517736 -2093233 -860734 303148 312573 -84845 549276
34999 549276 1804571 2075695 1222249 408101 -292059 -1714604 -3155449 -2689139 -361505
34990 -361505 1313234 781007 -684736 -1299344 -978914 -375685 388781 962104 427095
34981 427095 -1126596 -2154863 -1831844 -1242493 -1363913 -1358649 -177910 1427377 1930186
34972 1930186 1133551 16061 -728585 -969574 -798012 -817086 -1819627 -3309059 -3499982
34963 -3499982 -1833042 -238518 -574235 -1955030 -2169354 -798438 733034 1461738 1507083
34954 1507083 924048 -280333 -1207868 -808033 444447 1036843 573664 60084 -6553
34945 -6553 -380067 -1582118 -2935875 -3578869 -3475344 -2933259 -1912230 -373913 1160900
34936 1160900 1883214 1412309 187857 -728988 -493599 566308 1125138 358003 -1087540
34927 -1087540 -1989952 -1923060 -1261303 -468080 -78033 -747281 -2398806 -3780221 -3805771
34918 -3805771 -2955743 -2458059 -2556659 -2624376 -2531023 -2651138 -2754545 -2174257 -1071615 -401109
34908 -401109 -559774 -1049014 -1441752 -1711189 -1692182 -1233647 -794812 -910698 -1289185 -1470499
34898 -1470499 -1893736 -2887997 -3150991 -1256385 1450510 1848169 -546149 -2514008 -1559181
34889 -1559181 784203 1622019 810172 373245 1083100 1795555 1618635 837830 -114340
34880 -114340 -1083188 -1702873 -1702814 -1491175 -1399653 -840434 586747 1771107 1426795 318552
34870 318552 376895 1720935 2431688 1486846 51601 -657725 -952029 -1245572 -793292
34861 -793292 785637 2001627 1134432 -1259313 -2902373 -2563863 -1117457 -53482 -11386
34852 -11386 -736611 -1533100 -1629152 -789589 330609 937108 1112332 1513641 2169701 2281225
34842 2281225 1337514 -102567 -903718 -323457 1432864 3227051 3703534 2522618 819133
34833 819133 -70384 -185067 -575181 -1489454 -1901865 -1130555 -4402 250028 -305220
34824 -305220 -520809 210551 1234484 1534902 806735 -482855 -1681297 -2346528 -2282271
34815 -2282271 -1540892 -532052 50570 -237290 -1004651 -1291220 -711767 -46546 -235756
34806 -235756 -1023395 -1266189 -546585 296289 441563 122269 -39335 -43845 -209159 -338553
34796 -338553 3739 555425 447203 -668141 -2109600 -2959201 -2984557 -2588766 -2131392
34787 -2131392 -1600252 -930464 -385342 -333023 -619905 -570271 36400 364424 -411214 -1628007
34777 -1628007 -1713796 -437308 485244 -350503 -2090985 -2846037 -2160454 -1169862 -749358
34768 -749358 -763493 -1019226 -1640287 -2240328 -1919982 -654595 247825 -229292 -1454547
34759 -1454547 -2177214 -2272634 -2454677 -2635558 -1887773 -274292 540785 -587054 -2323487
34750 -2323487 -2284030 -256870 1358084 759950 -836831 -966884 788878 2595907 3027017
34741 3027017 2460411 1789987 1173136 511615 17273 -297471 -781859 -1278891 -979749
34732 -979749 321639 1661001 2058536 1395842 -133029 -2219418 -3651804 -2895262 -375914
34723 -375914 1310976 639988 -847147 -1076056 -338349 54024 324762 1117322 1217392
34714 1217392 -771713 -3316498 -3544965 -1615031 -470052 -1281169 -2287747 -2469554 -2982299
34705 -2982299 -4031446 -3715232 -1587728 -291470 -1511708 -2949213 -1815469 806480
34697 806480 1794296 546628 -1016062 -1814766 -2298085 -2581901 -2441066 -2613327 -3755419
34688 -3755419 -4554567 -3224832 -573532 804130 289220 -207676 384947 838174 168678
34679 168678 -601410 -330083 337976 216658 -476005 -621456 80147 820156 686405 -545901
34669 -545901 -2206745 -3116199 -2722345 -1869955 -1735747 -2146030 -1964179 -1040105 -418770
34660 -418770 -417955 -22276 1182500 1913379 1065114 -434797 -897076 -258056 113217 -397012
34650 -397012 -961000 -813708 -294935 -53109 -73791 -36688 -67436 -467800 -956307 -900625
34640 -900625 -366533 -220828 -819557 -1278959 -802277 -184527 -799372 -2245115 -2507756
34631 -2507756 -892344 730694 560027 -597182 -790501 122484 672203 245930 -467525
34622 -467525 -1155549 -2087447 -2673762 -1816964 -71447 480724 -759075 -1805542 -1021139
34613 -1021139 481970 724884 -203027 -735435 -438739 -268432 -647590 -955135 -905957
34604 -905957 -1039353 -1657738 -2411211 -3112046 -3906695 -4424302 -3846757 -2274051 -1069661
34595 -1069661 -1227480 -2118534 -2491349 -2076768 -1476343 -1015853 -628400 -559694 -1144313 -1833820
34585 -1833820 -1422915 375397 2267141 2735934 1623488 72222 -613549 171995 1898923
34576 1898923 2912557 1714037 -1059879 -2731575 -1617975 753981 1663827 727565
34568 727565 -197785 -154762 -39766 -314691 -36427 1016691 1299657 -126361 -1843159
34559 -1843159 -2152505 -1447235 -906910 -195441 1576163 3582938 4116993 3169619 2226719
34550 2226719 1847366 1339329 582329 253523 338279 269028 453620 1717626 3243588
34541 3243588 3191106 1584104 387574 307909 -122554 -1508406 -2112758 -793985 727893
34532 727893 326770 -1427818 -2421655 -1935839 -694756 806798 2134860 2075840 18574
34523 18574 -2415796 -3067377 -2184628 -1830837 -2631374 -3099401 -2306090 -1304724 -1334134 -2101494
34513 -2101494 -2530927 -2094586 -824963 1008560 2683732 3344731 3039107 2667048 2514055
34504 2514055 1771047 105236 -1253635 -984035 369159 1048046 516120 89425 844925
34495 844925 1899855 1598724 -86174 -1418193 -1264900 -567953 -803947 -1786799 -2099384
34486 -2099384 -1317777 -451900 -87490 487233 1733114 2734781 2583422 1869301 1644812
34477 1644812 1699477 1178111 311407 15870 61906 -711141 -2210983 -2705909 -1207921
34468 -1207921 983434 1858503 935352 -732152 -1990089 -2322340 -1775186 -843423 -54119
34459 -54119 713085 1909505 3006428 2466810 -164918 -2952702 -3480434 -1669269 384642
34450 384642 1110408 844513 552707 388978 -37267 -758905 -1313346 -1146598 -66005
34441 -66005 1276488 1537774 119913 -1632180 -1716664 -97330 1136311 602538 -680410
34432 -680410 -1146775 -887306 -831845 -882752 -457762 -164807 -1134454 -2897991 -3626324 -2605053
34422 -2605053 -1032139 -220966 -417259 -1504641 -3247106 -4437024 -3504646 -769095 1355821
34413 1355821 1258296 -88635 -1046284 -1486212 -1893540 -1785102 -620995 760699 1235406
34404 1235406 1115080 1275656 1396950 738394 -53377 229340 1172119 1260675 364062 -134956
34394 -134956 372624 1070835 1368807 1439013 1025087 -430574 -2167085 -2444126 -1029960
34385 -1029960 289146 220410 -602116 -1194775 -1511059 -1479883 -545921 878436 1182508
34376 1182508 -84679 -1177912 -730167 153666 -121402 -954739 -688130 578303 1334148
34367 1334148 1309674 1753731 3017159 3629323 2354358 11915 -1445986 -1136902 -52613
34358 -52613 173939 -923639 -2242017 -2661186 -2579333 -3133352 -4179459 -4356424 -3329094
34349 -3329094 -2451946 -2550633 -2547543 -1373090 67777 231279 -732192 -1446226 -1426494 -1310514
34339 -1310514 -1445010 -1554946 -1503383 -1306151 -788037 -158896 -289909 -1368620 -2076456
34330 -2076456 -1379829 -300545 -367235 -1120927 -1050332 -397552 -796135 -2279036 -3007704
34321 -3007704 -2324135 -1816115 -2585092 -3496966 -3233739 -2312815 -1745024 -1184248 28994
34312 28994 1118738 904498 -69373 -157238 822385 1239982 138126 -1265672 -1234979 183217
34302 183217 1385195 1391615 902148 1000627 1549498 1528742 637851 -325401 -780441 -1139488
34292 -1139488 -1810233 -2281403 -1997949 -1484366 -1588974 -2040242 -1861158 -997323 -387179
34283 -387179 -448953 -633324 -586068 -629219 -844376 -777025 -408873 -343475 -575086 -226092
34273 -226092 795395 1029615 -559412 -2716218 -3348552 -2387583 -1763452 -2576490 -3731173
34264 -3731173 -3827127 -3155613 -2904685 -3228984 -3331110 -3133619 -3519856 -4642958 -5205900
34255 -5205900 -4187153 -2402855 -1340559 -1083661 -674133 -160700 -652621 -2134460 -2902980
34246 -2902980 -1991872 -791661 -1112121 -2644686 -3626917 -3286288 -2264938 -1129856 67791
34237 67791 907661 687188 -389973 -1166569 -934863 -129114 458398 413750 -325931 -1422440
34227 -1422440 -2029871 -1535538 -474733 21064 -307354 -690235 -622756 -467861 -681391
34218 -681391 -1262539 -2129017 -3243198 -4136367 -4047517 -2892625 -1602476 -1232584 -2042937
34209 -2042937 -3458954 -4549765 -4608071 -3679476 -2476736 -1555063 -920774 -668014 -1213670
34200 -1213670 -2293622 -2630230 -1583405 -303036 -40284 -174278 523184 1432757 914001
34191 914001 -779740 -1646833 -1107679 -788537 -1605744 -2212296 -1316561 271737 1088039
34182 1088039 1041867 817727 477533 -144174 -598029 -438925 17851 266904 150049 -608343
34172 -608343 -2261165 -3923576 -3974515 -2306102 -761147 -497729 -486581 297844 907737
34163 907737 196023 -946301 -998908 -284778 -49163 -20426 940683 2362136 2576442 1416896
34153 1416896 379824 48085 -586157 -1888663 -2644647 -2082452 -1204390 -1152133 -1486780
34144 -1486780 -1115811 -74644 589496 236886 -781103 -1655066 -1753999 -990552 100955
34135 100955 824558 994864 930243 789751 291228 -821565 -2283733 -3298730 -2938593
34126 -2938593 -915438 1688473 2893649 1688060 -771820 -2426399 -2585451 -2277860
34118 -2277860 -2512002 -3041176 -3031559 -2290975 -1459418 -1239605 -1641589 -1951290 -1518145 -564215
34108 -564215 105060 196456 144885 120662 -290277 -986977 -971742 97174 937177 388528
34098 388528 -674207 -614503 347963 458993 -823563 -2118854 -2319167 -1879846 -1517190
34089 -1517190 -1153664 -812392 -1175775 -2355112 -3200418 -2796803 -1795824 -1343213 -1428325
34080 -1428325 -1240615 -545863 260496 994589 1620869 1706971 908695 -189265 -610846
34071 -610846 -282104 24668 -28950 4619 347350 508591 117576 -493123 -952252 -1448276
34061 -1448276 -2104978 -2313982 -1493112 -256923 75090 -752197 -1496224 -1168671 -495111
34052 -495111 -864453 -2231241 -3037557 -2276219 -744674 129787 12837 -359150 -420585
34043 -420585 -256732 -27123 371094 957216 1491841 1811523 1959570 1847535 1214958 218198
34033 218198 -331245 133665 914156 587181 -1180362 -2936227 -3111893 -1986308 -1209334
34024 -1209334 -1580098 -2322111 -2652032 -2829101 -3098280 -2848968 -1849678 -1233802 -1860976
34015 -1860976 -2537827 -1563636 485773 1411679 606278 -408101 -694862 -938271 -1328614
34006 -1328614 -787769 668884 1028396 -746000 -2741816 -2898842 -2161170 -2742941 -4476759
33997 -4476759 -5178536 -3983903 -2201967 -1177621 -1136264 -1876285 -2901716 -3103429 -1912933
33988 -1912933 -510342 -337749 -818226 -297889 1110932 1631330 693412 -325191 -439130
33979 -439130 -221773 -262938 -263117 -162778 -511990 -1167837 -1178387 -510628 -369473 -1202002
33969 -1202002 -1865539 -1435672 -445313 312549 819918 1015074 372551 -898468 -1544236
33960 -1544236 -982741 -162460 -8552 -243441 -438342 -897941 -1684841 -2075624 -1861785
33951 -1861785 -1910162 -2553162 -2781052 -2031041 -1392810 -1863321 -2706165 -2813672 -2458194 -2336378
33941 -2336378 -2095095 -1331157 -929001 -1678273 -2460537 -1657283 226876 1160321 489658
33932 489658 -421465 -348772 478336 1255207 1558760 1315818 723012 210084 -86811 -451194
33922 -451194 -705765 -58105 1384609 2007382 775619 -1049313 -1651164 -1159799 -858388
33913 -858388 -868890 -531657 -308649 -1112479 -2163293 -1794864 -294635 309123 -588942
33904 -588942 -1445099 -1289945 -906994 -750482 -1211 1351279 1631296 -11069 -1985685
33895 -1985685 -2552899 -2187808 -2195396 -2364904 -1700679 -478221 153079 -480 -277373 -626913
33885 -626913 -1507771 -2571557 -2819193 -2095808 -1351313 -1319551 -1762971 -2059037 -1834226 -1042716
33875 -1042716 -68499 284786 -476266 -1789923 -2500639 -2042365 -801667 490132 1217046
33866 1217046 912047 -484564 -2254976 -3272430 -3020029 -2072001 -1423906 -1455263 -1686814
33857 -1686814 -1554748 -1235479 -1407902 -2189030 -2804367 -2665859 -2287698 -2476056 -2946029
33848 -2946029 -2610346 -1171611 437374 1291735 1359232 1018459 491944 -12042 -290316
33839 -290316 -476297 -763432 -800265 -176054 516005 164239 -1154381 -2079812 -1868588 -1240200
33829 -1240200 -1000731 -1108417 -1565237 -2770060 -4207799 -4248586 -2341690 -141606 711185
33820 711185 676246 887660 991065 137184 -951124 -944071 -288080 -554634 -1720589 -2127781
33810 -2127781 -1132392 119680 717229 944407 900501 -31811 -1731122 -2922823 -2957439
33801 -2957439 -2690657 -2894829 -3031221 -2371692 -1254342 -430785 -62870 -35256 -391181
33792 -391181 -855921 -820508 -366520 -344856 -857402 -785319 368707 1324869 845066 -240088
33782 -240088 -193281 1038856 1850866 1398045 613507 583805 989643 699415 -651827 -2182912
33772 -2182912 -2730072 -2047766 -999664 -575303 -883386 -1331682 -1589625 -1893006 -2472288
33763 -2472288 -3215642 -3859760 -3985588 -3036380 -1127518 391193 283970 -733264 -813098
33754 -813098 296924 926128 216286 -642222 -692046 -821932 -1812187 -2543914 -1878302 -803957
33744 -803957 -700916 -774441 426202 1933928 1529571 -475525 -1455932 -543088 331111
33735 331111 3663 -89897 1184587 2403471 1922750 586491 216691 749678 779570
33726 779570 67126 -309694 148416 856662 1305252 1464352 1186170 286358 -822079
33717 -822079 -1398875 -1228310 -670800 -151917 -55096 -587574 -1195187 -793477 693897 1774708
33707 1774708 1281420 78352 -258326 219073 233660 -410259 -569861 182944 832012
33698 832012 603686 19043 -284347 -581544 -1182031 -1519507 -1031325 -280226 -255534 -896690
33688 -896690 -1157753 -449502 675583 1361979 1436715 1283377 1020099 234104 -1302709
33679 -1302709 -2911382 -3472553 -2739086 -1738585 -1545311 -2051670 -2419838 -2351618 -2202250
33670 -2202250 -2053530 -1540898 -700940 -213127 -488481 -1087649 -1379672 -1344314 -1399337 -1752460
33660 -1752460 -2189210 -2283338 -1711614 -633663 232013 316574 8236 231803 1126434 1773312
33650 1773312 1514524 902315 840601 1278193 1387670 782969 -47938 -437718 -163945 595415
33640 595415 1456640 1881043 1420278 168201 -1152475 -1728444 -1311182 -337875 544122
33631 544122 985686 928733 281378 -981354 -2272897 -2526138 -1468649 -413287 -895882
33622 -895882 -2555219 -3376750 -2365826 -937244 -888677 -1854157 -1949070 -544763 930450
33613 930450 1078490 215726 -547966 -956777 -1492624 -2160992 -2364986 -1934055 -1504520 -1670371
33603 -1670371 -2254544 -2649566 -2503119 -1834133 -830521 115443 430324 -106130 -886587
33594 -886587 -973761 -187882 651837 747340 255366 -82290 39507 285158 388477 512707
33584 512707 712237 512641 -486167 -1759024 -2176789 -1353588 -240587 11562 -475888
33575 -475888 -522837 438231 1523366 1528900 404282 -872748 -1500494 -1334803 -497056 652325
33565 652325 1209838 350590 -1466068 -2735623 -2764612 -2497486 -2920522 -3447271 -2823337
33556 -2823337 -1131979 192497 249396 -378431 -652862 -269362 379599 798828 718836
33547 718836 298621 137571 650439 1372118 1382520 509016 -414910 -619663 -210347 258201
33537 258201 488194 455917 172140 -252428 -604395 -861837 -1211187 -1602711 -1623567 -1061099
33527 -1061099 -358635 -263802 -1072784 -2243966 -2704166 -1762174 15582 1126820 774421
33518 774421 -128416 -235953 279670 59114 -1218398 -2169698 -1711799 -662339 -561808
33509 -561808 -1633172 -2771568 -3111975 -2782292 -2317312 -2033915 -1964183 -1952785 -1834477 -1718651
33499 -1718651 -1883368 -2227018 -2228478 -1717609 -1223430 -1200655 -1395835 -1428184 -1502405 -1955959
33489 -1955959 -2503767 -2616255 -2409213 -2498936 -3073536 -3652292 -3706279 -3098044 -2044885 -1071907
33479 -1071907 -841188 -1558552 -2618174 -3200198 -3133930 -2901983 -2983021 -3451603 -3955783 -3839015
33469 -3839015 -2695074 -1136438 -472130 -1087952 -1692271 -925780 694173 1332946 155605
33460 155605 -1762572 -2774039 -2145857 -298775 1604165 2292295 1466217 397992 665583
33451 665583 2075863 2642179 990584 -1914124 -3898481 -3825513 -2171750 64997 2165431
33442 2165431 3506637 3467944 2041315 249313 -592315 -174912 537330 509087 -260462
33433 -260462 -1165591 -2021018 -2861216 -3051703 -1862174 -84406 334800 -1061518 -2305697
33424 -2305697 -1744516 -433570 -344478 -1298085 -1628701 -1214517 -1546945 -2828303 -3320671
33415 -3320671 -2142200 -660605 -216132 -274029 29730 144209 -649501 -1519246 -1203124
33406 -1203124 -7142 789237 860604 761745 517120 -220423 -995524 -1064260 -894087 -1605985
33396 -1605985 -2885720 -3032981 -1485960 147204 300462 -474436 -602882 153413 560251
33387 560251 -159036 -1280181 -1648775 -1142995 -644063 -759958 -1039282 -703887 82784
33378 82784 263353 -625694 -1649987 -1731167 -1206068 -1232040 -1838321 -1713410 -255647 1205797
33368 1205797 1037010 -455534 -1336222 -421152 1481568 2793300 2889502 2251541 1443479
33359 1443479 561959 -399967 -1200465 -1594325 -1660385 -1621382 -1470404 -1059452 -521796 -259303
33349 -259303 -349687 -256887 509070 1535520 1776794 905232 18176 462575 2023661 2966117
33339 2966117 2198660 715707 111448 159683 -821115 -3095683 -4532506 -3391498 -873030
33330 -873030 507699 262110 -104031 -51272 -767953 -2549855 -3524123 -2250816 -80282
33321 -80282 690864 38142 -159536 803517 1597670 1179555 331562 240838 703443 636127
33311 636127 -223019 -967301 -756482 142301 692107 304059 -458186 -546833 289529 1294225
33301 1294225 1810170 1940990 1777481 793371 -1153864 -2829328 -2780111 -1302288 -164287
33292 -164287 -382200 -1321346 -2070574 -2528068 -2763729 -2421176 -1417076 -431350 -38568
33283 -38568 42782 304650 697931 1078783 1720251 2673701 3200917 2640163 1421742 460075
33273 460075 -93150 -692804 -1312226 -1401741 -833831 -100641 417692 717957 785206 632780
33263 632780 650882 1160838 1670879 1425553 725745 710303 1573366 2042505 1183242 -206273
33253 -206273 -789798 -549050 -505283 -1088716 -1804019 -2248179 -2432175 -2184035 -1292810 -377720
33243 -377720 -586500 -2061983 -3572629 -4083485 -3847974 -3449358 -2740274 -1598188 -873325
33234 -873325 -1345072 -2225193 -2077233 -1062013 -793804 -1753069 -2348406 -1249829 610500
33225 610500 1387819 742156 -256619 -973785 -1632453 -2171540 -2020475 -1176899 -454687 -325628
33215 -325628 -296896 235407 1157772 1966509 2359446 2207663 1455180 397434 -310919 -237281
33205 -237281 433456 1149153 1371427 800235 -334297 -1290611 -1655665 -2003067 -2972949
33196 -2972949 -3874556 -3332318 -1474613 -174341 -522910 -1320313 -1051695 -256767 -522870
33187 -522870 -1799093 -2361587 -1396378 -139418 -54778 -978562 -1655585 -1418460 -758960
33178 -758960 -569724 -1185583 -2061115 -2378014 -2109289 -2156892 -2988856 -3572039 -2528131 -183530
33168 -183530 1567544 1597942 757486 394057 621751 711017 470767 382291 666010 949359
33158 949359 840621 400578 39652 136494 645597 1016873 779384 244911 175158 617581
33148 617581 675832 -195942 -1242169 -1334063 -479875 252726 201268 -95075 321604 1573314
33138 1573314 2646722 2374714 788030 -687450 -779910 -2402 -54059 -1501619 -2950752
33129 -2950752 -2986483 -2049397 -1545095 -1760494 -1772071 -1151207 -648748 -1062786 -2230488 -3338650
33119 -3338650 -3704972 -3216162 -2468914 -2377447 -3123483 -3702934 -3145090 -1903473 -1218477
33110 -1218477 -1371802 -1628625 -1740704 -2152346 -2563000 -1827310 48970 1216273 339470
33101 339470 -1452822 -2218139 -1910983 -1967368 -2756983 -3150733 -2577620 -1865955 -1614309 -1126478
33091 -1126478 268412 1871019 2490362 2004022 1230155 779699 840103 1585455 2776254
33082 2776254 3219682 1808451 -765366 -2419861 -2205177 -1412044 -1528642 -2118732 -1875129
33073 -1875129 -1030910 -1053890 -2026086 -2188474 -813644 142446 -1275741 -3787066 -4234628
33064 -4234628 -1859964 713433 1080040 -127237 -850391 -564381 -293039 -562194 -830481
33055 -830481 -715896 -551235 -623906 -743057 -687487 -431341 73008 686448 754420 -169382
33045 -169382 -1225619 -880869 937203 2252817 1340051 -1006864 -2406369 -1777822 -301725
33036 -301725 504442 556880 498604 154860 -1130535 -2854271 -3362305 -2003460 -310411
33027 -310411 -168315 -1407772 -2236181 -1713475 -614761 125648 524756 756501 502233
33018 502233 -179719 -362834 445044 1305131 1149397 415382 288609 835647 1085326 641791
33008 641791 13215 -474862 -897183 -980052 -386380 258971 -64772 -1051444 -1251501 -254227
32998 -254227 683680 627859 192345 157321 271801 295893 851470 2045320 2430461 795315
32988 795315 -1818629 -3307650 -3099963 -2211237 -1323802 -338399 545737 868270 867117 986567
32978 986567 673012 -762170 -2306336 -2203926 -857470 -615893 -2086311 -2919550 -1477608
32969 -1477608 422341 292711 -1205000 -1605859 -698100 -476865 -1367526 -1403612 195515
32960 195515 1264571 -21803 -2116212 -2346342 -907960 -317214 -1365354 -2004891 -696998
32951 -696998 1186512 1470068 272032 -526468 -145803 420472 459129 632768 1521900
32942 1521900 2374334 2228425 1429634 975424 903382 512098 -75814 89021 1025806 1335052
32932 1335052 103358 -1672843 -2393376 -1860753 -1052733 -453237 256501 1059258 1326374
32923 1326374 854634 253198 22709 22647 116742 540394 1232309 1581012 1379260 1323564
32913 1323564 1881748 2275581 1440521 -397106 -1972723 -2564632 -2456915 -2000746 -1206202
32904 -1206202 -353839 -65194 -432429 -796032 -713574 -503223 -500801 -447951 -75649 273626
32894 273626 134602 -385573 -862525 -1129650 -1193603 -994417 -687193 -737026 -1261029 -1707165
32884 -1707165 -1690372 -1667192 -2163006 -2799062 -2841502 -2356451 -2030555 -2137236 -2465452 -2947208
32874 -2947208 -3469528 -3391531 -2304678 -1057708 -883746 -1652936 -2226204 -2370285 -2734690
32865 -2734690 -2877089 -1316534 1723931 3577766 2474629 89208 -811208 1032 721686
32856 721686 627993 559345 781663 552871 -138647 -356807 -46691 -311747 -1386803 -1993681
32846 -1993681 -1389439 -526605 -325788 -202644 612990 1478131 1308153 311013 -459156
32837 -459156 -684582 -822048 -1053412 -1252355 -1622044 -2392871 -3196066 -3597938 -3859957 -4263925
32827 -4263925 -4166182 -2864986 -1075805 -256984 -562174 -767841 -324663 -111920 -738197
32818 -738197 -1350667 -878238 426765 1432427 1479468 706541 -328156 -754768 202208
32809 202208 2170872 3516027 3080955 1641473 818527 933806 943679 324136 -138988
32800 -138988 295601 1160571 1536923 1329473 1146301 1275576 1391344 1107214 304206 -990439
32790 -990439 -2509552 -3492942 -3090325 -1327551 656730 1668022 1544276 916720 207706
32781 207706 -562426 -1077469 -614397 987631 2754610 3511762 3172192 2662422 2739138
32772 2739138 3282422 3576795 2853732 765965 -2105375 -4327216 -4822858 -4012956 -3207856
32763 -3207856 -2975690 -2849808 -2564119 -2516721 -2737447 -2500310 -1577938 -915494 -1253155 -1945324
32753 -1945324 -2133063 -2289182 -3309633 -4620347 -4734028 -3585072 -2759368 -3105222 -3531618
32744 -3531618 -2816380 -1454738 -856462 -1495582 -2675915 -3538063 -3531819 -2411284 -621885
32735 -621885 591622 272435 -1108437 -2183176 -2276225 -1899420 -1678373 -1391038 -382605
32726 -382605 1327840 2744703 2896147 2023079 1328655 1317746 993255 -558815 -2307421
32717 -2307421 -2310179 -587130 590892 -163461 -1454677 -1371288 -260219 288836 163011
32708 163011 497697 1279352 1295914 512094 421956 1476945 2009139 680955 -1483173
32699 -1483173 -2679951 -2762970 -2784478 -2970850 -2615052 -1607549 -752319 -546280 -591948 -317963
32689 -317963 341051 964337 928699 -42095 -1177915 -1063900 565606 2059308 1865279
32680 1865279 721870 476076 1122284 835715 -896885 -2217149 -1854833 -1251780 -2107236
32671 -2107236 -3258623 -2290584 378248 1579731 -96223 -2247108 -2222817 -758601 -268309
32662 -268309 -921165 -772368 671625 1476607 350412 -1345527 -1703375 -902944 -492209
32653 -492209 -1107333 -2197483 -3186690 -3570138 -2573054 -255821 1538774 1083774 -579272
32644 -579272 -782330 831908 1647311 126980 -1588552 -742048 1921339 3167698 1647251
32635 1647251 -822473 -2170203 -2298520 -2034446 -1564556 -803969 -223038 -327962 -859013
32626 -859013 -1186959 -1108733 -764802 -216439 353905 386593 -481245 -1677296 -2021677 -906146
32616 -906146 1030055 2437017 2457548 1500280 798059 1063298 1718038 1721583 907349 -70384
32606 -70384 -948939 -2108550 -3401394 -3739343 -2569175 -1020690 -605458 -1197418 -1409691
32597 -1409691 -816760 -509757 -1111377 -1495125 -404845 1466049 2237496 1410497 427199
32588 427199 484607 960569 668085 -235806 -632038 -279447 -106321 -643034 -1243852 -1252271
32578 -1252271 -1059340 -1394409 -2206831 -2933493 -3374180 -3557608 -3177936 -2089452 -1109725
32569 -1109725 -1263870 -2206458 -2496051 -1716779 -1190645 -1945622 -3013710 -2784249 -1341483
32560 -1341483 -194779 -22634 -84820 33772 -443536 -1935751 -3263156 -3052139 -1687765
32551 -1687765 -657350 -316653 314053 1456923 1757501 301024 -1669905 -2208136 -1227954
32542 -1227954 -364117 -479822 -643300 136171 1327499 1726669 1115353 276361 -210868
32533 -210868 -446967 -686194 -936411 -1034448 -787537 -207291 221316 -30800 -572211 -324284
32523 -324284 666894 592572 -1722888 -4490789 -4782395 -2580651 -1048424 -2183519 -4102763
32514 -4102763 -3914749 -1788563 -367780 -973122 -2347105 -3009783 -3028529 -3042890 -3000588
32505 -3000588 -2622665 -2176915 -2036155 -2037454 -1826164 -1377824 -782837 4360 824180 1198637
32495 1198637 948339 487280 148535 -312169 -1137590 -1961361 -2257827 -2026831 -1585657
32486 -1585657 -1038181 -382744 216977 686781 1164874 1478252 1052561 -124028 -1084302
32477 -1084302 -1153822 -985976 -1394686 -1827688 -1296364 -341648 -439565 -1522578 -1858198 -777366
32467 -777366 167438 -485942 -2126795 -3325733 -3707742 -3493783 -2507294 -1028609 -506523
32458 -506523 -1781254 -3419545 -3492386 -2318543 -1646851 -1735550 -1392865 -645916 -936369
32449 -936369 -2330713 -2904683 -1738141 -398072 -318570 -677673 -323667 -8468 -845585
32440 -845585 -1962529 -1817319 -913308 -997364 -2089886 -2561284 -2050618 -2064596 -3266389
32431 -3266389 -4179688 -3441990 -1798109 -849883 -948049 -1274870 -1160219 -462465 641136
32422 641136 1456124 1001240 -774345 -2506046 -2863740 -2047427 -1191617 -794727 -554536
32413 -554536 -379282 -598160 -1221488 -1834263 -2358278 -3212682 -4423948 -5109848 -4314324
32404 -4314324 -2200834 -93205 717544 126311 -805876 -945632 -115030 927048 1355667
32395 1355667 993108 280846 -219126 -310604 -327241 -736454 -1392778 -1405813 -189439 1459732
32385 1459732 1918104 529401 -1604226 -2815988 -2488907 -1337701 -498854 -547683 -1072502
32376 -1072502 -1071811 -102495 979402 963407 -53612 -778968 -656206 -594927 -1219341 -1577093
32366 -1577093 -695723 519578 460651 -611092 -855302 332602 1509047 1552427 1192332
32357 1192332 1378051 1598184 1042827 327465 566166 1364116 1268243 -15317 -1304466
32348 -1304466 -1881099 -2353652 -3236136 -3934477 -3807499 -3243682 -2872743 -2458251 -1492961
32339 -1492961 -400488 -159471 -898611 -1728245 -1983789 -1879533 -1769956 -1446305 -570490
32330 -570490 574815 1213685 910607 63951 -477763 -271471 269917 372396 -158289
32321 -158289 -713601 -683736 -161192 384611 774396 1034783 926445 165490 -900741 -1397367
32311 -1397367 -892349 48069 410366 -310390 -1646149 -2467968 -1967555 -615654 147343
32302 147343 -409638 -1315277 -1216770 -305871 36190 -662853 -1429792 -1590953 -1776263 -2560348
32292 -2560348 -3209143 -2757545 -1611015 -1005571 -1239823 -1424877 -863951 166205 1044523
32283 1044523 1521116 1625142 1317600 485730 -824555 -2215779 -3042629 -2952221 -2324633
32274 -2324633 -1845226 -1675388 -1513289 -1356637 -1421609 -1301358 -275976 1239982 1749817
32265 1749817 777236 -282216 -251639 152077 -56860 -84564 1281977 3064286 2951040
32256 2951040 665516 -1435904 -1423403 133239 1502347 1703788 609298 -1400800 -3103158
32247 -3103158 -2941303 -813484 1385608 1730058 207715 -1714497 -2724089 -2398970 -1114254
32238 -1114254 141180 426156 -134405 -463895 -13280 484850 121920 -986970 -2071979
32229 -2071979 -2657871 -2639776 -1981711 -915123 -38886 258888 172981 -22717 -444989 -1258083
32219 -1258083 -2227560 -2859162 -2681343 -1405925 636883 2232553 2216624 854194 -420899
32210 -420899 -779397 -706781 -806239 -905265 -760287 -698997 -967322 -1162778 -847009 -119833
32200 -119833 743804 1512918 1631287 592837 -935566 -1401823 -306266 1137002 1787483
32191 1787483 1902883 2022638 1749852 613473 -853133 -1873771 -2394214 -2459227 -1712025
32182 -1712025 -504811 -304705 -1669994 -2871392 -2031632 219016 1772452 1952625 1745988
32173 1745988 1794032 1949058 2362001 3159220 3328622 1829402 -306875 -935561 60095
32164 60095 582204 -392659 -1363535 -877208 284158 565000 -141089 -877447 -1148787 -994323
32154 -994323 -420414 266975 335968 -257246 -364672 792213 2198918 2223118 790305
32145 790305 -634844 -1032223 -832153 -908181 -1382768 -1742833 -1690076 -1515391 -1694155 -2276037
32135 -2276037 -2795171 -2834892 -2524930 -2293168 -2289147 -2333150 -2271555 -2037018 -1535029 -887369
32125 -887369 -600139 -988081 -1587203 -1679160 -1254246 -893242 -882810 -1086955 -1462312 -1910618
32115 -1910618 -1833706 -818163 308262 201167 -1113242 -2210683 -2369304 -2455336 -3190107
32106 -3190107 -3784443 -3239733 -2079478 -1640018 -2120193 -2389207 -1587424 -135642 836043
32097 836043 601227 -510440 -1315307 -960244 -108760 -326309 -1915913 -3216758 -2817447
32088 -2817447 -1634206 -1588498 -2762507 -3387044 -2591122 -1557046 -1502715 -2023769 -2336996
32079 -2336996 -2861898 -4189661 -5357716 -4847072 -2998183 -1719552 -1677423 -1509457 -338433
32070 -338433 749353 826421 1028090 2570368 4081903 3151748 31868 -2483656 -2856329
32061 -2856329 -2237795 -1815519 -1126359 76301 538470 -414262 -1302345 -696498 435479
32052 435479 352309 -719656 -1367034 -1494701 -1977126 -2480476 -1774942 3831 1290959
32043 1290959 1240634 369897 -717147 -1627409 -1483096 239498 2202268 2303000 411547
32034 411547 -1551561 -2255816 -2046676 -1486987 -703748 -316640 -1083896 -2299718 -2386590
$$ [...]
##END NTUPLES=NMR SPECTRUM
##END=
