##TITLE=31Pdec_LR-684B-C2-TFA
 CDCl3, 124 sc
 2.8.2019
##JCAMPDX= 6.0         $$ Bruker NMR JCAMP-DX V2.0
##DATA TYPE= NMR SPECTRUM
##DATA CLASS= NTUPLES
##ORIGIN= UXNMR, Bruker Analytische Messtechnik GmbH
##OWNER= root
$$ XWIN-NMR		Version 3.5
$$ Fri Aug  2 15:40:23 2019 Russian Standard Time (UT+4h)  she@DPX200
##.OBSERVE FREQUENCY= 81.013821
##.OBSERVE NUCLEUS= ^31P
##.ACQUISITION MODE= SIMULTANEOUS
##.ACQUISITION SCHEME= undefined
##.AVERAGES= 124
##.DIGITISER RES= 17
##SPECTROMETER/DATA SYSTEM= spect
##.PULSE SEQUENCE= zgpg30
##.SOLVENT NAME= CDCl3
##.SHIFT REFERENCE= (INTERNAL, CDCl3, 0, 182.463)
##AUDIT TRAIL= $$ (NUMBER, WHEN, WHO, WHERE, WHAT)
$$ ##TITLE= Audit trail, XWIN-NMR		Version 3.5
$$ ##JCAMPDX= 5.01
$$ ##ORIGIN= Bruker BioSpin GmbH
$$ ##OWNER= she
$$ F:/spectra/data/she/nmr/P31/1/pdata/1/auditp.txt
$$ ##AUDIT TRAIL=  $$ (NUMBER, WHEN, WHO, WHERE, WHAT)
(   1,<2019-08-02 15:39:16.25 +0400>,<she>,<DPX200>,
      <continue with go, POWCHK disabled, PULCHK disabled
       configuration hash MD5:
       00 E9 B6 7A A2 85 ED C7 34 08 36 98 17 FE 4E 26
       data hash MD5: 32K
       98 61 3F 23 B8 0D DF C7 C5 FE E7 75 36 0B 8A 3D>)
(   2,<2019-08-02 15:39:19.18 +0400>,<she>,<DPX200>,
      <Start of raw data processing
       efp BC_mod = 2 LB = 1 FT_mod = 6 PKNL = 1 PHC0 = -408.0592 PHC1 = 86.20038 SI = 64K 
       data hash MD5: 64K
       9A 1E D5 C3 BF 84 8A BF B5 47 C3 16 73 2E A6 73>)
(   3,<2019-08-02 15:39:46.79 +0400>,<she>,<DPX200>,
      <pk PHC0 = 10.31545 PHC1 = 56.4 
       data hash MD5: 64K
       C8 20 43 62 B2 8D 92 A3 6B A2 B0 AF 2E 37 FD 25>)
(   4,<2019-08-02 15:39:49.87 +0400>,<she>,<DPX200>,
      <abs ABSG = 5 
       data hash MD5: 64K
       73 F2 E6 01 B9 1D D6 54 C7 5A 8E DE 2E 4C B3 E9>)
$$ ##END=
$$ 
$$ hash MD5
$$ B0 3A 40 D5 E4 3C 56 2B 8D 4C FC 06 48 89 ED 2F
##$RELAX= 
##$RELAX= 
##$RELAX= 
##$RELAX= 
##$RELAX= 
##$RELAX= 
##$RELAX= 
##$RELAX= 
$$ Bruker specific parameters
$$ --------------------------
##$DU= <F:/spectra>
##$EXPNO= 1
##$NAME= <P31>
##$PROCNO= 1
##$TYPE= <nmr>
##$USER= <she>
##$AMP= (0..31)
100 100 100 100 100 100 100 100 100 100 100 100 100 100 100 100 100 100 
100 100 100 100 100 100 100 100 100 100 100 100 100 100 
##$AQSEQ= 0
##$AQ_mod= 1
##$AUNM= <au_zg>
##$AUTOPOS= <>
##$BF1= 81.014009
##$BF2= 200.13
##$BF3= 200.13
##$BF4= 200.13
##$BF5= 200.13
##$BF6= 200.13
##$BF7= 200.13
##$BF8= 200.13
##$BYTORDA= 1
##$CFDGTYP= 0
##$CFRGTYP= 5
##$CHEMSTR= <none>
##$CNST= (0..31)
1 1 145 1 1 1 1 1 1 1 1 1 1 1 1 1 1 1 1 1 1 1 1 1 1 1 1 1 1 1 1 1 
##$CPDPRG= <waltz16>
##$CPDPRG1= <>
##$CPDPRG2= <waltz16>
##$CPDPRG3= <>
##$CPDPRG4= <mlev>
##$CPDPRG5= <mlev>
##$CPDPRG6= <mlev>
##$CPDPRG7= <mlev>
##$CPDPRG8= <mlev>
##$CPDPRGB= <>
##$CPDPRGT= <>
##$D= (0..31)
0 1 0 0 0 0 0 0 0 0 0 0.03 2e-05 3e-06 0 0 0 0 0 0 0 0 0 0 0 0 0 0 0 0 
0 0 
##$DATE= 1564745772
##$DBL= (0..7)
120 120 120 11 120 120 24 19 
##$DBP= (0..7)
150 150 150 150 150 150 150 150 
##$DBP07= 0
##$DBPNAM0= <>
##$DBPNAM1= <>
$$ [...]
##$SUBNAM3= <"">
##$SUBNAM4= <"">
##$SUBNAM5= <"">
##$SUBNAM6= <"">
##$SUBNAM7= <"">
##$SUBNAM8= <"">
##$SUBNAM9= <"">
##$SW= 369.568048894756
##$SWIBOX= (0..15)
0 1 3 0 0 0 0 0 0 0 0 0 0 0 0 0 
##$SW_h= 29940.119760479
##$TD= 32768
##$TD0= 1
##$TE= 0
##$TE2= 300
##$TE3= 300
##$TEG= 300
##$TL= (0..7)
0 120 53 12 22 120 120 120 
##$TP= (0..7)
150 150 150 150 150 150 150 150 
##$TP07= 0
##$TPNAME0= <>
##$TPNAME1= <>
##$TPNAME2= <>
##$TPNAME3= <>
##$TPNAME4= <>
##$TPNAME5= <>
##$TPNAME6= <>
##$TPNAME7= <>
##$TPOAL= (0..7)
0.5 0.5 0.5 0.5 0.5 0.5 0.5 0.5 
##$TPOFFS= (0..7)
0 0 0 0 0 0 0 0 
##$TUNHIN= 0
##$TUNHOUT= 0
##$TUNXOUT= 0
##$USERA1= <user>
##$USERA2= <user>
##$USERA3= <user>
##$USERA4= <user>
##$USERA5= <user>
##$V9= 5
##$VALIST= <valist>
##$VCLIST= <CCCCCCCCCCCCCCC>
##$VD= 0
##$VDLIST= <DDDDDDDDDDDDDDD>
##$VPLIST= <PPPPPPPPPPPPPPP>
##$VTLIST= <TTTTTTTTTTTTTTT>
##$WBST= 1024
##$WBSW= 4
##$XGAIN= (0..3)
0 0 0 0 
##$XL= 0
##$YL= 0
##$YMAX_a= 15809
##$YMIN_a= -17191
##$ZGOPTNS= <>
##$ZL1= 120
##$ZL2= 120
##$ZL3= 120
##$ZL4= 120
##$ABSF1= 182.463
##$ABSF2= -187.1042
##$ABSG= 5
##$ABSL= 3
##$ALPHA= 0
##$AQORDER= 0
##$ASSFAC= 0
##$ASSFACI= 0
##$ASSFACX= 0
##$ASSWID= 0
##$AUNMP= <proc_1d>
##$AZFE= 0.1
##$AZFW= 0.5
##$BCFW= 0
##$BC_mod= 2
##$BYTORDP= 0
##$COROFFS= 0
##$CY= -3
##$DATMOD= 1
##$DC= 0
##$DFILT= <>
##$DTYPP= 0
##$F1P= 0
##$F2P= 0
##$FCOR= 1
##$FTSIZE= 65536
##$FT_mod= 6
##$GAMMA= 0
##$GB= 0
##$INTBC= 1
##$INTSCL= 5.30512e-09
##$ISEN= 30
##$LB= 1
##$LEV0= 0
##$LPBIN= 0
##$MAXI= 10000
##$MC2= 0
##$MEAN= 0
##$ME_mod= 0
##$MI= 50
##$NCOEF= 0
##$NC_proc= -7
##$NLEV= 6
##$NOISF1= 182.463
##$NOISF2= 159.3651
##$NSP= 0
##$NTH_PI= 0
##$NZP= 0
##$OFFSET= 182.463
##$PC= 4
##$PHC0= -397.7437
##$PHC1= 142.6004
##$PH_mod= 1
##$PKNL= yes
##$PPARMOD= 0
##$PSCAL= 0
##$PSIGN= 0
##$REVERSE= no
##$SF= 81.0140089999434
##$SI= 65536
##$SIGF1= 159.3651
##$SIGF2= -187.1042
##$SINO= 113.3802
##$SIOLD= 16384
##$SREGLST= <1H.CDCl3>
##$SSB= 0
##$STSI= 65536
##$STSR= 0
##$SW_p= 29940.119760479
##$SYMM= 0
##$S_DEV= 0
##$TDeff= 32768
##$TDoff= 0
##$TI= <>
##$TILT= no
##$TM1= 0
##$TM2= 0
##$TOPLEV= 0
##$USERP1= <user>
##$USERP2= <user>
##$USERP3= <user>
##$USERP4= <user>
##$USERP5= <user>
##$WDW= 1
##$XDIM= 65536
##$YMAX_p= 296700086
##$YMIN_p= -74301602
$$ End of Bruker specific parameters
$$ ---------------------------------
##NTUPLES= NMR SPECTRUM
##VAR_NAME=  FREQUENCY,     SPECTRUM/REAL,   SPECTRUM/IMAG
##SYMBOL=    X,             R,               I
##VAR_TYPE=  INDEPENDENT,   DEPENDENT,       DEPENDENT
##VAR_FORM=  AFFN,          ASDF,            ASDF
##VAR_DIM=   65536,         65536,           65536
##UNITS=     HZ,            ARBITRARY UNITS, ARBITRARY UNITS
##FACTOR=    0.456856943014862, 1,           1
##FIRST=     14782.0589164792, 0,            0
##LAST=      -15158.0608439998, 0,           0
##MIN=       -15158.0608439998, -74301602,   0
##MAX=       14782.0589164792, 296700086,    0
$$ Real data points
##PAGE= N=1
##DATA TABLE= (X++(R..R)), XYDATA
$$ [...]
4219a0152528k842565L476207J0474441P886658k575838p416760j216021N484183
$$ -10152528 -12995093 -9518886 955555 8842213 6266375 -1150385 -2366406 3117777
4211C117777L201999k863684l714415j097160j558987l640947j740982K266726
$$ 3117777 6319776 3456092 -258323 -1355483 -2914470 -6555417 -8296399 -6029673
4203f029673J822107k780317n037571k679566N85008K121118K036545n1171l037241
$$ -6029673 -4207566 -6987883 -12025454 -14705020 -14120012 -11998894 -9962349 -10013520 -13050761
4194a3050761j978241M922080J0318653P063201N6316j041369K106279m37432
$$ -13050761 -15029002 -10106922 211731 7274932 7331248 6289879 8396158 7958726
4186G958726q809167j1447403l432331N566446O265460K166605R94476K362707
$$ 7958726 -850441 -12297844 -15730175 -10163729 -3898269 -1731664 -737188 1625519
4178A625519J065610l115033n516611l521865P52810K733513o76434o409407n827088
$$ 1625519 2691129 -423904 -5940515 -9462380 -8709570 -5976057 -6652491 -13061898 -18888986
4169a8888986M374502J4010082J0884826q95723n572437O92657M797756o78926
$$ -18888986 -14514484 -504402 10380424 9484701 3912264 4604921 9402677 8723751
4161H723751n035263J374456R193047M684066p314157j0390743j550174N714949
$$ 8723751 3688488 5062944 14255991 18940057 11625900 1235157 -315017 5399932
4153E399932K280642n596344p784504k968997K816752L897470m33483m953542
$$ 5399932 7680574 2084230 -5700274 -8669271 -5852519 -1955049 -2388532 -7342074
4145g342074k956013M801936Q834444L290219n049773o514103k143134O67801
$$ -7342074 -10298087 -5496151 3338293 6628512 1578739 -4935364 -7078498 -6410697
4137f410697J132086L417427N809743L204202j624418j354349K209123N43826
$$ -6410697 -5278611 -1861184 3948559 7152761 5528343 4173994 6383117 6926943
4129F926943n380698n351722J361807K539518o147044j1343643k245771J1504796
$$ 6926943 1546245 -3805477 -2443670 95848 -6051196 -17394839 -19640610 -8135814
4121h135814J3636408L985064m745570o461422n270754l508175J045927O570590
$$ -8135814 5500594 9485658 4740088 -1721334 -6992088 -10500263 -9454336 -2883746
4113b883746O917082J471212l149049k849438m28844J044350K291688L425301
$$ -2883746 4033336 5504548 2355499 -493939 -922783 121567 2413255 5838556
4105E838556J971155k038329m464388l429400k366288l494839l024071K545099
$$ 5838556 7809711 5771382 1306994 -2122406 -4488694 -7983533 -11007604 -8462505
4097h462505Q810847P960582q5752o519996m945123M52917J045035m455851q508112
$$ -8462505 348342 8308924 8223172 1703176 -3241947 -2789030 -1743995 -6199846 -14707958
4088a4707958m935725L362004Q759879P943346L577488r07490m101135m952259
$$ -14707958 -19643683 -16281679 -7521800 421546 3999034 3091544 -1009591 -5961850
4080e961850k822817O5993J56876k196309k564599R96982M865620N290302L358436
$$ -5961850 -8784667 -8718674 -8561798 -10758107 -13322706 -12325724 -7460104 -2169802 1188634
4071A188634K109339K053744K236734K415568J356833l192429r256575r712752
$$ 1188634 3297973 5351717 7588451 10004019 11360852 8168423 -1088152 -10800904
4063a0800904j854200O027836M550233k887535m422601K766169Q536445N527149
$$ -10800904 -12655104 -6627268 -2077035 -4964570 -9387171 -6621002 1915443 7442592
4055G442592j99469L49052M923861M092864l982618j0791422r315095k176312
$$ 7442592 7243123 7592175 12516036 16608900 12626282 1834860 -7480235 -9656547
4047i656547L636632N265887M413408K540140o43633m659691p199758o424693
$$ -9656547 -6019915 -754028 3659380 6199520 5555887 896196 -6303562 -12728255
4039a2728255k948076J221457M645017O339899M882711J5339m741744m112593
$$ -12728255 -15676331 -14454874 -9809857 -3469958 1412753 1428092 -3313652 -7426245
4031g426245K252318P421595M797312l066390p145705l397372K781345M773286
$$ -7426245 -5173927 2247668 7044980 3978590 -3167115 -6564487 -3783142 990144
4023I90144K853596R93545m60074l717767p053318n566710O35300M497755J305868
$$ 990144 3843740 4837285 4377211 659444 -6393874 -11960584 -11325284 -6827529 -5521661
4014e521661m068684l628449K235179N037954K47533o144889n812649Q07168N862935
$$ -5521661 -9590345 -13218794 -10983615 -5945661 -5698128 -11843017 -17655666 -16848498 -10985563
4005a0985563M958973J867709J709272L729839L581214K51190k693684k211129
$$ -10985563 -6026590 -4158881 -2449609 1280230 4861444 5112634 2418950 207821
3997B07821N21875J903548p5128l872579n725610l298851J382799L609812J396206
$$ 207821 729696 2633244 2558116 -1314463 -7040073 -10338924 -8956125 -5346313 -3950107
3988c950107k320759m075778m082148l575035o93213O349159J3345216J3247303
$$ -3950107 -6270866 -10346644 -14428792 -18003827 -18697040 -12347881 997335 14244638
3980A4244638N986522n65047j496406j095210m704934r671504r781555m956796
$$ 14244638 20231160 19666113 18169707 17074497 12369563 2698059 -7083496 -12040292
3972a2040292l39834K000689M032109N614108M153410O95274r9005K487377L568707
$$ -12040292 -12380126 -10379437 -6347328 -733220 3420190 4115464 4016459 6503836 10072543
3963A0072543O59403k280327j703338r8599r12924k475077j650592J30357l47847
$$ 10072543 10731946 8451619 6748281 6649682 5736758 3261681 1611089 1741446 1393599
3954A393599k005204j542435K45298k39941k707989l146727q21472K43681j888607
$$ 1393599 -611605 -2154040 -1908742 -2148683 -4856672 -8003399 -8824871 -8581190 -10469797
3945a0469797l420653n22643M544158O050534K281529k048025j359161L601577
$$ -10469797 -13890450 -14413093 -9868935 -3818401 -1536872 -3584897 -4944058 -1342481
3937a342481N709409M04988o536488m907892N074652J0226354J614167j1484513
$$ -1342481 4366928 4771916 -1764572 -6672464 -1597812 8628542 10242709 -1241804
3929a241804j3068574k335127O134606L515462l083229m299973j679835j188134
$$ -1241804 -14310378 -16645505 -10510899 -6995437 -10078666 -14378639 -16058474 -17246608
3921a7246608k148776n22953K501902L050877J862653K024785K644109J447702
$$ -17246608 -19395384 -19918337 -17416435 -14365558 -12502905 -10478120 -7834011 -6386309
3913f386309M72561K029232K103416l783491j0117227o585966N709108J2999481
$$ -6386309 -5913748 -3884516 -1781100 -5564591 -15681818 -22267784 -16558676 -3559195
3905c559195P117738l276105n015654K204991P328733L365486n331805j0629843
$$ -3559195 3558543 282438 -4733216 -2528225 4800508 8165994 2834189 -7795654
3897g795654r942771o265587k276645K286542P497816J0352072P693151J428330
$$ -7795654 -17738425 -24004012 -26280657 -23994115 -16496299 -6144227 1548924 2977254
3889B977254k559105j748941J06010p30938k580008k401992j397677j905904k015045
$$ 2977254 418149 -1330792 -1224782 -1955720 -4535728 -6937720 -8335397 -10241301 -12256346
3880a2256346R13374L891982K288697j456898q19582L483202L655254k259617
$$ -12256346 -11342972 -7450990 -5162293 -6619191 -7438773 -3955571 -300317 -2559934
3872b559934o279015k796859K830300L096894p39313k627388j597859j052776
$$ -2559934 -8838949 -11635808 -8805508 -5708614 -6447927 -9075315 -10673174 -11725950
3864a1725950j546523q00240R57196J483389J250971K467632M060461K650789
$$ -11725950 -13272473 -14072713 -13115517 -11632128 -10381157 -7913525 -3853064 -1202275
3856a202275j464043l989112l050486j709151k418665k572577J424744P505582
$$ -1202275 -2666318 -6655430 -9705916 -11415067 -13833732 -16406309 -14981565 -7475983
3848g475983R095674L648567l012759l791016j00840K95691m228840n422991J834653
$$ -7475983 1619691 5268258 2255499 -1535517 -1636357 -1340666 -5569506 -10992497 -9157844
3839i157844R257992O295460k534967k828340P455357J3463817N296520p116969
$$ -9157844 100148 6395608 3860641 1032301 8487658 21951475 27247995 20131026
3831B0131026q705318l7819O139489L401982l185405p306093p748167n685037
$$ 20131026 11425708 11387889 17527378 20929360 17743955 10437862 2689695 -2995342
3823b995342k900477k054367l170062j741183M176688Q114397L478883n008107
$$ -2995342 -5895819 -7950186 -11120248 -12861431 -8684743 -570346 2908537 -2099570
3815b099570o490347O63376P174653O441342J536700k178474l522017k988590
$$ -2099570 -8589917 -7926541 -751888 5689454 7226154 5047680 1525663 -1462927
3807a462927r93086k97960l349233n921400j130703Q370833J0992509K658920
$$ -1462927 -2456013 -2753973 -6103206 -12024606 -13155309 -4784476 6208033 8866953
3799H866953o153167n491821J71424R80669k135615o32308N780957P691848J187565
$$ 8866953 2713786 -2778035 -2606611 -1625942 -3761557 -4393865 1387092 9078940 10266505
3790A0266505n305557l397170L180607M760000j23097l685287j275525J950933
$$ 10266505 4960948 1563778 4744385 9504385 9381288 5696001 4420476 6371409
3782F371409l89302n607321n815878p9398M164109K855515J368942M597611P190367
$$ 6371409 5982107 374786 -5441092 -5520490 -1356381 1499134 2868076 7465687 14656054
3773A4656054J104153j0335602j4567408o218292N972552J0551451N870419j091718
$$ 14656054 15760207 5424605 -9142803 -15361095 -9388543 1162908 7033327 5941609
3765E941609l674040q45761K926042J628781n347397j0344872o175779K748506
$$ 5941609 2267569 1421808 4347850 5976631 629234 -9715638 -15891417 -13142911
3757a3142911M880095j895634o453990p39323Q425451J0066406M646491O35335
$$ -13142911 -8262816 -10158450 -16612440 -17351763 -8926312 1140094 5786585 6421920
3749F421920K46153j741219o518802q075152l042012L579320N491513K881675
$$ 6421920 6668073 4926854 -1591948 -9667100 -12709112 -9129792 -3638279 -756604
3741g56604J45004m77578J41596J060090K151726K727108J634090q72865k548263
$$ -756604 -611600 -1089178 -947582 112508 2264234 4991342 6625432 5752567 3204304
3732C204304j306375K144553M671271M234811K056367K26563j344829l306554
$$ 3204304 1897929 4042482 8713753 12948564 15004931 15231494 13886665 10580111
3724A0580111l690365k68665M255066M148009j183121n633439m955513k090176
$$ 10580111 6889746 6621081 10876147 15024156 13841035 8207596 3252083 1161907
3716A161907j142048j082292K11956K94391l384007o501916k578818O241116J0228490
$$ 1161907 19859 -1062433 -850477 -556086 -3940093 -10442009 -13020827 -6779711 3448779
3707C448779N044170k443665l849538J79076K812422J052780j738538k292680
$$ 3448779 8492949 6049284 2199746 2378822 5191244 6244024 4505486 2212806
3699B212806j939313l219948m951821l748721K18427K381099J7720l542114l613918
$$ 2212806 273493 -2946455 -7898276 -11646997 -11428570 -9047471 -9029751 -12571865 -16185783
3690a6185783p41099J208508J806669L795111O487921N502399N42683k460198
$$ -16185783 -16926882 -15718374 -13911705 -10116594 -3628673 1873726 2416409 -43789
3682d3789k4975L145293J083954m750909p875786m881026K388628R670315J2053707
$$ -43789 -68764 3076529 4160483 -590426 -8466212 -13347238 -10958610 -1288295 10765412
3673A0765412O632363k721359o917939k322032L704618K463707m709506r837460
$$ 10765412 17397775 14676416 7758477 5436445 9141063 11604770 6895264 -2942196
3665b942196r003226l715414M192240J1645499J1994148K445326q306587r087302
$$ -2942196 -11945422 -15660836 -11468596 176903 12171051 14616377 6309790 -2777512
3657b777512j753024J824213k217536n413046k031348K736240L484466L119703
$$ -2777512 -4530536 -2706323 -4923859 -10336905 -12368253 -9632013 -6147547 -3027844
3649c027844M913780M989697j33723n570939n147865j052347O06311p84242j980545
$$ -3027844 1885936 6875633 6741910 1170971 -3976894 -5029241 -4422930 -5207172 -7187717
3640g187717k374543k185115J059534O904300P833173l76149q588424n280643
$$ -7187717 -9562260 -11747375 -10687841 -3783541 4049632 3673483 -4914941 -10195584
3632a0195584N372822Q632139J521233l688935m40659K328000k311679n995712
$$ -10195584 -4822762 3809377 5330610 1641675 1201016 3529016 1217337 -4778375
3624d778375k24916O418311Q08500j1827054j3897396k047908Q702395Q914314
$$ -4778375 -5003291 1415020 2223520 -9603534 -23500930 -25548838 -16846443 -7932129
3616g932129O431122Q656535Q954628J171047n278645O75099J1122543Q782827
$$ -7932129 -1501007 7155528 16110156 17281203 12002558 12677657 23800200 32583027
3608C2583027o280186j5816355r822509J296989M695672J627665l76354n54530
$$ 32583027 26302841 10486486 663977 1960966 6656638 8284303 7907949 7353419
3600G353419j814363k808545j394176k5920o51955Q9271L982388N640256J048996
$$ 7353419 5539056 2730511 1336335 1310415 658460 747731 4730119 10370375 11419371
3591A1419371m256906l576156Q1336K80018j258566M42988K059488k740608r641362
$$ 11419371 7162465 3586309 3667645 3947663 2689097 3132085 5191573 2450965 -7190397
3582g190397q394317j44459L411323q01256k565361L583877Q701300M099000n182166
$$ -7190397 -15584714 -15729173 -12317850 -13119106 -15684467 -12100590 -3399290 699710 -4482456
3573d482456r135137o486963k091077K104253N690258N460679N39576k648709
$$ -4482456 -13617593 -20104556 -22195633 -20091380 -14401122 -8940443 -8400867 -11049576
3565a1049576J613013Q491808Q123108q43014r584191j0133424l089039M996676
$$ -11049576 -9436563 -944755 7178353 6335339 -3248852 -13382276 -16471315 -11474639
3557a1474639P981200M494972j174382l148476j12351M301123P121997P940882
$$ -11474639 -3493439 1001533 -172849 -3321325 -3433676 867447 7989444 15930326
3549A5930326N112719l364999j2927741j3721148l491880P070679P511434O70902
$$ 15930326 21043045 17678046 4750305 -8970843 -12462723 -5392044 2119390 2790292
3541B790292l475936j801692J300028L027644M078237L903739J396158j020753
$$ 2790292 -685644 -2487336 -1187308 1840336 5918573 9822312 11218470 10197717
3533A0197717j41013K467372K978534J616740J355037K412838K941570K606023
$$ 10197717 10056704 12524076 15502610 17119350 18474387 20887225 23828795 26434818
3525B6434818Q81340m283964j0757425j0537854j271162O113020J255442q718903
$$ 26434818 27316158 23032194 12274769 1736915 465753 6578773 7834215 -884688
3517h84688q366550K631739R232973M603892p86956K339144Q032328O529683j211057
$$ -884688 -9251238 -6619499 2613474 7217366 6430410 8769554 16801882 23331565 22120508
3508B2120508q291058j2224465j2476490n825754O639649J4438719R477568j570930
$$ 22120508 13829450 1604985 -10871505 -16697259 -10057610 4381109 13858677 12287747
3500A2287747o027898k605311k10867k051738k099257K163770M162235q96499
$$ 12287747 6259849 3654538 3443671 1391933 -707324 1456446 5618681 4722182
3492D722182p611143p977237k170224L288934M776217M108661L520221K602404
$$ 4722182 -2888961 -10866198 -13036422 -9747488 -4971271 -862610 2657611 5260015
3484E260015N63933j455212j576814M92531L121773M226252K714521r01638m548154
$$ 5260015 5823948 4368736 2791922 3284453 6406226 10632478 13346999 12445361 7897207
3475G897207n568735l034951M22559O10913l030448n624304k514003M133412P334221
$$ 7897207 2328472 -706479 -283920 326993 -2703455 -8327759 -10841762 -6708350 625871
3466F25871L880643k229878n597302n253451l173826m40206K223568K705257J06985
$$ 625871 4506514 2276636 -3320666 -8574117 -11747943 -12188149 -9964581 -7259324 -7152339
3457g152339k104203N51399O954810J0576743P359738O67955l320913k989180
$$ -7152339 -9256542 -8705143 -1750333 8826410 16186148 16854103 13533190 10544010
3449A0544010j653118j965646l158160l928971m654313n009964k391968L986149
$$ 10544010 8890892 6925246 3767086 -161885 -4816198 -9826162 -12218130 -8231981
3441h231981R263088P562073K51304m835863l310421R53281K454993R69569p73640
$$ -8231981 1031107 8593180 8844484 4008621 698200 1651481 4106474 5076043 4302403
3432D302403j830073j853223O93829M731983M790486j678957q455394p953457
$$ 4302403 2472330 619107 1312936 6044919 10835405 9156448 701054 -7252403
3424g252403j843184K105306J468884K21734p1907j946178m930027m726255n91970
$$ -7252403 -9095587 -6990281 -5521397 -5299663 -5371570 -7317748 -12247775 -16974030 -17566000
3415a7566000L523336N965408Q139093P871901J014165q409713r341773R47794
$$ -17566000 -14042664 -8077256 61837 7933738 8947903 538190 -8803583 -7855789
3407g855789J1374545J1737407M665992k278978p638328j2207631j2272472n430940
$$ -7855789 3518756 15256163 19922155 17643177 10004849 -2202782 -14475254 -19906194
3399a9906194K740372O136036O974004R304482R573988L059959n300035o940473
$$ -19906194 -17165822 -11029786 -4055782 5248700 14822688 17882647 12582612 5642139
3391E642139k979218j077991j976075k88176L207630K151895k435366j759843
$$ 5642139 2662921 1584930 -391145 -679321 2528309 4680204 2244838 484995
3383D84995N947602J1090184O896581j197087m632839k680401j98431n95887m267964
$$ 484995 6432597 17522781 24419362 23222275 18589436 15909035 15710604 15114717 10846753
3374A0846753q657778q057894O18531J0661494J1194064J422140q250876j0635075
$$ 10846753 2188975 -5868919 -5250388 5411106 16605170 18027310 9776434 -858641
3366h58641q530388n301596P91658Q600445J0806642M970613j044453j263316
$$ -858641 -9389029 -14690625 -13898967 -5298522 5508120 10478733 9434280 8170964
3358H170964m91199l821485o301686k149051L722934L681494K39232K27203J988776
$$ 8170964 7679765 3858280 -2443406 -4592457 -869523 2811971 3051203 3278406 5267182
3349E267182j24386l464839j679478K235946N95494l853786j500145O301170P721045
$$ 5267182 5142796 1677957 -1521 2234425 2829919 -1023867 -2524012 3777158 11498203
3340A1498203K62300m605481l93501M827313L562987M92607J155459Q10028n668741
$$ 11498203 11760503 7155022 6761521 11588834 15151821 15644428 16799887 17609915 11941174
3331A1941174j2233866j0644811l891434k53621K02888K643211N693884L781430
$$ 11941174 -292692 -10937503 -14828937 -15082558 -14879670 -12236459 -6542575 -2761145
3323b761145j525067l223786o00667P72452Q4109K193443O842518O964909L30880
$$ -2761145 -4286212 -7509998 -8110665 -7338213 -7254104 -5060661 1781857 8746766 9077646
3314I077646n765669m992203p7720L021735K751174M16616k940346m667801j472476
$$ 9077646 3311977 -1680226 -1757946 1263789 4014963 4431579 1491233 -3176568 -4649044
3305d649044M028307M029392k632749o173533N4249P540807M007104p228924j0590734
$$ -4649044 -620737 3408655 775906 -5397627 -5343378 2197429 6204533 -1024391 -11615125
3296a1615125p22930R752707Q583029J55814l336990J79057K607326M068k817351
$$ -11615125 -12338055 -2585348 5997681 6153495 2816505 2995562 5602888 5606956 2789605
3287B789605k342862k182170n306344p230637k668886M945963P013278J554606
$$ 2789605 446743 -1735427 -7041771 -14272408 -16941294 -11995331 -4982053 -3427447
3279c427447m409291m639222o53618K565805L202337K302967N76010j126095p57301
$$ -3427447 -7836738 -12475960 -13129578 -10563773 -7361436 -5058469 -4482459 -5608554 -6365855
3270f365855J988761L677143J587404j584187j472058Q62933L92791l531089n457300
$$ -6365855 -4377094 -699951 887453 -696734 -2168792 -1305859 -913068 -4444157 -9901457
3261i901457j828527L840899O133612M383255J362098j476128l889474m283115
$$ -9901457 -11729984 -7889085 -1755473 2627782 3989880 2513752 -1375722 -5658837
3253e658837j411180K176260K270103j087708l038188k81494M505052O209797
$$ -5658837 -7070017 -4893757 -2623654 -3711362 -6749550 -7031044 -2525992 3683805
3245C683805L503707m77603k801272l702591m380401m046076j374491J937274
$$ 3683805 7187512 6709909 3908637 206046 -4174355 -8220431 -9594922 -7657648
3237g657648K089934j410957m076497k363838J099109J580440k01388P10799M939668
$$ -7657648 -5567714 -6978671 -11055168 -13419006 -12319897 -10739457 -10940845 -10230046 -5290378
3228e290378O773323K645204l095581m264372j197767R73437j5516j944770k759933
$$ -5290378 1482945 4128149 1032568 -3231804 -4429571 -3456134 -3471650 -5416420 -8176353
3219h176353k551512j418895O19249J608471n09510l578681k753041K365998N943303
$$ -8176353 -10727865 -12146760 -11527511 -9919040 -10428550 -14007231 -16760272 -14394274 -8450971
3210h450971L541762j624372l091322M71548M766217O415129O112915N265411
$$ -8450971 -4909209 -6533581 -9624903 -9153355 -4387138 2027991 8140906 13406317
3202A3406317L301056k21428l658170n454543o245150o666688n052818l03989
$$ 13406317 16707373 16485945 12827775 7373232 1128082 -5538606 -10591424 -10895413
3194a0895413M329199M258045K12937k288272r66802L04390j198139j709002K645336
$$ -10895413 -6566214 -2308169 -2095232 -4383504 -5350306 -5045916 -6244055 -7953057 -5307721
3185e307721P835080O412334j394531p189776n352688Q19951M981951N030212
$$ -5307721 2527359 8939693 7545162 355386 -4997302 -4177351 804600 5834812
3177E834812K894928J034346J024831K675988L417844J220703j997287l339238
$$ 5834812 8729740 9764086 10788917 13464905 16882749 18103452 16106165 12766927
3169A2766927m189703p202092r182587m725343K708370L038141m174363o380475
$$ 12766927 8577224 1375132 -7807455 -12532798 -9824428 -6786287 -10960650 -17341125
3161a7341125K842493J1784112P525021l660375n615932L176197Q699098L746536
$$ -17341125 -14498632 -2714520 4810501 1150126 -4465806 -1289609 7409489 11156025
3153A1156025l057347l106045o7707o84066k991063j052498M489085P519917N209686
$$ 11156025 8098678 4992633 4924926 4240860 1249797 197299 4686384 12206301 17415987
3144A7415987O13018k083186j837507j036068k567028n775854o402836k687790
$$ 17415987 18029005 15945819 14108312 13072244 10505216 4729362 -1673474 -4361264
3136d361264Q75949q3072k481856q09164K943844K265795k162379l017507Q05688
$$ -4361264 -3485315 -3568387 -6050243 -6859407 -3915563 -1649768 -3812147 -6829654 -6023966
3127f023966J839382k816088n854140j910358L554190L595932M86162K46194K627643
$$ -6023966 -4184584 -7000672 -12854812 -14765170 -11210980 -7615048 -7128886 -6882692 -4255049
3118d255049L579345K810818K108879K24335m042421p160580n467603j446063
$$ -4255049 -675704 2135114 4243993 4468328 425907 -6734673 -12202276 -13648339
3110a3648339K16464j64926O48504K670889L947582M781304N487910L528685j497893
$$ -13648339 -13431875 -13596801 -12948297 -10277408 -6329826 -1548522 3939388 7468073 5970180
3101E970180l973139o735M593151J778860o025458r029756m475927O42152J272173
$$ 5970180 1997041 1990306 6583457 8362317 2336859 -6692897 -11168824 -10526672 -9254499
3092i254499L17542J243622K094450K15957k305178j582815K559920O494879O644781
$$ -9254499 -8936957 -7693335 -5598885 -5382928 -7688106 -9270921 -6711001 -216122 6428659
3083F428659K513000k879457n663835n065193l320528j181119K885298P203916
$$ 6428659 8941659 6062202 398367 -4666826 -7987354 -9168473 -6283175 920741
3075I20741N801613k821450j0509647q969032r16894M468871L863335P52689k488575
$$ 920741 6722354 3900904 -6608743 -15577775 -16494669 -12025798 -8162463 -7409774 -9898349
3066i898349n306768m401428K204090P877232M279440m371085m810230N348995
$$ -9898349 -15205117 -19606545 -17402455 -9525223 -5245783 -9616868 -14427098 -9078103
3058i078103J2328386N827504n939352q417169o30575N988323M542197n48247
$$ -9078103 3250283 9077787 3138435 -5278734 -5909309 79014 4621211 4072964
3050D072964k721037j491220J25535J011509J786583K043909R09930l10765J080273
$$ 4072964 1351927 -139293 -13758 997751 2784334 4828243 5738173 5427408 6507681
3041F507681M703569N856811J469137m366396n038030r33731J259678p57651k089087
$$ 6507681 11211250 17068061 18537198 14170802 9132772 8199041 9458719 8701068 6611981
3032F611981q83936k824219r966426j3633550o910447K883071M615621N73345
$$ 6611981 5728045 2903826 -7062600 -20696150 -27606597 -24723526 -20107905 -19534560
3024a9534560J240026O903084Q153797L265639Q15426L819047M974034P00808
$$ -19534560 -18294534 -11391450 -3237653 27986 843412 4662459 9636493 10337301
3016A0337301l058206l233905n160483j0123592r677786J3850R054969P986683
$$ 10337301 7279095 4045190 -1115293 -11238885 -20916671 -20902821 -11847852 -3861169
3008c861169J997287J386966N387011N793364J316698k005783j713121j187419
$$ -3861169 -1863882 -476916 4910095 10703459 12020157 10014374 8301253 7113834
3000G113834k387559l518923l389584k929598l002825l881480n202655m622214
$$ 7113834 4726275 1207352 -2182232 -5111830 -8114655 -11996135 -17198790 -21821004
2992b1821004O9535N935166O935422K901169M23263K395541L855729J634358P3949
$$ -21821004 -21751469 -15816303 -8880881 -5979712 -5556449 -3160908 694821 2329179 2403128
2983B403128K146653K934295j540077o178465m742418J82570K227725P09840j441765
$$ 2403128 4549781 7484076 5943999 -234466 -4976884 -4794314 -2566589 -1856749 -3298514
2974c298514l433488m063743l362O842035P714683K20812n046869j30001O574808
$$ -3298514 -6732002 -10795745 -10799107 -3957072 3757611 3978423 -1068446 -1198447 5376361
2965E376361L456425n177691o524002j80498K949856l93091k430426O68571L447411
$$ 5376361 8832786 3655095 -2868907 -3049405 -99549 -492640 -2923066 -2254495 1192916
2956A192916J813663j678192l939463l873132K07321O921258Q307049N0444q235350
$$ 1192916 3006579 1328387 -2611076 -6484208 -6276887 644371 8951420 9001864 766514
2947G66514m818457N442068P984173J561434j518232K422330L457707k198378
$$ 766514 -4051943 1390125 9374298 10935732 9417500 11839830 15297537 13099159
2939A3099159m936861R8058L530032j825699q734725q174171k512032J902241
$$ 13099159 8162298 8260356 11790388 9964689 1229964 -6944207 -9456239 -7553998
2931g553998M507828N490788J847478m144684l781404L123587M496081l819797
$$ -7553998 -3046170 2444618 4292096 147412 -3633992 -510405 3985676 165879
2923A65879p825462K274191J2708151N889550j0408811j3344779M91401J1250145
$$ 165879 -7659583 -5385392 7322759 13212309 2803498 -10541281 -10049880 1200265
2915A200265O593942l019096m636096j651566l319741p615487n918176J749094
$$ 1200265 7794207 4775111 139015 -1512551 -4832292 -12447779 -18365955 -16616861
2907a6616861O900086N748129L323046L877642M343171O02111m488947m746543
$$ -16616861 -9716775 -3968646 -645600 3232042 7575213 8177324 3688377 -1058166
2899a058166p08538L84507l757723n571500N63284P619071N524781k403526l783901
$$ -1058166 -1766704 -1382197 -5139920 -10711420 -10148136 -2529065 2995716 592190 -3191711
2890c191711K936748N642010j609927q777926o263867M48227J758826o5443K731616
$$ -3191711 -254963 5387047 3777120 -5000806 -11264673 -10816446 -9057620 -9123063 -6391447
2881f391447P836130O282479j736624o241854k344349L747104M510453j63164
$$ -6391447 1444683 7727162 5990538 -251316 -2595665 1151439 5661892 5498728
2873E498728m876440m525028J300530O275281K661841p485936j1619694l026082
$$ 5498728 622288 -3902740 -2602210 3673071 6334912 -1151024 -12770718 -15796800
2865a5796800Q225384Q933475J538037j496575K337617M010919m54080n214080
$$ -15796800 -7571416 1362059 2900096 1403521 3741138 7752057 7297977 2083897
2857B083897p079847r510408j1398196m951859R663250J9020436J3423411M37141
$$ 2083897 -4995950 -14506358 -25904554 -30856413 -21193163 -2172727 11250684 11687825
2849A1687825o520609n838973n196371o827968n327110J356235P290430O546489
$$ 11687825 5167216 -671757 -5868128 -12696096 -18023206 -16666971 -9376541 -2830052
2841b830052P21738l648953k958353k34941r81884n652337q175031l972670K942793
$$ -2830052 -2108314 -5757267 -8715620 -8950561 -9932445 -15584782 -23759813 -27732483 -24789690
2832b4789690N245756K975337K716909O303187P765789L599729j261738j680753
$$ -24789690 -19543934 -16568597 -13851688 -7548501 217288 3817017 2555279 874526
2824H74526j65303j339660l757121l230865o45686k05020k001372k088199R40075
$$ 874526 709223 -630437 -4387558 -7618423 -8264109 -8469129 -10470501 -12558700 -11618625
2815a1618625M182660M851360K752365j107382n153545p002449n336403j584228
$$ -11618625 -7435965 -2584605 167760 -939622 -6093167 -13095616 -18432019 -20016247
2807b0016247J995158M495187N182291K945385n89469o05115M631762R882672
$$ -20016247 -18021089 -13525902 -8343611 -5398226 -5987695 -6592810 -1961048 7921624
2799G921624R386524M367535m80753m666190r708301j2107680p074118J215030
$$ 7921624 17308148 21675683 21194930 16528740 6820439 -5287241 -12361359 -11146329
2791a1146329K487080m426842q482962k826018M481246L058613l801748n105319
$$ -11146329 -8659249 -13086091 -21569053 -24395071 -19913825 -16855212 -20656960 -25762279
2783b5762279O28435M874967M081100L936456P256256Q130043K525639l840468
$$ -25762279 -25133844 -20258877 -16177777 -12241321 -4985065 3144978 5670617 1830149
2775A830149m146291m43058J260572L96700m20743k157983o001430p032924l27921
$$ 1830149 -2316142 -2759200 -1498628 -1101928 -1522671 -3680654 -9682084 -16715008 -17042929
2766a7042929Q591799R007842P35384m797281q19561O396733Q310826M722129
$$ -17042929 -8451130 556712 1292096 -3505185 -4324746 2071987 10382813 15104942
2758A5104942m57041n875308r784286p856362o13972L342610j053154o173664
$$ 15104942 14647901 8772593 -1011693 -8868055 -9482027 -6139417 -7192571 -13366235
2750a3366235k604759N693554P259788J137558k377123J247659M648534K365646
$$ -13366235 -15970994 -10277440 -3017652 -1880094 -4257217 -3009558 1638976 4004622
2742D004622O7333L859745Q580771N227222m271897q537066k554967N336538M783343
$$ 4004622 4071955 7931700 16512471 21739693 17467796 8930730 6375763 11712301 16495644
2733A6495644l100742p919455m022447K455811K393249l999969q074861m953136
$$ 16495644 13394902 5475447 1453000 3908811 6302060 2302091 -5772770 -10725906
2725a0725906O46825K511316J707206L206307P158709Q471686L845229m432634
$$ -10725906 -10079081 -7567765 -5860559 -2654252 4504457 12976143 16821372 12388738
2717A2388738j0754820j0001511j656374P137707O517076l739741j0923402m587175
$$ 12388738 1633918 -8367593 -10023967 -2886260 3630816 -108925 -11032327 -15619502
2709a5619502Q661770J3403497N881669l039257m540122j143917K127166N291476
$$ -15619502 -6957732 6445765 12327434 9288177 4748055 3604138 5731304 11022780
2701A1022780P854203N215568k916137q000865m014939K347301Q59424o854677
$$ 11022780 18876983 24092551 21176414 13175549 9160610 11507911 12367335 5512658
2693E512658r790609l718240L648696M554325J165759N74579M343088O968118
$$ 5512658 -4277951 -7996191 -4347495 206830 1372589 1947168 6290256 13258374
2685A3258374L472475m221435r272488p630384k434354M30116j80098o34600M86220
$$ 13258374 16730849 12509414 3236926 -4393458 -6827812 -6397696 -6577794 -7212394 -6726174
2676f726174J05891k854176l600549J659266Q326495Q390693J490203m521588
$$ -6726174 -6620283 -9474459 -13075008 -11415742 -3089247 5301446 6791649 2270061
2668B270061m349411j345637r73650k850697l066127j442018j390921l056591
$$ 2270061 -2079350 -3424987 -4398637 -7249334 -10315461 -11757479 -13148400 -16204991
2660a6204991j948550L457084P296524M019306k193648j912781N764980J0634344
$$ -16204991 -18153541 -14696457 -7399933 -3380627 -5574275 -7487056 -1722076 8912268
2652H912268N148463n155714r459225n219204J590063O115586P901345O758898
$$ 8912268 14060731 8905017 -554208 -5773412 -4183349 1932237 9833582 16592480
2644A6592480K535365j498182j665968m13090l215920q373478p260314K653905
$$ 16592480 19127845 17629663 15963695 15550605 12334685 3961207 -3299107 -645202
2636f45202J1776009R829617j271403j0625875j1496582o899808l411908l145073
$$ -645202 11130807 20960424 19689021 9063146 -2433436 -9333244 -12745152 -15890225
2628a5890225k705621R82007N165081L916125k804698o688266j615838O758691
$$ -15890225 -18595846 -17613839 -12448758 -8532633 -11337331 -18025597 -19641435 -12882744
2620a2882744P921110Q18035n671980n528294j411388K127890L531924J849323
$$ -12882744 -4961634 -4143599 -9815579 -15343873 -16755261 -14627371 -11095447 -9246124
2612i246124k572540m253020J821509R500691O543636o547941j3691582m922120
$$ -9246124 -11818664 -16071684 -14250175 -4749484 1794152 -4753789 -18445371 -23367491
2604b3367491R209886J2735520N199441j670494j628166J606139L339225K206848
$$ -23367491 -14157605 -1422085 3777356 2106862 478696 2084835 5424060 7630908
2596G630908k114461p863804r682342m345902L920754Q693559Q780576N927143
$$ 7630908 5516447 -2347357 -12029699 -16375601 -12454847 -3761288 5019288 10946431
2588A0946431q6076q007690j1467996o079355K980645P030893M550003J18005
$$ 10946431 10860355 2852665 -8615331 -14694686 -11714041 -4683148 -133145 -15140
2580a5140l192580m141569o92610N744461P897375K122783m151100k615869L119546
$$ -15140 -3207720 -7349289 -8041899 -2297438 5599937 7722720 3571620 955751 4075297
2571D075297M233290J312197J134012K684202p61283p213099p074094M26172M628902
$$ 4075297 8308587 9620784 10754796 13438998 12677715 5464616 -1609478 -1183306 3445596
2562C445596Q1306n646589m732608L45240L623434M318332L786989J272839k364040
$$ 3445596 3526902 -2119687 -6852295 -6507055 -2883621 1434711 5221700 6494539 4130499
2553D130499k849902R45114L755048J242003l738481n555862k887282J121157
$$ 4130499 1280597 2225711 5980759 7222762 3484281 -2071581 -4958863 -3837706
2545c837706K738986L57603l789194m503609N16382O502810P016302K002183l518838
$$ -3837706 -1098720 -741117 -4530311 -9033920 -8517538 -2014728 5001574 7003757 3484919
2536C484919o249204n570528j432931L201830K508281l232153n064828L90430
$$ 3484919 -2764285 -8334813 -9767744 -6565914 -4057633 -7289786 -12354614 -11964184
2528a1964184K697854n118886j1171554l049053P993091L327146r619288q160501
$$ -11964184 -9266330 -14385216 -25556770 -28605823 -20612732 -17285586 -26904874 -35065375
2520c5065375L881711p85930k1819152k0512856K0749993O1508652N4884477J2033685
$$ -35065375 -31183664 -31969594 -53788746 -74301602 -53551609 7957043 62841520 74875205
2512G4875205j8324140j7959749j0264273j2022178j2465208l086146N163678
$$ 74875205 56551065 38591316 28327043 16304865 3839657 753511 5917189
2505E917189M207052K408428M986714K780287p799366j3070151l842902P292902
$$ 5917189 10124241 12532669 17519383 20299670 12500304 -569847 -4412749 2880153
2497B880153N181987m143906m446011M964935J0092506M367370l891470n263440
$$ 2880153 8062140 3918234 -527777 4437158 14529664 18897034 15005564 9742124
2489I742124j49173M875321M971686O64062k955333j742382J168917j390541q867016
$$ 9742124 9592951 14468272 19439958 20104020 17148687 15406305 16575222 15184681 6317665
2480F317665j0892011j875841Q649183P926031k011732p232174j495119O077963
$$ 6317665 -4574346 -6450187 2198996 10125027 8113295 881121 -613998 5463965
2472E463965M852199l196166p865476n001256m13782J37418o61012L033383R395981
$$ 5463965 10316164 7119998 -745478 -5746734 -6160516 -6023098 -6684110 -3650727 5745254
2463E745254R624339O69613q820871r567954l705989M02174J175403L026051N019635
$$ 5745254 15369593 16039206 7218335 -2349619 -6055608 -5653434 -4478031 -1451980 3567655
2454C567655J370253n623356m826565O452251J4746758Q173754n968423j1422221
$$ 3567655 4937908 -685448 -5512013 940238 15686996 23860750 17892327 6470106
2446F470106n582579l57989k313246m250568O31536O725146M900315l009354o709338
$$ 6470106 887527 529538 -1783708 -6034276 -5402740 1322406 6222721 3213367 -3495971
2437c495971k194173L513547L370476m7222L23395M816896O382179J030183o045889
$$ -3495971 -5690144 -2176597 1193879 1146657 1470052 6286948 12669127 13699310 7653421
2428G653421p339014k701952J571691J558313o74810j914278j873813j283300
$$ 7653421 314407 -2387545 -815854 742459 67649 -1846629 -3720442 -5003742
2420e003742K72866K402376K691849K27871j625610Q75491N968249P539392K784448
$$ -5003742 -4730876 -2328500 363349 591220 -1034390 -158899 5809350 13348742 16133190
2411A6133190l645853m823622J41351M989795L923882j510991m925485l355831
$$ 16133190 12487337 7663715 7805066 12794861 16718743 15207752 10282267 6926436
2403F926436j47835N83795j012926k605090l490931l516037r94195M303340P890965
$$ 6926436 6778601 7362396 6349470 3744380 253449 -3262588 -4256783 46557 7937522
2394G937522N051474j752353m601780k24251N585140N462066o08765o212735o596100
$$ 7937522 12988996 11236643 6634863 6410612 11995752 17457818 16849053 10636318 4040218
2385D040218l433398j614125k699874k897841J529124P808715Q639706J561856
$$ 4040218 606820 -1007305 -3707179 -6605020 -5075896 2732819 11372525 12934381
2377A2934381p033006r637683o292544k377043q08334o06999p24427n50238J479909
$$ 12934381 5901375 -3736308 -10028852 -12405895 -13214229 -13821228 -14545655 -15095893 -13615984
2368a3615984N052057N911175J931824j305302K199175Q126539O921551j024299
$$ -13615984 -8563927 -2652752 -720928 -2026230 172945 8299484 15221035 14196736
2360A4196736n048380o83991L686433Q14131m253277l654104L13523K33442l288711
$$ 14196736 9148356 8464365 12150798 12964929 8711652 5057548 5371071 5604513 2315802
2351B315802k722912L658080Q139145L901219o028684j2071247q288824J414372
$$ 2315802 -407110 3250970 11390115 15291334 9262650 -2808597 -11097421 -9683049
2343i683049O911199K633661n602340p238163j23788P302095P472284J889200
$$ -9683049 -2771850 -138189 -5740529 -12978692 -13102480 -5800385 1671899 3561099
2335C561099l744827o499912n406972Q3022O556974P186705O63173n555420n646848
$$ 3561099 -183728 -6683640 -12090612 -12007590 -5450616 1736089 2399262 -3156158 -8803006
2326h803006l217296l158154k575899K147263N471308L76418q045496q238454
$$ -8803006 -12020302 -15178456 -17754355 -15607092 -10135784 -9759366 -17804862 -26043316
2318b6043316K36755O560379O254432O530093J1056401J1549932J452611j1113778
$$ -26043316 -25806561 -19246182 -12991750 -6461657 4594744 16144676 17597287 6483509
2310F483509j2918233l132384O727379P777987J981365l386110l769953K05459
$$ 6483509 -6434724 -9567108 -2839729 4938258 6919623 3533513 -236440 -30981
2302c0981M137313L229176k877645q431528o994631J248812R371875J1025059
$$ -30981 4106332 7335508 4457863 -3973665 -10968296 -9719484 -347609 10677450
2294A0677450O351045M03688k673175k737934j799533j053618o40633q46229j493727
$$ 10677450 17028495 17432183 14759008 12021074 10221541 9167923 8527290 7681061 6187334
2285F187334q53655K138482M663292K463533l540278o786834l197921L676093
$$ 6187334 5333679 7472161 12135453 14598986 11058708 4271874 1073953 4750046
2277D750046P948249Q123774N590914N22126o271904j0620108r075576l579853
$$ 4750046 12698295 20822069 26412983 26935109 20663205 10043097 967521 -2612332
2269b612332J945950O605800R788800P757895n26924p815248o695764r51593m46646
$$ -2612332 -666382 5939418 15728218 23486113 22959189 15143941 8448177 7496584 7049938
2260G049938o316079j0272622p955960l378057L13845M541812Q181186O709673
$$ 7049938 733859 -9538763 -17494723 -20872780 -20558935 -16017123 -7835937 -1126264
2252a126264J221372j145859J189902J834318j215861j580281K543544L142392
$$ -1126264 95108 -1050751 139151 1973469 757608 -822673 1720871 4863263
2244D863263k967486n956718J027109Q363662M383840n396513o961802O21786
$$ 4863263 1895777 -4060941 -3033832 5329830 9713670 4317157 -2644645 -2022859
2236b022859O427999O116135M685587L374551j352054o263237l539778M160292
$$ -2022859 4405140 10521275 15206862 18581413 17229359 10966122 7426344 11586636
2228A1586636N048988k634465o902241j770799L413969R98340k336185O36291
$$ 11586636 16635624 14001159 7098918 5328119 8742088 9740428 7404243 8040534
2220H040534L455456k208938r811981p131031L313651P429003J128519m870381
$$ 8040534 11495990 9287052 -524929 -7655960 -4342309 3086694 4215213 -655168
2212f55168k761848K135533K499163J54861M11471K453549J877618j249812k620548
$$ -655168 -3417016 -1281483 1217680 1372541 1784012 4237561 6115179 4865367 2244819
2203B244819j83021L658616N364778L111943k445932p825876q253004k244922
$$ 2244819 2061798 5720414 11085192 14197135 11751203 3925327 -4327677 -6572599
2195f572599N477862P810375K606674m893106p542930l648431J732830K751143
$$ -6572599 -1094737 6715638 9322312 4429206 -3113724 -6762155 -5029325 -2278182
2187b278182p68367l701006k164219J951630L814887J564939k190256l915571
$$ -2278182 -3046549 -6747555 -8911774 -6960144 -3145257 -1580318 -3770574 -7686145
2179g686145k337245J535033N568436P371613N704548J883359j128948j622849
$$ -7686145 -10023390 -8488357 -2919921 4451692 10156240 12039599 10910651 9287802
2171I287802n48991J30920l36464j218777j451723o21177P23661J445511Q45536
$$ 9287802 8738811 8869731 8533267 7314490 5862767 5241590 5965251 7410762 8256298
2162H256298o06115j845366k280839j844082n27123J172438J834887O48751p14848
$$ 8256298 7650183 5804817 3523978 1679896 1152773 2325211 4160098 4808849 4094001
2153D094001L52539L357531M249581O49501m007417m125196N37775L676412j14086
$$ 4094001 4446540 7804071 12053652 12703153 8695736 4570540 5108315 8784727 8670641
2144H670641q386784j2991948q733810J213743Q534711P928768K055302j693915
$$ 8670641 283857 -12708091 -21441901 -20228158 -11693447 -3764679 -1709377 -3403292
2136c403292M76418M474760L589476k806964q367084p680405j947639M205118
$$ -3403292 -2926874 1547886 5137362 2330398 -6036686 -13717091 -15664730 -11459612
2128a1459612P813079P278958J345159p222223j0408151l503878O925110J0129122
$$ -11459612 -3646533 3632425 4977584 -2244639 -12652790 -16156668 -9231558 897564
2120H97564N282242J305676K755990M469853K187748n24247k18539q2897k705010
$$ 897564 6179806 7485482 10241472 14711325 16899073 16374826 16156287 16073390 13368380
2111A3368380l865865n02730K056830j139338n029096k857198J634482Q65140
$$ 13368380 9502515 8999785 11056615 9917277 4888181 2030983 3665465 4530605
2103D530605k738078j631049J908435n58629o922370o359141J663505N509652
$$ 4530605 1792527 161478 2069913 1511284 -5411086 -11770227 -10106722 -4597070
2095d597070J065654k212167M73548Q94258n035696p312776N84618Q246327N129847
$$ -4597070 -3531416 -5743583 -5270035 -4375777 -9411473 -16724249 -16139631 -7893304 -2763457
2086b763457j341925J053882Q156426P424302k78864l546969l46543J211686q34806
$$ -2763457 -4105382 -3051500 5104926 12529228 12250364 8703395 8356852 9568538 8733732
2077H733732r96106K22684k971851p896130n654282K036506L541193l044946o070364
$$ 8733732 7737626 7960310 4988459 -2907671 -8561953 -6525447 -2984254 -6029200 -12099564
2068a2099564J38048O538761N526088K234684K996502M562668K268359j371646
$$ -12099564 -11961516 -5422755 103333 2338017 5334519 9897187 12165546 10793900
2060A0793900l255185n424782p884824n363906K298050O412275K962198k66944
$$ 10793900 7538715 2113933 -5770891 -11134797 -8836747 -2424472 537726 270782
2052B70782K365923L936095k186782r164935p554266r36234J245087l93041J189880
$$ 270782 2636705 6572800 4386018 -4778917 -12333183 -13269417 -12024330 -12417371 -11227491
2043a1227491N180700M901076P53225o55253J687755K946023K387816L563489
$$ -11227491 -6046791 -1145715 -392490 -1047743 640012 3586035 5973851 9537340
2035I537340N643599L979470j152979m505777l926966j617700Q65831K294759
$$ 9537340 15180939 19160409 18007430 13501653 9574687 7956987 8822818 11117577
2027A1117577m23029o898962r626219l810717L465182K996081k302506l353657
$$ 11117577 10694548 3795586 -5830633 -9641350 -6176168 -3180087 -5482593 -8836250
2019h836250l97537k21893j831925J125713N972882M098041k167712j455178O703846
$$ -8836250 -9233787 -9455680 -11287605 -10161892 -4189010 -90969 -2258681 -3713859 2989987
2010B989987R836619L334203k815866k675448l305110q205970q168714J404810
$$ 2989987 12826606 16160809 13344943 10669495 7364385 -841585 -9010299 -7605489
2002g605489Q834686M142891l844962k234802M522053L439628m262030n740442
$$ -7605489 1229197 5372088 1527126 -707676 3814377 7254005 2991975 -2748467
1994b748467J772493P598539N497132R61407r26966k522245n040351l590132L760272
$$ -2748467 -975974 6622565 12119697 13081104 12154138 9631893 4591542 1001410 4761682
1985D761682R661173O597631k059262n965373j074553N714407N743164o52455
$$ 4761682 14422855 21020486 18961224 12995851 11921298 17635705 23378869 22726414
1977B2726414n136716k684419J544321n51682q174811j1933644o037232M483731
$$ 22726414 17589698 14905279 16449600 15897918 7723107 -4210537 -10247769 -5764038
1969e764038R910746N573473m984090j2799180r914932K149340J1217349P816364
$$ -5764038 4146708 9720181 4736091 -8063089 -17978021 -15828681 -4611332 3205032
1961C205032j681170l609568K451414L451089n084851j0648187l777690O423469
$$ 3205032 1523862 -2085706 365708 3816797 -1268054 -11916241 -15693931 -9270462
1953i270462O775185l59933l708281j449176k54386j288972O6251L270990K982104
$$ -9270462 -2495277 -2855210 -6563491 -8012667 -8267053 -9556025 -9489774 -6218784 -3236680
1944c236680q55531l087627k444522j833215j006501K584927P053819Q212876
$$ -3236680 -4092211 -7179838 -9624360 -11457575 -12464076 -9879149 -2825330 5387546
1936E387546O725212N503684K720216m111378j0090915q615033k727975o77371
$$ 5387546 12112758 17616442 20336658 16225280 6134365 -2480668 -5208643 -5886014
1928e886014k162822O3177O138313Q353024M679161J495452J503634P3855m196820
$$ -5886014 -8048836 -7985659 -1847346 6505678 11184839 12680291 14183925 14257780 10060960
1919A0060960n901652k703874P24326J284219J020673L22321k882602n592400
$$ 10060960 4159308 1455434 2179760 3463979 4484652 4806973 1924371 -3668029
1911c668029k019787M574975M008511l803432o466185J559368J0016958R654356
$$ -3668029 -5687816 -1112841 2895670 -907762 -7373947 -5814579 4202379 13856735
1903A3856735N277365L790318J576663n539056j0605714o385456N93927q627m987234
$$ 13856735 19134100 22924418 24501081 18962025 8356311 1970855 2564782 2556155 -2431079
1894b431079l884433K298816L320826j602768k048769N586262J1520990P739744
$$ -2431079 -6315512 -4016696 -695870 -2298638 -4347407 1238855 12759845 20499589
1886B0499589r11703n640736n460053m545330l795663r18318L891632O933285
$$ 20499589 19587886 13947150 8487097 3941767 146104 -772214 3119418 10052703
1878A0052703N236292n1845m412394m170042m53970K243176K005051J299135J654866
$$ 10052703 15288995 15237150 10824756 6654714 6200744 8443920 10448971 11748106 13402972
1869A3402972P07472k676801n026616m255267m147947p166691p772472p57072
$$ 13402972 14110444 11433643 6407027 2151760 -1996187 -9162878 -16935350 -17692422
1861a7692422P876678Q199645K136726N79600M865739M013246n974647j2862709
$$ -17692422 -9815744 -1616099 520627 1100227 5965966 9979212 4004565 -8858144
1853h858144o148047O000166Q451346P93067m726282k983403o32857j354775K43194
$$ -8858144 -15006191 -9006025 -554679 238388 -4487894 -7471297 -8104154 -9458929 -9215735
1844i215735O177144Q311310J280061o784289n530751K038319N435944L528525
$$ -9215735 -3038591 5272719 6552780 -231509 -5762260 -3723941 1712003 5240528
1836E240528L676557O126726K809393o392949r823834k338769M885026J620860
$$ 5240528 8917085 15043811 17853204 11460255 1636421 -702348 4182678 5803538
1828E803538n180978m078249J078211j027438p508531n036664O027060R727167
$$ 5803538 622560 -3455689 -2377478 -3404916 -10913447 -15950111 -9923051 -195884
1820a95884L64197p320559j760070P187763N222880l712156o121286j527681l31494
$$ -195884 168313 -7152246 -8912316 -1724553 3498327 -213829 -6335115 -7862796 -8194290
1811h194290l798571k740952M188687O565852J06140m972386Q2941Q868191J0188415
$$ -8194290 -11992861 -14733813 -10545126 -3979274 -3873134 -8845520 -8762579 105612 10294027
1802A0294027M246095n28465j408772k373416l955343k276452J520451O81875
$$ 10294027 14540122 14011657 12602885 10229469 6274126 3997674 5518125 6200000
1794F200000n115581n968272L806765J4351487J2270168j0568p338092l462336
$$ 6200000 1084419 -4883853 -1077088 13274399 25544567 25533999 18195907 14733571
1786A4733571J876560K22462k952987k9660M231752P80151p355543r099538l013865
$$ 14733571 16610131 16832593 13879606 13849946 18081698 18861849 11506306 2406768 -607097
1777f07097J298497o35445k406665O37545L835437K468641n30535j212722j432481
$$ -607097 691400 55955 -2350710 -1713165 2122272 4590913 4060378 2847656 1415175
1768A415175l665894n226544l067391N17020J749008Q11933m23212k003521l745852
$$ 1415175 -2250719 -7477263 -10544654 -10027634 -8278626 -7466693 -7889905 -9893426 -13639278
1759a3639278l483679o09541K293561L554086M102998L753908R55081k471432
$$ -13639278 -17122957 -17732498 -15438937 -11884851 -7781853 -4027945 -3072864 -5544296
1751e544296k381649M73822J057918o89759P26569N437953N967791j43093m818713
$$ -5544296 -7925945 -7452123 -6394205 -7083964 -6357395 -919442 5048349 4905256 86543
1742H6543k064361K561382J540108l223899n288827l159243J151550O179988Q193068
$$ 86543 -1977818 583564 2123672 -1100227 -6389054 -9548297 -8396747 -2216759 5976309
1733E976309K269191p849838r860815l9410Q842967N214892m696812p821200l308363
$$ 5976309 8245500 395662 -9465153 -9504563 -661596 4553296 -143516 -7964716 -11273079
1724a1273079P23137K361060N336870Q114930N680037l77618l633381k492654
$$ -11273079 -10549942 -8188882 -2852012 5262918 10942955 10565337 6931956 4439302
1716D439302r6494K064713L146730P6092o843832j0234739m761777M877799J0955749
$$ 4439302 4342808 6407521 9554251 9630343 2786511 -7448228 -12210005 -7332206 3623543
1707C623543J1507138P297357j288357r081775q425243k085309j266799n727238
$$ 3623543 15130681 22428038 21139681 12057906 3632663 1547354 280555 -5446683
1699e446683k699208P926745R176007j983374n094943O990028J1435859k685698
$$ -5446683 -8145891 -219146 8956861 6973487 1878544 8868572 20304431 17618733
1691A7618733r263024P413310J7122182N5242Q81625O0741340J21095369Q1035309
$$ 17618733 8355709 15769019 32891201 32946443 33828068 94569408 215664777 296700086
1683B96700086m8285399j35072128r9135391j1993602J9265247m948388j4268437
$$ 296700086 248414687 113342559 14207168 2213566 21478813 16530425 2261988
1676B261988P093707J4440195n461575j5776257o99775J0412950n29460j2233450
$$ 2261988 9355695 23795890 18334315 2558058 1858283 12271233 11741773 -491677
1668d91677o515246L275989K289789j429410J540331L975178L90764j3204P366253
$$ -491677 -7006923 -3730934 -1441145 -2870555 -1330224 2644954 3035718 3022514 10388767
1659A0388767J0465664R38173j0392548j0685837l529155O04478K34268n32517
$$ 10388767 20854431 21792604 11400056 714219 -2814936 -2210458 -1976190 -2508707
1651b508707j192934k102618n04780M074882O925050N022906J063910j650043
$$ -2508707 -3701641 -5804259 -6309039 -2234157 4690893 9713799 10777709 9127666
1643I127666k719178k431345j528402k157425l889411k248716L053109M717144
$$ 9127666 6408488 3977143 2448741 291316 -3598095 -5846811 -2793702 1923442
1635A923442q722j998391M524828R352891K645449o147824l308296M204204K27728
$$ 1923442 1914720 -83671 4441157 13794048 16439497 10291673 6983377 11187581 11415309
1626A1415309j0560605q666377O207981J2900703L118726o761353m309017J600555
$$ 11415309 854704 -7811673 -1603692 11297011 14415737 7654384 3345367 4945922
1618D945922P71572j832830k21261J99474m368306o452115j642120J693073k463967
$$ 4945922 5717494 3884664 3663403 3862877 -505429 -6957544 -8599664 -6906591 -9370558
1609i370558o457540l150929J578209J119356L42198M330465O673592J075296
$$ -9370558 -15828098 -18979027 -17400818 -16281462 -15939264 -11608799 -4935207 -3859911
1601c859911n505733l612824L119890M830012J046160j308372J30062K715377
$$ -3859911 -9365644 -12978468 -9858578 -5028566 -3982406 -5290778 -5160716 -2445339
1593b445339N417221P818644O954457J619805m564057q656434j1162919j0537928
$$ -2445339 2971882 10790526 17744983 19364788 14800731 6144297 -5018622 -15556550
1585a5556550l338167O730209R722210L752686j772836j436743p62674l102503
$$ -15556550 -18894717 -12164508 -2442298 1310388 -462448 -1899191 -2661865 -5764368
1577e764368k843438J645281K229571l363119m349809M338344J0362034L736073
$$ -5764368 -8607806 -6962525 -4732954 -8096073 -12445882 -8107538 2254496 5990569
1569E990569n172832k383247O699905P681938J111583j552359J087957J079418
$$ 5990569 817737 -1565510 5134395 12816333 13927916 12375557 13463514 14542932
1561A4542932j915424j417646J044067j832312p558266n949176L196226Q516543
$$ 14542932 12627508 11209862 12253929 10421617 2863351 -3085825 110401 8626944
1553H626944M250642l175457o839484o767271m662985q74856K385399K700824
$$ 8626944 12877586 9702129 2862645 -3904626 -8567611 -9442467 -7057068 -4356244
1545d356244K021816K827216K415942j417329l336558J477810O737896L631115
$$ -4356244 -2334428 492788 2908730 1491401 -1845157 -367347 6370549 10001664
1537A0001664l812019m203993L008750P627282N434383J976692K88345k200675
$$ 10001664 6189645 1985652 4994402 12621684 18056067 20032759 20321104 18120429
1529A8120429m193836q49088N047687M502386l043095p995540n644048j624688
$$ 18120429 13926593 13077505 18125192 22627578 19584483 11588943 5944895 4320207
1521D320207j71390J505025M090400K907128k149525m085537p60399O79814l693436
$$ 4320207 4148817 5653842 9744242 12651370 10501845 6416308 5655909 6335723 2642287
1512B642287p167182l304226L843332O432457L291894j304492l682300j831169
$$ 2642287 -4524895 -7829121 -3985789 2446668 5738562 4434070 751770 -1079399
1504a079399L927593Q534209O453323K67055k008771L05465o20473o720978q594226
$$ -1079399 2848194 11382403 17835726 18102781 16094010 16399475 15779002 9058024 463798
1495D63798j37974J0246481J0613400J362971p172558q621513n474602l014254
$$ 463798 325824 10572305 21185705 22548676 15376118 6754605 1280003 -1734251
1487a734251l640867n618586m654706J182673P442743Q134538M490589K911815
$$ -1734251 -5375118 -10993704 -15648410 -14465737 -7022994 1111544 5602133 8513948
1479H513948M126551K525761k309090l126197K191155N189866K43314n629401
$$ 8513948 12640499 15166260 12857170 9730973 11922128 17111994 17355308 11725907
1471A1725907m125030Q53795K95065n021162o590488j876034L264627M248245
$$ 11725907 7600877 8454672 8749737 3728575 -2861913 -4737947 -1473320 2774925
1463B774925J936514j850158n812007o745734k393560L189268L198543k418698
$$ 2774925 4711439 2861281 -2950726 -9696460 -12090020 -8900752 -5702209 -8120907
1455h120907o425366m045752J776518O020249P529183P143801M364506m16707
$$ -8120907 -14546273 -18592025 -16815507 -10795258 -3266075 3877726 8242232 7825525
1447G825525l249024r51685K653480J73458p845337j0316781p2080J2892578J1794988
$$ 7825525 4576501 3624816 6278296 6451754 -1393583 -11710364 -11782444 1110134 12905122
1438A2905122l333155j3550915p040799M327112M005153l940774l364065O361875
$$ 12905122 9571967 -3978948 -11019747 -6692635 -2687482 -6628256 -9992321 -3630446
1430c630446R584899Q71189o357068k569768L349205R56991m729509m310614o55411
$$ -3630446 5954453 6825642 468574 -2101194 1248011 2205002 -2524507 -6835121 -7490532
1421g490532j635028m564272j415074N656647P095016J685523k289157p78615
$$ -7490532 -9125560 -13689832 -15104906 -9448259 -2353243 -667720 -2956877 -3735492
1413c735492J596091J204433M35635J596156K875030K140297q8880k072074j811779
$$ -3735492 -2139401 -934968 -499333 1096823 3971853 6112150 6023270 3951196 2139417
1404B139417K014871O568327N449896k399289q312762m826811K818323M098996
$$ 2139417 4154288 10722615 16172511 13773222 5460460 633649 3451972 7550968
1396G550968r49849k936053J111967L709977Q8400m418040l752877J08965K327727
$$ 7550968 6601119 3665066 4777033 8487010 8575410 4157370 404493 513458 2841185
1387B841185K738677L245081K524340j432091o452849q361996o353617k879577
$$ 2841185 5579862 8824943 11349283 9917192 3464343 -4897653 -11251270 -14130847
1379a4130847M48695L934139P477675R526647Q543740M624804l29075l865999
$$ -14130847 -13682152 -9748013 -2270338 7256309 15800049 20424853 20095778 16229779
1371A6229779m636212k778625Q79826M679069N596588J813022l438176m252662
$$ 16229779 11593567 8814942 9694768 14373837 19970425 21783447 18345271 14092609
1363A4092609j35604K430878n37528m114969k268843K191201K033159k838430
$$ 14092609 13957005 16387883 15850355 11735386 9466543 11657744 13690903 10852473
1355A0852473n702264l772626j181740j066537j733177j666492j739010j171046
$$ 10852473 5150209 1377583 195843 -870694 -2603871 -4270363 -6009373 -7180419
1347g180419K002182M761189P53615q757699j2937485n475742N453332P809652
$$ -7180419 -5178237 -417048 336567 -8421132 -21358617 -26834359 -21381027 -13571375
1339a3571375J883469j527142K980657Q898860P928723O89492n215978m501480
$$ -13571375 -11687906 -13215048 -10234391 -1335531 6593192 7282684 2066706 -2434774
1331b434774R59873N216165M458782K96310k717536k418321q29631m00261m55947
$$ -2434774 -1474901 3741264 8200046 8496356 5778820 3360499 2530868 2130607 1674660
1322A674660Q57338K590885J701957k296497n802409n205695j051994K999179
$$ 1674660 2531998 5122883 6824840 4528343 -1274066 -6479761 -7531755 -4532576
1314d532576M496157M106165L359336K064771p94952m196871n020107j841716
$$ -4532576 -36419 4069746 7429082 9493853 8698901 4502030 -518077 -2359793
1306b359793K372266L035538p01505m780731m864844j104995K461936K646384
$$ -2359793 12473 3048011 2346506 -2434225 -7299069 -8404064 -5942128 -3295744
1298c295744J84652j989805k467314k244975k250689j796255m15260M85446j05744
$$ -3295744 -3111092 -5100897 -7568211 -9813186 -12063875 -13860130 -14275390 -13789944 -13895688
1289a3895688k2350L517770Q516001Q891731K324066n347994o384853n32384M653593
$$ -13895688 -13918038 -10400268 -1884267 7007464 9331530 3983536 -2401317 -2933701 1719892
1280A719892K851759l790621p380145l403618L965859O493814J713476l765376
$$ 1719892 4571651 781030 -6599115 -10002733 -6036874 456940 2170416 -1594960
1272a594960k571082L528344N807313O30786n282441m011803K808907O479310
$$ -1594960 -4166042 -637698 5169615 5800401 517960 -3493843 -684936 5794374
1264E794374K944009k392382k399900K441181M950887N39303p133115j0865585
$$ 5794374 8738383 6346001 3946101 6387282 11338169 11877472 4744357 -6121228
1256f121228q183313k347924L338518P809415Q989486M469046k283525l177246
$$ -6121228 -14304541 -16652465 -13313947 -5504532 3484954 7954000 5670475 2493229
1248B493229K468302M349704l242525r852458l875228P073286N899708o464717
$$ 2493229 4961531 9311235 6068710 -3783748 -7658976 -585690 5314018 -1150699
1240a150699j1009169k72745J0267006P425705k57095M26838N488138L412213
$$ -1150699 -12159868 -12432613 -2165607 5260098 5003003 5429841 10917979 14330192
1232A4330192m000247n971772r77202L723886N521566O217178L412435m624653
$$ 14330192 10329945 4358173 3380971 7104857 12626423 18843601 22256036 17631383
1224A7631383j0207856n879043J648343J163424m165347l237623K012571M11989
$$ 17631383 7423527 1544484 3192827 4356251 190904 -3046719 -1034148 -622159
1216f22159n834542k744010R670748J4017992L277425p619426o073979K92583
$$ -622159 -6456701 -9200711 470037 14488029 17765454 10146028 4072049 4364632
1208D364632L78254k017600Q58486M772090K121043l607887m653162j944569j00767
$$ 4364632 4742886 2725286 3583772 8355862 10476905 6869018 2215856 271287 170520
1199A70520K252183O338934N978420j999953q227869l883231M214742M361903
$$ 170520 2422703 8761637 14740057 12740104 4512235 629004 4843746 9205649
1191I205649j229186k206057J375315J190478k906077l750250j568354k786115
$$ 9205649 7976463 5770406 7145721 8336199 5430122 1679872 111518 -2674597
1183b674597n595062j887197O382842P938335R87136l330534N73792M749971K623621
$$ -2674597 -8269659 -10156856 -3774014 4164321 5151457 1820923 2394715 7144686 9768307
1174I768307j266496k092610l097566o352837o165170N11900O402024M533060
$$ 9768307 8501811 6409201 3311635 -3041202 -9206372 -8694472 -2292448 2240612
1166B240612j413221m631484n156311m822160m65708Q798516J4573283R494038
$$ 2240612 827391 -3804093 -8960404 -13782564 -14248272 -5449756 9123527 18617565
1158A8617565p95578n792818n312244n929405o670304r51825Q676705J0852735
$$ 18617565 17821987 12029169 6716925 787520 -5882784 -6834609 1842096 12694831
1150A2694831K381483o447095o954634k475019O82286L089685O679988P420564
$$ 12694831 15076314 8629219 1674585 -800434 -118148 2971537 9651525 17072089
1142A7072089J647213n584637o680707k685542n29233j511061p25399K777264
$$ 17072089 18719302 13134665 6453958 3768416 3239183 1728122 1002723 3779987
1134C779987L629001n35937m634614m007508j000116l9611o79462L28897L202179
$$ 3779987 7408988 6873051 2238437 -1769071 -2769187 -2808798 -3488260 -3159363 42816
1125D2816N324899N224748L219690O376k752643k603539L00271K276763J152710
$$ 42816 5367715 10592463 13812153 13818529 11065886 8462347 8762618 11039381 12192091
1116A2192091n58233l55176j92721k415494m776211m276488k660469k621498j981706
$$ 12192091 11633858 11278682 11085961 8670467 3894256 -382232 -3042701 -5664199 -7645905
1107g645905J693829M051378j04163o278412n586479N46609K221728j840214j723769
$$ -7645905 -5952076 -1900698 -2004861 -8283273 -13869752 -13323143 -11101415 -12941629 -14665398
1098a4665398N877809J0576746N621108k47548K130528O435306K338708n761305
$$ -14665398 -8787589 1789157 7410265 7162717 9293245 15728551 18067259 12305954
1090A2305954n824961J454871M516751P86808o15203L368958M212439k019877
$$ 12305954 6480993 7935864 12452615 13239423 12624220 15993178 20205617 18185740
1082A8185740o289674j248519O123179M994774l251578q044661m734159R64818
$$ 18185740 11896066 10647547 16770726 21765500 18513922 10469261 5735102 6699920
1074F699920K116905j662216n573123n240554o28269M199593N433765L488099
$$ 6699920 8816825 7154609 1581486 -3659068 -4287337 -87744 5346021 8834120
1066H834120J317758k2051j256469j657962k28824O44269k110774n950645m850978
$$ 8834120 10151878 10129827 8873358 7215396 6986572 7630841 5520067 -430578 -5281556
1057e281556J479811O391489N626088J885050j509734m815326p149313m715045
$$ -5281556 -3801745 2589744 8215832 10100882 8591148 3775822 -3373491 -8088536
1049h088536K056625O048278L167058j338595j695470o79630k994173n189403
$$ -8088536 -6031911 16367 3183425 1844830 149360 -530270 -3524443 -8713846
1041h713846j189143N582835N549724k294790q324204n972053R46087O660872
$$ -8713846 -9902989 -4320154 1229570 -1065220 -9389424 -15361477 -14415390 -7754518
1033g754518J0821766J3329825R435784k877235j4904616j4707558k294496R131598
$$ -7754518 3067248 16397073 25832857 22955622 8051006 -6656552 -8951048 180550
1025A80550Q861368P33266l679705l33062M083588L454742N31704O70749K063381
$$ 180550 9041918 9775184 6095479 5762417 9846005 13300747 13832451 14503200 16566581
1016A6566581j250289p983519q913140r3645R709343R832511J588360m772169
$$ 16566581 15316292 7332773 -1580367 -1674012 8035331 17867842 19456202 14684033
1008A4684033m307654j643891j562063k534782j641999J4567L66733O45536K591933
$$ 14684033 10376379 8732488 7170425 4635643 2993644 3008211 3374944 4020480 6612413
999F612413M273790K737833j070559l931271n337565o598493o182223j457502
$$ 6612413 10886203 13624036 12553477 8622206 3284641 -3313852 -9496075 -10953577
991a0953577M568576M536008k459362p207344k616697N154130N071183k177710
$$ -10953577 -6385001 -1848993 -4308355 -11515699 -14132396 -8978266 -3907083 -6084793
983f084793n204984M60693O063142M431374J004542K907135N640619J200968o222819
$$ -6084793 -11289777 -10829084 -4765942 -334568 669974 3577109 9217728 10418696 4195877
974D195877n360217L326535P176920J106728m941325k654190K404200K244940
$$ 4195877 -1164340 2162195 9339115 10445843 5504518 2850328 5254528 7499468
966G499468j06228J943004N409442K882342l937649o588935l256903Q1206N96595
$$ 7499468 7393240 9336244 14745686 17628028 13690379 7101444 3844541 3925747 4522342
957D522342J166218K241078M20982l759176m967577j765508J213235J397203J345496
$$ 4522342 5688560 7929638 8350620 4591444 -376133 -2141641 -928406 468797 1814293
948A814293K033429O91594k383262k599707N39153J813372L58452K374720Q854561
$$ 1814293 3847722 4539316 2156054 -443653 95500 1908872 2267324 4642044 13496605
939A3496605J0378845K041528n442376m88172J0108835R751675l297970j3557736
$$ 13496605 23875450 25916978 20474602 19986430 30095265 39846940 36548970 22991234
931B2991234j0971476k839219K63191j202192j548147p05281j526625k460385
$$ 22991234 12019758 9180539 9443730 8241538 6693391 5988110 4461485 2001100
923B001100o32699J620683K33182l095352l107076P94376L994913L573870J160573
$$ 2001100 1368401 2989084 3222266 126914 -2980162 -2185786 1809127 5382997 6543570
914F543570o00025n30107J533593M099321L715402j037235n996658n775499j268047
$$ 6543570 5943545 5413438 6947031 11046352 14761754 13724519 7727861 1952362 684315
905F84315J307771r26258l989476l357106j12134J360617n16131l006857k836332
$$ 684315 1992086 1065828 -2923648 -6280754 -6392888 -5032271 -5548402 -8555259 -11391591
896a1391591K0159K505279K317656J078686K117127M938926M907287L18663l511170
$$ -11391591 -11371432 -8866153 -6548497 -5469811 -3352684 1586242 6493529 6812192 3301022
887C301022j048455M803549N645707j435577j0173752j2556576o507968L589003
$$ 3301022 2252567 7056116 12701823 11266246 1092494 -11464082 -17972050 -14383047
879a4383047J0618705R512838J914136m496049m556349j684265j300928j531825
$$ -14383047 -3764342 5748496 7662632 3166583 -1389766 -3074031 -4374959 -5906784
871e906784K439005P226183M334996n183753r694860l712624M241223N318825
$$ -5906784 -3467779 3758404 8093400 2909647 -6785213 -10497837 -6256614 -937789
863i37789K383899J724886J480924k764631p297951n022541K751384Q014482P264745
$$ -937789 1446110 3170996 4651920 1887289 -5410662 -10433203 -7681819 332663 7597408
854G597408L705956N16502j464625j626323r47713k477074n402709l718065L078148
$$ 7597408 11303364 11819866 10355241 8728918 7781205 5304131 -98578 -3816643 -738495
845g38495M994738l613544j1452891n187834Q487023J1031991m3991q210305l925594
$$ -738495 4256243 642699 -10810192 -15998026 -7511003 3520988 3476997 -4733308 -8658902
836h658902L303121L497728R97342K851008N714382L820763k89439k167299l711355
$$ -8658902 -5355781 -1858053 -860711 1990297 7704679 11525442 11236003 9068704 5357349
827E357349o367750m733826L701501J0336305P104066l16521j333241L200059
$$ 5357349 -1010401 -5744227 -2042726 8293579 15397645 15081124 13747883 16947942
819A6947942M265405j09948l944420m702031n061944n056524k208802J597247
$$ 16947942 21213347 21103399 17158979 12456948 7395004 2338480 129678 1726925
811A726925K282068J344386K777365L853921j346136r953145j2051060n173880
$$ 1726925 4008993 5353379 8130744 11984665 10638529 685384 -11365676 -16539556
803a6539556K554701N170260N238313N305172K758605k722338n266549j686460
$$ -16539556 -13984855 -8814595 -3576282 1728890 4487495 1765157 -3501392 -5187852
795e187852K682845K400661J40141Q46010L002054K180034n22589l90091K489890
$$ -5187852 -2505007 -104346 35795 881805 3883859 6063893 5541304 5151213 7641103
786G641103L064397n08564l705231k053091K631525M524268J152020l349578l175722
$$ 7641103 10705500 10196936 6491705 4438614 7070139 11594407 12746427 9396849 6221127
777F221127J604410M705690J996692k547062k450991J860469L996096J072729
$$ 6221127 7825537 12531227 14527919 11980857 9529866 11390335 15386431 16459160
769A6459160l075674m540282l811806k394731l53367P82588j880132o772455p562338
$$ 16459160 13383486 8843204 5031398 2636667 2283300 3065888 1185756 -5586699 -13149037
760a3149037k345527K366857J685667O78912N587194J1400665P941304l307741
$$ -13149037 -15494564 -13127707 -11442040 -10763128 -5175934 6224731 14166035 10858294
752A0858294r267143m054358K670002J267773l208759m93249P254380Q548743
$$ 10858294 1591151 -2463207 206795 1474568 -1734191 -2227440 5026940 13575683
744A3575683J108534m497407j599500K970930J151338l562365l366754M34651
$$ 13575683 14684217 10186810 8587310 11558240 12709578 9147213 5780459 6215110
736F215110O99499k783079l821461j512209j216552l497639k329598L304092O055005
$$ 6215110 6914609 4131530 310069 -1202140 -2418692 -5916331 -8245929 -4941837 1113168
727A113168K703755L64244L884264O055781o17946r417421p834701L188448J0041039
$$ 1113168 3816923 4181167 8065431 14121212 13503266 4085845 -3748856 -560408 9480631
718I480631N972238r49496j525127K258339L031664n26251l531728k691044L13050
$$ 9480631 15452869 14503373 12978246 15236585 18268249 17741998 14210270 11519226 11832276
709A1832276J989701R23803j153349j494354j64889q29924n701472j0797735r462299
$$ 11832276 13821977 14745780 13592431 12098077 11933188 11103264 5401792 -5395943 -14858242
700a4858242n59904R710713J4332637J1346155L530096m710342r565755r463648
$$ -14858242 -15418146 -5707433 8625204 19971359 23501455 18791113 9225358 -238290
692b38290n866391j893742l7371q95067k559771j439144L515814P519693N211861
$$ -238290 -6104681 -7998423 -8035794 -8930861 -11490632 -12929776 -9413962 -1894269 3317592
683C317592n44140j466025K956756L450070l641002q436634k836292N165533L661671
$$ 3317592 2773452 1307427 4264183 7714253 4073251 -4363383 -7199675 -2034142 1627529
674A627529l623739l652833M212881P848663K692625k634691k588460k060228
$$ 1627529 -1996210 -5649043 -1436162 6412501 9105126 6470435 3881975 1821747
666A821747l856385k523824L792447P538408M237372n1637j93688k89028l557515
$$ 1821747 -2034638 -4558462 -766015 6772393 11009765 10958128 10764440 10475412 6917897
657F917897m546056K94355M155109J190328k815526r28824K498845Q15108j632488
$$ 6917897 2371841 2666196 6821305 8011633 5196107 4267283 6766128 7581236 5948748
648E948748K316479P850901N364681k347229m507532j041171j681543p023082
$$ 5948748 8265227 16116128 21480809 19133580 14626048 13584877 11903334 4880252
640D880252o234111L465342R812226M100930n408355o628190p12419K942189J845073
$$ 4880252 -1353859 2111483 11923709 16024639 10616284 3988094 3275675 6217864 8062937
631H062937R48008J948439J413177j322136k279161m114J483629p65948l705056
$$ 8062937 9010945 10959384 12372561 11050425 8771264 8767150 10250779 9484831 5779775
622E779775l171660n53359l09832k304947j790198K180325L843346l79904m990645
$$ 5779775 2608115 2054756 1744924 -560023 -2350221 -169896 3673450 3293546 -1697099
613a697099l169097K181138K837715j178347j759038L155974N859484K342446
$$ -1697099 -4866196 -2685058 152657 -1025690 -2784728 371246 6230730 8573176
605H573176q56986J181519K623800k050891o539348k598263N140319N909003P4724
$$ 8573176 7716190 8897709 11521509 9470618 2931270 333007 5473326 11382329 11457053
596A1457053k612857R3425M39788m562483q003284n513034k238745l056028m684981
$$ 11457053 8844196 8937621 9377409 4814926 -3188358 -8701392 -10940137 -13996165 -18681146
587a8681146k792162K54366M60629m90169J128771L995778L919442R64972n10743
$$ -18681146 -21473308 -21218942 -20758313 -21248482 -20119711 -16123933 -12204491 -11239519 -11750262
578a1750262J658425M604677M599890J975373N92401K527588M631846K448043
$$ -11750262 -10091837 -5487160 -887270 1088103 1680504 4208092 8839938 11287981
570A1287981k800749m841558j230022K874482K627082L62057K02506P31566q87367
$$ 11287981 8487232 3645674 2415652 5290134 7917216 8279273 8481779 9213345 8325978
561H325978j881274J363889M754116J487163o088985q717390l990600J105604
$$ 8325978 6444704 7808593 12562709 14049872 7960887 -756503 -4747103 -3641499
553c641499J981694J783131L236847L814037J900546K49587K56468l78471j588997
$$ -3641499 -1659805 123326 3360173 7174210 9074756 9324343 9580811 9202340 7613343
544G613343M33016N517761P400206K941786k950947n229607n191813n343779m350223
$$ 7613343 8046359 13564120 20964326 23906112 20955165 15725558 10533745 5189966 839743
535H39743j690624j243572m887298p550880m024003L276593Q064381Q096879N245197
$$ 839743 -850881 -2094453 -6981751 -14532631 -18556634 -15280041 -7215660 881219 6126416
526F126416J398732j644912j614263J218120L457012L528229L396104L472064
$$ 6126416 7525148 5880236 4265973 5484093 8941105 12469334 15865438 19337502
518A9337502J140925l075375m112998p85728Q41488k864889o517937m479871k4915
$$ 19337502 20478427 17403052 13290054 12504326 13345814 10480925 3962988 -516883 -541798
509e41798J003205J06183J916660M515535K455207l257614o276315m444932j030606
$$ -541798 461407 567590 2484250 6999785 9454992 6197378 -78937 -4523869 -5554475
500e554475K170543N833139Q004665N123212j307550m917887k440465K745849
$$ -5554475 -3383932 2449207 10453872 15577084 14269534 9351647 6911182 9657031
492I657031N515707M064275K75455k143022p23268K403529K271962j776529m359818
$$ 9657031 15172738 19237013 19512468 17369446 16646178 19049707 21321669 19545140 15185322
483A5185322k282971L62162m43506j710411J33802J427030k113745n635415j796377
$$ 15185322 12902351 13264513 12821007 11110596 11244398 12671428 10557683 4922268 3125891
474C125891N780879O587504m1043l486623J299972O197330L077743m424529p765021
$$ 3125891 8906770 15494274 15453231 11966608 13266580 19463910 22541653 18117124 10352103
465A0352103n480018k535009k016893k638891k177252R6304K899817L361736Q0530
$$ 10352103 4872085 2337076 320183 -2318708 -4495960 -4399656 -1499839 1861897 1942427
456A942427l762452l397657J052141M523281L765303N94301j637239j088037K585926
$$ 1942427 -1820025 -5217682 -4165541 357740 4123043 4717344 3080105 1992068 4577994
447D577994P052600P116989R21313m998523l537313J279310p72399r140065j1147709
$$ 4577994 11630594 18747583 19668896 14670373 11133060 12412370 11639971 2499906 -8647803
438h647803j175459R467009Q615590K73149l300820J78433K901833J111728j120582
$$ -8647803 -9823262 -356253 8259337 8532486 5231666 5410099 8311932 9423660 8303078
429H303078j124454j203629k244388j725362K30115k96439l771706m845767m06255
$$ 8303078 7178624 5974995 3730607 2005245 2235360 1938921 -1832785 -6678552 -7084807
420g084807M912006N065345Q52282k215245j907503r16468j427632k064629r59442
$$ -7084807 -2172801 2892544 3744826 1529581 -377922 -1294390 -2722022 -4786651 -5746093
411e746093J045556J878552J280692N82802K59409l31909q11493M73853L534898
$$ -5746093 -4700537 -2821985 -1541293 -958491 -699082 -1030991 -1842484 -1368631 2166267
402B166267N333389L140782j626688m885426m788746l293758k947191l853301
$$ 2166267 7499656 10640438 9013750 4128324 -660422 -3954180 -6901371 -10754672
394a0754672m004088j379566M008155Q941894Q825787K722068m272302o205758
$$ -10754672 -14758760 -16138326 -12130171 -3188277 5637510 8359578 4087276 -2118482
386b118482l114338L14035K099547M552041P921299P644931J065913o676960p682827
$$ -2118482 -5232820 -4918785 -2819238 1732803 9654102 17299033 18364946 11687986 4005159
377D005159q78862O838950Q635895M181753j953398n785311o529554n010606j590282
$$ 4005159 3126297 9965247 18601142 22782895 20829497 15044186 8514632 3504026 1913744
368A913744L037044N846528L200850l802089q276796n233213J193822K551079
$$ 1913744 4950788 10797316 13998166 10196077 1919281 -3313932 -2120110 430969
360D30969k332875n772742k430986L439348N238829L732770M230931O863402O163855
$$ 430969 -1901906 -7674648 -10105634 -6666286 -1427457 2305313 6536244 13399646 19563501
351A9563501N59351l639158o75063N928050P350716J088888n791042o252554k304733
$$ 19563501 20122852 16483694 15808631 21736681 29087397 30176285 24385243 18132689 15827956
342A5827956q21363k759461k350595K481387N435819J362468m908512n350954
$$ 15827956 15006593 12247132 9896537 12377924 17813743 19176211 14267699 8916745
334H916745q18368J056415j619783k850515K61344K654987L67045k780370k040127
$$ 8916745 8098377 9154792 7535009 4684494 4945838 7600825 7967870 5187500 3147373
325C147373M64476J37503k135801k117241L18899J185364j326360m707341n669186
$$ 3147373 3611849 3749352 1613551 -503690 -184791 1000573 -325787 -5033128 -10702314
316a0702314l056079J654396M707581K928050j690498k934803J567207O349841
$$ -10702314 -13758393 -12103997 -7396416 -4468366 -6158864 -9093667 -7526460 -1176619
308a176619N395859K24912l326191l505299k990921k892830j597602J234699L997468
$$ -1176619 4219240 4444152 1117961 -2387338 -5378259 -8271089 -9868691 -8633992 -4636524
299d636524N914596O746719M883778j57520m559510m184295r16376j16910k232157
$$ -4636524 1278072 8024791 12908569 12751049 8191539 4007244 3090868 2973958 741801
290G41801k428031R24880L116312M77388l824489m320091m09136L812416M935479
$$ 741801 -1686230 -761350 2354962 2832350 -992139 -5312230 -5721366 -1908950 3026529
281C026529L223604J292192J122683J959285J396780o67755r44675K000395L638719
$$ 3026529 6250133 7542325 8665008 10624293 12021073 11353318 10408643 12409038 16047757
272A6047757q68988q001341q700051q23043O969181O467128K10512l317385j183289
$$ 16047757 15178769 7177428 -1522623 -2345666 4623515 11090643 11301155 7983770 6800481
263F800481J985222J701915j201019l154192k380803K5872J811353J547367l89265
$$ 6800481 8785703 10487618 9286599 6132407 3751604 3777476 5588829 7136196 6746931
254F746931k341060k753249j034732K131357M531891L633216k95820l406667k909286
$$ 6746931 4405871 1652622 617890 2749247 7281138 10914354 10618534 7211867 4302581
245D302581j209743k086836l853194j254327N429424Q853293M652537k017052
$$ 4302581 3092838 1006002 -2847192 -4101519 1327905 10181198 14833735 12816683
237A2816683l854219j267239K6562j636039k656229j266783j11405r69294j680520
$$ 12816683 8962464 7695225 7721787 6085748 3429519 2162736 2051331 1082037 -598483
228e98483k78406J373360O72068j288460j291824R11286J990211J47069j496144
$$ -598483 -876889 496471 1168539 -119921 -1411745 -500459 1489752 1636821 140677
219A40677J031452N785583N620025k447744j1388604j1646410l317323M062783
$$ 140677 1172129 6957712 12577737 10129993 -1258611 -12905021 -16222344 -12159561
211a2159561M278423J341818J317547L080418K170056n13530m84939J998358K223432
$$ -12159561 -7881138 -6539320 -5221773 -2141355 28701 -484829 -969768 1028590 3252022
202C252022p29097k436605o20983J649554J680261O93629m8650j275471j792355
$$ 3252022 2522925 86320 -534663 1114891 2795152 3488781 3440131 2164660 372305
193C72305J628955P395126Q205050J536926m695381k890704K875723L564021p71243
$$ 372305 2001260 9396386 17601436 19138362 14442981 11552277 14428000 17992021 17220778
184A7220778k481997K92524J576016q90609j863927J115341K625912j158428n522750
$$ 17220778 14738781 15031305 16607321 15716712 13852785 14968126 17594038 16435610 10912860
175A0912860m961389j448204O21714J865281M000272L888804j093652n923602
$$ 10912860 5951471 4503267 5124981 6990262 10990534 14879338 13785686 7862084
167G862084m218154J253200K591313p03043j895615J114350L062343J168120q27697
$$ 7862084 3643930 4897130 7488443 6785400 4889785 6004135 9066478 10234598 9406901
158I406901l40135J65537o24072j33488J823596J162550k839375m998489k867431
$$ 9406901 9066766 9232303 8608231 8474743 10298339 11460889 8621514 3623025 755594
149G55594q23777j529778r48317K985840M697065Q24252j887352K755800Q476962
$$ 755594 -68183 -1597961 -2546278 439562 5136627 5960879 4073527 6829327 15306289
140A5306289N669672k564373n246440j398843m13372m956357o389995O9436P129772
$$ 15306289 20975961 18411588 13165148 11766305 11352933 6396576 6581 76017 7205789
131G205789P131599K567719o08890k254420m513982n521510l102584n9439Q7558
$$ 7205789 14337388 16905107 16296217 14041797 9527815 4006305 903721 844282 931840
122I31840j128285o04678Q21534J186844J931530M430638N449632J702595l679267
$$ 931840 -196445 -801123 20411 1207255 3138785 7569423 13019055 14721650 11042383
113A1042383m836431j474881J637087J800779J99197j710297k809924j138353
$$ 11042383 6205952 4731071 6368158 8168937 8368134 6657837 3847913 2709560
105B709560K909197M265262j58423m539732j025770P435948R523915J899263n459664
$$ 2709560 5618757 9884019 9725596 5185864 4160094 11596042 21119957 23019220 17559556
96A7559556l715062K812903M559999M73631l125698l499981l668675m955301m407981
$$ 17559556 13844494 16657397 21217396 21691027 18565329 15065348 11396673 6441372 2033391
87B033391n87081L292297L705948R16601k377632l729560j836534K222625M238942
$$ 2033391 1446310 4738607 8444555 9361156 6983524 3253964 1417430 3640055 7878997
78G878997P85533n320621p144141k566370K804299L725769K095080K200088L238186
$$ 7878997 8664530 3343909 -3800232 -6366602 -3562303 163466 2258546 4458634 7696820
69G696820J807828q38996m96577J868263O45383m520415o181784L1607P565516
$$ 7696820 9504648 8665652 8169075 10037338 10682721 6162306 -19478 12129 7577645
60G577645P237421j30283n257518l162173J322105J361743l066620o207843m004642
$$ 7577645 14815066 14684783 9427265 6265092 7587197 8948940 5882320 -325523 -4330165
51d330165J391029M177137J502962k857865k818122J993064N480215L736303N00697
$$ -4330165 -2939136 1238001 2740963 -116902 -2935024 -941960 4538255 8274558 8775255
42H775255N81485J782738r11766n746517o165093j869348J37880k655152l494800
$$ 8775255 9356740 11139478 10227712 4481195 -1683898 -3553246 -3415366 -6070518 -9565318
33i565318K308495Q362611O258579j199640m005998l4643K591928r69150m684546
$$ -9565318 -7256823 1105788 7364367 6164727 2158729 2124086 4716014 3746864 -937682
24i37682j661854M512423N024243n94392l635537O07521N889750M773354k71804
$$ -937682 -2599536 1912887 6937130 6342738 2707201 3314722 9204472 13977826 13706022
15A3706022j576642J328985J872325j673540l209473m8229J559388k673780o469263
$$ 13706022 12129380 13458365 15330690 13657150 10447677 10399448 11958836 9285056 2815793
6B815793k985042K913293K107676l489227m366695J98309
$$ 2815793 -169249 2744044 4851720 1362493 -3004202 -2805893
0b805893
$$ -2805893
$$ Imaginary data points
##PAGE= N=2
##DATA TABLE= (X++(I..I)), XYDATA
65535G569139J413140O294976O222111k105493q916771o662033q88425Q69887
$$ 7569139 8982279 15277255 21499366 19393873 10477102 3815069 2926644 3796531
65527C796531P35536K946703M042463J59728l608959j436444K058543m54383n575553
$$ 3796531 4532067 7478770 11521233 11680961 8072002 6635558 8694101 8239718 2664165
65518B664165m931182j02046M38968l351991l491384J177300L146233J89460r26707
$$ 2664165 -2267017 -2369063 -1930095 -5282086 -8773470 -7596170 -4449937 -4260477 -5187184
65509e187184K834094N498938L181893M26360J094873J870182m28385l011662
$$ -5187184 -2353090 3145848 6327741 6754101 7848974 9719156 9290771 6279109
65501F279109l291134l539082m883181l836734N71122L294883J686998L13424
$$ 6279109 2987975 -551107 -5434288 -9271022 -8699900 -5405017 -3718019 -3404595
65493c404595K291036L161006o74972m572161l472140m56813j49478L6660L815313
$$ -3404595 -1113559 2047447 1372475 -3199686 -6671826 -7128639 -7278117 -7241457 -3426144
65484c426144P008649L879772k093368l374379p02061n01779k873081k428326
$$ -3426144 3582505 7462277 5368909 1994530 1292469 790690 -2082391 -4510717
65476d510717P06953J244696o57163L12736L518491K348287l256855n094922n30975
$$ -4510717 -3803764 -2559068 -3216231 -2903495 614996 2963283 -293572 -5388494 -5919469
65467e919469K474763j194629n081019k160348L699853M848965K089608J672199
$$ -5919469 -3444706 -4639335 -9720354 -11880702 -8180849 -3331884 -1242276 429923
65459D29923M233035M708214J287451k358590l233642k236307j260261p17153
$$ 429923 4662958 9371172 10658623 8300033 5066391 2830084 1569823 852670
65451H52670j1129J506219L355180L042851j203685o167361o026850n26552L810794
$$ 852670 841541 2347760 5702940 8745791 7542106 1374745 -4652105 -5178657 -1367863
65442a367863K874179K22546J5482L32572j815616m032927k822147K0617J245206
$$ -1367863 1506316 1728862 1744344 2076916 261300 -3771627 -6593774 -6573157 -5327951
65433e327951K215227M707455M978696j57826m986508j830404N795208O903619
$$ -5327951 -3112724 1594731 6573427 6415601 1429093 -401311 5393897 12297516
65425A2297516m52526o413063m405874N89270J774838j14059j184313p78240P34581
$$ 12297516 11844990 5431927 1026053 1615323 3390161 3276102 2091789 1313549 2048130
65416B048130M150269P365502N284967k029783p175233n807489l043708m301619
$$ 2048130 6198399 13563901 18848868 16819085 9643852 3836363 792655 -3508964
65408c508964o006663k183127M722407P290327M259299Q88220Q0198j83655j549012
$$ -3508964 -9515627 -11698754 -6976347 313980 4573279 5461499 5541697 5358042 3809030
65399C809030l174593m302728m384189j889276K799218N374739L141263J31347
$$ 3809030 634437 -3668291 -8052480 -9941756 -7142538 -1767799 1373464 1504811
65391A504811J384493M639740M009278j00204j868738J14011J266946o34879k594772
$$ 1504811 2889304 7529044 11538322 11438118 9569380 9683391 10950337 10315458 7720686
65382G720686k698918k662300k903592j420668J003876O66832k344555l361576
$$ 7720686 5021768 2359468 -544124 -1964792 -960916 -294084 -2638639 -6000215
65374f000215q13670J373386Q77010J01002J98046j009437k497444P22145P732884
$$ -6000215 -6813885 -5440499 -4563489 -4462487 -4264441 -5273878 -7771322 -7049177 683707
65365F83707R257103J208009o820642m656438L027573M052392k672943o763117
$$ 683707 9940810 11148819 4328177 -328261 2699312 6751704 4078761 -2684356
65357b684356l194146J444128J170267p18836O62741L098190J943219j570247
$$ -2684356 -5878502 -4434374 -3264107 -3982943 -3320202 -222012 1721207 150960
65349A50960k721335j166298o65579j978989j441411K474590N679312M199215
$$ 150960 -2570375 -3736673 -4402252 -6381241 -7822652 -5348062 331250 4530465
65341D530465M47168n8670K899538L663173n16853m734530l647694L57206J184358
$$ 4530465 4977633 4918963 7818501 11481674 10964821 6230291 2582597 2939803 4124161
65332D124161j269441j733560Q65136J506553j922262m562043k572790P16949
$$ 4124161 2854720 1121160 1986296 3492849 1570587 -2991456 -5564246 -4847297
65324d847297O77962j510426k021942n29630J193658L023924M485675K931203
$$ -4847297 -4169335 -5679761 -7701703 -8231333 -7037675 -4013751 471924 3403127
65316C403127j494127l046564J861571P651599O563492k26817n026286m783659
$$ 3403127 1909000 -1137564 724007 8375606 14939098 14712281 9685995 4902336
65308D902336k916664j828767r68955j335913m340131o378602k212015N610280
$$ 4902336 1985672 156905 -812050 -2147963 -6488094 -12866696 -15078711 -9468431
65300i468431Q352220L639437j110651l21896J971648q934m275702m639506P617
$$ -9468431 -1116211 2523226 1412575 1090679 3062327 3053393 -1222309 -5861815 -5854198
65291e854198M725104M908292N07994m699985o316642l315904N43876J166593
$$ -5854198 -1129094 3779198 4287192 -412793 -6729435 -10045339 -9501463 -8334870
65283h334870o64355j480589j068679j475444j356511K230071O578321N440482
$$ -8334870 -8999225 -10479814 -11548493 -13023937 -14380448 -12150377 -5572056 -131574
65275a31574l74461k585847J663207M816398J223666l614304k425503K082058
$$ -131574 -506035 -3091882 -1428675 3387723 4611389 997085 -1428418 653640
65267F53640K489192j433584m096131l737319k882048j783047R79140L237458
$$ 653640 3142832 1709248 -2386883 -6124202 -9006250 -10789297 -9810157 -6572699
65259f572699K011292Q1601K172029N493375K508405o168009j0166593l647530
$$ -6572699 -4561407 -4479806 -2307777 3185598 5694003 -474006 -10640599 -14288129
65251a4288129N934214P800650J487655m384720l783262J051088M274943L022852
$$ -14288129 -8353915 -553265 934390 -3450330 -7233592 -6182504 -1907561 1115291
65243A115291p18704k662058m09996M025731O150771L796189o77999l256539k454157
$$ 1115291 396587 -2265471 -2675467 1350264 7501035 11297224 10619225 7362686 4908529
65234D908529j83652Q44575l4792j183950j025328k8356L77150P5385k21739j013411
$$ 4908529 4724877 5569452 5534660 4350710 3325382 3297026 3674176 3749561 3527822 2514411
65224B514411k826624l385668k7845M402773L305180l543717p252710j953672
$$ 2514411 -312213 -3697881 -3725726 677047 3982227 438510 -6814200 -8767872
65216h767872N433849M549467k852452n486921K91513N447158K602294l275033
$$ -8767872 -3334023 1215444 -1637008 -7123929 -6832416 -1385258 1217036 -2057997
65208b057997l512324J393066M056166J707021j132779k68459L267506O052235
$$ -2057997 -5570321 -4177255 -121089 1585932 453153 184694 3452200 9504435
65200I504435N949999K485145l112383p379204o826389j922178K819572L601898
$$ 9504435 15454434 17939579 14827196 7447992 621603 -1300575 1518997 5120895
65192E120895Q83689k207463l229924j473428K333841N755146N587737J192905
$$ 5120895 6004584 3797121 567197 -906231 1427610 7182756 12770493 13963398
65184A3963398l923037n924805n239196m735421m172081o48944M798387O273134
$$ 13963398 10040361 4115556 -1123640 -5859061 -10031142 -10680086 -5881699 391435
65176C91435J738218k122546J042676O850526N645799l248806j0322442r233359
$$ 391435 2129653 7107 1049783 7900309 13546108 10297302 -25140 -9258499
65168i258499l743603N15005L395356N614514M187715j598949n377849j844482
$$ -9258499 -13002102 -12487097 -9091741 -3477227 710488 -888461 -6266310 -8110792
65160h110792M246655M420635r62442m034014j867062K35946j568393l841395
$$ -8110792 -3864137 556498 -405944 -4439958 -6307020 -6071074 -7639467 -11480862
65152a1480862k108056K337509M835812L297027n86558l882502m609415k853360
$$ -11480862 -13588918 -11251409 -6415597 -3118570 -3705128 -7587630 -12197045 -15050405
65144a5050405m34616J381550L139013M940907M824185J860595r74929l09826
$$ -15050405 -15485021 -14103471 -10964458 -6023551 -1199366 661229 -313700 -623526
65136f23526K704127M419427M167887L835257L364740J236204j318000j400130
$$ -623526 2080601 6500028 10667915 14503172 17867912 19104116 17786116 16385986
65128A6385986J86925p04083m971765p935257n045830K404499Q006031N653388
$$ 16385986 16572911 15868828 10897063 2961806 -2084024 320475 8326506 13979894
65120A3979894m382939j3450233j1699197N0247R565966Q060807P46796k920582
$$ 13979894 9596955 -3853278 -15552475 -15502228 -5936262 2124545 2871341 -49241
65112d9241l275656n751374p587522j807253P643653Q679713K77528m795097j21552
$$ -49241 -3324897 -9076271 -16663793 -18471046 -10827393 -2147680 -1870152 -6665249 -6786801
65103f786801M892014J795305l336866j894759K441854J462453l127647m073367
$$ -6786801 -1894787 -99482 -3436348 -5331107 -2889253 -1426800 -4554447 -8627814
65095h627814j431381l20793l54550K231955N333517M035225M12268M65269L221694
$$ -8627814 -10059195 -10379988 -10734538 -8502583 -3169066 866159 1278427 1743696 4965390
65086D965390K687396p26816r11182K147012J712709l289477n302818n39889M586708
$$ 4965390 7652786 6925970 6014788 8161800 9874509 6585032 1282214 742325 5329033
65077E329033L590799r68075l137600k190208o58459J301835M416470O533941
$$ 5329033 8919832 7951757 4814157 2623949 1965490 3267325 7683795 14217736
65069A4217736N042763J002803k580352m724064n920089n653124l377630n26819
$$ 14217736 19260499 20263302 17682950 12958886 7038797 1385673 -1991957 -2518776
65061b518776R71768J110500Q00096j97052k093274k784697N89116P238802J1614544
$$ -2518776 -1547008 -436508 363588 166536 -1926738 -4711435 -4122319 3116483 14731027
65052A4731027Q320737j627004j0478015j0951753l686146L804889N504377K266226
$$ 14731027 23051764 21424760 10946745 -5008 -3691154 113735 5618112 7884338
65044G884338j273989k151930j96098L098496M566594J186688n265696q166893
$$ 7884338 6610349 4458419 4262321 7360817 11927411 13114099 7848403 -318490
65036c18490m073578J783384K157006k183369l932216K83233N843292O706647
$$ -318490 -4392068 -2608684 -451678 -2635047 -6567263 -6284030 -440738 6265909
65028F265909J990906m505747q133561o424637j016879L321483L582702J686586
$$ 6265909 8256815 3751068 -4382493 -10807130 -11824009 -8502526 -4919824 -3233238
65020c233238R22875J154490L14263j430253k379278k246344j146156J852095
$$ -3233238 -2310363 -1155873 -841610 -2271863 -4651141 -6897485 -8043641 -6191546
65012f191546N555565N364549j38881m936429l751222o49084k032140m680980
$$ -6191546 -635981 4728568 4589687 -346742 -4097964 -4747048 -6779188 -11460168
65004a1460168n12747Q611876J1972016O467763Q40758Q57881J263428k774130
$$ -11460168 -11972915 -3361039 8610977 15078740 15919498 16777379 18040807 15266677
64996A5266677o275299l323947K530417M165813J440054j020293j953509k992378
$$ 15266677 8991378 5667431 8197848 12363661 13803715 12783422 10829913 7837535
64988G837535l799186l383715l133313l804210k877481Q32584L788978L241028
$$ 7837535 4038349 654634 -2478679 -6282889 -9160370 -8327786 -4538808 -1297780
64980a297780K005359L269657M879011L567602O98090j075028k596029m718457
$$ -1297780 707579 3977236 8856247 12423849 13121939 12046911 9450882 4732425
64972D732425m617264r75176J828837M70392j305617K89533J447334k248965o357933
$$ 4732425 115161 -860015 968822 1439214 133597 423130 1870464 -378501 -6736434
64963f736434m090125J938638M243146L257987M776146P073740K828560o163154
$$ -6736434 -10826559 -8887921 -4644775 -1386788 3389358 10463098 13291658 7128504
64955G128504q577762m71468Q266407Q211283J825737l537442n483661m805267
$$ 7128504 -1449258 -1920726 6345681 14556964 16382701 12845259 7361598 2556331
64947B556331j637390J494649m82071p128546j0208974m554999M087280P022852
$$ 2556331 918941 2413590 1931519 -5197027 -15406001 -19961000 -15873720 -8850868
64939h850868L615287m38233j401953N54658L733581N129495K200018k238728
$$ -8850868 -5235581 -5673814 -7075767 -6521109 -2787528 2341967 4541985 2303257
64931B303257j759703L597938N201498j338689p911605n531425J668730L071349
$$ 2303257 543554 4141492 9342990 8004301 92696 -5438729 -3769999 -698650
64923f98650j769534l364592J937917O475661L413102l682245o792238l545923
$$ -698650 -2468184 -5832776 -3894859 2580802 5993904 2311659 -4480579 -8026502
64915h026502J879430M375039J953729l344398o980378n968813j815302J902740
$$ -8026502 -6147072 -1772033 181696 -3162702 -10143080 -16111893 -17927195 -16024455
64907a6024455L773568M219578K806766o49066l714585l995500l091471l854936
$$ -16024455 -12250887 -8031309 -5224543 -5873609 -9588194 -13583694 -16675165 -20530101
64899b0530101m791446j811957M928738J0480335J1093895O638542j677390j0533136
$$ -20530101 -25321547 -27133504 -22204766 -11724431 -630536 6008006 4330616 -6202520
64891f202520j2667054l246035J0991345J6308474Q208472l282125p190489l738766
$$ -6202520 -18869574 -22115609 -11124264 5184210 13392682 10110557 2920068 -818698
64883h18698N92404K952408L503624J042838l749211n048471P72241P575839O591775
$$ -818698 -226294 2726114 6229738 7272576 3523365 -1525106 -752865 6822974 13414749
64874A3414749j029104o347148n969850m997343o348775n708346J8448O254091
$$ 13414749 12385645 6038497 68647 -4928696 -11277471 -16985817 -16967369 -10713278
64866a0713278P083089L213517m88205j703553j085962Q46190L290288L956972
$$ -10713278 -3630189 -416672 -904877 -2608430 -3694392 -2848202 442086 4399058
64858D399058J933368j00514K46356J029823n57976k617305r91315L577825N584810
$$ 4399058 6332426 6231912 6478268 7508091 6950115 4332810 3341495 6919320 12504130
64849A2504130K473949k221405m620270n103646n080006l216819J461362N465910
$$ 12504130 14978079 12756674 8136404 3032758 -2047248 -5264067 -3802705 1663205
64841A663205M296181r95985m809276m423642k419279j143729P87456M290543
$$ 1663205 5959386 4963401 154125 -4269517 -6688796 -7832525 -7045069 -2754526
64833b754526O040719K676277l475059o860064n780978l284977j723697m37708
$$ -2754526 3286193 5962470 2487411 -4372653 -10153631 -13438608 -15162305 -15600013
64825a5600013J231391K742422M567480P348420Q241688L286686m833990p256822
$$ -15600013 -14368622 -11626200 -7058720 289700 8531388 11818074 6984084 -272738
64817b72738q26067N961893M249558k602242m626723j30127L278728J342706j763819
$$ -272738 -1098805 4863088 9112646 6510404 1883681 1753554 5032282 6374988 4611169
64808D611169k019543j285742j874214k137293p07616O00341J200007L297152
$$ 4611169 2591626 1305884 -568330 -2705623 -3413239 -2812898 -1612891 1684261
64800A684261N770118K879453o138855j2213663p498749L244648Q957856O347674
$$ 1684261 7454379 10333832 4194977 -8018686 -15517435 -12272787 -3314931 3032743
64792C032743Q46728l236743n782089n959856k315411K449662L809115K583742
$$ 3032743 3879471 642728 -5139361 -11099217 -13414628 -10964966 -7155851 -4572109
64784d572109L176387M918377K729948k945569n054391j014883K983604K200703
$$ -4572109 -1395722 3522655 6252603 3307034 -1747357 -2762240 221364 2422067
64776B422067L08150J310081J494870l776313j0243273r466377j147324O144390
$$ 2422067 2730217 4040298 5535168 1758855 -8484418 -17950795 -19098119 -12953729
64768a2953729O053147Q06003l538971l657600j96265L963701N674019L926006
$$ -12953729 -6900582 -6094579 -9633550 -13291150 -13487415 -9523714 -3849695 76311
64760G6311Q00471j161396j862689k548635l056273k204011j07775J823941K744169
$$ 76311 876782 -284614 -2147303 -4695938 -7752211 -9956222 -10063997 -8240056 -5495887
64751e495887K871775K800006L263839M598270N615823M261434J31642m778581
$$ -5495887 -2624112 175894 3439733 8038003 13653826 17915260 18046902 13268321
64743A3268321p917004p424102k732347L238455M214553k083068p830156l382475
$$ 13268321 5351317 -2072785 -4805132 -1566677 2647876 564808 -7265348 -10647823
64735a0647823P970172J2250075M389918m193091l099251J939908L90400n173017
$$ -10647823 -2677651 9572424 13962342 9769251 6670000 8609908 9000308 3827291
64727C827291m478886K545689O405643M089768J634136J316241r47060m532414
$$ 3827291 -651595 1894094 8299737 12389505 14023641 15339882 14392822 9860408
64719I860408l246051J930463J881468m689122o905454N02593P207780L707530
$$ 9860408 6614357 8544820 10426288 5737166 -1168288 -665695 6542085 10249615
64711A0249615l080834j706220M751494M371133l805786q809728n196879L48215
$$ 10249615 7168781 5462561 10214055 14585188 10779402 1969674 -3227205 -2878990
64703b878990J095424q45641q63536j5156k728684r561483j4789287j0860328
$$ -2878990 -1783566 -2629207 -3492743 -3507899 -6236583 -15798066 -30587353 -41447681
64695d1447681L390642J8063816J9821693P293846n855214p600996j569245J942290
$$ -41447681 -38057039 -19993223 -171530 7122316 1267102 -6333894 -7903139 -5960849
$$ [...]
##END NTUPLES=NMR SPECTRUM
##END=
