##TITLE=31Pdec_LR-684B-C1
 CDCl3, 24 sc
 30.7.2019
##JCAMPDX= 6.0         $$ Bruker NMR JCAMP-DX V2.0
##DATA TYPE= NMR SPECTRUM
##DATA CLASS= NTUPLES
##ORIGIN= UXNMR, Bruker Analytische Messtechnik GmbH
##OWNER= root
$$ XWIN-NMR		Version 3.5
$$ Tue Jul 30 15:11:23 2019 Russian Standard Time (UT+4h)  she@DPX200
##.OBSERVE FREQUENCY= 81.013821
##.OBSERVE NUCLEUS= ^31P
##.ACQUISITION MODE= SIMULTANEOUS
##.ACQUISITION SCHEME= undefined
##.AVERAGES= 24
##.DIGITISER RES= 17
##SPECTROMETER/DATA SYSTEM= spect
##.PULSE SEQUENCE= zgpg30
##.SOLVENT NAME= CDCl3
##.SHIFT REFERENCE= (INTERNAL, CDCl3, 0, 182.463)
##AUDIT TRAIL= $$ (NUMBER, WHEN, WHO, WHERE, WHAT)
$$ ##TITLE= Audit trail, XWIN-NMR		Version 3.5
$$ ##JCAMPDX= 5.01
$$ ##ORIGIN= Bruker BioSpin GmbH
$$ ##OWNER= she
$$ F:/spectra/data/she/nmr/P31/1/pdata/1/auditp.txt
$$ ##AUDIT TRAIL=  $$ (NUMBER, WHEN, WHO, WHERE, WHAT)
(   1,<2019-07-30 15:10:36.68 +0400>,<she>,<DPX200>,
      <created by zg, POWCHK disabled, PULCHK disabled
       configuration hash MD5:
       00 E9 B6 7A A2 85 ED C7 34 08 36 98 17 FE 4E 26
       data hash MD5: 32K
       5A 93 88 56 DD F2 BE F5 02 F7 95 F1 52 4E C4 E4>)
(   2,<2019-07-30 15:10:39.59 +0400>,<she>,<DPX200>,
      <Start of raw data processing
       efp BC_mod = 2 LB = 1 FT_mod = 6 PKNL = 1 PHC0 = -394.535 PHC1 = 101.2 SI = 64K 
       data hash MD5: 64K
       D8 C4 D5 5F AA 95 C8 9F D4 27 E2 30 4A 07 89 1E>)
(   3,<2019-07-30 15:10:52.20 +0400>,<she>,<DPX200>,
      <pk PHC0 = 5.303764 PHC1 = 0 
       data hash MD5: 64K
       A4 A1 15 60 DC A8 58 0C 57 3A F9 5D FA E6 A4 57>)
(   4,<2019-07-30 15:10:55.85 +0400>,<she>,<DPX200>,
      <abs ABSG = 5 
       data hash MD5: 64K
       CA 4E CC 19 E6 A0 57 E4 5E B1 2E 70 E3 C9 FF 73>)
$$ ##END=
$$ 
$$ hash MD5
$$ 5B 8C 71 32 D3 FB F2 74 E2 77 B4 18 4A 6A 8D 34
##$RELAX= 
##$RELAX= 
##$RELAX= 
##$RELAX= 
##$RELAX= 
##$RELAX= 
##$RELAX= 
##$RELAX= 
$$ Bruker specific parameters
$$ --------------------------
##$DU= <F:/spectra>
##$EXPNO= 1
##$NAME= <P31>
##$PROCNO= 1
##$TYPE= <nmr>
##$USER= <she>
##$AMP= (0..31)
100 100 100 100 100 100 100 100 100 100 100 100 100 100 100 100 100 100 
100 100 100 100 100 100 100 100 100 100 100 100 100 100 
##$AQSEQ= 0
##$AQ_mod= 1
##$AUNM= <au_zg>
##$AUTOPOS= <>
##$BF1= 81.014009
##$BF2= 200.13
##$BF3= 200.13
##$BF4= 200.13
##$BF5= 200.13
##$BF6= 200.13
##$BF7= 200.13
##$BF8= 200.13
##$BYTORDA= 1
##$CFDGTYP= 0
##$CFRGTYP= 5
##$CHEMSTR= <none>
##$CNST= (0..31)
1 1 145 1 1 1 1 1 1 1 1 1 1 1 1 1 1 1 1 1 1 1 1 1 1 1 1 1 1 1 1 1 
##$CPDPRG= <waltz16>
##$CPDPRG1= <>
##$CPDPRG2= <waltz16>
##$CPDPRG3= <>
##$CPDPRG4= <mlev>
##$CPDPRG5= <mlev>
##$CPDPRG6= <mlev>
##$CPDPRG7= <mlev>
##$CPDPRG8= <mlev>
##$CPDPRGB= <>
##$CPDPRGT= <>
##$D= (0..31)
0 1 0 0 0 0 0 0 0 0 0 0.03 2e-05 3e-06 0 0 0 0 0 0 0 0 0 0 0 0 0 0 0 0 
0 0 
##$DATE= 1564485036
##$DBL= (0..7)
120 120 120 11 120 120 24 19 
##$DBP= (0..7)
150 150 150 150 150 150 150 150 
##$DBP07= 0
##$DBPNAM0= <>
##$DBPNAM1= <>
##$DBPNAM2= <>
$$ [...]
##$SUBNAM3= <"">
##$SUBNAM4= <"">
##$SUBNAM5= <"">
##$SUBNAM6= <"">
##$SUBNAM7= <"">
##$SUBNAM8= <"">
##$SUBNAM9= <"">
##$SW= 369.568048894756
##$SWIBOX= (0..15)
0 1 3 0 0 0 0 0 0 0 0 0 0 0 0 0 
##$SW_h= 29940.119760479
##$TD= 32768
##$TD0= 1
##$TE= 0
##$TE2= 300
##$TE3= 300
##$TEG= 300
##$TL= (0..7)
0 120 53 12 22 120 120 120 
##$TP= (0..7)
150 150 150 150 150 150 150 150 
##$TP07= 0
##$TPNAME0= <>
##$TPNAME1= <>
##$TPNAME2= <>
##$TPNAME3= <>
##$TPNAME4= <>
##$TPNAME5= <>
##$TPNAME6= <>
##$TPNAME7= <>
##$TPOAL= (0..7)
0.5 0.5 0.5 0.5 0.5 0.5 0.5 0.5 
##$TPOFFS= (0..7)
0 0 0 0 0 0 0 0 
##$TUNHIN= 0
##$TUNHOUT= 0
##$TUNXOUT= 0
##$USERA1= <user>
##$USERA2= <user>
##$USERA3= <user>
##$USERA4= <user>
##$USERA5= <user>
##$V9= 5
##$VALIST= <valist>
##$VCLIST= <CCCCCCCCCCCCCCC>
##$VD= 0
##$VDLIST= <DDDDDDDDDDDDDDD>
##$VPLIST= <PPPPPPPPPPPPPPP>
##$VTLIST= <TTTTTTTTTTTTTTT>
##$WBST= 1024
##$WBSW= 4
##$XGAIN= (0..3)
0 0 0 0 
##$XL= 0
##$YL= 0
##$YMAX_a= 8614
##$YMIN_a= -10551
##$ZGOPTNS= <>
##$ZL1= 120
##$ZL2= 120
##$ZL3= 120
##$ZL4= 120
##$ABSF1= 182.463
##$ABSF2= -187.1042
##$ABSG= 5
##$ABSL= 3
##$ALPHA= 0
##$AQORDER= 0
##$ASSFAC= 0
##$ASSFACI= 0
##$ASSFACX= 0
##$ASSWID= 0
##$AUNMP= <proc_1d>
##$AZFE= 0.1
##$AZFW= 0.5
##$BCFW= 0
##$BC_mod= 2
##$BYTORDP= 0
##$COROFFS= 0
##$CY= -3
##$DATMOD= 1
##$DC= 0
##$DFILT= <>
##$DTYPP= 0
##$F1P= 0
##$F2P= 0
##$FCOR= 1
##$FTSIZE= 65536
##$FT_mod= 6
##$GAMMA= 0
##$GB= 0
##$INTBC= 1
##$INTSCL= 5.30512e-09
##$ISEN= 30
##$LB= 1
##$LEV0= 0
##$LPBIN= 0
##$MAXI= 10000
##$MC2= 0
##$MEAN= 0
##$ME_mod= 0
##$MI= 50
##$NCOEF= 0
##$NC_proc= -8
##$NLEV= 6
##$NOISF1= 182.463
##$NOISF2= 159.3651
##$NSP= 0
##$NTH_PI= 0
##$NZP= 0
##$OFFSET= 182.463
##$PC= 4
##$PHC0= -389.2312
##$PHC1= 101.2
##$PH_mod= 1
##$PKNL= yes
##$PPARMOD= 0
##$PSCAL= 0
##$PSIGN= 0
##$REVERSE= no
##$SF= 81.0140089999434
##$SI= 65536
##$SIGF1= 159.3651
##$SIGF2= -187.1042
##$SINO= 113.3802
##$SIOLD= 16384
##$SREGLST= <1H.CDCl3>
##$SSB= 0
##$STSI= 65536
##$STSR= 0
##$SW_p= 29940.119760479
##$SYMM= 0
##$S_DEV= 0
##$TDeff= 32768
##$TDoff= 0
##$TI= <>
##$TILT= no
##$TM1= 0
##$TM2= 0
##$TOPLEV= 0
##$USERP1= <user>
##$USERP2= <user>
##$USERP3= <user>
##$USERP4= <user>
##$USERP5= <user>
##$WDW= 1
##$XDIM= 65536
##$YMAX_p= 419511699
##$YMIN_p= -41652443
$$ End of Bruker specific parameters
$$ ---------------------------------
##NTUPLES= NMR SPECTRUM
##VAR_NAME=  FREQUENCY,     SPECTRUM/REAL,   SPECTRUM/IMAG
##SYMBOL=    X,             R,               I
##VAR_TYPE=  INDEPENDENT,   DEPENDENT,       DEPENDENT
##VAR_FORM=  AFFN,          ASDF,            ASDF
##VAR_DIM=   65536,         65536,           65536
##UNITS=     HZ,            ARBITRARY UNITS, ARBITRARY UNITS
##FACTOR=    0.456856943014862, 1,           1
##FIRST=     14782.0589164792, 0,            0
##LAST=      -15158.0608439998, 0,           0
##MIN=       -15158.0608439998, -41652443,   0
##MAX=       14782.0589164792, 419511699,    0
$$ Real data points
##PAGE= N=1
##DATA TABLE= (X++(R..R)), XYDATA
$$ [...]
45447A3674142M099767q82574l977301p036582j0335691r035324j685352M719406
45439a0459509M560246J995654K570170L059478j650706p282814n958093N30373
45431a2635201L640183J869263J226895L219542K900997q39423k929788j327874
45423d875406K86354M25967J900971M487538M020749P44912J9720K312922J357873
45414A0681600m355089p281241k895307K343352J404962k199854j258342K834967
45406g24952L095631r91627k858737M96762M447768M269851J285788m04925L06361
45397H921920J262317O20968j304921l311924m848731n567518m330698o30838
45389i189425K965645K628330j163911k999144J27122M155122M029053R79243
$$ plain form
45447 13674142 17773909 16891335 12914034 5877452 -4458239 -13493563 -15178915 -10459509
45439 -10459509 -5899263 -3903609 -1333439 1726039 75333 -7207481 -13165574 -12635201
45431 -12635201 -8995018 -7125755 -5898860 -2679318 221679 -617744 -3547532 -4875406
45423 -4875406 -4589052 -4163085 -2262114 2225424 6246173 6991085 7010805 9323727 10681600
45414 10681600 6326511 -954730 -3850037 -1506685 -101723 -2301577 -3559919 -724952
45406 -724952 2370679 1379052 -1479685 -982923 3464845 7734696 9020484 8615559 8921920
45397 8921920 10184237 10805205 9500284 6188360 1339629 -4227889 -8558587 -9189425
45389 -9189425 -6223780 -3595450 -4759361 -7758505 -7631383 -3476261 552792 1532035
45381A532035p35765q75493j207002K74378N588413R352537M038261p326044j2563029
45372a921709o187214M043239Q566501O414676J584429l329013o139812m387026
45364a355929L25586K766273J742163J418375K738943J040974m412935o751644
45356b488194k280880K992638L517543K887982N077337M895571l049999j1877843
45348c25845j0201240P43582Q694086P822224L979567K132111p29070o782726
45340E332689j0478999o413128J209662L271914j932501o128210j604751Q569648
45332h173676J3386912O999715l642616o966453j008124N101955L952959j552007
45324H098665m630472m035666k884372k407568j794432j381701j428491N4488
$$ plain form
45381 1532035 796270 -79223 -1286225 -1011847 4576566 13929103 17967364 10641320 -1921709
45372 -1921709 -8108923 -4065684 4500817 10915493 12499922 9170909 3031097 -1355929
45364 -1355929 -1030343 1735930 3478093 4896468 7635411 8676385 4263450 -2488194
45356 -2488194 -4769074 -1776436 1741107 4629089 9706426 14601997 11551998 -325845
45348 -325845 -10527085 -9783503 -1089417 6732807 10712374 12844485 12115415 5332689
45340 5332689 -5146310 -11559438 -10349776 -7077862 -9010363 -15138573 -16743324 -8173676
45332 -8173676 5213236 12212951 8570335 1603882 595758 5697713 9650672 8098665
45324 8098665 3468193 -567473 -3451845 -5859413 -7653845 -9035546 -10464037 -10409549
45316a0409549M163920P852115P609130M500352K144760J597705J237189k64003
45308A8431619l152675o208310n719708Q55832Q464516P766796j788795q978036
45300I671239n812105J438941K693600j421559l761335l091036k378587L10548
45292b350294P816038J3818133Q786838m624332j3193918j0647200l488378J240033
45284b643080L696672N128140M022961J179504N1380k97792m261109r944967r634645
45275a2702936k542031K583579J147929p38279J928541M407476J689123k128896
45267f355494j412386J312357J002348p29434l1806R00511j744305m846539k635167
45258a4539915L311442O241698M460635K086391J081166l75963k306787k347538
$$ plain form
45316 -10409549 -6245629 1606486 9215616 13715968 15860728 17458433 18695622 18431619
45308 18431619 15278944 9070634 3350926 4206758 12671274 20438070 18649275 9671239
45300 9671239 3859134 5298075 7991675 6570116 2808781 -282255 -2660842 -2350294
45292 -2350294 5465744 19283877 28070715 23446383 10252465 -394735 -3883113 -2643080
45284 -2643080 1053592 6181732 10204693 11384197 11435577 11137785 6876676 -3068291 -12702936
45275 -12702936 -15244967 -12661388 -11513459 -12251738 -10323197 -5915721 -4226598 -6355494
45267 -6355494 -7767880 -6455523 -5453175 -6182609 -6214415 -5313904 -7058209 -11904748 -14539915
45258 -14539915 -11228473 -4986775 -526140 1560251 2641417 2265454 -41333 -2388871
45250b388871o57267L15772P00638K229718K841403j282036p531822p513800J239968
45241a2046297R748227Q244704j048846o834368l172957L980254N741868J590108
45233F202693j756666n66242J715612J077265j080461j410129k91943o7677l88511
45224C433941K81371Q91186K59914P81928M126132N965773J994044l281515k452370
45215A2000404J801111J96379o868598q781461k591624J897149k99764o54057
45207c300461N862882Q783711p03940j2008537r560547L016963R294954N389853
45199F774878J991347L335585J616228o020813j0869772p454406j739542L61410
45191a2005085J133706K882220K698725P10904K774173Q865630R340606k3347
$$ plain form
45250 -2388871 -3046138 -2730366 -2029728 199990 3041393 1759357 -5772465 -13286265 -12046297
45241 -12046297 -2298070 5946634 4897788 -1936580 -5109537 -1129283 4612585 6202693
45233 6202693 4446027 3879785 5595397 6672662 5592201 4182072 3890129 3822452 3433941
45224 3433941 3715312 4606498 4866412 5648340 9774472 15740245 17734289 14452774 12000404
45215 12000404 13801515 13997894 7129296 -1652165 -4243789 -2346640 -2646404 -3300461
45207 -3300461 2562421 11346132 10642192 -1366345 -10926892 -7909929 1385025 6774878
45199 6774878 8766225 12101810 13718038 7697225 -3172547 -10626953 -12366495 -12005085
45191 -12005085 -10871379 -7989159 -5290434 -4579530 -1805357 7060273 16400879 16377532
45183A6377532r229346q607144k848142j089466j793225J093112M159666N8563
45175a878450p335262p131595N95847M288897p19360n648925l013017L132031
45167a7709834O153975O486258O651100M664808r74631n756678n279257k485158
45159h249417k731310n367562o036563m049568j647462J083676M499010N393589
45151a7105607J443261k595883o73102L986468K726556l995445n542891K552591
45143a9204052J0366063P267827l357127r811107p174045K59684P299377J1078771
45135c274609R092223J982135l356518j049074M431892L820208k837808o156720
45127B651729j970410L155833L165809L41093j780132m585233q048284o260488
$$ plain form
45183 16377532 7148186 -1458958 -4307100 -5396566 -7189791 -6096679 -1937013 -1878450
45175 -1878450 -9213712 -16345307 -15749460 -11460563 -12179923 -17828848 -20841865 -17709834
45167 -17709834 -11555859 -5069601 1581499 6246307 5271676 -485002 -5764259 -8249417
45159 -8249417 -10980727 -16348289 -22384852 -26434420 -28081882 -26998206 -22499196 -17105607
45151 -17105607 -15662346 -18258229 -18931331 -14944863 -12218307 -16213752 -21756643 -19204052
45143 -19204052 -8837989 -1570162 -4927289 -14738396 -21912441 -21652757 -14353380 -3274609
45135 -3274609 5817614 7799749 4443231 3394157 7826049 11646257 8808449 2651729
45127 2651729 681319 3837152 7002961 7344054 5563922 978689 -7069595 -13330083
45119a3330083L234699J1837505J0148113J672709k445426K59162J771712k318388
45111A0830003o082990l262398K889578M253967j108572o657614n533247J263952
45103c407321N904076K983072l785481o435114l054759J225744L267956N316245
45095B014418P481245M749326l615653r174112n929238l07948q75605m022676
45087i680243p94871O306583O295995j797685o697857k739629K507710K090817
45079d509180k23390J048331L742315L781610K304466J287073q37724l903882
45071B689619l469686J187012L851085J622479M02945L596798L914524m598841
45063I195935j3847742j2018495j640449M198360J026062k811798m78953N027675
$$ plain form
45119 -13330083 -10095384 1742121 11890234 13562943 11117517 11376679 13148391 10830003
45111 10830003 4747013 1484615 4374193 8628160 7519588 861974 -4671273 -3407321
45103 -3407321 2496755 5479827 1694346 -4740768 -7795527 -6569783 -3301827 2014418
45095 2014418 9495663 14244989 10629336 1455224 -4474014 -4781962 -5657567 -9680243
45087 -9680243 -10475114 -4168531 2127464 329779 -6368078 -9107707 -6599997 -4509180
45079 -4509180 -4732570 -3684239 58076 3839686 6144152 7431225 6593501 2689619
45071 2689619 -780067 406945 4258030 5880509 6283454 9880252 13794776 9195935
45063 9195935 -4651807 -16670302 -18310751 -14112391 -13086329 -15898127 -16377080 -11349405
45055a1349405P885071O474472K158940k291634k727566J684508M553218N2401
45047F440005o619480n210725L477288P536649J837937m512180l112164J025426
45039H62756r29854o548726n983206K369946Q970052O265557j807945n700759
45031b502179j840209M421912O210125K989809j74401j06521P79122m90141k172174
45022G115343j155368J016894N14382j750787j316784J635780J488931l861190
45014C687201q863428p748839j734708L793554N709768M616339L090334L875286
45006F425507O606188O175485r38135q822870p485218K597611R303380N428551
44998A9290499k095651m557634m017016n750219o553361j438306M026641Q23954
$$ plain form
45055 -11349405 -3464334 3010138 5169078 2877444 149878 1834386 6387604 6440005
45047 6440005 -179475 -5390200 -1912912 5623737 7461674 2949494 -162670 862756
45039 862756 -67098 -6615824 -12599030 -10229084 -1259032 5006525 3198580 -2502179
45031 -2502179 -4342388 79524 6289649 9279458 9105057 8998536 9777658 9287517 7115343
45022 7115343 5959975 6976869 7491251 5740464 4423680 6059460 7548391 3687201
45014 3687201 -5176227 -12925066 -14659774 -10866220 -5156452 -540113 2550221 6425507
45006 6425507 13031695 19207180 18269045 9446175 1960957 4558568 13861948 19290499
44998 19290499 17194848 12637214 8620198 2869979 -3683382 -5121688 -1095047 -271093
44990b71093p168784p393539J281534O478505K619752o36830L975825Q289677
44982G175047K871216n942025n536807K535994M943823k554258r431584p330483
44974a3269077j518585p30189m136277m933893j315186L057090O289163R196703
44966g360251J0363035O807880J90987l354790j594032L78493j877075m868736
44958a314489k562996L526761N628519J046381l713637k404457K339725L803282
44950F349089J024392j363407j266276j224342k207123j133196L133651N954891
44942I267679K678280m639167r730975r306964m625816J859708P443797Q444769
44934A391311L467239k867860m243847j148880p8597l132777m292329P54013O756888
$$ plain form
44990 -271093 -7439877 -14833416 -13551882 -7073377 -4453625 -5090455 -1114630 7175047
44982 7175047 10046263 4104238 -1432569 1103425 6047248 3492990 -5938594 -13269077
44974 -13269077 -14787662 -15517851 -19654128 -24588021 -25903207 -22846117 -16556954 -7360251
44966 -7360251 3002784 9810664 10001651 6646861 5052829 5431322 3554247 -1314489
44958 -1314489 -3877485 -350724 5277795 6324176 2610539 206082 2545807 6349089
44950 6349089 7373481 6010074 4743798 3519456 1312333 179137 3312788 9267679
44942 9267679 11945959 7306792 -2424183 -11731147 -16356963 -14497255 -7053458 1391311
44934 1391311 4858550 1990690 -2253157 -3402037 -3480634 -6613411 -10905740 -10151727 -3394839
44925c394839O335716J043655j896278j331802k503703o043063n617879Q70687
44917a2537506O075940M173761N2360Q36445L931390K110207l167028l668777
44909b193208J198486K556203l062113p105111k619906M036213L021457l312386
44901g480365m087965L258748R475867P597171K069447M39734K327758J806261
44893A5406656k699037o228622m423405R62129M520249L189900j170313m364838
44885E192719m102142j543695P44413J378481N48215q84032j756935j063173R26453
44876e59696K805311L964372M855502M470187K73280o893429j0587283n750546
44868g422302L398127P396259L495945j442152j186762J844706J708978j932676
$$ plain form
44925 -3394839 2940877 3984532 2088254 756452 -1747251 -7790314 -13408193 -12537506
44917 -12537506 -6461566 -2287805 -2235445 -1399000 2532390 4642597 1475569 -2193208
44909 -2193208 -994722 1561481 -1500632 -8605743 -11225649 -7189436 -4167979 -7480365
44901 -7480365 -11568330 -8309582 1166285 8763456 10832903 11272637 13600395 15406656
44893 15406656 12707619 6478997 2055592 3017721 7537970 10727870 9557557 5192719
44885 5192719 1090577 -453118 291295 1669776 2217991 1333959 -422976 -1486149 -559696
44876 -559696 2245615 6209987 11065489 15535676 15808956 8915527 -1671756 -7422302
44868 -7422302 -4024175 3372084 6868029 5425877 4239115 6083821 7792799 5860123
44860E860123l908190q99025M717387P733338M808642k742083r393094r978056
44852c800958n093835l34520P37559K28124J160652K629598K544908J994815K934392
44843C000735L901610K407583j34606n27472M22852o48152l031552k453316J196349
44834D134031K472888j259458n301418m476600j21120L308992M702002N062342
44826H521659L097592k493297p899906p176239q10487L591724R51714m654619
44818f871859n457716L72235P278284R346951O269558K219612N21550M09222j102739
44809A2985098m714903p166834m948469P82626M629058K937470j856943l980695
44801a333592q57457M109966N177362J99561o759316q640221k313966P120340
$$ plain form
44860 5860123 1951933 1052908 5770295 13503633 18312275 15570192 6177098 -3800958
44852 -3800958 -8894793 -9229313 -8491754 -8263630 -7102978 -4473380 -1928472 66343 3000735
44843 3000735 6902345 9309928 9175322 8647850 9070702 8422550 5390998 2937682 4134031
44834 4134031 6606919 5347461 46043 -4430557 -4551677 -1242685 3459317 8521659
44826 8521659 11619251 9125954 1226048 -5950191 -6760678 -3168954 -2217240 -6871859
44818 -6871859 -12329575 -11957340 -4679056 4667895 10937453 13157065 13678615 14087837 12985098
44809 12985098 8270195 1103361 -3845108 -3062482 1566576 4504046 2647103 -1333592
44801 -1333592 -2191049 1918917 7096279 7295840 536524 -8103697 -10417663 -3297323
44793c297323J0627188N374873j301862j012748M259684M866866k218539q431588
44785H866551o370113j116363j897089o852372n817595K590330P420770K014353
44777a161528n619687n223110P98878L055173J8749k252528j786083k022717k659629
44768a6852482P89591P300115R455467M728413n55052j605508j650110m025946
44760b415512n423280k525899J062781R12378l69078J888109N597397N102164
44752C829060N07800k860497k660901j169977N8173J588042K929540K811584J890331
44743F923155J258732o7804k295338k331142R97324K611580j559522o183104l289296
44734c935415M761037Q049348L935743n11828j319126k492640n754352n741416
$$ plain form
44793 -3297323 7329865 12704738 11402876 10390128 14649812 19516678 17298139 8866551
44785 8866551 2496438 1380075 -517014 -7369386 -13186981 -10596651 -3175881 -1161528
44777 -1161528 -6781215 -12004325 -11205447 -8150274 -8131525 -10384053 -12170136 -14192853 -16852482
44768 -16852482 -16062891 -8762776 692691 5421104 4866052 3260544 1610434 -2415512
44760 -2415512 -7838792 -10364691 -9301910 -8389532 -8758610 -6870501 -1273104 3829060
44752 3829060 4336860 1476363 -1184538 -2354515 -2296342 -708300 2221240 5032824 6923155
44743 6923155 8181887 8114083 5818745 3487603 4484927 7096507 5536985 -646119 -3935415
44734 -3935415 825622 8874970 12810713 12298885 10979759 8487119 2732767 -3008649
44726c008649j05813M620191L122838l29245J22455K382493J750342r4297R16582
44717I376897K753801N88303m397696o664515m753437j818338M43290K617709
44709a853986L954835L127537J081832j015437l976617o695542m434949L402906
44701f409421Q721762N305491q38009q40088J765557l003389j2664151j3348647
44693b1310895j486335R314311Q082065J009734j073811Q69829k27558l363952
44685h186612j969069L718056O984511N491517L139524K005596K20799k122273
44677I282049k029373M53519J307293r80364k879136j435728J454390K065932
44669G238582o74618m788139p107102n390582r48143J376394j088997l923807
$$ plain form
44726 -3008649 -3114462 1505729 4628567 4299322 4421777 6804270 8554612 8460315 9376897
44717 9376897 12130698 12719001 8321305 1656790 -3096647 -4914985 -4471695 -1853986
44709 -1853986 2100849 5228386 6310218 5294781 1318164 -5377378 -9812327 -6409421
44701 -6409421 2312341 7617832 6779823 5939735 7705292 4701903 -7962248 -21310895
44693 -21310895 -22797230 -13482919 -5400854 -4391120 -5464931 -4595102 -4822660 -8186612
44685 -8186612 -10155681 -6437625 546886 6038403 9177927 11183523 11404322 9282049
44677 9282049 7252676 7706195 9013488 8033124 5153988 3718260 5172650 7238582
44669 7238582 6563964 1775825 -5331277 -10721859 -11670002 -10293608 -11382605 -15306412
44661a5306412o88545P058762J0158047M249544l336887l207991L163618N715321
44653G805457j65610p779979q806107l909681J0430J4487n72980P99307K180479
44644a0424197J932167K120109L830209L625365n05112l504253r8983N373617
44636B348922M227232k377824m262412J068409L348562l516505r787691m417149
44628a3368456O586065Q307870o75076o975823k978510L861840N049379L005058
44620B812347L360816M314447J191991m226254o523850n350437m540878m655099
44612a3616917k707527J392317L696722K093614p94621j556386O7475K098907
44604i326416L108626L187739L216464L610697L515487J703922j550148m560318
$$ plain form
44661 -15306412 -15994957 -8936195 1221852 5471396 2134509 -1073482 2090136 7805457
44653 7805457 7639847 -140132 -8946239 -12855920 -12845490 -12831003 -13403983 -12604676 -10424197
44644 -10424197 -8492030 -6371921 -2541712 1083653 578541 -2925712 -3024695 2348922
44636 2348922 6576154 4198330 -64082 1004327 4352889 836384 -8951307 -13368456
44628 -13368456 -6782391 1525479 850403 -6125420 -9103930 -5242090 -192711 2812347
44620 2812347 6173163 10487610 11679601 7453347 929497 -4420940 -8961818 -13616917
44612 -13616917 -16324444 -14932127 -11235405 -9141791 -9936412 -11492798 -11425323 -9326416
44604 -9326416 -6217790 -3030051 186413 3797110 7312597 9016519 7466371 2906053
44596B906053o336987p024334o148470k866740J431026L669307L373379L215713
44588g781053L814216K078636k456027m155454Q77336O849863M742457m461100
44580d91126r862630m897684M618918R034992O267945J189818k355226m250592
44572g45585m677088k635417J495657M679982L932110k86950l980912l342193
44564e560396R59658L835867J408322m007701o559400m080404J87431L180116
44556a0636507N451746P539586P075829K892000j231301j332768L53898j231610
44548H880873n526366p036401m470958k767704m214449m146193N33628M535605
44540a4211965K093097k750176j716515M135413N596184M38069k384562K665216
$$ plain form
44596 2906053 -3430934 -10455268 -16603738 -19470478 -18039452 -14370145 -10996766 -7781053
44588 -7781053 -3966837 -1888201 -4344228 -8499682 -7622346 -772483 3969974 -491126
44580 -491126 -10353756 -15251440 -10632522 -1597530 4670415 5860233 3505007 -745585
44572 -745585 -5422673 -8058090 -6562433 -1882451 2049659 1762709 -2218203 -5560396
44564 -5560396 -4600738 -764871 643451 -3364250 -9923650 -14004054 -13816623 -10636507
44556 -10636507 -5184761 2354825 9430654 12322654 11091353 9758585 10112483 8880873
44548 8880873 3354507 -3681894 -8152852 -10920556 -15135005 -19281198 -18747570 -14211965
44540 -14211965 -12118868 -14869044 -16585559 -12450146 -6853962 -6415893 -8800455 -6135239
44532f135239P895040M043970m974006p880594k633178K476170K780345K130018
44524b297474K851520J087875l872948m911917J602034P162878K519943p113076
44516b971165q287906J092143Q884659O727605R72377R48892M457186K674607
44508A4498398m900875r152925m772030K268682L244608j982509n842222l208308
44500i847181K769135N117884J408306l415000k705193L658303Q105651M086034
44492I177939n046800r177826m110079K972409L558246n66911j182024L123404
44484a251642N140887J354524k048215K71045L336297M1376o164228n752740J864310
44475c208386P230444N003894N2252k534390m336065o545179m800603K532044
$$ plain form
44532 -6135239 1759801 5803771 829765 -7050829 -9684007 -7207837 -4427492 -2297474
44524 -2297474 554046 1641921 -2231027 -7142944 -5540910 1621968 4141911 -2971165
44516 -2971165 -11259071 -10166928 -1282269 5445336 6417713 7366605 11823791 14498398
44508 14498398 9597523 444598 -4327432 -2058750 1185858 -796651 -6638873 -9847181
44500 -9847181 -7078046 -1960162 -551856 -3966856 -6672049 -3013746 5091905 9177939
44492 9177939 4131139 -5046687 -9156766 -6184357 -2626111 -3193022 -4375046 -1251642
44484 -1251642 3889245 5243769 3195554 3466599 6802896 6844272 680044 -5072696 -3208386
44475 -3208386 4022058 9025952 9078204 6543814 2207749 -4337430 -9138033 -6605989
44467f605989P963735M537238l116564n335801j269470K015624J405572p966r41066
44458a354687l124918m641261j012539N821689Q105667L994746N40215K042233
44450A0371145L645581Q64516k431250j598044O4709k252495m909633j082914
44442B671615O778152Q816827J998184n556759o251667k380372o04617k061926
44434C409437k420755N78462L865681L356333j004339n387435o246580l534453
44426g383649j3388J881131K074241K116085K900775L103664K93359n262737q496338
44417h786857m416896L940497O899960Q84530m892696o79107Q568462R192202
44409A0710095j021680r277423o498513R85778L534219K126603K436168L032558
$$ plain form
44467 -6605989 1357746 5894984 2778420 -2557381 -3826851 -1811227 -405655 -413621 -1354687
44458 -1354687 -4479605 -9120866 -10133405 -4311716 3793951 7788697 8328912 10371145
44450 10371145 14016726 14881242 12449992 10851948 10916657 8664162 3754529 2671615
44442 2671615 9449767 18266594 20264778 14708019 8456352 6075980 5471363 3409437
44434 3409437 988682 1567144 5432825 8789158 7784819 2397384 -3849196 -7383649
44426 -7383649 -7397037 -5515906 -3441665 -1325580 1575195 4678859 4972218 -290519 -8786857
44417 -8786857 -13203753 -9263256 -2363296 -1478766 -6371462 -7050569 1517893 10710095
44409 10710095 9688415 410992 -6087521 -5101743 -1567524 559079 2995247 6027805
44401F027805o87224o037563o510226k509332N46327K039348M697860N918141
44393C485136J187947n030858l404749M562956O806204n75301o796709l737884
44385c503258J586287k42719n638520n578186j344696q38580l269796k25587Q374365
44376a0680690J1552702L760868n937960o855224j285525J236284p05846K06353
44368h709038O381668J0052300M828569l997704o299511p79588M557855M528219
44360A0562770K603536L041581L425766n90086p040187r480790n641931J42761
44352b976580K732817J042266k505729m456157k587962J847836M637628L191581
44344I25700n86355l536152m818363m111674R846O140521Q427885M168019n46394
$$ plain form
44401 6027805 5340581 -696982 -7207208 -9716540 -9170213 -7130865 -2433005 3485136
44393 3485136 4673083 -357775 -3762524 800432 7606636 7031335 234626 -3503258
44385 -3503258 -1916971 -2159690 -7798210 -13376396 -14721092 -15559672 -18829468 -19055055 -10680690
44376 -10680690 872012 4632880 -1305080 -8160304 -9445829 -8209545 -8915391 -8709038
44368 -8709038 -2327370 7724930 12553499 8555795 2256284 1476696 6034551 10562770
44360 10562770 13166306 16207887 19633653 19043567 12003380 2522590 -3119341 -2976580
44352 -2976580 -243763 798503 -1707226 -6163383 -8751345 -6903509 -2265881 925700
44344 925700 339345 -3196807 -8015170 -12126844 -12116998 -5976477 2451408 6619427 6073033
44335F073033Q17911M546865K372463m486468o635875j622714K451075M55505
44327C971795k373948n81325K477796J224475k970106m845054k975424K16482
44319e855309K689767L642219L184196K965613L826294K944569j657421n066115
44311F673813j653320L769897J452254o332445o819225J919978O101428q27611
44303D284769n914916J815383J1885914R034393k052217n747153j081543J41772
44295A2366402l849037k969636M385607P126471L85781o517441n392781j14517
44287E420849K198083P23417k194159n105232n698685k600407K27912j286744
44279h314966k828582J925008Q391668O873891K8067k38278N978039N222347n537115
$$ plain form
44335 6073033 6890944 11437809 13810272 9323804 2687929 1065215 3516290 3971795
44327 3971795 1597847 1016522 3494318 4718793 1748687 -3096367 -6071791 -5855309
44319 -5855309 -3165542 476677 3660873 6626486 10452780 13397349 11739928 6673813
44311 6673813 5020493 8790390 10242644 3910199 -2909026 -989048 5112380 4284769
44303 4284769 -1630147 185236 12071150 21105543 19053326 13306173 12224630 12366402
44295 12366402 8517365 5547729 9933336 17059807 17445588 10928147 5535366 5420849
44287 5420849 7618932 8342349 6148190 1042958 -4655727 -7256134 -7028222 -8314966
44279 -8314966 -11143548 -9218540 -826872 6047019 6075086 5836808 11814847 17037194 11500079
44270A1500079j1343110l300928O169664L279575n784587o707360N59149N355424
44262b72094M502561L003990J730705k491090p363614p074561k194257J597586
44254h560774K792630L851382M137714J327793k099882j674268J261444J631897
44246B667936r95728k608454j692612l9244J483177K500191J003112k942316m484262
44237e108200p18695L326809J658972l252330m677899j854076J042112K927322
44229f655985N353078O691143M259997J43931j912382k856913m964474n661100
44221e602705k264192R15799j088089m013253o43483N897763O015436p96895n595856
44212g175475m757926l463113l580883r9706P395887J0835300N925811q89496
$$ plain form
44270 11500079 156969 -3143959 3025705 6305280 520693 -6186667 -5627518 -272094
44262 -272094 4230467 7234457 8965162 6474072 -889542 -7964103 -10158360 -8560774
44254 -8560774 -5768144 -1916762 2220952 3548745 1448863 -225405 1036039 2667936
44246 2667936 1672208 -936246 -2628858 -2668102 -1184925 1315266 2318378 -623938 -5108200
44237 -5108200 -5826895 -2500086 -841114 -4093444 -8771343 -10625419 -9583307 -6655985
44229 -6655985 -1302907 5388236 9648233 9792164 7879782 5022869 58395 -5602705
44221 -5602705 -7866897 -6951098 -8039187 -12052440 -12695923 -6798160 -782724 -1579619 -7175475
44212 -7175475 -11933401 -15396514 -18977397 -19077103 -11681216 -845916 5079895 4190399
44204D190399k590634p40633K32301N83202K011091L062407K668265L084402M966201
44195A7467001M269361j664599q698914j0295625m859924L123906O877404K512902
44187H731512n826021p583383J713912J1614167Q618580m360018j1046529n130952
44179c268732J784704l71466n356221l224165K859391L221494j895155m006544
44171a0256694r19378J115747j105228l198521j190004K779431M599084L478085
44163d697478J430476L19310N03602R00293J23831j798622l444197l771639k531958
44154a2966382N05991M323956N558493K316102j533597m59816M484514O684699
44146H913960L486836r68456l107622l953872m467743l162476l35279J167068
$$ plain form
44204 4190399 1599765 859132 1091433 1674635 3685726 6748133 9416398 12500800 17467001
44195 17467001 21736362 20071763 11372849 1077224 -3782700 -658794 6218610 8731512
44187 8731512 2905491 -4677892 -2963980 8650187 17268767 12908749 1862220 -3268732
44179 -3268732 -1484028 -1855494 -7211715 -10435880 -7576489 -4354995 -6250150 -10256694
44171 -10256694 -11176072 -10060325 -11165553 -14364074 -15554078 -12774647 -8175563 -4697478
44163 -4697478 -3267002 -2947692 -2444090 -1543797 -1419966 -3218588 -6662785 -10434424 -12966382
44154 -12966382 -12460391 -8136435 -2577942 -261840 -1795437 -2255253 2229261 8913960
44146 8913960 12400796 11432340 8324718 4370846 -96897 -3259373 -3594652 -2427584
44138b427584J089966J826202K487156k3546l251204j137057M752309N899097
44130I215339J367098K59782N071781N155023n332402j4877772j0875355J218144
44122h798362P204766M971671K909539L215416P16778m373557n615628j808814
44114a578191J633011K694581M493550P034915O109558Q15831n063682q635451
44106G504122q652488l429430M772405P196757m83073q559769n346041M544319
44098b453198O595779q78290m803496R97840O993972M821286n08078j595478m14355
44089H755982j485066k548812j73662K389554P23839k770685l319632j647250
44081g5732j059831p27952J735473M087912K202612k607555m636462j931172J013879
$$ plain form
44138 -2427584 -1337618 488584 2975740 2952194 -299010 -1436067 3316242 9215339
44130 9215339 10582437 10842219 15914000 21069023 15736621 858849 -10016506 -8798362
44122 -8798362 -1593596 3378075 6287614 9503030 10219808 5846251 230623 -1578191
44114 -1578191 54820 2749401 7242951 14277866 20387424 21203255 16139573 7504122
44106 7504122 -1148366 -4577796 194609 7391366 6908293 -1651476 -6997517 -2453198
44098 -2453198 4142581 3264291 -1539205 -541365 6452607 11273893 10765815 9170337 8755982
44089 8755982 7270916 4722104 4548442 6937996 7661835 4891150 1571518 -75732
44081 -75732 -1135563 -1863515 -128042 3959870 6162482 3554927 -1081535 -3012707 -1998828
44072a998828l21450m055114l837275K788357R557749P775542k236299j0112117
44064b439435q221117q02855L651225L832454L240463J618111k550053m822191
44056f493398k53409O201596N566678j73866q09425M458275N252697j868992p011701
44047D868455l444817K095732K254004P28385K927596M971055J446705l738995
44039A2108120l791322j76940J484131J289446K253925K398623j721865p134429
44031F709689q025840m429026n52453K461217N522977O566474L391227r52426
44023A0691839j930651m58243m34715j889488k199079j685471k400301l351591
44015c657700k073108P47364K429977K207648P77369j322898k341081k20106K807590
$$ plain form
44072 -1998828 -2320278 -6375392 -10212667 -7424310 2133439 9908981 7672682 -2439435
44064 -2439435 -10660552 -11463407 -7812182 -3979728 -739265 878846 -1671207 -6493398
44056 -6493398 -6746807 -545211 5021467 4847601 4038176 8496451 13749148 11880156 4868455
44047 4868455 1423638 3519370 5773374 6501759 9429355 14400410 15847115 12108120
44039 12108120 8316798 8139858 9623989 10913435 13167360 15565983 13844118 6709689
44031 6709689 -1316151 -5745177 -6297630 -3836413 1686564 8253038 11644265 10691839
44023 10691839 8761188 8302945 7868230 5978742 3779663 2094192 -306109 -3657700
44015 -3657700 -5730808 -4983444 -2553467 -345819 431550 -891348 -3232429 -3452535 -644945
44006f44945J826029k076376j723041L973691O201145K32978n560984k426284
43998a97787N086472P159047L322071n68577l305187o008847n165647R47673M736964
43989F006182j20474o303297l747027K829936J831554m738244n338406k59721
43981i839497m52527n492207k505919R665461J4851665N157078n545151l485394
43973B353509M910902O308290J099734j928218j683048k581819l434270p46957
43965D298123J991726n20696m844628l652985J862076M039515J149046j193805
43957C128372O999J735961J498553O51410O74561R94615R22145N18915p7245k69161
43947I785125L45356j04906l541400o522107k842959N867760R188182K240070
$$ plain form
44006 -644945 1181084 -895292 -2618333 1355358 7556503 7789481 2228497 -197787
43998 -197787 4888685 12047732 15369803 14801226 11496039 5487192 321545 1269218 6006182
43989 6006182 5885708 -417589 -4164616 -1334680 496874 -4241370 -9579776 -9839497
43981 -9839497 -10292024 -15784231 -18290150 -8624689 6226976 11384054 5838903 2353509
43973 2353509 7264411 13572701 14672435 12744217 11061169 8479350 5045080 4298123
43965 4298123 6289849 5769153 924525 -2728460 -866384 3173131 4322177 3128372
43957 3128372 3135371 4871332 6369885 7021295 7695856 8690471 9612616 10131531 10054286 9785125
43947 9785125 10130481 10025575 6484175 -37932 -2880891 2986869 12175051 14415121
43939A4415121o041502n504637P86342K841480q41592l601227k813685j814328
43931b574028j284691J554534N213916M401447o78224l424847q42034K643161
43923E009234L036460J668328K37670k352581n417519m912533l4100L752947K174835
43914C162741j638988k360971j96218R34236K01050K34157J969326L204262K173749
43905G683344l27757k437669k725967m45452L575931O257736M617180m91278m546979
43896A1159089m253887j220520K58849j721448n022510o242498l693857J811554
43888h925228P060770P659321K224604m096267m129279J613057M257092j060817
43880D603253p189026n140950K148922M593312P83989j242669J208782J603903
$$ plain form
43939 14415121 8373619 2868982 3655324 6496804 5655212 2053985 -759700 -2574028
43931 -2574028 -3858719 -2304185 2909731 7311178 6632954 3208107 2366073 5009234
43923 5009234 8045694 9714022 9951692 7599111 2181592 -2730941 -2765041 987906 3162741
43914 3162741 1523753 -837218 -1033436 -99200 101850 336007 2305333 5509595 7683344
43905 7683344 7355587 4917918 2191951 1746499 5322430 11580166 16197346 15706068 11159089
43896 11159089 6905202 5684682 5943531 4222083 -800427 -7042925 -10736782 -8925228
43888 -8925228 -1864458 5794863 8019467 3923200 -206079 1406978 5664070 4603253
43880 4603253 -2585773 -7726723 -5577801 -984489 -200500 -1443169 -234387 1369516
43872A369516k119396k070075M988140Q735574Q26652r497760p675503L737831
43864a705021Q367983N5714r449078q487894q450N763342M532631p19256n257826
43855f907855n336621k22192N386361N235424q598k883314K60192M281918L857323
43846C662638J425719J998580M434353L372408k433666q509603j0326173p023064
43838a3398808m90297O047673R073763P096676K034487k893985n816223n922869
43830d269583k605739L013831P121242O339524J657375k406489k587477P5077
43822F337761J829383L81917k413277k457463J208646L995825J016853n676157
43814D223488q332497k999409N133740P848181L259605l159004n462656k710894
$$ plain form
43872 1369516 -749880 -2819955 2168185 10903759 11730411 2232651 -5442852 -1705021
43864 -1705021 6662962 6718676 -2730402 -11218296 -11226746 -5463404 -930773 -1650029 -6907855
43855 -6907855 -12244476 -12466668 -7080307 -1844883 -1853481 -4736795 -4476603 -194685 3662638
43846 3662638 5088357 7086937 11521290 14893698 12460032 3950429 -6375744 -13398808
43838 -13398808 -13889105 -7841432 1232331 8329007 10363494 7469509 1653286 -4269583
43830 -4269583 -6875322 -3861491 3259751 9599275 11256650 8850161 6262684 6337761
43822 6337761 8167144 8549061 6135784 3678321 4886967 8882792 9899645 4223488
43814 4223488 -4109009 -7108418 -1974678 5873503 9133108 5974104 511448 -2199446
43806b199446J806907M429793L711781O73255k401431l606068k633789r32643
43798a151641m12489j257430j290083J160530L995082L358744n19914k713160
43790A169639o08462K003319J031240j239311m14345J814986J80039m476694n185766
43781e725355L09836N329259L683766j984341m760197k325429K110403M624249
43773A262191L459514j84736k143640P85377N206290L739019m180009r175810
43765a231804l978158N814995Q842878L053562k720713j452922L667925M595122
43757A6590885j666064r998898j2472717o615102J137215K205667l159128n503246
43749a9481388R80995J0042341J2132294O983585J405039j567704l725608m620019
$$ plain form
43806 -2199446 -392539 4037254 7749035 8422290 6020859 2414791 -218998 -1151641
43798 -1151641 -1564130 -2821560 -4111643 -2951113 1043969 4402713 3882799 1169639
43790 1169639 561177 2564496 3595736 2356425 1942080 3757066 3937105 -539589 -5725355
43781 -5725355 -5415519 -86260 3597506 1613165 -3147032 -5472461 -3362058 1262191
43773 1262191 4721705 4536969 2393329 3178706 8384996 12124015 7944006 -1231804
43765 -1231804 -5209962 605033 9447911 12501473 9780760 8327838 11995763 16590885
43757 16590885 14924821 4925923 -7546794 -14161896 -13024681 -10819014 -13978142 -19481388
43749 -19481388 -18500393 -8458052 3674242 10657827 12062866 10495162 6769554 2149535
43741B149535k303995j73040l690542r616640q168488J710993Q984952O652871
43733d454354J780897L032246O781547M516199k215446m528403n81076K762742
43725G094352J626164n67195q60258p58579j049939L23258L193383L987728J760896
43716A4749810R8589R34091J454959o52926l479459m518122l801163j835536J069194
43707D019437K239377j069161n303319l176279M773024Q587146L135184l646907
43699I558502k951465J645895J413069k855869l362176R75903L678405K163233
43691A0265497K03919q28454l637358p071394n683043P88208N570683M644437
43683D252495J064404j903492m030515l206332L477427J1247319J0109215l42308
$$ plain form
43741 2149535 -154460 -327500 -4018042 -13634682 -21803170 -20092177 -11107225 -4454354
43733 -4454354 -2673457 358789 7140336 11656535 9441089 4912686 4331610 7094352
43725 7094352 8720516 8153321 7293063 6534484 5484545 5807803 9001186 12988914 14749810
43716 14749810 14848399 15782490 17237449 16584523 13105064 8586942 4785779 2950243 4019437
43707 4019437 6258814 5189653 -113666 -3289945 1483079 10070225 13205409 9558502
43699 9558502 6607037 8252932 9666001 6810132 3447956 4423859 8102264 10265497
43691 10265497 10469416 9640962 6003604 -1067790 -6750833 -5962625 -391942 4252495
43683 4252495 5316899 3413407 -617108 -3823440 -346013 10901306 21010521 20668213
43675B0668213q450159p507610m562797n878410n279550L052597J0565522O274899
43667H882705m449539p328090j164584K206956j590643l677765J647719P722401
43659B249160P106297K223133o70171o23493l11271n78791m76618P04797K990762
43650A2613805M382430J119211o338131j0285106n329308J967100J666438l844097
43642d047658l526979M113083R009395O564184L290677K474648j725240j0211475
43634E940635j2810650m581596M106292L773281P51449M152382Q233772K317899
43626A1883464q890775j0826189j657986N697890L705180j304958k271316r04214
43618d568904q22453j007425P8026J255551K372225M875367O898696M403305j192469
$$ plain form
43675 20668213 12218054 4710444 147647 -5730763 -11010313 -7957716 2607806 8882705
43667 8882705 4433166 -2894924 -4059508 -1852552 -3443195 -7120960 -5473241 2249160
43659 2249160 9355457 11578590 10908419 10284926 9973655 9394864 8918246 9623043 12613805
43650 12613805 16996235 18115446 11777315 1492209 -3837099 -1869999 -203561 -4047658
43642 -4047658 -7574637 -3461554 5547841 12112025 15402702 17877350 16152110 5940635
43634 5940635 -6870015 -11451611 -7345319 -3572038 -2820589 1331793 9565565 11883464
43626 11883464 2992689 -7833500 -9491486 -3793596 -88416 -1393374 -3664690 -4568904
43618 -4568904 -5391357 -6398782 -6320756 -5065205 -2692980 2182387 9081083 13484388 12291919
43609A2291919l460902r55474M34222k188431l405380J112816O172526M027008
43601A4028304l959896q626527m779260L006715O691295L851438r00806k460733
43593F850530j249795j305545l568326m596869k628037n48239m27220L95733L904839
43584c172929O358048L750584j183604k988825j375680N89055K621548M956309
43576I554506L778584k917161q197287m489852L300490L711760l381972o672493
43568e313425j717201L407023L362429L368207O668247O791857n8503n886905
43560A0621729l325819K010556J443450k439591k098805Q74014k64838l828447
43552B992249k223266M011889O166135J308799l768813l641819p25095Q83543
$$ plain form
43609 12291919 8831017 7875543 8309765 6121334 2715954 3828770 10001296 14028304
43601 14028304 10068408 1441881 -3337379 -330664 6360631 10212069 9311263 6850530
43593 6850530 5600735 4295190 726864 -3870005 -6498042 -7046281 -7473501 -7077768 -3172929
43584 -3172929 3185119 6935703 5752099 2763274 1387594 1976649 4598197 9554506
43576 9554506 13333090 10415929 2218642 -2271210 1029280 4741040 1359068 -5313425
43568 -5313425 -7030626 -3623603 -261174 3107033 9775280 16567137 16508634 10621729
43560 10621729 7295910 9306466 10749916 8310325 6211520 7085534 6820696 2992249
43552 2992249 768983 4780872 10947007 12255806 8486993 4845174 4120079 5003622
43544E003622P91798q2924j375581j742108n17847n29107l729929n438626j31750
43535g752452P943810Q649450J111470m240324j288554L233320J298034m441060
43527D513694o410977l635968p02704M49071J174635J610949J433165K641028
43519A072893O014093P168798K240970m179797l574547M086340R037292M541165
43511B6407207m437352q197258l977904K520295M764985J540501l265344m851594
43503A0503536k060762J431800J623470j97046P84697M788883N431400r61604
43495B1344374q000837o841219Q77286M663598J77278m780514k426002L615028
43487H628992M911884J320631l01674J748344J743789k746884n833127k512883
$$ plain form
43544 5003622 5795420 5712496 4336915 2594807 2076960 1547853 -2182076 -7620702 -7752452
43535 -7752452 191358 8840808 9952278 5711954 4423400 7656720 8954754 4513694
43527 4513694 -1897283 -5533251 -6235955 -5786884 -4612249 -3001300 -1568135 1072893
43519 1072893 7086986 14255784 16496754 12316957 8742410 12828750 21866042 26407207
43511 26407207 21969855 13772597 9794693 12314988 17079973 18620474 15355130 10503536
43503 10503536 8442774 9874574 11498044 11300998 12085695 16874578 22305978 21344374
43495 21344374 13343537 6502318 7379604 12043202 12220480 7439966 5013964 8628992
43487 8628992 13540876 14861507 14559833 16308177 18051966 15305082 9471955 6959072
43479F959072L155711L942472m38640m123111l666206j045240Q95809J866144
43471G546011K893102M402112N626061M545686k73648o131121o893390l64279
43463A1350534P227119Q424615M831786M732846J0237717J3074478O371153m238683
43455F2011565o673132K306334J3349009J6672430J3202361J0831925J3050081
43448A24750573J6267478J7864116K1124401K8979446L6675731L5833582K4688899
43441C06184226R406486m646140j7460410k8873545l4430791l0975857k2765134
43434A76438835j7460045j7826404k0705355k2000496j9245934j1775377k674715
43427F4750509J473752k378796q390499q452995k960017N55282j272935m177605
$$ plain form
43479 6959072 10114783 14057255 13618615 9495504 5829298 4784058 5679867 7546011
43471 7546011 10439113 14841225 20467286 25012972 24739324 18608203 11714813 11350534
43463 11350534 18577653 27002268 31834054 36566900 46804617 59879095 66250248 62011565
43455 62011565 55338433 57644767 70993776 87666206 100868567 111700492 124750573
43448 124750573 141018051 158882167 180006568 208986014 245661745 281495327 306184226
43441 306184226 315590712 310944572 293484162 264610617 230179826 199203969 176438835
43434 176438835 158978790 141152386 120447031 98446535 79200601 67425224 64750509
43427 64750509 66224261 63845465 55454966 47001971 44041954 44597236 43324301 39146696
43419C9146696m539504m220866n042573m940336k962166k264589l978540l545423
43411G652699J601279N678680K629222l219582k809812L093879M355340k368105
43403A6613600p345376k361067O122881O029152k590072p832569l132968M501907
43395A0005488N825515J726894n28239J413905L457046K534425j40092k789502
43387B1505440n056724n958888m267353j646656j341468k888378k312854J298417
43379f68464L965748L278051J930734K341909K577634Q88261n50057l78265j458557
43370A1926994m595680m337416K119296O971972J977206o910523o189132M688779
43362E651496J1423453N778195l250501m452939l20834q702m059200n591180k440457
$$ plain form
43419 39146696 34607192 30386326 25343753 20403417 17441251 15176662 11198122 7652699
43411 7652699 9253978 14932658 17561880 14342298 11532486 14626365 18981705 16613600
43403 16613600 9268224 6907157 13030038 19059190 16469118 8636549 5503581 10005488
43395 10005488 15831003 17557897 17029658 18443563 21900609 24435034 24294942 21505440
43387 21505440 16448716 10489828 6222475 4575819 3234351 345973 -1966881 -668464
43379 -668464 3297284 6575335 8506069 10847978 13425612 14313873 13763816 13385551 11926994
43370 11926994 7331314 2993898 5113194 12085166 14062372 7151849 962717 5651496
43362 5651496 17074949 22853144 19602643 15149704 14828870 14820168 10760968 5169788 2729331
43353B729331Q21038J214533M40226M16437J348155L289560N002141L138670k567197
43344A5832894n869707j803850M409244L572777l626470p332155l538803N97919
43336B241849o47384k351737J882065Q146943P464130m53556o516723m996973
43328D768614k97499O82656k076188l152054J28503M313539M445555Q1503m150848
43319D743781l720723O32794L600219J464666l387202n381221k731856N35141
43311d244401L86821j378261L58420O174255J0054814O894309m41799m641121
43303A3163037l342499j178002k162318m237780l578341q49152N16755L16493
43295a351807J524638M553967N818512L357420M86046J304517M646329N657828
$$ plain form
43353 2729331 3550369 4764902 5205128 5621565 6969720 10259280 15261421 18400091 15832894
43344 15832894 9963187 8159337 12568581 16141358 12514888 5182733 1643930 2241849
43336 2241849 1594465 -757272 1124793 9271736 16735866 16282310 9765587 4768614
43328 4768614 4471115 5153771 3077583 -74471 54032 4367571 8813126 8894629 4743781
43319 4743781 1023058 1655852 5256071 6720737 3333535 -2047686 -4779542 -4244401
43311 -4244401 -3857580 -5235841 -4877421 1296834 11351648 18245957 17804158 13163037
43303 13163037 9820538 8642536 6480218 2242438 -1335903 -2185055 -1668300 -1351807
43295 -1351807 172831 4726798 10545310 13902730 14388776 15693293 20339622 25997450
43287B5997450K822282P2448P75770K552722J099229k466595k708574J069184
43279B9213916K322499k633923p117098l362630L929695K716731p675715j3592733
43271C800742o723842L506920M633236o66188j652002J823628J170354l408243
43263B484605k183752N857640Q632350K33242q283385n818087J626027J479844
43255D028484n378586p433024j200005N235846O356931N575866O100689N272027
43247A8558228J219347k549446l058479k570511l844596n374425m552327j727430
43239c899639J448914M109514M681887J482143l034505l117112K332859O977031
43231A0981092N563089J058558p88186j21928j017760l507401l467405N1476K419682
$$ plain form
43287 25997450 28819732 28892180 29667950 32220672 33319901 30853306 28144732 29213916
43279 29213916 31536415 28902492 21785394 18422764 22352459 25069190 17393475 3800742
43271 3800742 -2923100 583820 5217056 4550868 2898866 4722494 5892848 2484605
43263 2484605 300853 6158493 14790843 15024085 6740700 922613 2548640 4028484
43255 4028484 -1350102 -8783126 -9983131 -4747285 1609646 7185512 13286201 18558228
43247 18558228 19777575 17228129 14169650 11599139 7754543 2380118 -2172209 -3899639
43239 -3899639 -2450725 1658789 6340676 7822819 4788314 1671202 4004061 10981092
43231 10981092 16544181 17602739 16814553 16692625 15674865 12167464 8700059 8751535 11171217
43222A1171217n54434p088210j0879837p113742K400315R566454P627108n58412
43214D570459n112395j720804K892219J492464k773679k115388L087905N174116
43206E494897J497122k350569k171151l60900L61394J317720K991772K141116
43198H921401k252523n356914l217069R55023J573064j424884l540043k076780
43190f418725J921329N811852O643300K991888k001325k826012N40996J383515
43182H046818l505585p446152l370417M782322P479442L460732M6692Q55377J693142
43173A2042371o58416l495712m077596l575527k656802M21636M359655L971944
43165F331553j139204l370269J750731O633886J442202j0315808j4731042o122682
$$ plain form
43222 11171217 10616783 3528573 -7351264 -14465006 -12064691 -2498237 5128871 4570459
43214 4570459 -541936 -2262740 629479 2121943 -651736 -2767124 320781 5494897
43206 5494897 6992019 4641450 2470299 2109399 2470793 3788513 6780285 8921401
43198 8921401 6668878 1311964 -1905105 -950082 622982 -801902 -4341945 -6418725
43190 -6418725 -4497396 1314456 7957756 10949644 8948319 6122307 6663303 8046818
43182 8046818 4541233 -2904919 -6275336 -1493014 5986428 9447160 9493852 10349229 12042371
43173 12042371 11383955 7888243 3810647 235120 -2421682 -2000046 2359609 6331553
43165 6331553 5192349 1822080 3572811 10206697 11648899 1333091 -13397951 -19520633
43157a9520633N318232P283655L18195n659917n289234j761676J457435N485749
43149a2368194J0301573J0451724K350055p213930p248511K364163R132937M360793
43141A2130610n155609p331317j597150K434590O86123m04448L872802P816110
43133A2451711L927887n136234r466003m823365K626779M787626J053221k489013
43125B932609j501114J539768J728351o16156k20356M542126P712588L901619
43117B0019435l105066n162317j165504K401307J509654j344163l478033n548604
43109D126709o929078m288648J920051N375873K434206j992818j518884K702054
43101A829465M695968K385696j021835k395892j434867O98939K468174K594547
$$ plain form
43157 -19520633 -14202401 -6918746 -6600551 -12260468 -17549702 -19311378 -17853943 -12368194
43149 -12368194 -2066621 8385103 10735158 3521228 -3727283 -1363120 7769817 12130610
43141 12130610 6975001 -356316 -1953466 481124 1167247 762799 4635601 12451711
43133 12451711 16379598 11243364 1777361 -3046004 -419225 4368401 5421622 2932609
43125 2932609 1431495 2971263 4699614 4083458 3863102 8405228 16117816 20019435
43117 20019435 16914369 11752052 10586548 12987855 14497509 13153346 9675313 4126709
43109 4126709 -2802369 -7091017 -5170966 204907 2639113 646295 -872589 1829465
43101 1829465 6525433 8911129 7889294 5493402 4058535 4757474 7225648 9820195
43093I820195J333733j49961k019235m689484n777515k696739J447677O36157
43085b095172m125522m853801Q70980N545431M151999K190461M941223P361488
43077A3987087L399167k282502k439833o80004m502875r730549n941446M668314
43069c522641Q723021K817927j465875K653794O437330J537430n431525l864511
43061G884950L702127N882610o89098q060795q655937l088805L039847M934858
43053D949757J541534l657117n265335j739480K666584L448621J318091P0409
43045C333064R54863J553744n57157m376900n606212j071037N936167P404305
43037G570837R04189n057803j518050P862032J1820440P950109M488162N220295
$$ plain form
43093 9820195 11153928 11003967 8984732 4295248 -1482267 -4179006 -2731329 -2095172
43085 -2095172 -6220694 -11074495 -10203515 -4658084 -506085 1684376 6625599 13987087
43077 13987087 17386254 15103752 12663919 11983915 7481040 -2249509 -8190955 -3522641
43069 -3522641 5200380 8018307 6552432 9206226 15643556 17180986 11749461 7884950
43061 7884950 11587077 17469687 16780589 8719794 63857 -3024948 14899 4949757
43053 4949757 6491291 2834174 -2431161 -4170641 -1504057 1944564 3262655 3333064
43045 3333064 4287927 5841671 5284514 907614 -4698598 -5769635 166532 7570837
43037 7570837 8475026 3417223 1899173 9761205 21581645 29531754 34019916 39240211
43029C9240211L743713l366430q387471m467896K603230L146666j812064l511980
43021B7187979O31531M405451K545105l519782r010564j0216429o544600j446004
43013D032687M52146p73751o87780J605541J548246j917833k577219K744657P287091
43004A1713785M795501J85595J142839M818558L006446l583057p031482n570833
42996I477352m278415l880594j59320N409826N706598L99491k159780J643132
42988A2158290N004555K218293k786463l874821j251785J935828N082935P900142
42980B6386974Q397601O882764O723149Q346639Q453744P596144J1188738J9920530
42972A03896283K7873551L4700854M9067764P0945201P9638654N3389392j400834
$$ plain form
43029 39240211 42983924 39617494 31230023 26762127 29365357 32512023 30699959 27187979
43021 27187979 27819510 32224961 34770066 31250284 22239720 12023291 5478691 4032687
43013 4032687 4484833 3711082 3023302 4628843 6177089 4259256 1682037 4426694 11713785
43004 11713785 16509286 16694881 17837720 22656278 25662724 22079667 15048185 9477352
42996 9477352 5198937 1318343 1159023 6568849 12275447 12674938 10515158 12158290
42988 12158290 17162845 19381138 16594675 12719854 11468069 13403897 18486832 26386974
42980 26386974 34784575 41667339 48390488 56737127 65190871 72787015 83975753 103896283
42972 103896283 131769834 166470688 215538452 286483653 366122307 419511699 418110865
42965D18110865n2348532p3255561o5570238m8065974l5290734k9582905k6402626
42958H7594295k1348982j4144598q411046o442413n135807p02001L924893K315636
42950C7649977m667142q310666m504765J71673j091438n130471n018841j372087
42942G726240J79282m24957J524326M976520K961932m825174q320528j216915
42934B580726Q315969Q308308k36075n466639j519267N042216N969839J257529
42926B4252606l650774m915802k173417K310165M408654J788999k137684k021104
42918A7861643J275898J740581j848233l829401j501041N01268p80332j020677
42910A2399706K820754N886466L933015J288007K503774L016846k318379p597282
$$ plain form
42965 418110865 365762333 292506772 226936534 178870560 143579826 113996921 87594295
42958 87594295 66245313 52100715 43689669 37247256 32111449 31409448 35334341 37649977
42950 37649977 32982835 24672169 20167404 20339077 19247639 14117168 9098327 7726240
42942 7726240 7905522 7480565 9004891 13981411 16943343 12118169 3797641 2580726
42934 2580726 10896695 19205003 18968928 13502289 11983022 17025238 22995077 24252606
42926 24252606 20601832 15686030 13512613 15822778 20231432 22020431 19882747 17861643
42918 17861643 19137541 20878122 19029889 15200488 13699447 14200715 13420383 12399706
42910 12399706 15220460 21106926 25039941 26327948 28831722 31848568 29530189 21932907
42902B1932907m262724L458130M413797p93567r36412O211577R778217M138288
42894D3940213k039509k21125N991047R345059R466530Q417812M591112k046081
42886G7445058o149381n118820m306222p986076j1843846j0622406o556048l856877
42878B1005382j595822J183099K73892n924622r808773m313684N871755J0966119
42870A7657346R039704M460494j007146o716844q104062k810011K803694K857037
42862A8180212K340720P446325J1460129M364497p450852p407145N896119J6150842
42854E0980847J4412088J0122155J1880477J3273974O852543j241940k033844
42847A04246300Q37057j513041p246062p174860k22302N282714M153762n90122
$$ plain form
42902 21932907 17670183 21128313 25542110 24748543 23812131 30023708 39801925 43940213
42894 43940213 41900704 41679579 47670626 57015685 66482215 74900027 79491139 77445058
42886 77445058 71295677 66176857 61870635 53884559 42040713 31418307 24862259 21005382
42878 21005382 19409560 20592659 20866551 14941929 5133156 819472 6691227 17657346
42870 17657346 26697050 31157544 30150398 23433554 15329492 12519481 15323175 18180212
42862 18180212 20520932 27967257 39427386 43791883 36341031 28933886 34830005 50980847
42854 50980847 65392935 75515090 87395567 100669541 107522084 106280144 104246300
42847 104246300 105083357 103570316 96324254 89149394 88927092 94209806 98363568 97773446
42839I7773446m443838n959796m933506j954206M66857P76895J357152M807856
42831H7890860R398014J2446639J5468591K0521166K3599669J8037840M139373
42824A91502152r995080j7545289j8574005j6684933j4500120j3070549j2299945
42817H8832231j1171105r496072q671900q704556o680604j481554K439665N53181
42809D5619286m433791o165248m223146l862659o402346o882546k985702L85465
42801A1049313j043251l815113k080434L460501O645543M124721j234847m314862
42793A2791571k515603K371299N062498J170445p177692j1984464q154185K47378
42785h188753N327605M870651K706708J362314l65162k461322j957488J672144
$$ plain form
42839 97773446 93329608 87369812 82436306 80482100 80948957 81725852 83083004 87890860
42831 87890860 97288874 109735513 125204104 145725270 169324939 187362779 191502152
42824 191502152 181507072 163961783 145387778 128702845 114202725 101132176 88832231
42817 88832231 77661126 68165054 59493154 50788598 44107994 42626440 45066105 45619286
42809 45619286 41185495 35020247 30797101 26934442 20532096 13649550 10663848 11049313
42801 11049313 10006062 6190949 4110515 7571016 14216559 18341280 17106433 12791571
42793 12791571 10275968 12647267 17709765 18880210 11702518 -281946 -8436131 -8188753
42785 -8188753 -2861148 2009503 4716211 6078525 5713363 3252041 1294553 2966697
42777B966697L924239J438735k553463k894340l02755P8704k932847m472182r68609
42768e715821M263592N065194J7431o040197p185303k059432M826861P027568
42760A99893K566829l507193m591472l25687L675556L902892K810408L083672
42752G814898K554082j436198o002826o057525j862143J905876L686618N998650
42744F601432Q635073P061622Q4682n978899m865136R60268L425298p04117o234387
42735H985836o392382o05944N354211N841717J240975k741872j753759K295015
42727A2223797M337554K889607Q08769j71021j689450m519290o032579m254780
42719C592607j310739n447M72439K257776M168901K856685k191603p507560r062633
$$ plain form
42777 2966697 6890936 8329671 5776208 2881868 2579113 2657817 -275030 -4747212 -5715821
42768 -5715821 -1452229 3612965 3630396 -2409801 -9595104 -11654536 -6827675 199893
42760 199893 2766722 -740471 -5331943 -5657630 -1982074 1920818 4731226 7814898
42752 7814898 10368980 8932782 2929956 -3127569 -4989712 -3083836 602782 6601432
42744 6601432 15236505 22298127 22382809 16403910 11538774 12499042 15924340 15220223 8985836
42735 8985836 2593454 1987510 7341721 13183438 14424413 11682541 9928782 12223797
42727 12223797 16561351 19450958 20259727 20088706 18399256 13879966 7847387 3592607
42719 3592607 2281868 2276421 2748860 5006636 9175537 12032222 9840619 2333059 -6729574
42710f729574n231313K267076Q628350R131038M321826n489l38901k9746k901986
42701I111281n735570k853487L839286O443883K779233n85991J046638L434339
42693A7479612O77184n548928q742334o379027j720693J072300K64969l028088
42685e925005m956710j878104M180514O259997J980597j746598J495193P170967
42677F580851O314577j99466k954265P33718K787289j724146o291966m121392
42669A125200N99562K76700l373857l213099O92494K106934M11939J158181M545415
42660D329469L711053k679709n975110j060955M086303J44469q277330q586069
42652a4307879J146157R082732O151088k326142n138915n504N137364L665544
$$ plain form
42710 -6729574 -11960887 -9693811 -1065461 8065577 12387403 12381914 12043013 12013267 9111281
42701 9111281 3375711 522224 4361510 10805393 13584626 12998635 14045273 17479612
42693 17479612 18156796 12607868 3865534 -2513493 -4234186 -3161886 -2896917 -5925005
42685 -5925005 -10881715 -12759819 -8579305 -2319308 -338711 -2085309 -590116 6580851
42677 6580851 12895428 12695962 9741697 10475415 13262704 11538558 5246592 1125200
42669 1125200 1724762 2001462 -1372395 -4585494 -3893000 -1786066 -1374127 -215946 4329469
42660 4329469 8040522 5360813 -614297 -1675252 2411051 2555520 -5721810 -14307879
42652 -14307879 -13161722 -4078990 2072098 -254044 -5392959 -5398463 -261099 3404445
42644C404445j734516l905317j213089Q23763j765883n060147l248053J738418
42636a0960379K749634q46794j536421L861344P945281M231535j993672j836027
42628A614501L439400N751349L755036K943190L712396K07526p703983j1577511
42620B141904o935643m0455K091357R36492J069503K297199K452545K326865K569785
42611H909552Q45734k776929k921276K771310P518925M505729k175175l543759
42603A3134111L18144J058444m123588q151313n170389J176174L774251J387489
42595C403323j717312k626100k559370l267540l300562K60433O372271Q992890
42587E558033M439445k047018k235307L061883M756615l34038m348329j470433
$$ plain form
42644 3404445 1669929 -2235388 -3448477 -2624714 -4390597 -9450744 -12698797 -10960379
42636 -10960379 -8210745 -9057539 -10593960 -6732616 1212665 5444200 3450528 1614501
42628 1614501 5053901 10805250 14560286 17503476 21215872 21423398 13719415 2141904
42620 2141904 -4793739 -4834194 -2742837 -1806345 -736842 1560357 4012902 6339767 8909552
42611 8909552 9755286 6978357 4057081 6828391 14347316 18853045 16677870 13134111
42603 13134111 13452255 14510699 10387111 2235798 -2934591 -1758417 2015834 3403323
42595 3403323 1686011 -940089 -3499459 -6766999 -10067561 -9807128 -3434857 5558033
42587 5558033 9997478 7950460 5715153 8777036 13533651 13199613 8851284 7380851
42579G380851K472187M65969l468423j993261J915195N75720l415732r54359O412037
42570I390184P123079j031550o018107o80699N880189L482602l056310k607764
42562A2481624M709221Q837447M877436k011188n169577l033729J797977M854821
42554B7344032K501349l345037n393435k33749N543177L971569k313210l818170
42546B4256526J189404L868390j543508q462075p091728J559128O881550K962248
42538B3619935m054454n132375o60499J324784k235970n127700k312453J751330
42530G172598O60837l078588k609479R00745M2968n267234o558067j170196K796806
42521g109610L76767j656038L095194R034395P878995K219587j16407N40193j390139
$$ plain form
42579 7380851 9853038 10319007 6850584 4857323 6772518 7348238 3932506 2978147 9390184
42570 9390184 16513263 15481713 9463606 8782907 14663096 18145698 15089388 12481624
42562 12481624 17190845 26028292 30905728 28894540 23724963 20691234 22489211 27344032
42554 27344032 29845381 26500344 21106909 20873160 26416337 30387906 28074696 24256526
42546 24256526 25445930 29314320 27770812 19308737 12217009 13776137 20657687 23619935
42538 23619935 19565481 14433106 13772607 15097391 12861421 7733721 5421268 7172598
42530 7172598 7833435 4754847 2145368 3046113 3089081 -2178153 -8736220 -9906416 -7109610
42521 -7109610 -6732843 -8388881 -5293687 3740708 11619703 13839290 13722883 14263076 12872937
42512A2872937m741801l824075l0713R0514k982300k769812N84588N19125k600725
42503b882262r82149N395508O307816j084314n195319J545892R100608N477222
42495A7683002l490984l289774O070381J0175184K146659q466773j0607857m960085
42487E259753J339611M951104O484301N980318L134205o74213l595811m841646
42479A8037622l951594r63689K150500L067276K418412K377090K115809j092392
42471B4159034n906427p148155l583347m21612j481460l662080k715061j32412
42463h91520K25457j116425r89291L68949L45847n07228O12049L060717L421073
42454D529628J812694J914072L838023K818335k683828o889182m448664J691444
$$ plain form
42512 12872937 8131136 4307061 4276348 4366862 1384562 -1385250 -800662 -281537 -2882262
42503 -2882262 -3864411 1531097 7838913 6754599 1559280 3105172 12205780 17683002
42495 17683002 14192018 10902244 16972625 27147809 29294468 20827695 10219838 5259753
42487 5259753 6599364 11550468 18034769 24015087 27149292 26475079 22879268 18037622
42479 18037622 14086028 13122339 15272839 18340115 20758527 23135617 25251426 24159034
42471 24159034 18252607 11104452 7521105 7099493 5618033 1955953 -759108 -891520
42463 -891520 -666063 -1782488 -2771779 -2402830 -2056983 -2564211 -1952162 1108555 4529628
42454 4529628 6342322 8256394 12094417 14912752 12228924 5339742 891078 2582522
42446B582522M472387K080842j261322k200130j534067j042385q87452p18529
42438A491866o64191n97274j55430M07696P55991J282784J891643J127051j307406
42429D232730k445417M29727M836913N336829J089793k487370j045477K875588
42421A2823316L722718N17413k403528j757206K94424n24547m113033n354323
42413C205234j168003M091625L883476p21394j873835K999810O340032J962170
42405A8719115m676829m856705m90884k28485m435120n312125j849765k159169
42397e289967p698825p809555L119748J4096465J2744924L369039j331237J23338
42389A1323930o30471m859759m918542J033935N180067L007240p02629j885543
$$ plain form
42446 2582522 7054909 9135751 7874429 5674299 4140232 3097847 2210395 1491866
42438 1491866 827675 230401 74971 482667 1238658 2521442 4413085 5540136 4232730
42429 4232730 1787313 2217040 7053953 12390782 13480575 10993205 9947728 12823316
42421 12823316 16546034 17063447 14659919 12902713 13197137 12672590 8559557 3205234
42413 3205234 2037231 6128856 10012332 9290938 7417103 10416913 16756945 18719115
42405 18719115 14042286 9185581 8694697 8466212 4031092 -1281033 -3130798 -5289967
42397 -5289967 -12988792 -20798347 -17678599 -3582134 9162790 12531829 11200592 11323930
42389 11323930 10693459 5833700 915158 1949093 7129160 10136400 9433771 7548228
42381G548228l388238p069470q400801m043147K083703N084798N419256M739003
42373A973332J697215l286806n102630j294927K909069K484901M49450J773555
42365A603159M407739L496853M60038n3758P23645j821804n733270m123501K926381
42356A885482O844198L047756k686721l487689l93212J825623K092181J520571
42348A0648189q52984n344154p854325m592428J250641L168335Q48591J66213
42340b561922L123577L979650j498420p919849o786762J196456O492725L838998
42332a35547r72773m92762L138968K112402m194772p485802k884025L548057L629466
42323c736788j267801k951054J541350O605799O643213K639397j127897k672942
$$ plain form
42381 7548228 4159990 -2909480 -11310281 -15353428 -13269725 -8184927 -2765671 1973332
42373 1973332 3670547 383741 -4718889 -6013816 -3104747 -619846 -170396 1603159
42365 1603159 6010898 9507751 9967789 9914031 10637676 8815872 3082602 -1040899 1885482
42356 1885482 8729680 11777436 9090715 5603026 5209814 7035437 9127618 10648189
42348 10648189 9795205 4451051 -3403274 -7995702 -6745061 -3576726 -2728135 -2561922
42340 -2561922 561655 4541305 3042885 -4876964 -11663726 -10467270 -3974545 -135547
42332 -135547 -1108320 -1601082 1537886 3650288 -544484 -8030286 -10914311 -7366254 -3736788
42323 -3736788 -5004589 -7955643 -6414293 191506 6834719 9474116 8346219 5673277
42315E673277k536329j711473j630158l702685o624840o364490j354330M088729
42307a4162299M385297k77080m263738l364415J184354N412514O838968N471203
42299A224804K643022j34457k129333l497001l774296j285364L839895O950866
42291C838136K978519n822971j0246907n015239L887841O705633K484088r87293
42283b178193Q83078L678315K001871k139730l221679r86524O910j540690j417214
42274d913856L124075Q288465Q330546L100486j812977j982427J090106K685882
42266A7910300P49298k496315m299954m565331m298213l014110k04496J990319
42258A771498J106727j143186r74030O86231r19385n014723l706590N574157J2746219
$$ plain form
42315 5673277 3136948 1425475 -204683 -3907368 -10532208 -16896698 -18251028 -14162299
42307 -14162299 -9777002 -10054082 -14317820 -17682235 -16497881 -11085367 -4246399 1224804
42299 1224804 3867826 3733369 1604036 -1892965 -5667261 -6952625 -3112730 3838136
42291 3838136 6816655 993684 -9253223 -14268462 -10380621 -3674988 -1190900 -2178193
42283 -2178193 -1295115 2383200 4385071 2245341 -976338 -1962862 -1955952 -3496642 -4913856
42274 -4913856 -1789781 6498684 14829230 17929716 16116739 14134312 15224418 17910300
42266 17910300 18659598 16163283 11863329 7297998 2999785 -14325 -218821 1771498
42258 1771498 2878225 1735039 761009 1447240 527855 -4486868 -8193458 -2619301 10126918
42249A0126918Q077385k345062m405152K993740O587782k74674p735703n860007
42241G165227Q4865k95832n256324m847837K069683O126569K187259m078302n964673
42232b809365m042390k047138r12345j73360m84004j525673r65274J900831M413149
42223f645569M398707K813002R19678j877383n350064o674197l789844J635672
42215a4569998O289497Q028357N743439j03073n336181m700778P60627L294089
42207e94021r88977n555093k625114M956455P882334M061560J18797m01094j547277
42198E307570n402661o535627j257566M267385K419472l534891l654622L670142
42190d720798R190145O425307M29821o41857K753881L487979j313052o645844
$$ plain form
42249 10126918 18204303 15859241 11454089 14447829 21035611 20760937 13025234 7165227
42241 7165227 7250092 6954260 1697936 -3149901 -1080218 5046351 7233610 3155308 -2809365
42232 -2809365 -6851755 -8898893 -9811238 -9984598 -10468602 -11994275 -12959549 -11058718 -6645569
42223 -6645569 -2246862 566140 1485818 -391565 -5741629 -12415826 -16205670 -14569998
42215 -14569998 -8280501 -252144 5491295 5388222 52041 -4648737 -3888110 -594021
42207 -594021 -1582998 -7138091 -9763205 -4806750 3075584 7137144 7255941 6854847 5307570
42198 5307570 -95091 -6630718 -7888284 -3620899 -1201427 -4736318 -8390940 -4720798
42190 -4720798 4469347 10894654 11324475 10682618 13436499 16924478 15611426 8965582
42182H965582o905628k688635J343553L063192M609425P382113P897265J746682
42174B5413549q390431j2906054o519876L666305O191386l35522o705570o578320
42166f164533l246391j132388J632858P192138J0911636P310994q32355o118551
42158I553408o488150m992126k367808K521244O520773M797077n11072k243864
42150F789482O63638K094891k18800j375825P40223J389373j291651j703405K465629
42141I553555L815676k718799r175237n619006L812513O802169J450308k384515
42133E536664M96134M069039K776362j92769l42323K67984k095775n431068m910600
42124A73648l04037L868137M169158J394455j071069l74041L158713N607761L328900
$$ plain form
42182 8965582 2059954 -628681 714872 3778064 8387489 15769602 23666867 25413549
42174 25413549 17023118 4117064 -2402812 1263493 7454879 7119357 413787 -6164533
42166 -6164533 -9410924 -10543312 -8910454 -1718316 9193320 16504314 15671959 9553408
42158 9553408 3065258 -1926868 -4294676 -1773432 4747341 9544418 9033346 6789482
42150 6789482 7453120 9548011 9329211 7953386 8693609 10082982 8791331 7087926 9553555
42141 9553555 13369231 10650432 1475195 -4143811 -331298 6470871 7921179 5536664
42133 5536664 6032798 10101837 12878199 12685430 12343107 12611091 10515316 5084248 173648
42124 173648 -130389 3737748 7906906 9301361 8230292 7856251 11014964 16622725 19951625
42115A9951625k111250m941331k138261K570369L062846k021454p757781q261223
42107a646460l032676K320115K385941j528306l457709j460166k56292l175356
42099i850909o023324l380704K587726N474140M492317M271826N601773L737456
42091F910301k646500p471264n482926K94648L076848J280060n54968J571057
42083c022744O137557P852371L719439k924737n760292l324999o24280j205739
42075H46576j919169M82626K251023j156726n392598k535941N404834Q044417
42067F025042K363487k896535j179812K932395L083408J052018J497646L496002
42059A6373651L510237J725115j03755k553670n321694m884411n07714K210466
$$ plain form
42115 19951625 17840375 12899044 10760783 13331152 16393998 14372544 6614763 -1646460
42107 -1646460 -4679136 -2359021 26920 -1501386 -4959095 -6419261 -6675553 -9850909
42099 -9850909 -15874233 -19254937 -16667211 -11193071 -6700754 -2428928 3172845 6910301
42091 6910301 4263801 -3207463 -8690389 -8395741 -5318893 -4038833 -4593801 -3022744
42083 -3022744 3114813 10967184 14686623 11761886 6001594 2676595 2052315 846576
42075 846576 -1072593 -589967 1661056 504330 -4888268 -7424209 -2019375 6025042
42067 6025042 8388529 5491994 4312182 7244577 10327985 11380003 12877649 16373651
42059 16373651 19883888 21609003 21505248 18951578 13629884 8745473 8237759 10448225
42051A0448225o14153m162333k077480L483074N518288K596172r75808k742248
42043A1473737l479781l165745j636387j322780l658601n012395j984552J919746
42035f866758J492558r34087Q14198N593949O190578J500507j533306L25646J655439
42026H238724j490741m356094j602499L255343K894265k635148o028733l247906
42018d972789J203712P58769m554302q190518n151056K004729O391606N030190
42010g479659J535517M54128J797801K588839J242540j442851l366280j709946
42002f379911M388726R905612P076279l933490j1903091p461406M207211R862936
41994E762866N275176j178573j439453K732072M719434J984696k566587m869997
$$ plain form
42051 10448225 9834072 5671739 3594259 7077333 12595621 15191793 14215985 11473737
42043 11473737 7993956 4828211 3191824 1869044 -1789557 -6801952 -8786504 -6866758
42035 -6866758 -5374200 -6308287 -5494089 99860 6290438 7790945 6257639 6583285 8238724
42026 8238724 6747983 2391889 789390 4044733 6938998 4303850 -1724883 -4972789
42018 -4972789 -3769077 -3010308 -7564610 -15755128 -20906184 -18901455 -12509849 -7479659
42010 -7479659 -5944142 -5490014 -3692213 -1103374 139166 -1303685 -4669965 -6379911
42002 -6379911 -1991185 7914427 14990706 11057216 -845875 -8307281 -4100070 5762866
41994 5762866 11038042 9859469 8420016 11152088 15871522 17856218 15289631 10419634
41986A0419634l274302N27631L302627L557663K039416j131578o301799j0058409
41978i19117o760965K126788O497787J245604m843156j963911M857973L741115
41970C982118m286022o626341P18174P845519P562264M275776K632490j68782
41962A5935196n092640n949348o90556K286992k431962o807144k006738O427783
41954A671583P233066J285479j284924J705279K700947q94359k312558J951259
41946A2055772N403440K073970l941479n267323k408536j647897m197841m137008
41938b066902J743841P304430M441376m999591j0090148m737876M299642O761355
41930B656127J884948l237828m752657m313331k362239K284574O250734L943213
$$ plain form
41986 10419634 7145332 7672963 10975590 14533253 16572669 15441091 9139292 -919117
41978 -919117 -7680082 -5553294 944493 2190097 -2653059 -4616970 241003 3982118
41970 3982118 -303904 -6930245 -6212071 1633448 9195712 13471488 16103978 15935196
41962 15935196 10842556 4893208 4202652 6489644 4057682 -2749462 -4756200 1671583
41954 1671583 8904649 10190128 8905204 10610483 13311430 12417071 10104513 12055772
41946 12055772 17459212 19533182 15591703 10324380 7915844 6267947 2070106 -2066902
41938 -2066902 -323061 6981369 11422745 6423154 -3666994 -8404870 -4105228 2656127
41930 2656127 4541075 1303247 -3449410 -7762741 -10124980 -7840406 -1589672 2353541
41922B353541k486494m443984m38782J219946l120121n674985r21630M014443
41914i498066J254647m092488k447399M396210P114790M269999K651209M551524
41906H200426N345888K930630J08281k060697m656519n304422r96314L916658
41898G483931J866852n339008p564050j525282M455242L645918j70266j168074
41890A685263q13391l074861o343260o127682k025955K833654O408358Q030037
41882E72163O908586L768596J490670J198953K19253l323070o567079n863232
41874a595160k587144j357844l263635m182974m24744O051248R367027O197390
41866H204164o38151n588716o228363l989925k18462M752463Q211395N633044
$$ plain form
41922 2353541 -132953 -4576937 -5015719 -3795773 -6915894 -12590879 -13512509 -9498066
41914 -9498066 -8243419 -12335907 -14783306 -10387096 -3272306 997693 3648902 8200426
41906 8200426 13546314 16476944 16585225 14524528 9868009 4563587 3567273 7483931
41898 7483931 9350783 4011775 -3552275 -5077557 -622315 3023603 2853337 1685263
41890 1685263 871872 -2202989 -8546249 -14673931 -16699886 -13866232 -7457874 572163
41882 572163 7480749 11249345 12740015 13938968 14158221 10835151 4268072 -1595160
41874 -1595160 -4182304 -5540148 -8803783 -12986757 -13411501 -7360253 2006774 8204164
41866 8204164 7566013 1977297 -4251066 -8240991 -8459453 -3706990 4504405 10137449
41858A0137449k681503r615142r423680m508485n25395J404924L282750M878503
41850g050579M948641M474078L604648p38548q416313j1808217n575749L357588
41842a7204451M529293n82681j954441K267914L977633M9486k695669J32283L657754
41833g822879K902757n9785j683785j980356j186390J237650K567486k79261l039332
41824i343895J092959Q267253P383340j388558n174919N02637M267093o38513
41816D967397m271444J041247M939379l080460j2794520q165187N756958J0202243
41808a404387K088268l536654N47847M296681J3991n135061k480154M712333Q006078
41799G108942N307926J31380m083106n264441l882999m285379q881768j1474870
$$ plain form
41858 10137449 7455946 -2159196 -11582876 -16091361 -16616756 -15211832 -11929082 -7050579
41850 -7050579 -2101938 2372140 5976788 5238240 -3178073 -14986290 -20562039 -17204451
41842 -17204451 -12675158 -13257839 -15212280 -12944366 -8966733 -8917247 -11612916 -11480633 -7822879
41833 -7822879 -4920122 -4979907 -6663692 -8644048 -9830438 -8592788 -6025302 -6304563 -9343895
41824 -9343895 -8250936 16317 7399657 6011099 836180 1338817 5605910 4967397
41816 4967397 695953 1737200 6676579 3596119 -9198401 -17363588 -11606630 -1404387
41808 -1404387 683881 -2852773 -2304926 1991755 2005746 -3129315 -5609469 -897136 7108942
41799 7108942 12416868 12548248 8465142 3200701 -682298 -4967677 -13849445 -25324315
41791b5324315m562881P180007J1110568N368620J687763O098872R219752K568902
41783A3347288o534790o219033J625916N179261L90928n617515p048282n737167
41775a0613394m331044j271546M360214Q324046N823700j218495n136678j641477
41767e704674M196337L885878k873579o869396k002116N541696N988292J9287
41759B181725l405227j197928Q41606p22320k096585p69884J93090j93960K179345
41750b990138P175698O991865j374953q493850n591202J750408K581706k410038
41742b360504l889898j17071J937068O38791K428402Q483785J0132007K480443
41734A9733023o586528p504627k323476J77646k102065l614380j153047K486808
$$ plain form
41791 -25324315 -29887196 -22707189 -11596621 -6228001 -4540238 1558634 10778386 13347288
41783 13347288 6812498 593465 2219381 7398642 7789570 2172055 -4876227 -10613394
41775 -10613394 -14944438 -16215984 -11855770 -3531724 2291976 1073481 -4063197 -5704674
41767 -5704674 -1508337 2377541 -496038 -7365434 -9367550 -3825854 2162438 2181725
41759 2181725 -1223502 -2421430 -1579824 -2302144 -4398729 -5168613 -4975523 -5169483 -2990138
41750 -2990138 4185560 11177425 9802472 1308622 -4282580 -2532172 49534 -2360504
41742 -2360504 -6250402 -6367473 -4430405 -3791614 -1363212 7120573 17252580 19733023
41734 19733023 13146495 5641868 3318392 3496038 1393973 -2220407 -3373454 -886646
41726h86646M582822N853092O340742L205959m304880j1051363j1006932m886314
41718a2153520O01214J102106q09791l10010L288173O896971Q201463O940475
41710A3757081L143063k302875n978074m954720j750517j872523n488778o610886
41702a2058229k689114P42120q06959k645887J345636P030520N179431l013455
41694f915937n813439J410814Q173175M139473n459984p952786j722129L263198
41686a0877615J762990j72636K961361O811718M932885n36982k612948r4448K320591
41677D494916K481133K453463K353159m18223m659196m906743k36793K620137
41669D181853r06056n535374l600886L719696Q561240P057175J859689l859333
$$ plain form
41726 -886646 3696176 9549268 15890010 19095969 14791089 3739726 -7267206 -12153520
41718 -12153520 -11552306 -10450200 -11259991 -11570001 -8281828 -1384857 6816606 13757081
41710 13757081 16900144 14597269 8619195 3664475 1913958 41435 -5447343 -12058229
41702 -12058229 -14747343 -14005223 -14812182 -17458069 -16112433 -9081913 -3902482 -6915937
41694 -6915937 -12729376 -11318562 -3145387 994086 -4465898 -12418684 -14140813 -10877615
41686 -10877615 -9114625 -9287261 -6325900 485818 5418703 4881721 2268773 2174325 4494916
41677 4494916 6976049 9429512 11782671 11364448 6705252 1798509 1561716 4181853
41669 4181853 3275797 -2259577 -5860463 -2140767 6420473 13477648 15337337 11478004
41661A1478004q240501p821573l77489Q594252R416307N45542q620879r774144
41653d800481m916722o92761P22518Q57580n6214k118654k891865k69082L716682
41644a0448999N500913M376632J621642j734881l494043o64877M993182O300505
41636F450074N48519m506207j164748N748114N467376k066031o054592j525396
41628B897109L874241K615390k064618l057037M0821K823946L426227K567796
41620A3123875K65415k536460k584256P68372K816347M02599k387735j014497
41612H853660J201973j133501m792595k285012M479339N516888q13582l805322
41604G221848K393534P933041K022320r356680j1585640l027687L678471J527946
$$ plain form
41661 11478004 3237503 -4584070 -4961559 3632693 13049000 13594542 4973663 -4800481
41653 -4800481 -9717203 -10409964 -9687446 -8829866 -8886080 -11004734 -13896599 -14165681 -10448999
41644 -10448999 -4948086 -571454 1050188 -684693 -4178736 -4843613 149569 6450074
41636 6450074 6998593 2492386 1327638 7075752 12543128 10477097 4422505 2897109
41628 2897109 6771350 9386740 7322122 4265085 4305906 7129852 10556079 13123875
41620 13123875 13389290 10852830 8268574 9036946 11853293 12255892 9868157 8853660
41612 8853660 10055633 8922132 4129537 1844525 6323864 11840752 11027170 7221848
41604 7221848 9615382 17548423 19570743 10214063 -1371577 -4399264 -720793 807153
41596H07153j771176J762306P256117N376370k871182p940825n331087q5946J601277
41587a196993n36339k936001l409063k820230l117089m046769k064409N164679
41579a4962214J2937386J2767745L767115m485592m610698j377424k605086n543925
41571d112693j911242O506326Q765870J766428m813474l556545R44389K093437
41563E682496J639854L406738M434031K90254o150312q782448p138050m552652
41555a1170089j416196K987352N548339L416099K17118J226829M713437M899860
41547A0422749J312846j735143k911107l969817m000480j111021J591553m65529
41539h65949m767035m644522q6851K670777J974784K226175M228100L613534K64863
$$ plain form
41596 807153 -964023 798283 8054400 13430770 10559588 2618763 -2712324 -2798270 -1196993
41587 -1196993 -1733332 -4669333 -8078396 -10898626 -14015715 -18062484 -20126893 -14962214
41579 -14962214 -2024828 10742917 14510032 10024440 5413742 4036318 1431232 -4112693
41571 -4112693 -6023935 482391 9248261 11014689 6201215 2644670 3589059 5682496
41563 5682496 7322350 10729088 15163119 15453373 9303061 520613 -6617437 -11170089
41555 -11170089 -12586285 -9598933 -4050594 -634495 -417377 809452 5522889 10422749
41547 10422749 11735595 10000452 7089345 3119528 -880952 -1991973 -400420 -865949
41539 -865949 -5632984 -10277506 -10364357 -7693580 -5718796 -3492621 735479 4349013 4613876
41530D613876n37996J279006r40922p825428j0108782l035221N172254O185036
41522e198177L822810N030864O760479K117449o286768r935130p584496m553750
41514a5826719j763649L790677R192848P487015M4474l587441m24168J464520
41506C77557k937827o633314k189947N391555N903603m40000l739276L24750M536985
41497E94086J641847m881676o239239q81984M043859L314468K97320P28471L878565
41488B495717M253532K42418l910167m752244l354525j234425K387847O526121
41480B654274O374656o1687o440120m694351L942908R641324O032875k539774
41472A4910105o915837l265483L937590P190646L227310l952887p057016l152042
$$ plain form
41530 4613876 4075880 5354886 4413964 -3411464 -13520246 -16555467 -11383213 -5198177
41522 -5198177 -1375367 3655497 10415976 12533425 6246657 -3688473 -11272969 -15826719
41514 -15826719 -17590368 -13799691 -4606843 2880172 2924646 -662795 -1086963 377557
41506 377557 -2560270 -9193584 -11383531 -5991976 -88373 -528373 -4267649 -3942899 594086
41497 594086 2235933 -2645743 -8884982 -9766966 -5723107 -2408639 -2111319 -1382848 2495717
41488 2495717 6749249 6991667 3081500 -1670744 -5025269 -6259694 -3871847 2654274
41480 2654274 9028930 8967243 2527123 -2167228 1775680 11417004 17449879 14910105
41472 14910105 7994268 4728785 8666375 15857021 19084331 15131444 8074428 4922386
41464D922386L185493N062357M62870o629188j0556424q039113J1628Q476082
41456c103909J1332960P216631O12028l736717n323304n244835k750716K018416
41448A020554M902200K110965l846007p049807n765966k930073m71780J957565
41440a0072349L419662K073955p42670j497123J68797J366491J295824J963175
41432b024238L277729K483502n00113k043388o42327O96940l11682j809595j620357
41423b493529o63471k86520M97714K695206M666339L790796n30111n954165p947159
41414f224900k984421O085634J0255992M738428l263954l700935J639795K498875
41406I044514k770976m821348O0317L301106o86678m524188j292956K913445M51710
$$ plain form
41464 4922386 8107879 13170236 13633106 7003918 -3552506 -11591619 -11579991 -3103909
41456 -3103909 8229051 15445682 16057710 12320993 6997689 1752854 -997862 1020554
41448 1020554 5922754 8033719 4187712 -2862095 -8628061 -11558134 -12029914 -10072349
41440 -10072349 -6652687 -4578732 -5321402 -6818525 -6649728 -5283237 -3987413 -2024238
41432 -2024238 1253491 3736993 3236880 1193492 551165 1248105 936423 -873172 -2493529
41423 -2493529 -3157000 -3443520 -2945806 -250600 4415739 8206535 7676424 1722259 -6224900
41414 -6224900 -9209321 -3123687 7132305 11870733 8606779 4905844 6545639 9044514
41406 9044514 6273538 1452190 1512507 4813613 4126935 -397253 -1690209 1223236 1674946
41397A674946l265479M19828O293594L011085o388957q020125j81160L944176
41389b512092q41307k835671N785042J4068297R016552l597610q031511j805906
41381I245794L014202n17375n578632m285505O73633J632680k598037n914917
41373d328157l423467K927156P227599O260796K273047o81668j667371k458143
41365F129792l180013j597389K589446N975687N662679K551246j315468n698624
41357A1117356r884445j0360305m726113L268032O389107J975415m986430p246374
41349a4453757k501241M721130P665245M187502j107155k750202j429622j816104
41341g484204l827816j774908N522908J0002248N094897l556148n363910K0738
$$ plain form
41397 1674946 -1590533 -1170705 5122889 8133974 1745017 -6275108 -6456268 -2512092
41389 -2512092 -3353399 -6189070 -404028 13664269 22680821 19083211 11051700 9245794
41381 9245794 12259996 11742621 6163989 1878484 2552117 4184797 1586760 -4328157
41373 -4328157 -7751624 -4824468 2403131 8663927 10936974 10255306 8587935 6129792
41365 6129792 2949779 1352390 3941836 9917523 15580202 18131448 16815980 11117356
41357 11117356 1232911 -9127394 -13853507 -10585475 -4196368 -2220953 -7207383 -14453757
41349 -14453757 -16954998 -12233868 -4568623 -381121 -1488276 -4238478 -5668100 -7484204
41341 -7484204 -11312020 -13086928 -7564020 2438228 7533125 3976977 -1386933 -1366195
41333a366195L180168q580k879203N3165M006115K115198l320294m563045k20481
41324c003152L462474K198623j425649l330909l246492k681361j400851J126899
41316h300418K978710J751156j327687k248452K53764K666859J898070K47041
41308b080957J877879N264757L872253l999949j0606661q068116O80393N554983
41300g505418K648105j941098j873619J796375M626941M974797L212239m46355
41292E491967l758322k543566K843225N439370J109296m221810l188738J081713
41284B253135J38038n071272m993025K496038P689683M226018j499652k072076
41276C166887r44234m000039o805816j526085P775775R134369J096637m954236
$$ plain form
41333 -1366195 1813973 1805393 -1073810 -1020645 2985470 5100668 1780374 -2782671 -3003152
41324 -3003152 459322 2657945 1232296 -2098613 -5345105 -8026466 -9427317 -8300418
41316 -8300418 -5321708 -3570552 -4898239 -7146691 -6892927 -4226068 -2327998 -2080957
41308 -2080957 -203078 5061679 8933932 4933983 -5672678 -13740794 -13060401 -7505418
41300 -7505418 -4857313 -6798411 -8672030 -6875655 -2248714 2726083 5938322 5491967
41292 5491967 1733645 -809921 2033304 7472674 8581970 4360160 1171422 2253135
41284 2253135 2391173 -2680099 -7673124 -5177086 2512597 6738615 5238963 3166887
41276 3166887 2222653 -1777386 -8583202 -10109287 -2333512 6800857 7897494 2943258
41268B943258k666985P75751j479140m508186j731146K241969q04017p543796
41260a2772292p011483J901319P984203M483744j522247r95091L686494L888643
41252c56710j600213n501682k950552L096400P547077Q751160P000204K243108
41244A8228792l836609o782964m085544O38978J664735j298665l151806j259040
41236A17877P38417r46603l765078k511073K170309L921787o3021m581786l682178
41227h601349J314224M712825M770187M415301M715126K934284j812113n609609
41219F838876n049538k208730j255653k390703k543246o97541J005848J056457
41211e244230K50069n25884j197233p59387K236553O235514O717133J905759l806013
$$ plain form
41268 2943258 276273 1052024 -427116 -4935302 -6666448 -4424479 -5228496 -12772292
41260 -12772292 -19783775 -17882456 -9898253 -5414509 -6936756 -7931847 -4245353 -356710
41252 -356710 -1956923 -7458605 -10409157 -7312757 234320 8985480 15985684 18228792
41244 18228792 14392183 7609219 3523675 4162653 5827388 4528723 1376917 117877
41236 117877 856294 -90309 -3855387 -6366460 -4196151 -274364 -337385 -4919171 -8601349
41227 -8601349 -7287125 -2574300 2195887 6611188 11326314 14260598 12448485 6838876
41219 6838876 1789338 -419392 -1675045 -4065748 -6608994 -7306535 -6300687 -5244230
41211 -5244230 -4994161 -5520045 -6717278 -7476665 -5240112 995402 7712535 9618294 5812281
41202E812281m907717j729494Q33832P21243Q43058L016283L811919m57163o916432
41193A027810q404817k536613N019237P537761M694876R58618j177769k998973
41185D120130n279663n895343l061433J454970M235281L960454J708109j105219
41177A37286l070625k264233J721780N256904L275039m203860j0472902r270056
41169a8890667k258842L012559K217727j182685j121927L479917Q032106Q160813
41161A449001M252576L160j785215r32931J349608L639958M445761L021206P29145
41152A6172269P6099J278953J260256k081764n739287m575342J421969N812524
41144A3625677L122277m466548r733567q397478k598863K593041M055835K286876
$$ plain form
41202 5812281 904564 -824930 8902 730145 1573203 4589486 8401405 7944242 1027810
41193 1027810 -7377007 -9913620 -4894383 2643378 7338254 8296872 7119103 4120130
41185 4120130 -1159533 -7054876 -10116309 -8661339 -4426058 -465604 1242505 137286
41177 137286 -2933339 -5197572 -3475792 1781112 5056151 852291 -9620611 -18890667
41169 -18890667 -21149509 -18136950 -15919223 -17101908 -18223835 -14743918 -6711812 1449001
41161 1449001 5701577 5704737 3919522 2986591 4336199 7976157 12421918 15443124 16172269
41152 16172269 16248368 17527321 18787577 16705813 10966526 6391184 7813153 13625677
41144 13625677 16747954 12281406 2547839 -5849639 -8448502 -5855461 -1799626 487250
41136D87250p78o31244P295P9852l03901J337275N415842P596075L676537l911671
41126A3752532q136965n995513j670028l25181k041666l406163k354658N33559
41118i644083L640063N429768N230741L843919K096781j019228o098646r442003
41110e962688n949232K616804P251223K975357l818135l864213K504378O820755
41102B574249M336325j217730l941449j891107K810516N876637L609413k413204
41094I743650n129013j011809L348726O6102p280137q480716l032553p15615m541395
41085a7032760n434447J188452N851587Q46251m972057N56040J2184546J4079435
41077G267047L951154m272496k191258K590101J317278k883989l243932j084708
$$ plain form
41136 487250 486472 -144772 -137477 -57625 -361526 975749 6391591 13987666 17664203 13752532
41126 13752532 5615567 -379946 -2049974 -2375155 -4416821 -7822984 -10177642 -9644083
41118 -9644083 -6004020 -574252 4656489 8500408 10597189 9577961 3479315 -5962688
41110 -5962688 -11911920 -9295116 -2043893 931464 -2886671 -6750884 -4246506 2574249
41102 2574249 6910574 5692844 1751395 -139712 2670804 8547441 12156854 9743650
41094 9743650 4614637 3602828 6951554 7017656 -262481 -8743197 -11775750 -12491365 -17032760
41085 -17032760 -22467207 -21278755 -15427168 -14580917 -19552974 -18996934 -6812388 7267047
41077 7267047 11218201 6945705 4754447 7344548 8661826 5777837 2533905 1449197
41069A449197j411313l166839j806760K203589M380904L441723J816965N82734
41061G490200j146058k840767k869805j550769n13795J85002J380242K295320
41053B429570J665062M10219M11062J465096J961899J551925P04686j060460l705183
41044E833876m760829k230747J367825J444573k122097m198237j019301M854194
41036h30743P419394L844110k490337n279888k126570K002285L57918n884070
41028b987901p460271M09723R512739Q624643n64344n435422n30588N082598K128017
41019H779194n095708o139899l93216L155452M11654k659529j054445J210338
41011a786159j163218m899190l088763K781120L785063k596149p085854j352599
$$ plain form
41069 1449197 37884 -3128955 -4935715 -2732126 1648778 5090501 6907466 7490200
41061 7490200 6344142 3503375 633570 -917199 -1430994 -1245992 134250 2429570
41053 2429570 4094632 4504851 4915913 6381009 8342908 9894833 10599519 9539059 5833876
41044 5833876 1073047 -1157700 210125 1654698 -467399 -4665636 -5684937 -830743
41036 -830743 6588651 10432761 7942424 2662536 535966 2538251 2896169 -2987901
41028 -2987901 -10448172 -10038449 -525710 8098933 7534589 2099167 1568579 6651177 8779194
41019 8779194 3683486 -2456413 -2849629 305823 717477 -1942052 -2996497 -1786159
41011 -1786159 -2949377 -7848567 -10937330 -8156210 -4371147 -6967296 -14053150 -15405749
41003a5405749R229564J2139099M595741l573320m396936j532783k077221n045945
40995f067550m355407L89149L423618K186869L06516N78289J256594J048891J786479
40986E53448L361542J818288l537444o594174l272898J109152J90359k063294
40978h435021K380794J0219830R176850k460898j0382886m393170N953298N323077
40970G381874m819510r457001k660839N673843O500524L003612J163121n90452
40962F195172n298539q910620o303359q48080N73797j117924N74038O008417Q633806
40953d93292N777667J851633k51959k773118n829120m702769J474390N505845
40945E59277K185444l210596k918428J393433K097024j832580l727554k60068
$$ plain form
41003 -15405749 -6176185 5962914 10558655 6985335 2588399 1055616 -1021605 -6067550
40995 -6067550 -10422957 -10033808 -6610190 -4423321 -4116805 -3538516 -2281922 -1233031 553448
40986 553448 3914990 5733278 2195834 -4398340 -7671238 -6562086 -6371727 -8435021
40978 -8435021 -6054227 4165603 13342453 10881555 498669 -3894501 2058797 7381874
40970 7381874 2562364 -6894637 -9555476 -3881633 2618891 5622503 6785624 6195172
40962 6195172 896633 -8013987 -14317346 -15165426 -14591629 -15709553 -15135515 -9127098 -493292
40953 -493292 5284375 7136008 6884049 4110931 -1718189 -6420958 -4946568 559277
40945 559277 2744721 -465875 -3384303 -1990870 106154 -1726426 -5453980 -5714048
40937e714048L785809L327876j91053k280039j562513K07746J496960J878789
40929I49527J216600j21834j015994o17862P39029J797458J242631r34401k408570
40920H46584n19321L497232M624399O86287l736094l510268o77736j091795m798857
40911d679569n760697j413692L514878M417389K570742R20586r29953l939726
40903e300042n740974l578766J347329N745421Q153705Q272429N224812k10512
40895A3913402m273795m703373m027455m671437l863071J357889O508251L955052
40887D195463n338312j1263193p561636O11614N018671M839392M487571N095317
40879H4887L979948R27348o51536P06696K135858Q94402k097633m579381n785949
$$ plain form
40937 -5714048 -1928239 1399637 1208584 -1071455 -2633968 -2426222 -929262 949527
40929 949527 2166127 2044293 1028299 410437 1149466 2946924 4189555 3255154 846584
40920 846584 327263 3824495 8448894 9135181 5399087 1888819 1211083 119288 -4679569
40911 -4679569 -10440266 -11853958 -8339080 -3921691 -1350949 -430363 -1360316 -5300042
40903 -5300042 -11041016 -14619782 -13272453 -7527032 626673 8899102 14123914 13913402
40895 13913402 9639607 4936234 908779 -3762658 -7625729 -6267840 240411 4195463
40887 4195463 -1142849 -12406042 -19967678 -19356064 -14337393 -9498001 -5010430 84887
40879 84887 4064835 4992183 4340647 5047343 7183201 8077603 5979970 1400589 -4385360
40870d385360n131622j127689N293614Q707190M797779k669024n171370m62308
40862a48790M520591L907708J071573K266578O276181O858664L333760J027982
40854B9114247J047289k020226r282952j2458378n498316M771224P247403J917440
40846A4837731j805212r8995J289410j298350l259682q48071J582523p88250m437964
40837E173140l343450M29008k06057n516737q098716m209269J286705L243087
40829a1242289L052686L871511M562521K945857R66786J483201K704022J025709
40821I370004k605044m441680m371906m734870m002019J137667P242916O049110
40813C644178k448297p142680j065091P889233Q389094J656806k568662j507037
$$ plain form
40870 -4385360 -9516982 -10644671 -5351057 3356133 8153912 5484888 313518 -148790
40862 -148790 4371801 8279509 9351082 11617660 17893841 24752505 28086265 29114247
40854 29114247 30161536 28141310 18858358 6399980 901664 5672888 12920291 14837731
40846 14837731 13032519 12933524 14222934 12924584 9664902 8816831 10399354 9611104 5173140
40837 5173140 1829690 2258698 2052641 -3464096 -11562812 -15772081 -14485376 -11242289
40829 -11242289 -8189603 -4318092 244429 3190286 4157072 5640273 8344295 9370004
40821 9370004 6764960 2323280 -2048626 -6783496 -10785515 -9647848 -2404932 3644178
40813 3644178 1195881 -5946799 -7011890 877343 9266437 10923243 8354581 6847544
40805F847544p33210k401907k682976r09198r80137k220146R75892P654912Q802119
40796A4352893J713506m289852k551869N85111j723900l774625J989647R074898
40788A5375809N742779m652763p328896O44889N972945Q63789n308146k462797
40780H847609M397920N119158R14332N3788K690360J376301n173162r166276n763175
40771C296855j1611J057745k271962m352983k069163K316665M671232L199069
40763E835847k92367k250964q59820J941772K446201n23534l919747l785696k20479
40754a628787K004951r75663o429650p355043j387352N542650O843338L628914
40746B43358J434263J032009j409480n558840n496382O77564O167263M609360
$$ plain form
40805 6847544 6114334 3712427 1029451 120253 -859884 -3080030 -2104138 5550774 14352893
40796 14352893 16066399 11776547 9224678 9809789 8085889 4311264 6300911 15375809
40788 15375809 21118588 16465825 9136929 9781818 15754763 16618552 11310406 8847609
40780 8847609 13245529 18364687 19279019 19332807 22023167 23399468 18226306 9060030 3296855
40771 3296855 3285244 4342989 2071027 -2281956 -4351119 -2034454 2636778 5835847
40763 5835847 5543480 3292516 2432696 4374468 6820669 6297135 2377388 -1408308 -1628787
40754 -1628787 376164 -599499 -7029149 -14384192 -15771544 -10228894 -3385556 243358
40746 243358 1677621 2709630 1300150 -4258690 -9755072 -9077508 -2910245 1699115
40738A699115q76178k761767J09158K327091Q03656j572005j326070P36897J334593
40729D74490q62954l610939l262514J141817N818146N895597J548731k112647
40721E029727k240587j768827l491527m545468r50333N054226P226853L841591
40713H155655n90603j949863q53535j05861j316761m580224q399014r259574m266944
40704b3166724M485551J0354176Q574862J380806m242024l619528J154511L988412
40696a089958K027199j141804r57686J296273Q50802k407981l646256j446507
40688f515918O7675m67447J263731N781883N629834k373259q434982l207554O239469
40679b016568O068687k609688n770147P03152N402731J254786l952948k855237
$$ plain form
40738 1699115 822937 -1938830 -1829672 497419 1301075 -270930 -1597000 -860103 474490
40729 474490 -388464 -3999403 -7261917 -6120100 -301954 5593643 7142374 5029727
40721 5029727 2789140 1020313 -2471214 -7016682 -7967015 -2912789 4314064 8155655
40713 8155655 7565052 5615189 4761654 4655793 3339032 -1241192 -9640206 -18899780 -23166724
40704 -23166724 -18681173 -8326997 247865 1628671 -2613353 -6232881 -5078370 -1089958
40696 -1089958 937241 -204563 -1162249 134024 984826 -1423155 -5069411 -6515918
40688 -6515918 -6448243 -6915690 -5651959 129924 5759758 3386499 -5048483 -8256037 -2016568
40679 -2016568 4052119 1442431 -4327716 -3624564 1778167 3032953 -919995 -3775232
40671c775232n17615k390009k463339N065985J1998914P468985l415516o485089
40663E487084m92496K394983k441980n185107R88517Q241592O401879k089949
40655A3304523p068373m766379n3176K126484J576274N60731Q73392K489929L019096
40646A2062501R0476m378182n181431r62632L099365K516879j07188J35954K208364
40637I484106R41282m035814o718779l080461L288849N915659L017663j736361
40629G076144m209278l538343j827114j643915l553584n535604n316951l139860
40621b1688505q02332J922496P168496J4017660J6771452J1424872J991954l679980
40613B7126113l647010k895325m467819n007216j499088K503717J691097l112338
$$ plain form
40671 -3775232 -4292847 -6682856 -9146195 -4080210 7918704 15387689 11972173 5487084
40663 5487084 4994588 7389571 4947591 -237516 751001 8992593 15394472 13304523
40655 13304523 6236150 1469771 1416595 3543079 5119353 5680084 6553476 9043405 12062501
40646 12062501 12152977 7774795 2593364 1630732 4730097 7246976 7139788 7275742 9484106
40637 9484106 10425388 6389574 -329205 -3409666 -120817 5794842 8812505 7076144
40629 7076144 2866866 -671477 -2498591 -4142506 -7696090 -13231694 -18548645 -21688505
40621 -21688505 -22490837 -20568341 -13399845 617815 17389267 28814139 30806093 27126113
40613 27126113 23479103 20583778 16115959 11108743 9609655 12113372 13804469 10692131
40605A0692131o371889n158688r76259L700822O374875M170661k247955o249231
40597C934467k874435K456864L11833p941917j0475055k152127P648556Q719182
40589c72632L350849j03119O7198K02588j58399P52015J086762j420595l238625
40580A66042j05436L949379J299273o660469j0432533o217215l15209J548879
40572a6767289J239625K169645L407257L005440J644555L10060r57587n78376
40564f526670L096854O951636N762311N69243k357904j741954k425928m893219
40556a565631l356178K509407M426013o40263m118110m42073K757156j383962
40548a813641n303094K8028P356773L901190o171918p496780R11361M441799j629882
$$ plain form
40605 10692131 4320242 -838446 -1814705 1886117 8260992 12431653 10183698 3934467
40597 3934467 1060032 3516896 3828729 -4113188 -14588243 -16740370 -9091814 -372632
40589 -372632 2978217 2875098 2942296 3144884 2986485 3738500 4825262 3404667 166042
40580 166042 60606 4009985 5309258 -1351211 -11783744 -18000959 -18316168 -16767289
40572 -16767289 -15527664 -13358019 -9950762 -6945322 -5300767 -4990707 -5948294 -6526670
40564 -6526670 -3429816 3521820 9284131 9853374 7495470 5753516 3327588 -1565631
40556 -1565631 -4921809 -2412402 2013611 1373348 -2744762 -3186835 -429679 -1813641
40548 -1813641 -7116735 -7088707 268066 4169256 -2002662 -9499442 -8588081 -4146282 -5776164
40539e776164m443417L166255R586028M419960l518545j204282O842451O532892
40531A5605178k951979r048471n625047K94100J515353n41545j535871m15063
40523b703345J641682K577981j94731n474219o278454J023562Q161443M539091
40515C293010o164307r728169k202971M917770L522857N39800M007907Q622143
40507F808040N420753k099936l571492J096124K519077j766899l920596j61459
40499D323612K854038J79045k633514N71541N165724K478026o123485j0310700
40491c495713n032556L455018O730614L746129p20283k797749k031636m4434O25514
40482D34904j847075n835075o620040j750725N112844Q063815N808883K181971
$$ plain form
40539 -5776164 -10219581 -7053326 2532702 6952662 3434117 2229835 9072286 15605178
40531 15605178 12653199 3604728 -2020319 -1726219 -210866 -752411 -2288282 -2703345
40523 -2703345 -1061663 1516318 1321587 -4152632 -10431086 -9407524 -1246081 3293010
40515 3293010 -2871297 -12599466 -14802437 -9884667 -6361810 -5822010 -1814103 6808040
40507 6808040 12228793 10128857 6557365 7653489 10172566 8405667 4485071 4323612
40499 4323612 7177650 7356695 4723181 5294722 10460446 12938472 6814987 -3495713
40491 -3495713 -8528269 -5073251 1657363 5403492 4683209 1885460 -146176 -190610 434904
40482 434904 -1412171 -7247246 -13867286 -15618011 -10505167 -2441352 3367531 5549502
40474E549502N14191N96990J215257K023913J730151j882875p644492r900003
40466g797366n268191J784681M213642J635962l75607O86588J588051K89354l96130
$$ plain form
40474 5549502 6063693 6660683 7875940 9899853 11630004 9747129 2102637 -7797366
40466 -7797366 -13065557 -11280876 -7067234 -5431272 -5806879 -5120291 -3532240 -3242886 -3639016
$$ [...]
##END NTUPLES=NMR SPECTRUM
##END=
