##TITLE=31Pdec_LR-684B-C1-TFA
 CDCl3, 24 sc
 30.7.2019
##JCAMPDX= 6.0         $$ Bruker NMR JCAMP-DX V2.0
##DATA TYPE= NMR SPECTRUM
##DATA CLASS= NTUPLES
##ORIGIN= UXNMR, Bruker Analytische Messtechnik GmbH
##OWNER= root
$$ XWIN-NMR		Version 3.5
$$ Tue Jul 30 16:37:15 2019 Russian Standard Time (UT+4h)  she@DPX200
##.OBSERVE FREQUENCY= 81.013821
##.OBSERVE NUCLEUS= ^31P
##.ACQUISITION MODE= SIMULTANEOUS
##.ACQUISITION SCHEME= undefined
##.AVERAGES= 24
##.DIGITISER RES= 17
##SPECTROMETER/DATA SYSTEM= spect
##.PULSE SEQUENCE= zgpg30
##.SOLVENT NAME= CDCl3
##.SHIFT REFERENCE= (INTERNAL, CDCl3, 0, 182.463)
##AUDIT TRAIL= $$ (NUMBER, WHEN, WHO, WHERE, WHAT)
$$ ##TITLE= Audit trail, XWIN-NMR		Version 3.5
$$ ##JCAMPDX= 5.01
$$ ##ORIGIN= Bruker BioSpin GmbH
$$ ##OWNER= she
$$ F:/spectra/data/she/nmr/P31/1/pdata/1/auditp.txt
$$ ##AUDIT TRAIL=  $$ (NUMBER, WHEN, WHO, WHERE, WHAT)
(   1,<2019-07-30 16:36:18.26 +0400>,<she>,<DPX200>,
      <created by zg, POWCHK disabled, PULCHK disabled
       configuration hash MD5:
       00 E9 B6 7A A2 85 ED C7 34 08 36 98 17 FE 4E 26
       data hash MD5: 32K
       54 EE FC FD E0 6E F9 F0 67 03 57 B9 BD 0B 44 6C>)
(   2,<2019-07-30 16:36:36.81 +0400>,<she>,<DPX200>,
      <Start of raw data processing
       efp BC_mod = 2 LB = 1 FT_mod = 6 PKNL = 1 PHC0 = -589.0526 PHC1 = 680.4003 SI = 64K 
       data hash MD5: 64K
       3C 40 B1 D1 44 51 42 7B 9C 4E AC 36 A4 33 6B 79>)
(   3,<2019-07-30 16:36:48.12 +0400>,<she>,<DPX200>,
      <pk PHC0 = 1.454032 PHC1 = 0 
       data hash MD5: 64K
       77 68 1D 00 F4 60 B2 45 21 35 C8 2D FE 78 AF B8>)
$$ ##END=
$$ 
$$ hash MD5
$$ 47 65 50 4A 0D 4A 74 06 8A C3 BB 30 C2 65 B0 FA
##$RELAX= 
##$RELAX= 
##$RELAX= 
##$RELAX= 
##$RELAX= 
##$RELAX= 
##$RELAX= 
##$RELAX= 
$$ Bruker specific parameters
$$ --------------------------
##$DU= <F:/spectra>
##$EXPNO= 1
##$NAME= <P31>
##$PROCNO= 1
##$TYPE= <nmr>
##$USER= <she>
##$AMP= (0..31)
100 100 100 100 100 100 100 100 100 100 100 100 100 100 100 100 100 100 
100 100 100 100 100 100 100 100 100 100 100 100 100 100 
##$AQSEQ= 0
##$AQ_mod= 1
##$AUNM= <au_zg>
##$AUTOPOS= <>
##$BF1= 81.014009
##$BF2= 200.13
##$BF3= 200.13
##$BF4= 200.13
##$BF5= 200.13
##$BF6= 200.13
##$BF7= 200.13
##$BF8= 200.13
##$BYTORDA= 1
##$CFDGTYP= 0
##$CFRGTYP= 5
##$CHEMSTR= <none>
##$CNST= (0..31)
1 1 145 1 1 1 1 1 1 1 1 1 1 1 1 1 1 1 1 1 1 1 1 1 1 1 1 1 1 1 1 1 
##$CPDPRG= <waltz16>
##$CPDPRG1= <>
##$CPDPRG2= <waltz16>
##$CPDPRG3= <>
##$CPDPRG4= <mlev>
##$CPDPRG5= <mlev>
##$CPDPRG6= <mlev>
##$CPDPRG7= <mlev>
##$CPDPRG8= <mlev>
##$CPDPRGB= <>
##$CPDPRGT= <>
##$D= (0..31)
0 1 0 0 0 0 0 0 0 0 0 0.03 2e-05 3e-06 0 0 0 0 0 0 0 0 0 0 0 0 0 0 0 0 
0 0 
##$DATE= 1564490177
##$DBL= (0..7)
120 120 120 11 120 120 24 19 
##$DBP= (0..7)
150 150 150 150 150 150 150 150 
##$DBP07= 0
##$DBPNAM0= <>
##$DBPNAM1= <>
##$DBPNAM2= <>
##$DBPNAM3= <>
##$DBPNAM4= <>
##$DBPNAM5= <>
##$DBPNAM6= <>
##$DBPNAM7= <>
##$DBPOAL= (0..7)
0.5 0.5 0.5 0.5 0.5 0.5 0.5 0.5 
##$DBPOFFS= (0..7)
$$ [...]
##$SUBNAM2= <"">
##$SUBNAM3= <"">
##$SUBNAM4= <"">
##$SUBNAM5= <"">
##$SUBNAM6= <"">
##$SUBNAM7= <"">
##$SUBNAM8= <"">
##$SUBNAM9= <"">
##$SW= 369.568048894756
##$SWIBOX= (0..15)
0 1 3 0 0 0 0 0 0 0 0 0 0 0 0 0 
##$SW_h= 29940.119760479
##$TD= 32768
##$TD0= 1
##$TE= 0
##$TE2= 300
##$TE3= 300
##$TEG= 300
##$TL= (0..7)
0 120 53 12 22 120 120 120 
##$TP= (0..7)
150 150 150 150 150 150 150 150 
##$TP07= 0
##$TPNAME0= <>
##$TPNAME1= <>
##$TPNAME2= <>
##$TPNAME3= <>
##$TPNAME4= <>
##$TPNAME5= <>
##$TPNAME6= <>
##$TPNAME7= <>
##$TPOAL= (0..7)
0.5 0.5 0.5 0.5 0.5 0.5 0.5 0.5 
##$TPOFFS= (0..7)
0 0 0 0 0 0 0 0 
##$TUNHIN= 0
##$TUNHOUT= 0
##$TUNXOUT= 0
##$USERA1= <user>
##$USERA2= <user>
##$USERA3= <user>
##$USERA4= <user>
##$USERA5= <user>
##$V9= 5
##$VALIST= <valist>
##$VCLIST= <CCCCCCCCCCCCCCC>
##$VD= 0
##$VDLIST= <DDDDDDDDDDDDDDD>
##$VPLIST= <PPPPPPPPPPPPPPP>
##$VTLIST= <TTTTTTTTTTTTTTT>
##$WBST= 1024
##$WBSW= 4
##$XGAIN= (0..3)
0 0 0 0 
##$XL= 0
##$YL= 0
##$YMAX_a= 18161
##$YMIN_a= -20541
##$ZGOPTNS= <>
##$ZL1= 120
##$ZL2= 120
##$ZL3= 120
##$ZL4= 120
##$ABSF1= 0
##$ABSF2= 0
##$ABSG= 0
##$ABSL= 0
##$ALPHA= 0
##$AQORDER= 0
##$ASSFAC= 0
##$ASSFACI= 0
##$ASSFACX= 0
##$ASSWID= 0
##$AUNMP= <proc_1d>
##$AZFE= 0.1
##$AZFW= 0.5
##$BCFW= 0
##$BC_mod= 2
##$BYTORDP= 0
##$COROFFS= 0
##$CY= -3
##$DATMOD= 1
##$DC= 0
##$DFILT= <>
##$DTYPP= 0
##$F1P= 0
##$F2P= 0
##$FCOR= 1
##$FTSIZE= 65536
##$FT_mod= 6
##$GAMMA= 0
##$GB= 0
##$INTBC= 1
##$INTSCL= 5.30512e-09
##$ISEN= 30
##$LB= 1
##$LEV0= 0
##$LPBIN= 0
##$MAXI= 10000
##$MC2= 0
##$MEAN= 0
##$ME_mod= 0
##$MI= 50
##$NCOEF= 0
##$NC_proc= -7
##$NLEV= 6
##$NOISF1= 182.463
##$NOISF2= 159.3651
##$NSP= 0
##$NTH_PI= 0
##$NZP= 0
##$OFFSET= 182.463
##$PC= 4
##$PHC0= -587.5986
##$PHC1= 680.4003
##$PH_mod= 1
##$PKNL= yes
##$PPARMOD= 0
##$PSCAL= 0
##$PSIGN= 0
##$REVERSE= no
##$SF= 81.0140089999434
##$SI= 65536
##$SIGF1= 159.3651
##$SIGF2= -187.1042
##$SINO= 113.3802
##$SIOLD= 16384
##$SREGLST= <1H.CDCl3>
##$SSB= 0
##$STSI= 65536
##$STSR= 0
##$SW_p= 29940.119760479
##$SYMM= 0
##$S_DEV= 0
##$TDeff= 32768
##$TDoff= 0
##$TI= <>
##$TILT= no
##$TM1= 0
##$TM2= 0
##$TOPLEV= 0
##$USERP1= <user>
##$USERP2= <user>
##$USERP3= <user>
##$USERP4= <user>
##$USERP5= <user>
##$WDW= 1
##$XDIM= 65536
##$YMAX_p= 517431228
##$YMIN_p= -28217731
$$ End of Bruker specific parameters
$$ ---------------------------------
##NTUPLES= NMR SPECTRUM
##VAR_NAME=  FREQUENCY,     SPECTRUM/REAL,   SPECTRUM/IMAG
##SYMBOL=    X,             R,               I
##VAR_TYPE=  INDEPENDENT,   DEPENDENT,       DEPENDENT
##VAR_FORM=  AFFN,          ASDF,            ASDF
##VAR_DIM=   65536,         65536,           65536
##UNITS=     HZ,            ARBITRARY UNITS, ARBITRARY UNITS
##FACTOR=    0.456856943014862, 1,           1
##FIRST=     14782.0589164792, 0,            0
##LAST=      -15158.0608439998, 0,           0
##MIN=       -15158.0608439998, -28217731,   0
##MAX=       14782.0589164792, 517431228,    0
$$ Real data points
##PAGE= N=1
##DATA TABLE= (X++(R..R)), XYDATA
$$ [...]
$$ plain form
46212 4452523 1355035 220825 1634213 5133660 9624397 13141102 13696371 11420787
46204 11420787 8800674 7690344 6999890 4564793 490101 -2943101 -4374777 -4703256
46196 -4703256 -5062881 -4958994 -3326168 -560858 1658907 2370536 2127163 1660002 782432
46187 782432 -639455 -1398284 36557 3198673 5588076 5474437 3768027 2467968 2192649
46178 2192649 2114587 1488299 149963 -1755460 -3195527 -1990248 3082845 9834689 13996370
46169 13996370 13687104 11402062 10765468 12161067 12602864 9706798 4881089 2042133
46161 2042133 3261051 6339596 7400118 5499970 3350615 3316753 4513029 4871061 4257695
46152 4257695 3698129 2938663 1187797 -608395 -896247 -469802 -1446379 -3380414 -3597438
$$ packed form
46212D452523l097488j134210J413388L499447M490737L516705N55269k275584
46204A1420787k620113j110330o90454k435097m074692l433202j431676l28479
46196d703256l59625J03887J632826K765310K219765P11629k43373m67161q77570
46187G82432j421887p58829J434841L162116K389403j13639j706410j300059k75319
46178B192649p8062o26288j338336j905423j440067J205279N073093O751844M161681
46169A3996370l09266k285042o36594J395599M41797k896066m825709k838956
46161B042133J218918L078545J060522j900148k149355l3862J196276L58032o13366
46152D257695n59566p59466j750866j796192k87852M26445r76577j934035k17024
$$ plain form
46143 -3597438 -1922379 -1580022 -3895535 -5479248 -3276369 250995 352922 -3178011
46135 -3178011 -6002499 -5554793 -3897934 -3780544 -4899535 -5499236 -5453562 -5755165 -6092542
46126 -6092542 -5027782 -2486384 -336518 179749 344061 1963751 4043558 3390530 -812646
46117 -812646 -4872567 -4777792 -1409401 718115 -530261 -2768831 -3190070 -1959844 -392570
46108 -392570 1599036 4275679 6327791 6629652 6250765 6455006 6072683 3519094 419959
46099 419959 117028 2743186 4826507 4302989 3162647 4050743 6574744 8476334 8747092
46090 8747092 7980503 6822100 5630807 4976841 5133488 5404057 4891089 3665273 2568261
46081 2568261 2314580 3331510 5811340 9084155 11424586 11459920 9689080 7908924 7178245
$$ packed form
46143c597438J675059L42357k315513j583713K202879L527364J01927l530933
46135c178011k824488M47706J656859J17390j118991n99701M5674l01603l37377
46126f092542J064760K541398K149866N16267J64312J619690K079807o53028m203176
46117h12646m059921R4775L368391K127516j248376k238570m21239J230226J567274
46108c92570J991606K676643K052112L01861l78887K04241l82323k553589l099135
46099D19959l02931K626158K083321n23518j140342Q88096K524001J901590K70758
46090H747092p66589j158403j191293o53966J56647K70569n12968j225816j097012
46081B568261k53681J016930K479830L272815K340431L5334j770840j780156p30679
$$ plain form
46072 7178245 6917299 5979743 4037053 1750508 -39739 -1057285 -1666229 -2385573 -3341642
46063 -3341642 -4099842 -3930169 -2363135 138214 2009505 1736521 -302687 -1696165 -594626
46054 -594626 1785053 2308534 -322367 -4046125 -6093148 -6098829 -5690947 -5741349 -5359609
46045 -5359609 -3641160 -1260617 338271 825937 1302966 2695109 4386916 4877778 3679785
46036 3679785 2128193 2062281 3847006 5950017 6490611 4997000 2473862 -60928 -2454582
46027 -2454582 -4369510 -4074098 75834 6468016 10346653 8825262 4673598 2855147
46019 2855147 4017351 4452970 2543791 1315172 2938539 4589939 3068318 451118
46011 451118 704149 2718307 2119673 -723485 -633959 3385485 5329442 1421377 -3317042
$$ packed form
46072G178245k60946r37556j942690k286545j790247j017546o08944p19344r56069
46063c341642p58200J69673J567034K501349J871291k72984k039208j393478J101539
46054e94626K379679N23481k630901l723758k047023n681M07882n0402L81740
46045e359609J718449K380543J598888M87666M77029J392143J691807M90862j197993
46036C679785j551592o5912J784725K103011N40594j493611k523138k534790k393654
46027b454582j914928K95412M149932O392182L878637j521391m151664j818451
46019B855147J162204M35619j909179j228619J623367J651400j521621k617200
46011D51118K53031K014158n98634k843158Q9526M019444J943957l908065m738419
$$ plain form
46002 -3317042 -2486420 1888337 3013498 312454 -92911 4363018 8592955 7805379 4044560
45993 4044560 1817949 1504132 827392 -198024 97782 1274560 1550930 1392948 2748252
45984 2748252 5099725 5683171 3763408 1576466 600467 -69582 -893981 -593938 907614
45975 907614 1245560 -543340 -1498939 1153614 5321186 6775015 5374192 4834386 6528913
45966 6528913 7557669 6112480 4988412 7133589 10311748 9679115 4680555 13636
45958 13636 -504985 1776495 3114256 2093932 49949 -1494135 -1740313 60514 3823099
45949 3823099 7161508 6941972 3131545 -650642 -1615798 -1288964 -2771889 -5758364 -6817944
45940 -6817944 -4419957 -954216 1028009 2120403 4037335 6234473 6733701 5238710
$$ packed form
46002c317042Q30622M374757J125161k701044m05365M455929M229937p87576l760819
45993D044560k226611l13817o76740j025416K95806J176778K76370j57982J355304
45984B748252K351473N83446j919763k186942r75999o70049q24399L00043J501552
45975I07614L37946j788900r55599K652553M167572J453829j400823n39806J694527
45966F528913J028756j445189j124068K145177L178159o32633m998560m666919
45958A3636n18621K281480J337761j020324k043983j544084k46178J800827L762585
45949C823099L338409k19536l810427l782187r65156L26834j482925k986475j059580
45940f817944K397987L465741J982225J092394J916932K197138M99228j494991
$$ plain form
45932 5238710 3275051 1753036 313700 -1178657 -2189994 -2329934 -1190489 1932726
45924 1932726 6339147 8830726 6899199 2581216 251851 723104 897493 -435992
45916 -435992 -574665 1879787 3951110 3147901 1805341 3067349 5478707 5690864 4282816
45907 4282816 4243267 5119610 3734124 298179 -1276800 277173 1719563 1020861 393532
45898 393532 1569698 2139184 -536067 -4774653 -6824761 -5459986 -1992139 2065925
45890 2065925 5067798 5322875 3672875 3743474 6911810 9316464 7043576 2104532 -504461
45881 -504461 132744 1075922 1576251 3922879 8246514 11239057 10963468 8861916 6105105
45872 6105105 2234584 -1277305 -818356 3571135 6469242 4344836 793411 725136 2787519
$$ packed form
45932E238710j963659j522015j439336j492357j011337j39940J139445L123215
45924A932726M406421K491579j931527m317983k329365M71253J74389j333485
45916d35992j38673K454452K071323q03209j342560J262008K411358K12157j408048
45907D282816l9549Q76343j385486l435945j574979J553973J442390o98702o27329
45898C93532J176166N69486k675251m238586k050108J364775L467847M058064
45890B065925L001873K55077j650000P0599L168336K404654k272888m939044k608993
45881e04461O37205R43178N00329K346628M323635K992543k75589k101552k756811
45872F105105l870521l511889M58949M389491K898107k124406l551425o8275K062383
$$ plain form
45863 2787519 2368791 -421317 -1354987 565410 2100639 2094929 3176739 6038184 7304646
45854 7304646 5269414 3115949 3587793 4527617 3176140 1355376 2187083 4402663 4651789
45845 4651789 3635552 4777261 7541029 7492090 3642997 674812 2046385 5223716
45837 5223716 6272732 5484958 5226688 5154335 3471232 1160785 903085 2445618 2920461
45828 2920461 1945851 2635916 6171469 8520866 5148036 -2568554 -8290556 -7960313 -4100663
45819 -4100663 -2297106 -4757226 -8524944 -9533568 -6983772 -3259704 -683805 404890
45811 404890 796487 1066506 1293138 1070807 -326838 -2711093 -3962816 -1954060 2103150
45802 2103150 4287515 3090751 1787288 3600298 6208699 4215555 -3165461 -9942858
$$ packed form
45863B787519m18728k790108r33670J920397J535229n710J081810K861445J266462
45854G304646k035232k153465M71844R39824j351477j820764Q31707K215580K49126
45845D651789j016237J141709K763768m8939l849093k968185J371573L177331
45837E223716J049016p87774k58270p2353j683103k310447k57700J542533M74843
45828B920461r74610O90065L535553K349397l372830p716590n722002L30243L859650
45819d100663J803557k460120l767718j008624K549796L724068K575899J088695
45811D04890L91597K70019K26632k22331j397645k384255j251723K008756M057210
45802B103150K184365j196764j303463J813010K608401j993144p381016o777397
$$ plain form
45794 -9942858 -9911621 -3370018 4025957 7689581 7722184 6743864 6150222 5597110 5244627
45785 5244627 6391892 8862210 9415446 5251789 -1258122 -4261826 -1629071 2347064
45777 2347064 2934736 775217 -657913 -657163 -789698 -668126 1577954 5263137 7682050
45768 7682050 8775802 11345435 15918922 19101602 18320907 15024513 11722594 8826482
45760 8826482 6124487 4639643 4880093 5280129 4315187 2527813 987780 -401291 -1587808
45751 -1587808 -1392977 404807 1872118 1673451 1314540 2675452 4822031 5332349 3643962
45742 3643962 1244579 -448862 -825105 206569 1763927 2333367 1735475 1378771 1568393
45733 1568393 608049 -1925857 -3302344 -1197754 2788986 5508900 6389482 6766184 6833498
$$ packed form
45794i942858L1237O541603P395975L663624L2603r78320n93642n53112l52483
45785E244627J147265K470318N53236m163657o509911l003704K632755L976135
45777B347064N87672k159519j433130P50j32535J21572K246080L685183K418913
45768G682050J093752K569633M573487L182680p80695l296394l301919k896112
45760H826482k701995j484844K40450M00036r64942j787374j540033j389071j186517
45751a587808J94831J797784J467311j98667l58911J360912K146579N10318j688387
45742C643962k399383j693441l76243J031674J557358N69440n97892l56704J89622
45733A568393r60344k533906j376487K104590L986740K719914Q80582L76702O7314
$$ plain form
45724 6833498 6004129 4908635 4335682 3462219 1742598 1063698 3094132 5937754 6666665
45715 6666665 5885635 6242367 7523555 7204492 5274875 4403247 5337312 6068358 5779223
45706 5779223 5789243 6243515 5797321 5131645 6608004 9393226 9219478 4809089 655559
45697 655559 1126287 5121157 8912177 11054249 11705576 9986391 5499542 787651 -868583
45688 -868583 741686 3335483 5411951 6847554 7255241 5971138 3368323 795370
45680 795370 -490491 153565 2217324 3717272 3155767 2153298 3700183 7126111 8031651
45671 8031651 4841833 1946724 3542353 7449762 8750368 7114097 6026472 6151941
45663 6151941 4503786 406363 -2335192 -805338 2774640 4117879 2095105 -766847
$$ packed form
45724F833498q29369j095494n72953q73463j719621o78900K030434K843622P28911
45715F666665p81030L56732J281188l19063j929617q71628R34065P31046k89135
45706E779223J0020M54272m46194o65676J476359K785222j73748m410389m153530
45697F55559M70728L994870L791020K142072O51327j719185m486849m711891j656234
45688h68583J610269K593797K076468J435603M07687j284103k602815k572953
45680G95370j285861O44056K063759J499948n61505j002469J546885L425928R05540
45671H031651l189818k895109J595629L907409J300606j636271j087625J25469
45663F151941j648155m097423k741555J529854L579978J343239k022774k861952
$$ plain form
45655 -766847 -1574899 449403 3752060 5740425 5023544 2863608 1658921 1915829 1955192
45646 1955192 910552 503720 2813757 7175682 10464388 10263561 6980279 2850254
45638 2850254 -389717 -2339199 -2909956 -1666070 1148501 3833764 4817520 4664228 5076631
45629 5076631 6139762 6356975 5432088 4762732 4605700 3228781 134342 -2221047 -1691121
45620 -1691121 629371 2696937 4665768 7270973 8967536 7847030 5258097 4228522
45612 4228522 4875687 4694314 3238737 3022433 5119178 7100972 6743410 5245762 5050754
45603 5050754 6300374 7282472 7294113 7341449 8253888 9205788 8422048 5322088 1858039
45594 1858039 918755 2799995 4313063 2664401 -753608 -2210343 -553421 1850210
$$ packed form
45655g66847q08052K024302L302657J988365p16881k159936j204687K56908L9363
45646A955192j044640m06832K310037M361925L288706k00827l283282m130025
45638B850254l239971j949482n70757J243886K814571K685263R83756j53292M12403
45629E076631J063131K17213r24887o69356j57032j376919l094439k355389N29926
45620a691121K320492K067566J968831K605205J696563j120506k588933j029575
45612D228522O47165j81373j455577k16304K096745J981794l57562j497648j95008
45603E050754J249620R82098J1641M7336R12439R51900p83740l099960l464049
45594A858039r39284J881240J513068j648662l418009j456735J656922K403631
$$ plain form
45586 1850210 2771008 2416848 1900503 1582700 1570469 2228327 3614988 5495331 7761403
45577 7761403 9551761 8738654 4459292 -472295 -2433653 -1933452 -2431870 -4260298 -3831947
45568 -3831947 -41720 2864124 1313632 -2347777 -3901187 -3534789 -4119853 -5333383
45560 -5333383 -4066857 -57447 3093779 2967186 1097528 66956 656043 2645897
45552 2645897 5784919 8759364 9387303 7277055 4743876 3854439 3920359 3146053 1531586
45543 1531586 662032 1295315 2486500 2879215 1977134 283300 -1275636 -2305220 -3604922
45534 -3604922 -6297377 -9931148 -12272072 -11668666 -8864821 -5672193 -2822620 -481608
45526 -481608 41803 -2571211 -6636601 -8008434 -4905311 -390563 1662793 1583066 2582735
$$ packed form
45586A850210R20798l54160n16345l17803j2231O57858J386661J880343K266072
45577G761403J790358q13107m279362m931587j961358N00201m98418j828428M28351
45568c831947L790227K905844j550492l661409j553410L66398n85064j213530
45560e333383J266526M009410L151226j26593j869658j030572N89087J989854
45552B645897L139022K974445O27939k110248k533179q89437O5920p74306j614467
45543A531586q69554O33283J191185L92715r02081j693834j558936j029584j299702
45534c604922k692455l633771k340924O03406K803845L192628K849573K341012
45526d81608N23411k613014m065390j371833L103123M514748K053356p9727R99669
$$ plain form
45517 2582735 5419847 7376583 6760536 5463336 5761583 6915595 6754760 4921328 2541983
45508 2541983 -13908 -2824009 -4667359 -3917125 -1090209 1327755 1647349 137238
45500 137238 -2290845 -4860557 -6464585 -6140417 -4276359 -2077978 99983 2555525
45492 2555525 4665187 5182617 4019952 2100812 -331251 -3365864 -5655672 -5391265
45484 -5391265 -3260312 -1981153 -2346473 -2200361 -190660 1937085 2032473 355345 -1598025
45475 -1598025 -3074780 -3638660 -2850138 -1684707 -2092823 -3742096 -3639614 -764873 1574425
45466 1574425 428876 -2266549 -2895694 -1737828 -1685958 -2853892 -2509323 80729 2600467
45457 2600467 3753048 4940513 7092150 8707856 8192203 6038985 3815372 2618446
$$ packed form
45517B582735K837112J956736o16047j297200K98247J154012j60835j833432k379345
45508B541983k555891k810101j843350P50234K826916K417964L19594j510111
45500A37238k428083k569712j604028L24168J864058K198381K177961K455542
45492B555525K109662N17430j162665j919140k432063l034613k289808K64407
45484e391265K130953J279159l65320J46112K009701K127745R5388j677128j953370
45475a598025j476755n63880P88522J165431m08116j649273J02482K874741K339298
45466A574425j145549k695425o29145J157866N1870j167934L44569K590052K519738
45457B600467J152581J187465K151637J615706n15653k153218k223613j196926
$$ plain form
45449 2618446 2919813 4246417 4879077 3650598 1927740 1790916 2658245 2409130 1579965
45440 1579965 2904877 6161821 7492095 5593440 4726577 8531440 13847376 14580014
45432 14580014 10026175 5303551 4080636 4900858 5374571 6363773 9841742 14701369
45424 14701369 17307113 15859238 12371806 9946314 9292958 8778688 7223207 5254784
45416 5254784 3613280 1552798 -1704573 -4694291 -4775235 -1592659 2231677 4382266
45408 4382266 5226592 6150039 7197534 7741472 8171156 9088656 9456419 7388072 2861268
45399 2861268 -1685041 -3752965 -3002971 -1034484 327413 486264 372971 1304589 3304304
45390 3304304 4969109 5349984 5214937 5694417 6379631 5830598 3529032 251365 -3106585
$$ packed form
45449B618446L01367J326604O32660j228479j722858j36824Q67329k49115q29165
45440A579965J324912L256944J330274j898655q66863L804863N315936P32638
45432A4580014m553839m722624j222915Q20222M73713R89202L477969M859627
45424A4701369K605744j447875l487432k425492o53356n14270j555481j968423
45416E254784j641504k060482l257371k989718q0944L182576L824336K150589
45408D382266Q44326R23447J047495N43938M29684R17500L67763k068347m526804
45399B861268m546309k067924P49994J968487J361897J58851j13293R31618J999715
45390C304304J664805L80875j35047M79480O85214n49033k301566l277667l357950
$$ plain form
45381 -3106585 -5858990 -6962368 -5586371 -2488378 332168 1654864 1802843 1363185
45373 1363185 433311 -497851 -301114 1280720 2859437 3122592 2616833 2826332 4038288
45364 4038288 5215697 5655599 5606709 5278726 4418348 3229082 2733505 3537156 4813534
45355 4813534 5241499 4651170 4062817 4259707 5061631 6021569 6951929 7342649 6125493
45346 6125493 3012247 -299545 -1452201 -159055 1384860 1208835 -301326 -1569121
45338 -1569121 -1989988 -1762967 -502935 2181062 4981784 5746605 4455838 3525622 4314325
45329 4314325 5141916 4191080 2698841 3039242 4601596 4276532 1083671 -2260635 -3173637
45320 -3173637 -2315541 -1497820 -451387 2177341 5657830 7368340 6177072 3851902
$$ packed form
45381c106585k752405j103378J375997L097993K820546J322696J47979m39658
45373A363185r29874r31162J96737J581834J578717K63155n05759K09499J211956
45364D038288J177409M39902m8890l27983q60378j189266m95577Q03651J276378
45355D813534M27965n90329n88353J96890Q01924R59938R30360L90720j217156
45346F125493l113246l311792j152656J293146J543915j76025j510161j267795
45338a569121m20867K27021J260032K683997K800722P64821j290767r30216P88703
45329D314325Q27591r50836j492239L40401J562354l25064l192861l344306r13002
45320c173637Q58096Q17721J046433K628728L480489J710510j191268k325170
$$ plain form
45312 3851902 2738083 3384345 4894280 6333108 6936601 5814230 2642311 -1374828
45304 -1374828 -4040406 -4098683 -2486372 -1379873 -1996404 -3669536 -5211982 -6477032 -7723406
45295 -7723406 -7964264 -5545023 -710231 3896476 6084957 6191260 5480610 4129346 2337561
45286 2337561 1949552 4634242 9059539 12016641 12004996 9739914 5765603 310970 -4507144
45277 -4507144 -5499283 -2606088 95715 -953710 -4844894 -8047672 -8506983 -6658997
45269 -6658997 -3942373 -1716441 -586178 212018 1813856 3767520 4569385 4277358 4291461
45260 4291461 4159578 1731310 -2293194 -3522061 29237 4231059 4455003 2188308
45252 2188308 2232205 5399832 8235078 8610937 7254038 4596062 671312 -2158145 -1072540
$$ packed form
45312C851902j113819O46262J509935J438828O03493j122371l171919m017139
45304a374828k665578n8277J612311J106499o16531j673132j542446j265050j246374
45295g723406k40858K419241M834792M606707K188481J06303p10650j351264j791785
45286B337561l88009K684690M425297K957102j1645k265082l974311n454633m818114
45277d507144r92139K893195K701803j049425l891184l202778m59311J847986
45269f658997K716624K225932J130263P98196J601838J953664Q01865k92027J4103
45260D291461j31883k428268m024504j228867L551298M201822K23944k266695
45252B188308M3897L167627K835246L75859j356899k657976l924750k829457J085605
$$ plain form
45243 -1072540 2230818 3005695 734287 233442 3844904 7148931 5297677 -41280
45235 -41280 -3356583 -2224447 1618882 5925578 9252943 10045510 7735326 4321578 2384214
45226 2384214 1911902 1116564 -236889 -566578 647753 1766890 1061766 -1507504 -4757953
45217 -4757953 -7403736 -8506976 -7670101 -5189918 -1925006 961114 2484157 2802409
45209 2802409 3375558 4973644 5852611 3765788 -118947 -1653551 1045553 4957559
45201 4957559 6119266 4352562 2461715 2358873 3758179 5414279 5882060 4070152
45193 4070152 689017 -1670512 -1282212 683430 1885609 1427871 -230211 -2433476
45185 -2433476 -4100104 -3915297 -2282251 -1614720 -3232739 -5559262 -6748684 -7000012 -6593250
$$ packed form
45243a072540L303358P74877k271408n00845L611462L304027j851254n338957
45235d1280l315303J132136L843329M306696L327365P92567k310184l413748j937364
45226B384214m72312p95338j353453l29689J214331J119137p05124k569270l250449
45217d757953k645783j103240Q36875K480183L264912K886120J523043L18252
45209B802409N73149J598086Q78967k086823l884735j534604K699104L912006
45201D957559J161707j766704j890847j02842J399306J656100M67781j811908
45193D070152l381135k359529L88300J965642J202179m57738j658082k203265
45185b433476j666628J84807J633046O67531j618019k326523j189422k51328M06762
$$ plain form
45176 -6593250 -4270320 -99836 2665000 1920888 661992 2739589 6575367 7507098
45168 7507098 4927488 2067956 -415210 -4745736 -9548123 -9393486 -3166716 2537372
45160 2537372 1960883 -1980669 -2427478 1937244 6540323 8227915 8467806 9596234 11512134
45151 11512134 12694282 12076596 9296233 4787266 173150 -2588296 -2865545 -1587317
45143 -1587317 27479 1288362 1808632 1259174 -439885 -2779257 -4476153 -4122827 -1859632
45134 -1859632 -62364 -1056025 -4128293 -6198409 -5579033 -3546513 -1967791 -1196616 -929836
45125 -929836 -1308451 -2140325 -2498242 -2081328 -1716715 -1777984 -1529100 -716512 -165114 -20609
45115 -20609 757458 2204949 2670182 1551789 680322 1502647 2938614 3696496 4530802
$$ packed form
45176f593250K322930M170484K764836p44112j258896K077597L835778R31731
45168G507098k579610k859532k483166m330526m802387J54637O226770N704088
45160B537372n76489l941552m46809M364722M603079J687592K39891J128428J915900
45151A1512134J182148o17686k780363m508967m614116k761446k77249J278228
45143a587317J614796J260883N20270n49458j699059k339372j696896L53326K263195
45134a859632J797268r93661l072268k070116O19376K032520J578722P71175K66780
45125i29836l78615q31874l57917M16914L64613o1269K48884Q12588N51398J44505
45115b0609P78067J447491M65233j118393q71467Q22325J435967P57882Q34306
$$ plain form
45106 4530802 6129366 6932097 5613067 3818910 3585622 3781305 2360663 615411 1326781
45097 1326781 3579634 3648397 1068465 -358689 1486590 3848956 3395009 646705 -1628503
45088 -1628503 -1992788 -600642 2015065 4738603 6091885 5957765 5576742 5152560 3710462
45079 3710462 2201868 3709046 8578190 12238506 10844569 6944814 6057938 8980510
45071 8980510 11307629 10150996 7413328 5705464 4574840 2623187 826857 1221894
45063 1221894 3304481 3998400 1470619 -2256952 -3303623 -480023 2827734 2286633
45055 2286633 -1927665 -4986507 -3615667 -365741 577378 3305 2226946 7449060
45047 7449060 10267640 7446134 2951663 2149970 4272011 4762996 2875582 1936517 2802570
$$ packed form
45106D530802J598564Q02731j319030j794157k33288J95683j420642j745252P11370
45097A326781K252853O8763k579932j427154J845279K362366m53947k748304k275208
45088a628503l64285J392146K615707K723538J353282j34120l81023m24182j442098
45079C710462j508594J507178M869144L660316j393937l899755q86876K922572
45071H980510K327119j156633k737668j707864j130624j951653j796330L95037
45063A221894K082587O93919k527781l727571j046671K823600L307757n41101
45055B286633m214298l058842J370840L249926R43119n74073K223641N222114
45047G449060K818580k821506m494471q01693K122041M90985j887414r39065Q66053
$$ plain form
45038 2802570 2382593 -325401 -1611259 1087670 4595334 4637146 2336318 2199601 5149255
45029 5149255 7583970 7087371 5396610 5003966 5786203 6246939 5909095 5135746 4184497
45020 4184497 3613418 4246697 5629043 5794260 3767504 1221146 447329 1637171 3371826
45011 3371826 4853938 6199287 7234127 7622625 7836419 8434387 8541995 6703029 3470092
45002 3470092 1582237 2924295 6482094 9932454 12052911 12638947 11219310 7518798
44994 7518798 2959648 176079 527454 2874422 5132083 6278536 6447014 5910108 4893184
44985 4893184 4039532 4093301 4961800 5652485 5301606 3967373 2511691 2090171 3467906
44976 3467906 6111121 8100438 7817360 5707365 3482646 1775879 15619 -1344741
$$ packed form
45038B802570m19977k707994j285858K698929L507664M1812k300828j36717K949654
45029E149255K434715m96599j690761l92644P82237M60736l37844p73349r51249
45020D184497n71079O33279J382346J65217k026756k546358p73817J189842J734655
45011C371826J482112J345349J034840L88498K13794N97968J07608j838966l232937
45002C470092j887855J342058L557799L450360K120457N86036j419637l700512
44994G518798m559150k783569L51375K346968K257661J146453J68478n36906j016924
44985D893184q53652N3769Q68499O90685l50879j334233j455682m21520J377735
44976C467906K643215J989317k83078k109995k224719j706767j760260j360360
$$ plain form
44968 -1344741 -629990 1957966 3102689 306908 -4160997 -5567438 -2457601 1976880
44960 1976880 3972755 2609123 -636118 -3492773 -3862332 -1361325 1551536 1860818
44952 1860818 -139681 -1157305 581865 3402249 5383020 6844664 8302944 8468171
44944 8468171 6283154 3040380 489828 -1397290 -2794203 -2212530 911392 3485771
44936 3485771 2043153 -1968615 -3604641 -1114812 2099414 2851816 2344179 3456699
44928 3456699 6252866 8235006 7903752 6382653 5901969 7539539 10104873 10963202 8652967
44919 8652967 4826815 2614981 2897962 3493400 2506591 1035532 1473775 4171185 7175304
44910 7175304 8853974 9370626 9375479 8503091 6233288 3808002 3738284 6509408 8869480
$$ packed form
44968a344741P14751K587956J144723k795781m467905j406441L109837M434481
44960A976880J995875j363632l245241k856655l69559K501007K912861L09282
44952A860818k000499j017624J739170K820384J980771J461644J458280J65227
44944H468171k185017l242774k550552j887118j396913N81673L123922K574379
44936C485771j442618m011768j636026K489829L214226P52402n07637J112520
44928C456699K796167J982140l31254j521099m80684J637570K565334Q58329k310235
44919H652967l826152k211834K82981N95438r86809j471059M38243K697410L004119
44910G175304J678670N16652M853q72388k269803k425286o9718K771124K360072
$$ plain form
44901 8869480 7195574 2326920 -1048174 -182340 2990414 5945044 9428085 14613805
44893 14613805 18786343 17837528 12367664 7475113 6235444 6798814 6512192 5389389
44885 5389389 4158602 2123288 -905539 -2938044 -2293168 -104136 1460221 1898920
44877 1898920 1677418 579586 -1283117 -2283622 -1149346 1058698 2552685 3184612
44869 3184612 3536823 3177691 1939332 1479536 2976973 4330407 2546941 -1551540 -3865608
44860 -3865608 -2288747 1143995 3611164 4511902 4548664 4089542 3419068 2971184 2512664
44851 2512664 1392263 -741 -431907 268069 1013570 1339070 1677014 1547433 -360080
44842 -360080 -3587820 -5508709 -4590880 -2203502 -99677 1884381 4185720 5601929
$$ packed form
44901H869480j673906m868654l375094Q65834L172754K954630L483041N185720
44893A4613805M172538r48815n469864m892551j239669N63370k86622j122803
44885E389389j230787k035314l028827k032505O44876K189032J564357M38699
44877A898920k21502j097832j862703j000505J134276K208044J493987O31927
44869C184612L52211l59132j238359m59796J497437J353434j783466m098481k314068
44860c865608J576861L432742K467169R00738L6762m59122o70474m47884m58520
44851B512664j120401j393004m31166O99976P45501L25500L37944j29581j907513
44842c60080l227740j920889R17829K387378K103825J984058K301339J416209
$$ plain form
44834 5601929 5071977 3884716 3914272 4721900 4641272 3944817 4509633 6600716 8321612
44825 8321612 8489723 8014636 7877527 7479533 5860549 3398443 1492622 1199750 2542823
44816 2542823 4578942 6037568 6445258 6411624 6169664 4577591 969472 -2584227 -2948474
44807 -2948474 -50897 2695490 2775208 1505673 1555661 3223699 4664788 4640256 3458466
44798 3458466 1845380 307862 -581278 -191314 1912321 5799002 10440595 13174401
44790 13174401 11655209 7143570 4050548 4893141 7382600 8076534 7001113 6324953
44782 6324953 6135219 4702393 2195266 896179 1731790 3466438 5463701 8304128
44774 8304128 11195170 11729752 9236540 5961992 4096195 3939437 5460540 8665058
$$ packed form
44834E601929n29952j187261K9556Q07628q0628o96455N64816K091083J720896
44825H321612J68111m75087j37109l97994j618984k462106j905821k92872J343073
44816B542823K036119J458626M07690l3634k41960j592073l608119l553699l64247
44807b948474K897577K746387P9718j269535M9988J668038J441089k4532j181790
44798C458466j613086j537518q89140L89964K103635L886681M641593K733806
44790A3174401j519192m511639l093022Q42593K489459O93934j075421o76160
44782F324953j89734j432826k507127j299087Q35611J734648J997263K840427
44774H304128K891042N34582k493212l274548j865797j56758J521103L204518
$$ plain form
44766 8665058 11525711 10914867 7178176 4503521 4803015 4724662 1440675 -2088858 -1399633
44757 -1399633 2685293 5850589 6881167 7850156 8996204 8313397 6016955 4858509
44749 4858509 5604917 6244434 6093023 6587040 7371296 5997027 2806628 1708970 4004323
44740 4004323 5573973 3061609 -830319 -1826373 -906234 -2268137 -6073459 -7794622
44732 -7794622 -4824205 54649 2819734 3074908 3222921 4484307 5610089 5239636 4091689
44723 4091689 4014029 5303901 6170909 5330696 3946845 3874203 5043278 6188210 7147587
44714 7147587 8300233 8631705 7164511 5776846 7263920 10594483 11767627 9889610
44706 9889610 8401268 9197951 9877576 8695184 7741325 8405164 8091218 5161335 3012803
$$ packed form
44766H665058K860653o10844l736691k674655K99494p8353l283987l529533O89225
44757a399633M084926L165296J030578R68989J146048o82807k296442j158446
44749D858509P46408O39517j51411M94017P84256j374269l190399j097658K295353
44740D004323J569650k512364l891928r96054R20139j361903l805322j721163
44732g794622K970417M878854K765085K55174J48013J261386J125782l70453j147947
44723D091689p7660J289872Q67008q40213j383851p2642J169075J144932R59377
44714G147587J152646L31472j467194j387665J487074L330563J173144j878017
44706I889610j488342P96683O79625j182392r53859O63839l13946k929883k148532
$$ plain form
44697 3012803 4565804 6254271 3077097 -3003794 -5826279 -4504620 -3682921 -5015036
44689 -5015036 -5160550 -2865349 -1382817 -1996728 -1318667 2033114 3607300 6834 -4767981
44680 -4767981 -4597435 3988 3134376 1901153 -817170 -1501890 -140645 1176468
44672 1176468 1182357 273999 -77355 1459485 4447263 6525566 5792242 2850013 -286873
44663 -286873 -2412320 -3215465 -2238205 607169 3907076 5628177 5207771 3889118 3019750
44654 3019750 2664543 1888093 98998 -1855403 -2225985 -590317 960432 156255 -2198460
44645 -2198460 -3031864 -1125991 1563333 3088437 3741818 4230517 3995663 2870854 2347208
44636 2347208 3352373 4541576 4716503 5136152 7065778 8667354 7297570 3915987
$$ packed form
44697C012803J553001J688467l177174o080891k822485J321659Q21699j332115
44689e015036j45514K295201J482532o13911O78061L351781J574186l600466m774815
44680d767981J70546M601423L130388j233223k718323o84720J361245J317113
44672A176468N889r08358l51354J536840K987778K078303p33324k942229l136886
44663b86873k125447q03145R77260K845374L299907J721101m20406j318653q69368
44654C019750l55207p76450j789095j954401l70582J635668J550749q04177k354715
44645b198460q33404J905873K689324J525104O53381M88699k34854j124809n23646
44636B347208J005165J189203J74927M19649J929626J601576j369784l381583
$$ plain form
44628 3915987 1984925 2255780 1931309 -460253 -2452118 -1304398 2069969 4665404
44620 4665404 5285956 4955870 4395047 3192976 1509727 871247 2447835 5348963 7485880
44611 7485880 7878172 7369679 7060969 6894714 6300834 5534055 5425509 6093509 6881331
44602 6881331 7480381 8118361 8659960 8632207 8215320 7961407 7340996 5057131 1377332
44593 1377332 -1299767 -1126900 1054936 3051724 3609594 2563545 138473 -2556774
44585 -2556774 -3455273 -1535027 1634776 3501339 3118898 1278428 -924548 -2401751
44577 -2401751 -1970075 350804 2422376 1996081 -460236 -2227154 -1581032 500294 1910153
44568 1910153 1869153 1663285 3152641 6324171 8597625 7614946 4507994 2583225 2646746
$$ packed form
44628C915987j931062K70855l24471k391562j991865J147720L374367K595435
44620D665404O20552l30086n60823j202071j683249o38480J576588K901128K136917
44611G485880L92292n08493l08710j66255n93880p66779j08546O68000P87822
44602F881331N99050O37980N41599k7753m16887k53913o20411k283865l679799
44593A377332k677099J72867K181836J996788N57870j046049k425072k695247
44585b556774q98499J920246L169803J866563l82441j840470k202976j477203
44577b401751M31676K320879K071572m26295k456317j766918O46122K081326J409859
44568A910153m1000k05868J489356L171530K273454r82679l106952j924769O3521
$$ plain form
44559 2646746 2234201 355272 -204690 2507907 5709742 5843796 4110148 4116350 5673649
44550 5673649 5439675 2980509 1407552 1769914 1549599 -213045 -858161 975966 2537943
44541 2537943 1584807 160916 728953 1713379 535477 -1374377 -701092 2126731 3655422
44532 3655422 3178533 3617738 6221289 8273498 7593307 6189353 7060898 9272977 8970075
44523 8970075 4901258 691019 833764 5453470 9961844 9800569 4954923 -414430
44515 -414430 -2308630 -238740 3439784 6312635 7416279 6905963 5474240 4050929
44507 4050929 3149806 2289117 708542 -1129503 -1502678 484050 3263404 4262993 3063928
44498 3063928 1964726 2665788 3491464 1586520 -2485763 -4556843 -2031271 2699125
$$ packed form
44559B646746m12545j878929n59962K712597L201835J34054j733648O202J557299
44550E673649k33974k459166j572957L62362k20315j762644o45116J834127J561977
44541B537943r53136j423891N68037R84426j177902j909854O73285K827823J528691
44532C655422m76889M39205K603551K052209o80191j403954Q71545K212079l02902
44523H970075m068817m210239J42745M619706M508374j61275m845646n369353
44515d14430j894200K069890L678524K872851J103644n10316j431723j423311
44507D050929r01123q60689j580575j838045l73175J986728K779354R99589j199065
44498C063928j099202P01062Q25676j904944m072283k071080K525572M730396
$$ plain form
44490 2699125 5486231 5494016 5035949 5452028 5667702 4726092 3478349 3238204 4304259
44481 4304259 6126054 7584780 7101429 4092812 493064 -785182 877391 3596532
44473 3596532 5949154 8093180 9747099 9501102 7042530 3960593 1310689 -1595253
44465 -1595253 -4824965 -6398508 -4933760 -2114178 -756358 -1462310 -2447099 -1620547 1954673
44456 1954673 7072592 10065797 7765621 2172810 -362556 3242321 8420280 8943840
44448 8943840 5066060 2038952 1997989 1745847 -1287627 -4965233 -5796827 -3650617 -1363957
44439 -1363957 -1079586 -2204782 -2381852 -130568 3065132 3943881 1616920 -730651 -4399
44430 -4399 2299577 2378118 -40597 -1447709 -21520 2173940 3197671 4041133 5813038
$$ packed form
44490B699125K787106P785m58067M16079K15674r41610j247743k40145J066055
44481D304259J821795J458726m83351l008617l599748j278246J662573K719141
44473C596532K352622K144026J653919k45997k458572l081937k649904k905942
44465a595253l229712j573543J464748K819582J357820p05952r84789Q26552L575220
44456A954673N117919K993205k300176n592811k535366L604877N177959N23560
44448H943840l877780l027108m0963k52142l033474l677606q31594K146210K286660
44439a363957K84371j125196j77070K251284L195700Q78749k326961k347571P26252
44430d399K303976P8541k418715j407112J426189K195460J023731Q43462J771905
$$ plain form
44421 5813038 6955921 5579437 2804670 1548761 2859276 5083564 6064122 4990374
44413 4990374 2643087 709124 436315 1503971 2659589 3338573 3709198 3467101 2167511
44404 2167511 679284 511981 1601449 2625873 3446438 4816420 5570787 3309652 -1075255
44395 -1075255 -2870747 412047 5227088 6736046 5042051 3779034 4278785 4488343
44387 4488343 2919191 635562 -634774 -113133 2181692 5302039 7373263 7473416
44379 7473416 7056286 7770026 8587925 7297096 4383288 2961168 4644801 7596946 9096214
44370 9096214 8286258 5984562 3412244 1728212 1602338 2649482 3904822 4840739 5300155
44361 5300155 4938230 3694114 2306794 1448413 1069902 1395273 3157554 5592865 6116431
$$ packed form
44421E813038J142883j376484k774767j255909J310515K224288R80558j073748
44413D990374k347287j933963k72809J067656J155618O78984L70625k42097j299590
44404B167511j488227j67303J089468J024424Q20565J369982P54367k261135m384907
44395a075255j795492L282794M815041J508958j693995j263017M99751K09558
44387D488343j569152k283629j270336N21641K294825L120347K071224J00153
44379G473416m17130P13740Q17899j290829k913808j422120J683633K952145J499268
44370I096214q09956k301696k572318j684032j25874J047144J255340R35917M59416
44361E300155l61925j244116j387320q58381l78511L25371J762281K435311N23566
$$ plain form
44352 6116431 4103157 2990352 5571107 8904728 7889315 2967369 -225071 1205259
44344 1205259 4592227 7490440 11088572 15784908 18174754 15860616 11738628 9898596
44336 9898596 10006330 9336595 7955066 7865760 8644995 8024932 6092061 5252768 6282669
44327 6282669 7577340 8205569 8802402 9389464 8914108 7099394 4639328 1849845 -741907
44318 -741907 -1230187 1497799 5004617 5841011 4554568 4745101 7086726 8185363 6277858
44309 6277858 4197743 4912573 7448303 9368445 10322393 10701938 9496557 6409745 3981658
44300 3981658 4513422 6474347 6982370 6350682 6762168 7618846 6295538 3283751 2191454
44291 2191454 3594493 3105113 -2001311 -7581399 -7590490 -2421630 1543057 303700 -3372677
$$ packed form
44352F116431k013274j112805K580755L333621j015413m921946l192440J430330
44344A205259L386968K898213L598132M696336K389846k314138m121988j840032
44336I898596J07734o69735j381529q9306P79235o20063j932871q39293J029901
44327F282669J294671O28229N96833N87062m75356j814714k460066k789483k591752
44318g41907m88280K727986L506818Q36394j286443J90533K341625J098637j907505
44309F277858k080115P14830K535730J920142R53948L79545j205381l086812k428087
44300C981658N31764J960925N08023o31688M11486Q56678j323308l011787j092297
44291B191454J403039m89380n106424n580088r091N168860L964687j239357l676377
$$ plain form
44282 -3372677 -4548817 -1923179 2496856 6814399 9768336 9601608 5733416 1281459
44274 1281459 755984 4443622 7683879 6977620 4424103 4235416 6892138 9276461 9303257
44265 9303257 7691703 5774681 4222289 3813039 5017357 6634081 6926197 6129685 5780823
44256 5780823 5873959 5272629 4672021 5881969 7959702 7888543 6054132 6760239 11199215
44247 11199215 14214631 11515173 6477732 5277774 7845834 8822844 6170599 3446073
44239 3446073 3480506 4811518 5506288 6211505 7586415 8204604 7212535 6445126 7652428
44230 7652428 9468297 9135358 6033710 2073509 -413983 -369706 1121858 1115606 -2377757
44221 -2377757 -7277676 -9034008 -5986331 -991445 2929042 5745201 7955916 8291505
$$ packed form
44282c372677j176140K625638M420035M317543K953937j66728l868192m451957
44274A281459n25475L687638L240257p06259k553517j88687K656722K384323K6796
44265I303257j611554j917022j552392m09250J204318J616724K92116p96512l48862
44256E780823R3136o01330o00608J209948K077733p1159j834411P06107M438976
44247A1199215L015416k699458n037441j199958K568060R77010k652245k724526
44239C446073L4433J331012O94770P05217J374910O18189r92069p67409J207302
44230G652428J815869l32939l101648l960201k487492M4277J491564o252l493363
44221b377757m899919j756332L047677M994886L920487K816159K210715L35589
$$ plain form
44213 8291505 6499979 5696689 8440859 12177855 12217165 8208623 3990703 1665303 -24050
44204 -24050 -1185573 818924 6578078 11870100 12569944 9973295 8252440 8259724 7239929
44195 7239929 4117762 1588942 2154113 4739200 6696186 7264516 7304434 6918002 5470498
44186 5470498 3550484 2835146 3613270 4033316 2586666 196062 -1099035 -775611 -178538
44177 -178538 -623247 -1918277 -2595466 -1198225 2251541 5690111 6537181 4363252 1509817
44168 1509817 612479 2227157 5234469 8242067 9711721 8346513 5085675 3383902
44160 3383902 5235919 7814937 6713145 2160045 -895806 756122 4859184 7342568
44152 7342568 7209764 6394051 6675475 8250103 10059537 10444903 8608950 6047600 5190093
$$ packed form
44213H291505j791526q03290K744170L736996L9310m008542m217920k325400j689353
44204b4050j161523K004497N759154N292022O99844k596649j720855P284j019795
44195G239929l122167k528820N65171K585087J956986N68330L9918l86432j447504
44186E470498j920014p15338P78124M20046j446650k390604j295097L23424N97073
44177a78538m44709j295030o77189J397241L449766L438570Q47070k173929k853435
44168A509817q97338J614678L007312L007598J469654j365208l260838j701773
44160C383902J852017K579018j101792m553100l055851J651928M103062K483384
44152G342568j32804q15713K81424J574628J809434L85366j835953k561350q57507
$$ plain form
44143 5190093 6377458 8039986 9879831 12993659 16235838 16175648 12598589 10398966
44135 10398966 12879742 16243348 14770068 9273215 5771674 6831002 8996361 8858374
44127 8858374 7137274 5757603 4846140 4292439 5022716 6745498 7089491 5130277 3608049
44118 3608049 5286824 8707422 10066680 8422164 6549766 6756742 8072156 8299993
44110 8299993 7299862 6917443 8176117 9876537 10422813 10105329 10483140 11831636 12594745
44101 12594745 11652917 9777228 8199094 7076189 6307599 6560958 8214362 10284642
44093 10284642 11604546 12095689 11911381 10798277 9595926 10511950 13950306 16830649
44085 16830649 16434956 14192363 12832056 11637076 8316480 4252948 3213788 4986316
$$ packed form
44143E190093J187365J662528J839845L113828L242179o0190l577059k199623
44135A0398966K480776L363606j473280n496853l501541J059328K165359j37987
44127H858374j721100j379671r11463n53701P30277J722782L43993j959214j522228
44118C608049J678775L420598J359258j644516j872398K06976J315414K27837
44110H299993j000131l82419J258674J700420N46276l17484L77811J348496P63109
44101A2594745r41828j875689j578134j122905p68590K53359J653404K070280
44093A0284642J319904M91143j84308j113104j202351R16024L438356K880343
44085A6830649l95693k242593j360307j194980l320596m063532j039160J772528
$$ plain form
44077 4986316 5041386 1403199 -2504613 -3251147 -1513340 1000780 4624901 9008063 10806775
44068 10806775 7586646 1884878 -1710222 -2036039 -1373306 -1417834 -1704281 -1068856 1261848
44059 1261848 5123414 8626000 9351961 7591407 6494839 7612546 8641280 7464598
44051 7464598 5755468 5875296 6655967 5697404 4026285 4615029 7258756 8752256 7894246
44042 7894246 6802506 7067602 7816365 8215281 9085678 10988794 12776657 13098652 12023105
44033 12023105 10542576 9428130 8763998 7910644 6269895 4684221 4990105 7186538
44025 7186538 8576533 7249763 4708123 3076458 1741858 -436856 -1598130 522172
44017 522172 3659982 3245836 -472779 -2036644 1568065 6959585 9623921 9418029 8635719
$$ packed form
44077D986316N5070l638187l907812p46534J737807K514120L624121M383162J798712
44068A0806775l220129n701768l595100l25817O62733m4528k86447O35425K330704
44059A261848L861566L502586P25961j760554j096568J117707J028734j176682
44051G464598j709130J19828P80671r58563j671119N88744K643727J493500q58010
44042G894246j091740K65096P48763L98916Q70397J903116J787863L21995j075547
44033A2023105j480529j114446o64132q53354j640749j585674L05884K196433
44025G186538J389995j326770k541640j631665j334600k178714j161274K120302
44017E22172L137810m14146l718615j563865L604709N391520K664336k05892p82310
$$ plain form
44008 8635719 7740336 5931462 4064753 4183798 6738591 9963338 11660741 10922854 8924823
43999 8924823 8321774 10545875 13472608 13485120 10182482 6976961 6396403 7058352 6420346
43990 6420346 4462473 3201766 4142798 7437441 12072258 15834283 16704592 15360635
43982 15360635 14644233 15541548 15677992 13201815 10121721 9771276 12422273 15512358 17245641
43973 17245641 17960063 18448056 18694584 18301461 17156363 15692661 14817594 15179628 16537259
43964 16537259 18579924 21811479 26066820 28812228 27474006 23395097 20534832 19935863
43956 19935863 18928861 16640816 16192656 19427210 23389028 24895840 25060587 25931435
43948 25931435 26130557 24121821 22895691 26250978 32174839 35152656 34115900 32957265
$$ packed form
44008H635719q95383j808874j866709J19045K554793L224747J697403p37887j998031
43999H924823o03049K224101K926733J2512l302638l205521n80558O61949o38006
43990F420346j957873j260707R41032L294643M634817L762025Q70309j343957
43982A5360635p16402Q97315J36444k476177l080094l50445K650997L090085J733283
43973A7245641P14422M87993K46528l93123j145098j463702q75067L62034J357631
43964A6537259K042665L231555M255341K745408j338222m078909k860265n98969
43956A9935863j007002k288045m48160L234554L961818J506812J64747Q70848
43948B5931435J99122k008736j226130L355287N923861K977817j036756j158635
$$ plain form
43940 32957265 33667467 34452084 35024403 38028310 43372907 46233891 43730498 39914799
43932 39914799 40775439 46644088 52601293 54923296 54455209 54265547 55945812 58206226
43924 58206226 58350824 55377695 51505632 49750475 50532320 52262057 54525435 58104468
43916 58104468 62049091 63776603 62608192 60338601 57637702 52979489 46220840 40103485
43908 40103485 36635702 34821035 33524255 33511560 34682694 34457946 31548140 28512837
43900 28512837 27640419 26943824 23687133 19573280 18355859 19738118 19828233 17074113 13876974
43891 13876974 12382553 12226627 12785156 14427323 16751489 18094431 17538332 15620828
43883 15620828 13060052 10660839 9928396 11294958 12298821 10512944 7900022 8695559
$$ packed form
43940C2957265P10202P84617N72319L003907N344597K860984k503393l815699
43932C9914799Q60640N868649N957205K322003m68087j89662J680265K260414
43924E8206226J44598k973129l872063j755157P81845J729737K263378L579033
43916E8104468L944623J727512j168411k269591k700899m658213o758649o117355
43908D0103485l467783j814667j296780j2695J171134k24748k909806l035303
43900B8512837q72418o96595l256691m113853j217421J382259R0115k754120l197139
43891A3876974j494421j55926N58529J642167K324166J342942n56099j917504
43883A5620828k560776k399213p32443J366562J003863j785877k612922P95537
$$ plain form
43875 8695559 12792248 15161443 12856577 8754357 6688217 6559769 6650617 7437450 9897352
43866 9897352 12364634 12423528 10527445 8870267 7830932 6222702 4054862 2424832
43858 2424832 1514514 1186243 2609110 6481612 10357606 10833282 8160014 5624270 4398992
43849 4398992 2467335 -698394 -2062861 515602 4669340 6802528 6902063 7427436 8875857
43840 8875857 9468614 8823449 9040102 11436337 14249986 14737247 12399209 9063920 6472049
43831 6472049 4916809 4186978 4821390 7635053 12019483 15388379 15078211 10997612 5964400
43822 5964400 3090364 3071625 4333234 5447392 6563759 8100816 8777220 6368474 1125587
43813 1125587 -2659756 -444992 6871629 12868635 12469639 7540615 3937745 4183560
$$ packed form
43875H695559M096689K369195k304866m102220k066140j28448R0848P86833K459902
43866I897352K467282N8894j896083j657178j039335j608230k167840j630030
43858B424832r10318l28271J422867L872502L875994M75676k673268k535744j225278
43849D398992j931657l165729j364467K578463M153738K133188R9535N25373J448421
43840H875857N92757o45165K16653K396235K813649M87261k338038l335289k591871
43831F472049j555240p29831O34412K813663M384430L368896l10168m080599n033212
43822E964400k874036j8739J261609J114158J116367J537057O76404k408746n242887
43813A125587l785343K214764P316621N997006l98996m929024l602870K45815
$$ plain form
43805 4183560 5674391 5760298 5287100 5881920 6536891 5292454 2759007 1429028 2126504
43796 2126504 3410372 4326811 5575182 7527905 8920292 8420770 6396172 4305843
43788 4305843 3084678 2816177 3474648 5261961 8200790 11583422 13883996 13628061 10902835
43779 10902835 7841745 6978711 9058462 12774496 16297671 18418925 18609663 17091907
43771 17091907 14993399 13534853 12788534 11920526 10816461 10660503 12483584 15676307
43763 15676307 18353440 18913907 17058349 13576869 9407370 5030813 1022645 -1045597
43755 -1045597 628242 5756375 11366790 14578501 15252858 14880967 13999358 12515049 11640426
43746 11640426 12884086 15184552 15733076 14206024 13570167 15622151 18254893 18786416
$$ packed form
43805D183560J490831Q5907m73198N94820O54971j244437k533447j329979O97476
43796B126504J283868R16439J248371J952723J392387m99522k024598k090329
43788D305843j221165k68501O58471J787313K938829L382632K300574k55935k725226
43779A0902835l061090q63034K079751L716034L523175K121254J90738j517756
43771A7091907k098508j458546p46319q68008j104065j55958J823081L192723
43763A5676307K677133N60467j855558l481480m169499m376557m008168k068242
43755a045597J673839N128133N610415L211711O74357l71891q81609j484309q74623
43746A1640426J243660K300466N48524j527052o35857K051984K632742N31523
$$ plain form
43738 18786416 17735878 17106948 16732071 15045105 12577828 11961286 14395421 18085483
43730 18085483 20389253 20092149 17618302 14502801 12845094 13963102 17044232 19682088
43722 19682088 19882665 17390130 13650101 10945611 10742234 12179697 13021387 12624696 12616852
43713 12616852 13844962 14596055 13446916 11909506 11860552 12027221 10087107 7139294 6592732
43704 6592732 9020161 11692056 13303861 15395069 18301388 19522196 17850945 15907480
43696 15907480 16334825 18006646 18344366 17389888 17255278 19056319 22437693 26743058 30738208
43687 30738208 32484700 31319609 28795279 26250714 23181445 19684344 18287733 20687744
43679 20687744 24349834 25373718 23640829 22181118 22390327 23075425 23670865 24994772
$$ packed form
43738A8786416j050538o28930l74877j686966k467277o16542K434135L690062
43730A8085483K303770k97104k473847l115501j657707J118008L081130K637856
43722A9682088K00577k492535l740029k704490k03377J437463Q41690l96691p844
43713A2616852J228110P51093j149139j537410m8954J66669j940114k947813n46562
43704F592732K427429K671895J611805K091208K906319J220808j671251j943465
43696A5907480M27345J671821L37720r54478j34610J801041L381374M305365L995150
43687C0738208J746492j165091k524330k544565l069269l497101j396611K400011
43679B0687744L662090J023884j732889j459711K09209O85098N95440J323907
$$ plain form
43671 24994772 26742156 27385200 26964062 27111679 27882493 27450296 25550603 24231720 24238861
43662 24238861 23642144 21464716 19872649 20880516 23203247 24428428 24476292 24984972 26871604
43653 26871604 30201477 34709341 38648059 39130453 36029137 33850621 36898871 43642716
43645 43642716 48639074 49233286 47604764 46962404 48932679 54423405 63442523 73306296
43637 73306296 80277010 84363942 89840030 99521887 111125654 121215775 130380965 141938162
43629 141938162 157295977 175582280 196816039 222203276 251366634 282328228 314948191
43622 314948191 351663426 393208693 435286899 471149955 496636735 511594631 517431228
43615 517431228 514841884 503667489 484000767 457708889 429274338 403866841 383205711
$$ packed form
43671B4994772J747384O43044m21138J47617P70814m32197j899693j318883P141
43662B4238861n96717k177428j592067J007867K322731J225181M7864N08680J886632
43653B6871604L329873M507864L938718M82394l101316k178516L048250O743845
43645D3642716M996358N94212j628522o42360J970275N490726R019118R863773
43637G3306296O970714M086932N476088R681857J1603767J0090121R165190J1557197
43629A41938162J5357815J8286303K1233759K5387237K9163358L0961594L2619963
43622C14948191L6715235M1545267M2078206L5863056K5486780J4957896N836597
43615E17431228k589344j1174395j9666722k6291878k8434551k5407497k0661130
$$ plain form
43608 383205711 364230207 343424391 321437943 301181534 282272536 261041186 236889735
43601 236889735 215040667 200510091 191775053 183251451 172270661 160453914 149565895
43594 149565895 139909021 132518035 128823011 127197974 123438925 116223516 108996797 104690460
43586 104690460 101720765 97606039 93462920 91494583 90369977 87218402 82863939 80616211
43578 80616211 80115460 76883089 68976893 60176329 54745073 52179797 49431233 45884941
43570 45884941 43377920 42543243 41673606 39048704 34969114 31603743 31334478 34418514
43562 34418514 37824814 37719846 33856896 29941934 28576309 27634358 23498452 16535856
43554 16535856 11024845 10070066 12608180 15493791 16919080 17366665 18158372 19482971
$$ packed form
43608C83205711j8975504k0805816k1986448k0256409j8908998k1231350k4151451
43601B36889735k1849068j4530576q735038q523602j0980790j1816747j0888019
43594A49565895r656874p390986l695024j625037l759049p215409p226719m306337
43586A04690460k969695m114726m143119j968337j124606l151575m354463k247728
43578H0616211n00751l232371p906196q800564n431256k565276k748564l546292
43570D5884941k507021q34677q69637k624902m079590l365371k69265L084036
43562C4418514L406300j04968l862950l914962j365625r41951m135906o962596
43554A6535856n511011r54779K538114K885611J425289M47585P91707J324599
$$ plain form
43546 19482971 19777487 17549183 13880104 11809291 12539794 13824058 13393547 12380496
43538 12380496 13352670 16191534 18430398 19144357 19883811 21549650 22697699 21799532 19604678
43529 19604678 18355226 19509199 22670532 26132037 28360218 29309883 29821528 29469924
43521 29469924 26490517 20972161 16378615 15819816 18157224 20197747 21397101 23305565
43513 23305565 25368897 25145775 22715708 21111960 21763844 23012084 23885123 25579344
43505 25579344 27882082 27976496 24974931 22375402 23520149 27311208 30811929 33443651
43497 33443651 35980767 37854958 38403044 38840055 40217383 41262659 41003249 41694509 46127648
43488 46127648 53480446 60697696 66674169 72458434 78865150 86610780 97154390 110586577
$$ packed form
43546A9482971K94516k228304l669079k070813P30503J284264m30511j013051
43538A2380496R72174K838864K238864P13959P39454J665839J148049q98167k194854
43529A9604678j249452J153973L161333L461505K228181R49665N11645l51604
43521B9469924k979407n518356m593546n58799K337408K040523J199354J908464
43513B3305565K063332k23122k430067j603748O51884J248240Q73039J694221
43505B5579344K302738R4414l001565k599529J144747L791059L500721K631722
43497C3443651K537116J874191N48086M37011J377328J045276k59410O91260M433139
43488D6127648P352798P217250N976473N784265O406716P745630J0543610J3432187
$$ plain form
43480 110586577 124548075 138153602 154459662 175187957 195714064 210540763 221758399
43473 221758399 235726414 252034847 262669614 263127466 257751204 251748486 244012273 231509225
43465 231509225 215958504 201733976 190152124 179600491 169055979 158339060 146935963
43458 146935963 135359795 125776702 118898995 112416441 104895377 98776644 96608311 96511214
43450 96511214 94596139 90068860 84602170 78205881 69534027 59722073 52372531 49341531
43442 49341531 48942352 48543783 47119683 45292560 44354004 44897647 45275171 42456200 35905893
43433 35905893 29294932 26479699 27086294 28154876 28616931 29307133 29669312 27951395 24695597
43424 24695597 22854199 23555253 24084660 21262342 15510072 10710348 10529036 14833782
$$ packed form
43480A10586577J3961498J3605527J6306060K0728295K0526107J4826699J1217636
43473B21758399J3968015J6308433J0634767M57852n376262o002718p736213j2503048
43465B31509225j5550721j4224528j1581852j0551633j0544512j0716919j1403097
43458A46935963j1576168r583093o877707o482554p521064o118733k168333r7097
43450I6511214j915075m527279n466690o396289q671854r811954p349542l031000
43442D9341531l99179l98569j424100j827123r38556N43643L77524k818971o550307
43433C5905893o610961k815233O06595J068582M62055O90202L62179j717917l255798
43424B4695597j841398P01054N29407k822318n752270m799724j81312M304746
$$ plain form
43416 14833782 19341341 19587486 15863376 12858436 13490359 15220513 14423456 12101102
43408 12101102 11997231 14496652 16286427 15749790 14930410 15624612 16805042 16915258 16079822
43399 16079822 15007690 13836437 12820561 12223919 11139312 8551354 5804682 5483676
43391 5483676 7405907 8542659 7699671 7220100 8655428 9813690 8305523 5483442
43383 5483442 4174218 4384017 4205443 3768710 5095124 8242281 10546034 10424427 9695810
43374 9695810 10829868 13321517 14384199 12737323 10160833 8947120 9048162 8832451
43366 8832451 7982731 7971061 9435201 10758085 10222416 8309590 6657651 5776590 5133795
43357 5133795 4602406 4330957 3825795 2565830 1002536 -121494 -559344 314896 3553133
$$ packed form
43416A4833782M507559K46145l724110l004940O31923J730154p97057k322354
43408A2101102j03871K499421J789775n36637q19380O94202J180430J10216q35436
43399A6079822j072132j171253j015876n96642j084607k587958k746672l21006
43391E483676J922231J136752q42988m79571J435328J158262j508167k822081
43383E483442j309224K09799j78574m36733J326414L147157K303753j21607p28617
43374I695810J134058K491649J062682j646876k576490j213713J01042k15711
43366H832451q49720j1670J464140J322884n35669j912826j651939q81061o42795
43357E133795n31389k71449n05162j259965j563294j124030m37850Q74240L238237
$$ plain form
43348 3553133 8162040 10407989 8028142 3671289 1452962 1531493 1267348 371253 898750
43339 898750 2777434 3626516 3131683 3452484 4791955 4681636 2543163 938812 1133456
43330 1133456 1362278 904490 1946806 5630201 9829379 12516953 13772051 13104770 9080913
43321 9080913 3490343 1274888 3741114 6375136 6236174 6548185 10249343 14127272
43313 14127272 14295167 12840279 13182412 12908668 8083951 1695308 340679 4133788
43305 4133788 7220136 7491387 8372568 10893525 11470911 8877029 6561074 6083812 4591632
43296 4591632 1237078 13746 2999923 6180110 5636412 3244315 2488018 2887189 2545422
43287 2545422 2326467 3196436 2859383 -340835 -3074883 -1487498 2269953 3087678 929915
$$ packed form
43348C553133M608907K245949k379847m356853k218327P8531k64145q96095N27497
43339H98750J878684Q49082m94833L20801J339471j10319k138473j604351J94644
43330A133456K28822m57788J042316L683395M199178K687574J255098o67281m023857
43321I080913n590570k215455K466226K634022j38962L12011L701158L877929
43313A4127272J67895j454888L42133k73744m824717o388643j354629L793109
43305D133788L086348K71251Q81181K520957N77386k593882k315955m77262j492180
43296D591632l354554j223332K986177L180187n43698k392097p56297L99171l41767
43287B545422k18955Q69969l37053l200218k734048J587385L757451Q17725k157763
$$ plain form
43278 929915 541732 3760142 7250531 8158629 7300807 5863169 3306944 154830 -882573
43269 -882573 1302301 4115220 4986254 4790358 5494572 6599785 6383531 5091253 4314439
43260 4314439 4196180 3788453 3630998 5360141 8599350 10544853 9307609 5925864 2502736
43251 2502736 156100 -434799 1460174 4960339 7021801 5588502 2369581 573229
43243 573229 749589 1031707 687372 691488 1079008 859800 882622 3360412 7411748 8552739
43233 8552739 4715775 -273316 -1854912 -642670 -17175 -293948 626205 2280504 1828979
43224 1828979 -974577 -3017284 -2517196 -1083971 -490540 -537739 -908556 -2150698 -3742289
43215 -3742289 -3806830 -1912761 41037 612249 388614 231693 313534 1382920 4249442
$$ packed form
43278I29915l88183L218410L490389R08098q57822j437638k556225l152114j037403
43269h82573K184874K812919Q71034j95896P04214J105213k16254j292278p76814
43260D314439j18259m07727j57455J729143L239209J945503j237244l381745l423128
43251B502736k346636n90899J894973L500165K061462j433299l218921j796352
43243E73229J76360K82118l44335M116L87520k19208K2822K477790M051336J140991
43233H552739l836964m989091j581596J212242O25495k76773R20153J654299m51525
43224A828979k803556k042707N00088J433225N93431m7199l70817j242142j591591
43215c742289o4541J894069J953798N71212k23635j56921Q1841J069386K866522
$$ plain form
43206 4249442 7301656 7548170 5188519 3972910 5535364 6716015 4725600 1812579
43198 1812579 1766290 4163206 5457837 4321558 2689353 2259132 2724056 3211135 3401254
43189 3401254 3482008 4411309 7419899 11824123 14511198 13398955 10380230 8953882 9818172
43180 9818172 10650746 9415274 6038085 1577431 -2399803 -4194302 -3401864 -1466530
43172 -1466530 398084 2763704 6063494 8622083 8716562 7428484 7079668 7657652 7231356
43163 7231356 5408999 3959401 4099379 5225562 6312906 6838960 6470790 5365500 4460553
43154 4460553 4158688 3490656 1976355 1072427 1915379 3051191 2791449 2432912 4215062
43145 4215062 7231657 8732852 8659897 9106604 9692042 7801976 3963690 2595936 5791636
$$ packed form
43206D249442L052214K46514k359651j215609J562454J180651j990415k913021
43198A812579m6289K396916J294631j136279j632205m30221M64924M87079J90119
43189C401254Q0754R29301L008590M404224K687075j112243l018725j426348Q64290
43180I818172Q32574j235472l377189m460654l977234j794499P92438J935334
43172a466530J864614K365620L299790K558589R4479j288078l48816N77984m26296
43163G231356j822357j449598J39978J126183J087344N26054l68170j105290r04947
43154D460553l01865o68032j514301r03928Q42952J135812k59742l58537J782150
43145D215062L016595J501195p2955M46707N85438j890066l838286j367754L195700
$$ plain form
43136 5791636 10056297 11292741 9928394 8856115 8970006 9198154 8841463 7512664 4543282
43127 4543282 714460 -1051700 959591 4598780 6832089 8090140 11080179 16195583
43119 16195583 21068724 24703376 29231393 36429973 44383584 49370035 50531077 51144705
43111 51144705 54932403 62547334 73299709 89319250 114120900 144766844 168591169
43104 168591169 172639585 156400005 131418956 108367001 89154717 72559754 61051962
43097 61051962 57106092 56671753 52492270 43029014 33279646 27082537 23240557 19761065
43089 19761065 17425152 17244133 17546281 15854525 11926028 7535797 4814000 5617158
43081 5617158 10367480 16128167 17887279 13715575 7297979 3546576 2951282 2302894
$$ packed form
43136E791636M264661J236444j364347j072279J13891K28148l56691j328799k969382
43127D543282l828822j766160K011291L639189K233309J258051K990039N115404
43119A6195583M873141L634652M528017P198580P953611M986451J161042O13628
43111E1144705L787698P614931J0752375J6019541K4801650L0645944K3824325
43104A68591169M048416j6239580k4981049k3051955j9212284j6594963j1507792
43097F1051962l945870m34339m179483r463256r749368o197109l841980l479492
43089A9761065k335913j81019L02148j691756l928497m390231k721797Q03158
43081E617158M750322N760687J759112m171704o417596l751403n95294o48388
$$ plain form
43073 2302894 -41441 -2243164 -2254287 -511895 1497168 3539825 6167548 9003881
43065 9003881 10963876 11873483 12664779 13844725 14703627 14424569 13269264 12016632 10609847
43056 10609847 8208702 4730421 1674026 908248 2855184 6230848 9372267 11350588
43048 11350588 11917475 11181619 9852712 9252853 10125428 11402564 11153612 9239511 8009724
43039 8009724 9274412 11358314 10902601 7480085 4340613 3865415 4383046 3092792 428845
43030 428845 -800646 376365 2322417 3810747 5079514 5745256 4655265 2833852
43022 2833852 3728346 8543003 13437963 13831591 10257818 7508621 8591127 11930020
43014 11930020 14603964 16298582 19398603 26301153 36945488 48141003 55422892 56660558
$$ packed form
43073B302894k344335k201723j1123J742392K009063K042657K627723K836333
43065I003881J959995R09607P91296J179946Q58902k79058j155305j252632j406785
43056A0609847k401145l478281l056395p65778J946936L375664L141419J978321
43048A1350588N66887p35856j328907n99859Q72575J277136k48952j914101j229787
43039H009724J264688K083902m55713l422516l139472m75198N17631j290254k663947
43030D28845j229491J177011J946052J488330J268767O65742j089991j821413
43022B833852Q94494M814657M894960L93628l573773k749197J082506L338893
43014A1930020K673944J694618L100021O902550J0644335J1195515P281889J237666
$$ plain form
43006 56660558 53888085 50681562 48022777 44059228 37750916 30875345 25730531 22394151
42998 22394151 19476864 16656133 15078848 15493309 17053793 18065261 17243347 14276290
42990 14276290 9982997 6277119 5282477 7626783 11580369 14466377 15122625 14528875
42982 14528875 13888874 12949525 10966398 8626272 7656094 8541647 9916046 10518199 10544646
42973 10544646 10538376 10182722 9127331 8068381 7953971 8741128 9782829 10707878 11052181
42964 11052181 9985517 7629930 5717575 5372705 5076902 2871722 61813 136431 3699707
42955 3699707 7154295 7610298 6663188 7253741 8672097 7640463 3787393 1010326 2633086
42946 2633086 7480346 12060378 14904961 16938411 18658705 19285267 18720753 18231143 18294149
$$ packed form
43006E6660558k772473l206523k658785l963549o308312o875571n144814l336380
42998B2394151k917287k820731j577285M14461J560484J011468q21914k967057
42990A4276290m293293l705878r94642K344306L953586K886008O56248n93750
42982A4528875o40001r39349j983127k340126r70178Q85553J374399O02153K6447
42973A0544646o270l55654j055391j058950j14410P87157J041701R25049L44303
42964A1052181j066664k355587j912355l44870k95803k205180k809909P4618L563276
42955C699707L454588M56003r47110N90553J418356j031634l853070k777067J622760
42946B633086M847260M580032K844583K033450J720294O26562n64514m89610O3006
$$ plain form
42937 18294149 17337492 13958379 9428357 6477317 6041976 6713588 7249217 7962430 9171590
42928 9171590 9773024 8521491 6121927 4988224 6729316 10087231 11573921 8778538
42920 8778538 3520161 809259 3401076 8145198 9715161 7514103 6077527 8188409
42912 8188409 10923566 10386187 7413046 5629324 5932772 6462501 6836651 8447939 10569765
42903 10569765 9960331 5392707 -348485 -4187915 -5930799 -6457416 -5333329 -2188639
42895 -2188639 1364198 3285073 3512157 3284265 3179060 3224832 3685645 4110447 2820742
42886 2820742 -751395 -4189557 -4646232 -2619960 -1033598 -981580 -801979 551249 1736417
42877 1736417 1433024 385141 -187960 -466329 -766479 192296 3733607 8505604 11251901
$$ packed form
42937A8294149r56657l379113m530022k951040m35341O71612N35629P13213J209160
42928I171590O01434j251533k399564j133703J741092L357915J486690k795383
42920H778538n258377k710902K591817M744122J569963k201058j436576K110882
42912H188409K735157n37379k973141j783722L03448N29729L74150J611288K121826
42903A0569765o09434m567624n741192l839430j742884n26617J124087L144690
42895b188639L552837J920875K27084k27892j05205M5772M60813M24802j289705
42886B820742l572137l438162m56675K026272J586362N2018J79601J353228J185168
42877A736417l03393j047883n73101k78369l00150R58775L541311M771997K746297
$$ plain form
42868 11251901 10381176 7279637 3989656 1308534 -220436 656823 4132538 7613323
42860 7613323 7934051 5311434 3183655 3633548 4852007 4192259 1918736 102103 -799311
42851 -799311 -1722229 -2029463 207198 4464388 7150784 6093013 3307859 1615790 809175
42842 809175 -341244 -367581 2874824 7296816 7976722 4260638 1463600 3422716 6814181
42833 6814181 6179020 2128419 212826 2510664 4993971 4112808 1833057 1877917 4097551
42824 4097551 5604917 5518175 5351395 5826959 6518386 8074961 11389388 14415937 13333990
42815 13333990 8000081 3195490 2801078 5349404 7278786 8035024 9274695 11011658
42807 11011658 11778569 11509788 11097722 9742329 6076424 1890551 1278093 5113795 9254762
$$ packed form
42868A1251901q70725l101539l289981k681122j528970Q77259L475715L480785
42860G613323L20728k622617k127779M49893J218459o59748k273523j816633r01414
42851g99311r22918l07234K236661M257190K686396j057771k785154j692069q06615
42842H09175j150419k6337L242405M421992O79906l716084k797038J959116L391465
42833F814181o35161m050601j915593K297838K483307q81163k279751M4860K219634
42824D097551J507366q6742j66780M75564O91427J556575L314427L026549j081947
42815A3333990n333909m804591l94412K548326J929382P56238J239671J736963
42807A1011658P66911k68781m12066j355393l665905m185873o12458L835702M140967
$$ plain form
42798 9254762 9682866 7197735 5392012 5781175 6868926 7040042 6532861 6516056 7076183
42789 7076183 6503489 3133929 -1591730 -3128618 1221887 8058121 11057028 8203406
42781 8203406 3121474 -604813 -2690405 -3068292 -144483 5363704 8858734 7776865
42773 7776865 5962214 7979023 11621156 11039044 5782957 1332351 940346 2284386
42765 2284386 2910664 3809749 5719425 6383357 4220582 1371046 372780 511326 7376
42756 7376 -719110 -704282 -1074970 -2997093 -4746204 -3919905 -1295587 510776 1172883
42747 1172883 2325237 3837757 3753120 1888128 315326 -224941 -1421211 -3892911 -5259686
42738 -5259686 -3401144 174662 2126496 1568145 963324 2907005 7007097 10180580
$$ packed form
42798I254762M28104k485131j805723L89163J087751J71116n07181j6805N60127
42789G076183n72694l369560m725659j536888M350505O836234K998907k853622
42781H203406n081932l726287k085592l77887K923809N508187L495030j081869
42773G776865j814651K016809L642133n82112n256087m450606l92005J344040
42765B284386O26278Q99085J909676O63932k162775k849536r98266J38546n03950
42756G376p26486J4828l70688j922123j749111Q26299K624318J806363O62107
42747A172883J152354J512520q4637j864992j572802n40267j196270k471700j366775
42738e259686J858542L575806J951834n58351o04821J943681M100092L173483
$$ plain form
42730 10180580 9852231 6780431 4309314 4504423 5810886 5455919 3330231 1870429
42722 1870429 2489378 4101066 5385559 6456551 7358322 6611876 2842237 -2757893 -6783886
42713 -6783886 -6491512 -2103251 3371174 6541557 6388034 4644114 3188897 1900900
42705 1900900 86801 -1225994 -694372 285559 -1065232 -4213019 -5214613 -2466035
42697 -2466035 706620 1200817 744948 2322689 4556135 3701445 -3325 -2200622 -585696
42688 -585696 2542287 4525191 5745292 7508936 9322438 9966212 9344320 7809539 5258627
42679 5258627 2197541 250735 328382 1461337 2440207 3287506 4072683 3713994 1399431
42670 1399431 -1723973 -3468233 -2528638 1078960 6173830 10174016 10392162 7088256
$$ packed form
42730A0180580l28349l071800k471117J95109J306463l54967k125688j459802
42722A870429O18949J611688J284493J070992R01771p46446l769639n600130m025993
42713f783886K92374M388261N474425L170383j53523j743920j455217j287997
42705A900900j814099j312795N31622R79931j350791l147787j001594K748578
42697b466035L172655M94197m55869J577741K233446q54690l704770k197297J614926
42688e85696L127983J982904J220101J763644J813502O43774o21892j534781k550912
42679E258627l061086j946806P7647J132955R78870Q47299P85177l58689k314563
42670A399431l123404j744260R39595L607598N094870M000186K18146l303906
$$ plain form
42662 7088256 3965113 4030492 6036803 6599305 4689083 2120279 530117 54539 466648
42653 466648 1451413 1973704 1439548 1352115 3632993 7178860 8392241 5733496 1626802
42644 1626802 -1016047 -2077444 -2722965 -2548579 -386573 2918965 4683788 3453245
42636 3453245 533344 -1756716 -2294871 -1348693 346562 1840581 1845806 -408494 -3797012
42627 -3797012 -5640252 -4341569 -1286777 913727 1708443 2557873 3694759 3373366 1418106
42618 1418106 839969 3392718 5623542 3103439 -2293887 -3743834 1251994 7219991
42610 7219991 8277536 5504028 3677482 3798541 3176557 1296772 775851 2389534 3500906
42601 3500906 2641539 1876401 2542062 1889197 -2834247 -8922768 -10522476 -6043018 -156819
$$ packed form
42662G088256l123143O5379K006311N62502j910222k568804j590162m75578M12109
42653D66648R84765N22291n34156q7433K280878L545867J213381k658745m106694
42644A626802k642849j061397o45521J74386K162006L305538J764823j230543
42636C453245k919901k290060n38155R46178J695255J494019N225k254300l388518
42627c797012j843240J298683L054792K200504P94716Q49430J136886l21393j955260
42618A418106n78137K552749K230824k520103n397326j449947M995828N967997
42610G219991J057545k773508j826546J21059o21984j879785n20921J613683J111372
42601C500906q59367p65138O65661o52865m723444o088521j599708M479458N886199
$$ plain form
42592 -156819 2046688 371419 -1813111 -1892061 408197 3961103 6922828 7499276 5800277
42583 5800277 4366394 5287771 7249609 7027656 3593926 -954234 -4350689 -6095433
42575 -6095433 -6306991 -4861952 -2578444 -1415885 -2199422 -3397569 -3248092 -1891460 -320396
42566 -320396 1514468 4217720 7552237 10749595 13346446 14770311 14294620 12471334
42558 12471334 11200972 11156860 10791439 9331910 8628791 9840304 10521793 8185346 4976379
42549 4976379 4881806 7278346 7589390 4273984 839480 268828 1607089 3260039 5628232
42540 5628232 8616865 10145242 9358830 8212187 7675025 5512086 434731 -4464373
42532 -4464373 -5475679 -3168588 -634141 928482 1860610 1574016 702 -352547 2275251
$$ packed form
42592a56819K203507j675269k184530p8950K300258L552906K961725N76448j698999
42583E800277j433883R21377J961838k21953l433730m548160l396455j744744
42575f095433k11558J445039K283508J162559p83537j198147J49477J356632J571064
42566c20396J834864K703252L334517L197358K596851J423865m75691j823286
42558A2471334j270362m4112l65421j459529p03119J211513O81489k336447l208967
42549D976379r4573K396540L11044l315406l434504n70652J338261J652950K368193
42540E628232K988633J528377p86412j146643n37162k162939n077355m899104
42532d464373j011306K307091K534447J562623R32128k86594j573314l53249K627798
$$ plain form
42523 2275251 4858678 3066036 -1866273 -4062088 -1060703 3060518 3615258 946024
42515 946024 -1393141 -1499231 -428663 -178884 -1572420 -3260272 -2628880 1085417 4865284
42506 4865284 4901823 1332666 -2132697 -3251968 -3336545 -3857797 -3813804 -1958146 514060
42497 514060 1488185 1007477 1110391 2990253 5454115 6229785 4451640 1847220 1072927
42488 1072927 2497677 3595946 2587765 1395875 2851693 5808172 6034448 2288514
42480 2288514 -1429597 -958192 2912899 5969727 5619629 2852387 265784 -410624 628302
42471 628302 1716077 1537127 762350 1196012 3325227 5845040 7597374 8451819 8047469
42462 8047469 5500155 1157296 -2889963 -5010299 -5594971 -5715455 -5444176 -4254362 -2001833
$$ packed form
42523B275251K583427j792642m932309k195815L001385M121221N54740k669234
42515I46024k339165j06090J070568K49779j393536j687852O31392L714297L779867
42506D865284L6539l569157l465363j119271q4577n21252M3993J855658K472206
42497E14060R74125m80708J02914J879862K463862P75670j778145k604420p74293
42488A072927J424750J098269j008181j191890J455818K956479K26276l745934
42480B288514l718111M71405L871091L056828l50098k767242k586603o76408J038926
42471F28302J087775j78950p74777M33662K129215K519813J752334Q54445m04350
42462H047469k547314m342859m047259k120336n84672j20484K71279J189814K252529
$$ plain form
42453 -2001833 1035167 3945471 4780352 2105844 -2388098 -4711430 -3128128 -253143
42445 -253143 623865 -317621 -507565 1183757 3523624 4937599 4701523 2651620 -665710
42436 -665710 -3666401 -4741601 -3660333 -1424179 863435 2454235 2935665 2487169 1737062
42427 1737062 957436 2201 -733168 -264970 1652414 4126827 6370937 8156140 8765055
42418 8765055 7194901 4189868 2327683 2807456 3621631 2438882 117978 -365501 2193301
42409 2193301 5972761 8454271 8825944 8149280 7776334 7520267 5602550 1358562 -2377017
42400 -2377017 -1608063 3632235 8545814 8979828 5575061 1518547 -1407795 -2867974
42392 -2867974 -2509761 -953978 -536203 -2549819 -5025969 -5458196 -4239292 -3034747 -1546086
$$ packed form
42453b001833L037000K910304Q34881k674508m493942k323332J583302K874985
42445b53143Q77008r41486j89944J691322K339867J413975k36076k049903l317330
42436f65710l000691j075200J081268K236154K287614J590800M81430m48496p50107
42427A737062p79626r55235p35369M68198J917384K474413K244110J785203O08915
42418H765055j570154l005033j862185M79773Q14175j182749k320904m83479K558802
42409B193301L779460K481510L71673o76664l72946k56067j917717m243988l735579
42400b377017P68954N240298M913579M34014l404767m056514k926342j460179
42392b867974L58213J555783M17775k013616k476150m32227J218904J204545J488661
$$ plain form
42383 -1546086 998293 2654170 928496 -2464428 -2974124 403206 3741728 3878527
42375 3878527 2031202 539906 -701865 -2543308 -3799467 -2646273 425469 2929918
42367 2929918 3048527 952447 -1697058 -2794473 -1350780 1205957 2248298 1093669
42359 1093669 -174027 331675 1827717 2359220 1618283 928421 1054431 1351833 1027600
42350 1027600 339498 309981 1538043 3379252 4421794 4016234 3057762 2694005 2565758
42341 2565758 1291838 -1265956 -3273717 -2957830 -751220 1083971 742617 -1395601
42333 -1395601 -3143468 -2616732 -105752 2305969 2958880 1935364 243042 -1188290
42325 -1188290 -1336808 583862 3552803 4862313 3397507 1755041 3174179 6965981
$$ packed form
42383a546086K544379J655877j725674l392924n09696L377330L338522J36799
42375C878527j847325j491296j241771j841443j256159J153194L071742K504449
42367B929918J18609k096080k649505j097415J443693K556737J042341j154629
42359A093669j267696N05702J496042N31503p40937o89862J26010K97402l24233
42350A027600o88102k9517J228062J841209J042542m05560r58472l63757j28247
42341B565758j273920k557794k007761L15887K206610J835191l41354k138218
42333a395601j747867N26736K510980K411721O52911j023516j692322j431332
42325a188290j48518J920670K968941J309510j464806j642466J419138L791802
$$ plain form
42317 6965981 9051321 6979150 2645630 -105071 837284 4528096 7919091 8182940
42309 8182940 5411813 2832636 3073392 4744644 4424872 1526732 -1012339 -845271 1272703
42300 1272703 3481200 5135142 6299680 6720529 6318268 5492489 4265927 2235086 -231009
42291 -231009 -1959335 -2495033 -2470088 -2241045 -1452180 -152400 1003930 1886794 2912498
42282 2912498 3824416 3801536 2811549 1476106 -248625 -2660114 -4819724 -5339845 -4519901
42273 -4519901 -3761057 -3082406 -1401070 968580 2585332 3444840 4504524 4930326 3264628
42264 3264628 1388931 3117858 7844527 9967436 6578007 1535250 -700766 -1168248
42256 -1168248 -2796596 -4365202 -2687785 1489661 4510439 5496646 6623880 8316219
$$ packed form
42317F965981K085340k072171m333520k750701R42355L690812L390995K63849
42309H182940k771127k579177K40756J671252l19772k898140k539071J67068K117974
42300A272703K208497J653942J164538M20849m02261q25779j226562k030841k466095
42291b31009j728326n35698K4945K29043P88865J299780J156330Q82864J025704
42282B912498R11918k2880r89987j335443j724731k411489k159610n20121Q19944
42273d519901P58844O78651J681336K369650J616752Q59508J059684M25802j665698
42264C264628j875697J728927M726669K122909l389429n042757k236016m67482
42256a168248j628348j568606J677417M177446L020778R86207J127234J692339
$$ plain form
42248 8316219 8394913 6248424 4244961 4248002 5444270 6257502 6191431 5329591 3915120
42239 3915120 2701599 2158579 1499166 52873 -1006457 -242100 1371996 1561353 22081
42230 22081 -1687530 -2917187 -3952393 -3748832 -762244 3788678 6554358 6537594 6064801
42221 6064801 6574310 6552981 4988845 3831186 4915049 6888269 7655271 7926993 9494605
42212 9494605 11275040 10348627 6810095 4534933 6100438 9127229 9243822 5463423
42204 5463423 1008483 -622869 1151855 4542653 7324220 7641557 4604934 -360876
42196 -360876 -3686521 -2945972 373110 2958392 3995114 5226895 6955579 6997048 4584633
42187 4584633 2420010 2905457 4587503 4662816 3289937 2911250 4549981 7248206 10162318
$$ packed form
42248H316219P8694k146489k003463L041J196268Q13232o6071q61840j414471
42239C915120j213521n43020o59413j446293j059330P64357J614096J89357j539272
42230B2081j709611j229657j035206K03561K986588M550922K765680j6764m72793
42221F064801N09509k1329j564136j157659J083863J973220P67002K71722J567612
42212I494605J780435r26413l538532k275162J565505L026791J16593l780399
42204E463423m454940j631352J774724L390798K781567L17337l036623m965810
42196c60876l325645P40549L319082K585282J036722J231781J728684M1469k412415
42187D584633k164623M85447J682046P5313j372879l78687J638731K698225K914112
$$ plain form
42178 10162318 12726229 13589595 12019494 9835325 9446982 10409322 10389898 9012534 7927255
42169 7927255 7396023 5981426 3852142 3228243 4813530 6677205 7528084 8177704 8651378
42160 8651378 6968529 2679089 -1052182 -1221040 1144886 3113213 4014069 5028726
42152 5028726 6192708 6697373 7301427 9476567 12318511 13093709 11257497 9361556 9014000
42143 9014000 8260170 4700648 -380142 -3184456 -2110704 718011 2569209 2736386
42135 2736386 1620475 -566652 -2603051 -1548310 4137728 11259241 14252455 11265293
42127 11265293 5840287 2250526 1435815 2053891 2761642 2130647 -934730 -4652717 -4730620
42118 -4730620 154433 5407117 6048398 3344128 2403894 4554814 6182898 4745504
$$ packed form
42178A0162318K563911Q63366j570101k184169l88343R62340j9424j377364j085279
42169G927255n31232j414597k129284o23899J585287J863675Q50879O49620M73674
42160H651378j682849m289440l731271j68858K365926J968327R00856J014657
42152E028726J163982N04665O04054K175140K841944P75198j836212j895941l47556
42143I014000p53830l559522n080790k804314J073752K828715J851198J67177
42135B736386j115911k187127k036399J054741N686038P121513K993214k987162
42127A1265293n425006l589761q14711O18076P07751o30995l065377l717987p7903
42118d730620M885053N252684O41281k704270r40234K150920J628084j437394
$$ plain form
42110 4745504 1862712 -55735 -681675 -352141 1152978 3288036 4636127 4974910 5261107
42101 5261107 5171794 3222932 -161593 -2409450 -2334019 -1319420 -416893 869669 2222137
42092 2222137 2148216 1120667 1868439 5024304 7539348 7127598 5282383 4016944 2726083
42083 2726083 591519 -856761 -285976 883146 1152911 1706152 3672540 5151314 4222974
42074 4222974 2720943 3443926 5439206 5760748 4368883 3353332 2492619 -142756 -3648801
42065 -3648801 -4559992 -1905689 1635726 3948924 5394154 6150913 5262989 3219656 2151184
42056 2151184 2284574 1299807 -1442262 -3086069 -1501079 1382595 2582398 2094646 1541181
42047 1541181 820596 -879229 -1866787 857922 6795174 10994506 9392824 3863863
$$ packed form
42110D745504k882792j918447o25940L29534J505119K135058J348091L38783K86197
42101E261107q9313j948862l384525k247857P5431J014599R02527J286562J352468
42092B222137p3921j027549P47772L155865K515044m11750j845215j265439j290861
42083B726083k134564j448280N70785J169122K69765N53241J966388J478774r28340
42074D222974j502031P22983J995280L21542j391865j015551q60713k635375l506045
42065c648801r11191K654303L541415K313198J445230P56759q87924k043333j068472
42056B151184J33390r84767k742069j643807J584990K883674J199803m87752n53465
42047A541181p20585j699825r87558K724709N937252M199332j601682n528961
$$ plain form
42039 3863863 418071 2521797 7363240 9357270 6688369 3081390 2796061 5328678
42031 5328678 6540729 4308013 987242 -123742 1046510 1996900 1443020 751499 1485706
42022 1485706 2858310 2610926 46665 -2894870 -3935240 -2964200 -1509794 -496626
42014 -496626 179158 342833 -359200 -917850 512708 3836636 6616623 7473252 8001471
42005 8001471 9869965 11933439 12309265 11704066 12004964 12587435 11075327 7601831 5342444
41996 5342444 6204189 8430915 9342311 8324752 6137946 3359194 979221 790155 3232703
41987 3232703 5870818 5999558 4360182 4296085 6979443 9324742 7777593 3073388 -340806
41978 -340806 580321 4396860 7480153 7878055 5978220 2773550 -700474 -2841314 -2417769
$$ packed form
42039C863863l445792K103726M841443J994030k668901l606979k85329K532617
42031E328678J212051k232716l320771j110984J170252R50390n53880o91521P34207
42022A485706J372604k47384k564261k941535j040370R71040J454406J013168
42014d96626O75784J63675p02033n58650J430558L323928K779987Q56629N28219
42005H001471J868494K063474L75826o05199L00898N82471j512108l473496k259387
41996E342444Q61745K226726R11396j017559k186806k778752k379973j89066K442548
41987C232703K638115J28740j639376o4097K683358K345299j547149m704205l414194
41978c40806R21127L816539L083293L97902j899835l204670l474024k140840M23545
$$ plain form
41969 -2417769 -108963 2482076 5212349 8863028 12257847 12511524 9100561 5403815
41961 5403815 4722307 6498355 7925709 7757379 6966839 6811569 7576952 8360553 7463208
41952 7463208 4314148 1243699 1187892 3285052 3769657 2090081 2229220 5904601 8683503
41943 8683503 6426013 1988651 960103 3431551 5090869 4639675 4630513 5713481 5508710
41934 5508710 3503230 2269293 2996166 3840587 3449210 2485882 1222228 -673950 -1551102
41925 -1551102 1144521 6578087 11023380 13076698 14414721 15044783 12620075 7741172
41917 7741172 5064702 6876554 9704112 9752783 7914541 6743949 6004052 4302746 2399774
41908 2399774 1865879 2341011 2347525 1175542 -1241794 -4046092 -4384714 -15232 6018450
$$ packed form
41969b417769K308806K591039K730273L650679L394819K53677l410963l696746
41961E403815o81508J776048J427354j68330p90540j55270P65383P83601q97345
41952G463208l149060l070449n5807K097160M84605j679576J39139L675381K778902
41943H683503k257490m437362j028548K471448J659318m51194r162J082968k04771
41934E508710k005480j233937P26873Q44421l91377r63328j263654j896178q77152
41925a551102K695623N433566M445293K053318J338023O30062k424708m878903
41917G741172k676470J811852K827558M8671j838242j170592p39897j701306j902972
41908B399774n33895M75132O514j171983k417336k804298l38622M369482O033682
$$ plain form
41899 6018450 7487205 3498175 389140 2602805 6464125 6686535 4516789 4500947 6570836
41890 6570836 6790528 3994461 748881 -1084349 -1617233 -968452 339237 451858 -945281
41881 -945281 -763939 2779539 5880450 4072283 -533688 -2037773 546684 2708673
41873 2708673 1787751 -601891 -3346890 -7351306 -11483363 -12372981 -9840546 -7817432
41865 -7817432 -7984514 -6922780 -2058476 3461321 5020162 2982541 1699491 3526906
41857 3526906 6475150 7277417 5067393 2038036 1034992 2396442 3639582 2945292
41849 2945292 1762040 2332101 3920187 3981957 2241823 841652 944904 1966567 3617413
41840 3617413 5633713 5966953 2764914 -1927947 -4063908 -3309954 -3120668 -4868004 -6139963
$$ packed form
41899F018450J468755l989030l109035K213665L861320K22410k169746j5842K069889
41890F570836K19692k796067l245580j833230n32884O48781J307689J12621j397139
41881i45281J81342L543478L100911j808167m605971j504085K584457K161989
41873B708673r20922k389642k744999m004416m132057q89618K532435K023114
41865g817432j67082J061734M864304N519797J558841k037621j283050J827415
41857C526906K948244Q02267k210024l029357j003044J361450J243140o94290
41849B945292j183252N70061J588086O1770j740134j400171J03252J021663J650846
41840C617413K016300L33240l202039m692861k135961P53954J89286j747336j271959
$$ plain form
41831 -6139963 -5708383 -5649400 -6747469 -6041324 -1537674 4032534 6842002 6590731 5179663
41822 5179663 3539868 2229715 2562207 4482139 5515482 4260299 2787346 3293147
41814 3293147 4720968 5218704 5535616 7036944 8505944 8151525 6996159 6915551 6883058
41805 6883058 4844707 2259285 2800913 6640578 9558545 8280357 3935957 -243992
41797 -243992 -2166300 -1319717 1582492 4494744 5403648 4644867 4490574 5958320 7478478
41788 7478478 7238752 5404868 3311927 1743739 941986 1294921 2768180 4056008 3595046
41779 3595046 1797002 1326219 4122365 8457539 10402094 8688659 6537751 7387863
41771 7387863 10326823 11837890 10875954 9333709 8014673 5638378 2404652 1158834
$$ packed form
41831f139963M31580N8983j098069P06145M503650N570208K809468k51271j411068
41822E179663j639795j310153L32492J919932J033343j255183j472953N05801
41814C293147J427821M97736L16912J501328J469000l54419j155366q0608l2493
41805F883058k038351k585422N41628L839665K917967j278188m344400m179949
41797b43992j922308Q46583K902209K912252R08904p58781j54293J467746J520158
41788G478478k39726j833884k092941j568188q01753L52935J473259J287828m60962
41779C595046j798044m70783K796146M335174J944555j713435k150908Q50112
41771G387863K938960J511067r61936j542245j319036k376295l233726j245818
$$ plain form
41763 1158834 3517234 7384039 9671982 9204607 6066180 1107906 -2592966 -1288424
41755 -1288424 4212032 8074077 6730139 3422280 2554052 3102600 1854892 179894
41747 179894 2189553 7569942 11470534 11214498 8644421 5994557 3766904 2713651
41739 2713651 3569651 4387758 2270577 -1651621 -2998201 -571064 2113812 2641812 2728945
41730 2728945 4014873 5160477 5191644 5682309 7143595 7089847 4609954 3190962 5411579
41721 5411579 8011250 6462170 2094409 108621 1919647 4107909 4471365 4521962 5350401
41712 5350401 5105589 2312546 -1135831 -2252185 -541554 2169723 4218038 5084166
41704 5084166 4768900 3454101 1572879 -430659 -2297426 -3724203 -4262000 -3628705 -1956541
$$ packed form
41763A158834K358400L866805K287943m67375l138427m958274l700872J304542
41755a288424N500456L862045j343938l307859q68228N48548j247708j674998
41747A79894K009659N380389L900592k56036k570077k649864k227653j053253
41739B713651Q56000Q18107k117181l922198j346580K427137K684876N28000Q7133
41730B728945J285928J145604L1167M90665J461286n3748k479893j418992K220617
41721E411579K599671j549080m367761j985788J811026K188262L63456N0597Q28439
41712E350401k44812k793043l448377j116354J710631K711277K048315Q66128
41704E084166l15266j314799j881222k003538j866767j426777n37797O33295J672164
$$ plain form
41695 -1956541 210806 2012364 2707562 2416448 2123810 2549040 3375333 4022799 4679041
41686 4679041 5875167 7337834 7959390 6876320 4264872 1344649 -140911 1020099
41678 1020099 4420913 8266000 10951000 12005059 11477946 9486595 6917657 5410866
41670 5410866 5539956 5788742 4526339 2419804 1596108 2784802 4700056 6203914 7622712
41661 7622712 9432534 10759747 10122839 7384091 4316221 2985362 3616737 4319777 3264201
41652 3264201 931801 -458256 307145 2265266 4033023 5404473 6460300 6414589 4717276
41643 4717276 2502216 1482834 1814903 2332767 2559843 3194321 4757734 6837138 8428179
41634 8428179 8140562 4822699 -563952 -4398904 -3743103 -72790 2320687 1688830 395042
$$ packed form
41695a956541K167347J801558O95198k91114k92638M25230Q26293O47466O56242
41686D679041J196126J462667O21556j083070k611448k920223j485560J161010
41678A020099L400814L845087K685000J054059n27113j991351k568938j506791
41670E410866J29090K48786j262403k106535q23696J188694J915254J503858J418798
41661G622712J809822J327213o36908k738748l067870j330859O31375P03040j055576
41652C264201k332400j390057P65401J958121J767757J371450J055827m5711j697313
41643D717276k215060j019382L32069N17864K27076O34478J563413K079404J591041
41634H428179k87617l317863n386651l834952O55801L670313K393477o31857j293788
$$ plain form
41625 395042 798318 2052255 2099413 636952 -1525512 -4301822 -7610185 -10041437 -10169933
41616 -10169933 -8462419 -6318734 -4051271 -1460376 503610 764398 343389 1313035
41608 1313035 3450403 4073021 1809295 -1228541 -1957122 162730 2921222 3883379 2614713
41599 2614713 1010447 1542291 4486643 7127000 6761084 4103686 2147832 1992287 1990989
41590 1990989 1138351 588568 930443 815401 21586 1112554 5368983 9312364 8741806
41581 8741806 4894580 2828252 4245786 5937695 5621181 5064908 5847451 5908242 3210312
41572 3210312 129099 677965 4622851 7638667 7045050 4593884 3246000 3575397 4309385
41563 4309385 4740087 5307345 6518967 8243440 9839384 10522353 9841698 8155691 6495405
$$ packed form
41625C95042M03276J253937M7158j462461k162464k776310l308363k431252j28496
41616a0169933J707514K143685K267463K590895J963986K60788m21009R69646
41608A313035K137368O22618k263726l037836p28581K119852K758492R62157j268666
41599B614713j604266N31844K944352K640357l65916k657398j955854j55545j298
41590A990989q52638n49783L41875j15042p93815J090968M256429L943381n70558
41581H741806l847226k066328J417534J691909l16514n56273P82543O0791k697930
41572C210312l081213N48866L944886L015816n93617k451166j347884L29397P33988
41563D309385M30702N67258J211622J724473J595944O82969o80655j686007j660286
$$ plain form
41554 6495405 5643774 5314031 4469320 2653465 784536 68059 167063 -490392 -2071733
41545 -2071733 -2400794 -74044 2711060 2724321 450938 -587560 673251 1309995 -617155
41536 -617155 -2946023 -3306092 -3018386 -4072583 -4678761 -1759730 3353342 5824921 3980666
41527 3980666 1609914 2879285 7565452 12095219 13237843 10261203 5345280 2224898
41519 2224898 2703963 4559136 4731785 3912983 5064684 7746152 7840884 3939126 200503
41510 200503 765018 4351140 6900896 7088634 6352587 5349871 3567907 1606860 1037073
41501 1037073 2053288 3137777 2929042 1228477 -1186917 -2622094 -1427450 1680962
41493 1680962 3448179 1871476 -1005049 -1864808 -363132 1620256 3656617 6667495
$$ packed form
41554F495405q51631l29743q44711j815855j868929p16477R9004o57455j581341
41545b071733l29061K326750K785104J3261k273383j038498J260811O36744j927150
41536f17155k328868l60069K87706j054197o06178K919031N113072K471579j844255
41527C980666k370752J269371M686167M529767J142624k976640m915923l120382
41519B224898M79065J855173J72649q18802J151701K681468R4732l901758l738623
41510B00503N64515L586122K549756J87738p36047j002716j781964j961047n69787
41501A037073J016215J084489k08735j700565k415394j435177J194644L108412
41493A680962J767217j576703k876525q59759J501676J983388K036361L010878
$$ plain form
41485 6667495 9672646 9992196 7322710 4806545 4831343 5933432 5317572 2751502 229766
41476 229766 -1144677 -1975546 -2424048 -1076558 2962935 7596039 8964740 5847182 1640766
41467 1640766 460635 1977647 2363147 281707 -1063262 916686 3981759 4483229
41459 4483229 2736709 1808967 2368576 2275971 820982 -52964 930943 2653266 3645309
41450 3645309 3481766 1916708 -869083 -2891471 -1861181 1463024 3934247 4353413
41442 4353413 4296104 4226309 2325535 -1541747 -4227698 -3710224 -2049265 -1690003 -1813010
41433 -1813010 -1079581 -1084921 -3529690 -6168721 -5526686 -2255455 109892 769728 1988465
41424 1988465 4234754 5234028 4358561 4032697 5545753 6773775 5614506 3000751 1003614
$$ packed form
41485F667495L005151L19550k669486k516165K4798J102089o15860k566070k521736
41476B29766j374443q30869m48502J347490M039493M633104J368701l117558m206416
41467A640766j180131J517012L85500k081440j344969J979948L065073N01470
41459D483229j746520r27742N59609r2605j454989q73946R83907J722323R92043
41450C645309j63543j565058k785791k022388J030290L324205K471223M19166
41442D353413n7309o9795j900774l867282k685951N17474J660959L59262j23007
41433a813010P33429n340k444769k639031O42035L271231K365347O59836J218737
41424A988465K246289R99274q75467l25864J513056J228022j159269k613755j997137
$$ plain form
41415 1003614 310153 918926 2879150 4830638 4354348 1680009 555491 3026266 5701896
41406 5701896 4378745 590271 -389460 2498871 4271943 956305 -4900752 -7634106
41398 -7634106 -5137060 -89127 4053095 6105173 6677133 6590807 6301927 6012890 5746348
41389 5746348 5318461 4372922 2755856 1157874 896272 2199905 3058501 1163814 -2834311
41380 -2834311 -5519047 -4766208 -2155050 -432724 -150667 -268068 -594062 -1428287 -1689521
41371 -1689521 -46520 2214280 2144036 -472918 -2197926 -555183 2653717 4201392
41363 4201392 3640574 2694339 2076322 1375880 1164387 2649253 5495283 8179877 10258378
41354 10258378 11981681 11905942 7884959 1228751 -3001683 -1626302 2719726 5119764
$$ packed form
41415A003614o93461O08773J960224J951488m76290k674339j124518K470775K675630
41406E701896j323151l788474r79731K888331J773072l315638n857057k733354
41398g634106K497046N047933M142222K052078N71960q6326k88880k89037k66542
41389E746348m27887r45539j617066j597982k61602J303633Q58596j894687l998125
41380b834311k684736P52839K611158J722326K82057j17401l25994q34225k61234
41371a689521J643001K260800p0244k616954j725008J642743L208900J547675
41363D201392n60818r46235o18017p00442k11493J484866K846030K684594K078501
41354A0258378J723303p5739m020983o656208m230434J375381M346028K400038
$$ plain form
41346 5119764 4172822 2185280 982423 233548 -386904 83080 2322868 5349708 7299426
41337 7299426 6796361 3659354 -649814 -3474108 -3287841 -1643442 -1344402 -2568597 -2588875
41328 -2588875 124776 3494731 4745644 4021137 3333195 3194095 2591487 1798194 2709448
41319 2709448 5912289 9418355 11199056 11411975 11068110 9927321 7243949 3745858
41311 3745858 1256198 640608 1418897 3098290 5440009 7466351 7798827 6438521 4929775
41302 4929775 4198873 3413657 1674524 -345440 -1461454 -1747946 -2046311 -2288515 -1537330
41293 -1537330 529981 3171271 5463772 6828966 6899506 5685266 3741534 1585162
41285 1585162 -669023 -2525662 -2825807 -1383743 -96657 -752266 -2135715 -1241549 2564555
$$ packed form
41346E119764r46942j987542j202857p48875o20452M69984K239788L026840J949718
41337G299426n03065l137007m309168k824294J86267J644399K99040j224195k0278
41328b588875K713651L369955J250913p24507o87942j39100o02608p93293R11254
41319B709448L202841L506066J780701K12919l43865j140789k683372l498091
41311C745858k489660o15590P78289J679393K341719K026342L32476j360306j508746
41302D929775p30902p85216j739133k019964j116014k86492k98365k42204P51185
41293a537330K067311K641290K292501J365194P0540j214240j943732k156372
41285A585162k254185j856639l00145J442064J287086o55609j383449Q94166L806104
$$ plain form
41276 2564555 6544137 8238768 8287331 8692942 9815924 10293866 8994155 6096545 2974455
41267 2974455 1554839 2819522 5429958 6958087 6888231 6905290 7718274 7723332 6065434
41258 6065434 4792169 5845797 7737886 7922241 7207582 8619787 12258889 14496311
41250 14496311 12783357 8592185 4848107 2873235 2822230 4748926 7677191 9351263
41242 9351263 8506719 6212159 3860116 1342301 -1424446 -2809740 -1365213 1574459
41234 1574459 3320175 3428170 3915387 6005372 8512575 9679945 9008756 6909880 4065792
41225 4065792 1713315 1133567 1964150 2124410 414978 -1721253 -2156766 -1024571 -274325
41216 -274325 -685974 -1044470 -556823 -379515 -1681905 -3409975 -3527267 -1959480 -672534
$$ packed form
41276B564555L979582J694631M8563M05611J122982M77942j299711k897610l122090
41267B974455j419616J264683K610436J528129o9856J7059Q12984N058j657898
41258F065434j273265J053628J892089J84355p14659J412205L639102K237422
41250A4496311j712954m191172l744078j974872n1005J926696K928265J674072
41242I351263q44544k294560k352043k517815k766747j385294J444527K939672
41234A574459J745716J07995M87217K089985K507203J167370o71189k098876k844088
41225D065792k352477n79748Q30583J60260j709432k136231m35513J132195P50246
41216b74325m11649l58496M87647J77308j302390j728070j17292J567787J286946
$$ plain form
41207 -672534 -791300 -1235627 -742381 257461 880502 1793862 4379962 8165854 10519658
41198 10519658 9362799 5586440 2503687 2977152 6683867 9954015 9104876 4598467
41190 4598467 959076 1501415 4216123 4649845 2020589 -96784 825833 3074327 3982940
41181 3982940 3834481 4495270 5978796 6749567 6449403 5987273 5388067 3832475 1867247
41172 1867247 1409286 2928286 4348076 3720522 1842614 1196838 2895851 5441245 6213858
41163 6213858 3851998 -397886 -3383043 -2589764 1578916 6272723 9004798 9561150
41155 9561150 9116247 8303335 6756800 4096863 647508 -2796498 -5476074 -6904026
41147 -6904026 -6937637 -5823900 -4120085 -2420527 -1011939 236336 1495652 2424669 2258378
$$ packed form
41207f72534j18766m44327M93246R99842O23041R13360K586100L785892K353804
41198A0519658j156859l776359l082753M73465L706715L270148q49139m506409
41190D598467l639391N42339K714708M33722k629256k117373R22617K248494R08613
41181C982940j48459O60789J483526P70771l00164m62130n99206j555592j965228
41172A867247m57961J519000J419790o27554j877908o45776J699013K545394P72613
41163F213858k361860m249884k985157P93279M168680M693807K732075N56352
41155I561150m44903q12912j546535k659937l449355l444006k679576j427952
41147f904026l3611J113737J703815J699558J408588J248275J259316R29017j66291
$$ plain form
41138 2258378 769412 -972916 -1292525 303816 2171166 1889730 -986579 -3824562
41130 -3824562 -3420952 160655 3326195 3294519 1511173 1190650 2573345 3276897 3020614
41121 3020614 4376428 7602960 8529425 4638604 366861 1979240 8518627 12630525
41113 12630525 10438659 5857282 3840530 3957624 3392415 2544404 3658680 5955953
41105 5955953 6200689 3530034 459127 -790869 -257765 1350531 3492914 4773074
41097 4773074 3655238 950794 -474061 765863 3106450 4643741 5208559 5085659
41089 5085659 3891872 2091922 1622381 3177982 4535515 3737810 2543717 3940546
41081 3940546 6938595 7153670 3161420 -810494 -351032 3158806 4594433 2122895
$$ packed form
41138B258378j488966j742328l19609J596341J867350k81436k876309k837983
41130c824562M03610L581607L165540l1676j783346l20523J382695P03552k56283
41121C020614J355814L226532R26465l890821m271743J612379O539387M111898
41113A2630525k191866m581377k016752J17094n65209q48011J114276K297273
41105E955953K44736k670655l070907j249996N33104J608296K142383J280160
41097D773074j117836k704444j424855J239924K340587J537291N64818j22900
41089E085659j193787j799950m69541J555601J357533p97705j194093J396829
41081C940546K998049K15075l992250l971914M59462L509838J435627k471538
$$ plain form
41073 2122895 -557818 687204 5325867 9290181 9804965 7637765 5201012 3943528
41065 3943528 3772370 3948535 3914671 3586316 3251833 3240994 3734996 4884454 6703600
41056 6703600 8550687 9213783 8122579 6084731 4117223 2065994 -529514 -2694074
41048 -2694074 -2841197 -1405248 -704031 -1484127 -1586178 569432 2927100 2282949 -1281566
41039 -1281566 -4708433 -6078313 -6025860 -5248215 -3266644 -331001 1796502 2229184 2384216
41030 2384216 3656469 5086189 4846299 2933899 771546 -1025275 -2726214 -3842808
41022 -3842808 -3351664 -1684200 -736886 -1265143 -1677041 -418027 1476046 1599360 -392744
41013 -392744 -2017383 -1009530 2003326 4672471 5846065 5986908 5238836 3096785 437402
$$ packed form
41073B122895k680713J245022M638663L964314N14784k167200k436753j257484
41065C943528j71158J76165l3864l28355l34483j0839M94002J149458J819146
41056F703600J847087O63096j091204k037848j967508k051229k595508k164560
41048b694074j47123J435949P01217p80096j02051K155610K357668o44151l564515
41039a281566l426867j369880N2453P77645J981571K935643K127503M32682J55032
41030B384216J272253J429720k39890j912400k162353j796821j700939j116594
41022c842808M91144J667464R47314n28257m11898J259014J894073J23314j992104
41013c92744j624639J007853L012856K669145J173594J40843p48072k142051k659383
$$ [...]
##END NTUPLES=NMR SPECTRUM
##END=
