##TITLE=31Pdec_LR-684B-31(R)
 , 124 sc
 24.7.2019
##JCAMPDX= 6.0         $$ Bruker NMR JCAMP-DX V2.0
##DATA TYPE= NMR SPECTRUM
##DATA CLASS= NTUPLES
##ORIGIN= UXNMR, Bruker Analytische Messtechnik GmbH
##OWNER= root
$$ XWIN-NMR		Version 3.5
$$ Wed Jul 24 14:12:10 2019 Russian Standard Time (UT+4h)  she@DPX200
##.OBSERVE FREQUENCY= 81.013821
##.OBSERVE NUCLEUS= ^31P
##.ACQUISITION MODE= SIMULTANEOUS
##.ACQUISITION SCHEME= undefined
##.AVERAGES= 124
##.DIGITISER RES= 17
##SPECTROMETER/DATA SYSTEM= spect
##.PULSE SEQUENCE= zgpg30
##.SOLVENT NAME= DMSO
##.SHIFT REFERENCE= (INTERNAL, DMSO, 0, 182.463)
##AUDIT TRAIL= $$ (NUMBER, WHEN, WHO, WHERE, WHAT)
$$ ##TITLE= Audit trail, XWIN-NMR		Version 3.5
$$ ##JCAMPDX= 5.01
$$ ##ORIGIN= Bruker BioSpin GmbH
$$ ##OWNER= she
$$ F:/spectra/data/she/nmr/P31/1/pdata/1/auditp.txt
$$ ##AUDIT TRAIL=  $$ (NUMBER, WHEN, WHO, WHERE, WHAT)
(   1,<2019-07-24 14:10:50.40 +0400>,<she>,<DPX200>,
      <continue with go, POWCHK disabled, PULCHK disabled
       configuration hash MD5:
       00 E9 B6 7A A2 85 ED C7 34 08 36 98 17 FE 4E 26
       data hash MD5: 32K
       76 88 2F BB 5F 43 38 7B D8 78 48 80 8A 00 7B 23>)
(   2,<2019-07-24 14:10:57.92 +0400>,<she>,<DPX200>,
      <Start of raw data processing
       efp BC_mod = 2 LB = 1 FT_mod = 6 PKNL = 1 PHC0 = -2597.394 PHC1 = 229.1992 SI = 64K 
       data hash MD5: 64K
       65 A4 BC EA 7E F6 53 1B 0D 53 43 1D 4C ED 34 FA>)
(   3,<2019-07-24 14:11:22.81 +0400>,<she>,<DPX200>,
      <pk PHC0 = -36.70219 PHC1 = 119.6 
       data hash MD5: 64K
       4F 01 10 D2 07 76 62 A7 BF 43 62 16 D4 8E DE 0B>)
(   4,<2019-07-24 14:11:27.50 +0400>,<she>,<DPX200>,
      <abs ABSG = 5 
       data hash MD5: 64K
       13 6A C1 88 10 DE 0E 9A 41 7D 57 62 73 C1 80 D3>)
$$ ##END=
$$ 
$$ hash MD5
$$ 00 FE 53 84 52 2E A9 95 A7 8C 5E 98 11 D6 48 1B
##$RELAX= 
##$RELAX= 
##$RELAX= 
##$RELAX= 
##$RELAX= 
##$RELAX= 
##$RELAX= 
##$RELAX= 
$$ Bruker specific parameters
$$ --------------------------
##$DU= <F:/spectra>
##$EXPNO= 1
##$NAME= <P31>
##$PROCNO= 1
##$TYPE= <nmr>
##$USER= <she>
##$AMP= (0..31)
100 100 100 100 100 100 100 100 100 100 100 100 100 100 100 100 100 100 
100 100 100 100 100 100 100 100 100 100 100 100 100 100 
##$AQSEQ= 0
##$AQ_mod= 1
##$AUNM= <au_zg>
##$AUTOPOS= <>
##$BF1= 81.014009
##$BF2= 200.13
##$BF3= 200.13
##$BF4= 200.13
##$BF5= 200.13
##$BF6= 200.13
##$BF7= 200.13
##$BF8= 200.13
##$BYTORDA= 1
##$CFDGTYP= 0
##$CFRGTYP= 5
##$CHEMSTR= <none>
##$CNST= (0..31)
1 1 145 1 1 1 1 1 1 1 1 1 1 1 1 1 1 1 1 1 1 1 1 1 1 1 1 1 1 1 1 1 
##$CPDPRG= <waltz16>
##$CPDPRG1= <>
##$CPDPRG2= <waltz16>
##$CPDPRG3= <>
##$CPDPRG4= <mlev>
##$CPDPRG5= <mlev>
##$CPDPRG6= <mlev>
##$CPDPRG7= <mlev>
##$CPDPRG8= <mlev>
##$CPDPRGB= <>
##$CPDPRGT= <>
##$D= (0..31)
0 1 0 0 0 0 0 0 0 0 0 0.03 2e-05 3e-06 0 0 0 0 0 0 0 0 0 0 0 0 0 0 0 0 
0 0 
##$DATE= 1563962875
##$DBL= (0..7)
120 120 120 11 120 120 24 19 
##$DBP= (0..7)
150 150 150 150 150 150 150 150 
##$DBP07= 0
##$DBPNAM0= <>
##$DBPNAM1= <>
##$DBPNAM2= <>
$$ [...]
##$SUBNAM3= <"">
##$SUBNAM4= <"">
##$SUBNAM5= <"">
##$SUBNAM6= <"">
##$SUBNAM7= <"">
##$SUBNAM8= <"">
##$SUBNAM9= <"">
##$SW= 369.568048894756
##$SWIBOX= (0..15)
0 1 3 0 0 0 0 0 0 0 0 0 0 0 0 0 
##$SW_h= 29940.119760479
##$TD= 32768
##$TD0= 1
##$TE= 0
##$TE2= 300
##$TE3= 300
##$TEG= 300
##$TL= (0..7)
0 120 53 12 22 120 120 120 
##$TP= (0..7)
150 150 150 150 150 150 150 150 
##$TP07= 0
##$TPNAME0= <>
##$TPNAME1= <>
##$TPNAME2= <>
##$TPNAME3= <>
##$TPNAME4= <>
##$TPNAME5= <>
##$TPNAME6= <>
##$TPNAME7= <>
##$TPOAL= (0..7)
0.5 0.5 0.5 0.5 0.5 0.5 0.5 0.5 
##$TPOFFS= (0..7)
0 0 0 0 0 0 0 0 
##$TUNHIN= 0
##$TUNHOUT= 0
##$TUNXOUT= 0
##$USERA1= <user>
##$USERA2= <user>
##$USERA3= <user>
##$USERA4= <user>
##$USERA5= <user>
##$V9= 5
##$VALIST= <valist>
##$VCLIST= <CCCCCCCCCCCCCCC>
##$VD= 0
##$VDLIST= <DDDDDDDDDDDDDDD>
##$VPLIST= <PPPPPPPPPPPPPPP>
##$VTLIST= <TTTTTTTTTTTTTTT>
##$WBST= 1024
##$WBSW= 4
##$XGAIN= (0..3)
0 0 0 0 
##$XL= 0
##$YL= 0
##$YMAX_a= 28885
##$YMIN_a= -22965
##$ZGOPTNS= <>
##$ZL1= 120
##$ZL2= 120
##$ZL3= 120
##$ZL4= 120
##$ABSF1= 182.463
##$ABSF2= -187.1042
##$ABSG= 5
##$ABSL= 3
##$ALPHA= 0
##$AQORDER= 0
##$ASSFAC= 0
##$ASSFACI= 0
##$ASSFACX= 0
##$ASSWID= 0
##$AUNMP= <proc_1d>
##$AZFE= 0.1
##$AZFW= 0.5
##$BCFW= 0
##$BC_mod= 2
##$BYTORDP= 0
##$COROFFS= 0
##$CY= -3
##$DATMOD= 1
##$DC= 0
##$DFILT= <>
##$DTYPP= 0
##$F1P= 0
##$F2P= 0
##$FCOR= 1
##$FTSIZE= 65536
##$FT_mod= 6
##$GAMMA= 0
##$GB= 0
##$INTBC= 1
##$INTSCL= 5.30512e-09
##$ISEN= 30
##$LB= 1
##$LEV0= 0
##$LPBIN= 0
##$MAXI= 10000
##$MC2= 0
##$MEAN= 0
##$ME_mod= 0
##$MI= 50
##$NCOEF= 0
##$NC_proc= -6
##$NLEV= 6
##$NOISF1= 182.463
##$NOISF2= 159.3651
##$NSP= 0
##$NTH_PI= 0
##$NZP= 0
##$OFFSET= 182.463
##$PC= 4
##$PHC0= -2634.096
##$PHC1= 348.7992
##$PH_mod= 1
##$PKNL= yes
##$PPARMOD= 0
##$PSCAL= 0
##$PSIGN= 0
##$REVERSE= no
##$SF= 81.0140089999434
##$SI= 65536
##$SIGF1= 159.3651
##$SIGF2= -187.1042
##$SINO= 113.3802
##$SIOLD= 16384
##$SREGLST= <1H.CDCl3>
##$SSB= 0
##$STSI= 65536
##$STSR= 0
##$SW_p= 29940.119760479
##$SYMM= 0
##$S_DEV= 0
##$TDeff= 32768
##$TDoff= 0
##$TI= <>
##$TILT= no
##$TM1= 0
##$TM2= 0
##$TOPLEV= 0
##$USERP1= <user>
##$USERP2= <user>
##$USERP3= <user>
##$USERP4= <user>
##$USERP5= <user>
##$WDW= 1
##$XDIM= 65536
##$YMAX_p= 460048384
##$YMIN_p= -49625656
$$ End of Bruker specific parameters
$$ ---------------------------------
##NTUPLES= NMR SPECTRUM
##VAR_NAME=  FREQUENCY,     SPECTRUM/REAL,   SPECTRUM/IMAG
##SYMBOL=    X,             R,               I
##VAR_TYPE=  INDEPENDENT,   DEPENDENT,       DEPENDENT
##VAR_FORM=  AFFN,          ASDF,            ASDF
##VAR_DIM=   65536,         65536,           65536
##UNITS=     HZ,            ARBITRARY UNITS, ARBITRARY UNITS
##FACTOR=    0.456856943014862, 1,           1
##FIRST=     14782.0589164792, 0,            0
##LAST=      -15158.0608439998, 0,           0
##MIN=       -15158.0608439998, -49625656,   0
##MAX=       14782.0589164792, 460048384,    0
$$ Real data points
##PAGE= N=1
##DATA TABLE= (X++(R..R)), XYDATA
$$ [...]
##PAGE= N=2
##DATA TABLE= (X++(I..I)), XYDATA
5269E893277O87961j187437j32552K623596K416291k010051n951887m927573n21836
$$ 5893277 6581238 5393801 5261249 7884845 10301136 8291085 2339198 -2588375 -3110211
5260c110211K447014K256659P85972n35347j725876j943158J91874L550134M772341
$$ -3110211 -663197 1593462 2379434 1844087 118211 -1824947 -1633073 1917061 6689402
5251F689402K598141l20468j004675K79523J172209M10604j423626l205788l919834
$$ 6689402 9287543 8967075 7962400 8241923 9414132 9824736 8401110 5195322 1275488
5242A275488k684550M32089L611241M345649J833171j975970m127944l514967
$$ 1275488 -1409062 -976973 2634268 6979917 8813088 6837118 2709174 -805793
5234h05793j629580k48895R00852K994340N006170L909333j046550o129863p019596
$$ -805793 -2435373 -2684268 -1783416 1210924 6217094 10126427 9079877 2950014 -4069582
5225d069582l721362K76870K612326L423028K992263J174458o35153j10381K304818
$$ -4069582 -7790944 -7514074 -4901748 -1478720 1513543 2688001 2052848 1942467 4247285
5216D247285L019207K78259k820623k534381R7164Q53667j413324l092912q69966
$$ 4247285 7266492 7544751 4724128 2189747 2286911 3140578 1727254 -1365658 -2235624
5207b235624L768130O260047M015321j295103n760120o610688m034671o17059
$$ -2235624 1532506 7792553 11807874 10512771 4752651 -1858037 -5892708 -6509767
5199f509767R56266L04312l38679J296932M485428N780766K914914k144002m965522
$$ -6509767 -5553501 -5249189 -5587868 -4290936 194492 5975258 8890172 6746170 1780648
5190A780648l304414Q83188L843849L387749J02090l268209l576469k23856L184237
$$ 1780648 -1523766 -640578 3203271 6591020 6693110 3424901 -151568 -375424 2808813
5181B808813K142362k934031o420500m431712K85847K535305J487881L19637P19562
$$ 2808813 4951175 2017144 -4403356 -8835068 -8549221 -6013916 -4526035 -4206398 -3486836
5172c486836J432304J604152J903962K172142J242515l84318o27003P67020J551477
$$ -3486836 -2054532 -450380 1453582 3625724 4868239 4483921 3856918 4623938 6175415
5163F175415L64453j675766l206042l889675l119111l51915K662754K986151O49224
$$ 6175415 6539868 4864102 1658060 -2231615 -5350726 -5702641 -3039887 -53736 595488
5154E95488j152619o93908N58947J406996K351429K667019L57104l370910m153888
$$ 595488 -557131 -1251039 -692092 714904 3066333 5733352 6090456 2719546 -1434342
5145a434342j275048L42939j998506l868394r01267L701548M223747J262665m31270
$$ -1434342 -2709390 -2366451 -4364957 -8233351 -9134618 -5433070 -1209323 53342 -377928
5136c77928R356J5034k91277P94740J053546k617462o532187l779762L976948
$$ -377928 -368572 -353538 -644815 149925 1203471 -1413991 -7946178 -11725940 -7748992
5127g748992O853165J284529m138603j699307M037826M017671j744833n644369
$$ -7748992 -895827 388702 -3749901 -5449208 -1411382 2606289 861456 -4782913
5119d782913m139620o70920J587632L152005M301468L472391P84123j180882j427376
$$ -4782913 -8922533 -9593453 -8005821 -4853816 -552348 2920043 3704166 2523284 1095908
5110A095908j786822k910358k586945R8714K094972N64134k387112k261741J423947
$$ 1095908 -690914 -3601272 -6188217 -6089503 -3994531 -3430397 -5817509 -8079250 -6655303
5101f655303M315640L078726m88246k410540j689058m89409j76562K83577J668694
$$ -6655303 -2339663 739063 250817 -2159723 -3848781 -4338190 -4514752 -4231175 -2562481
5092b562481K639182J869761L18974l56434l81518r10984j516764r22394L64781
$$ -2562481 76701 1946462 2265436 1909002 1527484 616500 -900264 -1822658 -1457877
5083a457877O72249K06143P81853K274866K237312K4179j453143J54248K868114
$$ -1457877 -785628 -579485 202368 2477234 4714546 4738725 3285582 3439830 6307944
5074F307944K893399l33290l628061m078831k029259j29539l14610j805449k052017
$$ 6307944 9201343 8868053 5239992 1161161 -868098 -997637 -1312247 -3117696 -5169713
5065e169713J5886K230705J841452o13712j959450p44351J279926K215393K032556
$$ -5169713 -5153827 -2923122 -1081670 -1695382 -3654832 -4399183 -3119257 -903864 1128692
5056A128692R76559j227156l401667k949388L61842L046462K288711m88553k344160
$$ 1128692 2105251 878095 -2523572 -5472960 -5111118 -2064656 224055 -264498 -2608658
5047b608658k697625k207021l67219K665709M041769J703785j636820j925704
$$ -2608658 -5306283 -7513304 -7880523 -5214814 -1173045 530740 -1106080 -3031784
5039c031784k5995j70709k607633k726289J472446N616563M963260P16781k381859
$$ -3031784 -3057779 -3228488 -5836121 -8562410 -7089964 -1473401 3489859 4206640 1824781
5030A824781k305727p34851N24374J211234J414294J125029Q40545Q71405K90398
$$ 1824781 -480946 -1215797 -691423 519811 1934105 3059134 3899679 4771084 5061482
5021E061482j766337l906095l446557o8118L055746K860919K52819r65570J065477
$$ 5061482 3295145 -610950 -4057507 -4125625 -1069879 1791040 2043859 1078289 2143766
5012B143766L788153L387348l14404l503639l074410k63520J374151N06443j102086
$$ 2143766 5931919 9319267 9004863 5501224 2426814 2163294 3537445 4043888 2941802
5003B941802j746578j702448j552728o58014J308036K759401K061093K41098k56834
$$ 2941802 1195224 -507224 -2059952 -2717966 -1409930 1349471 3410564 3651662 3394828
4994C394828P17391R24108k84273o12447J086169K033784l78631l659371l215959
$$ 3394828 4112219 5036327 4752054 4139607 5225776 7259560 6880929 3221558 5599
4985E599M56910K020507o52358l235311j776551J488832K371769J124169M48970
$$ 5599 462509 2483016 1830658 -1404653 -3181204 -1692372 679397 1803566 2252536
4976B252536Q4218j615644k772356l70538L395272L160630j088515l519051j413480
$$ 2252536 2336754 721110 -2051246 -2421784 973488 4134118 3045603 -473448 -1886928
4967a886928J399791J771627J646799K493936J590186k026812l693361n02573
$$ -1886928 -487137 1284490 2931289 5425225 7015411 4988599 1295238 792665
4959G92665K491656k35063n120984m739927L11638K781272O70862o31783J425904
$$ 792665 3284321 3049258 -2071726 -6811653 -6500015 -3718743 -3047881 -3679664 -2253760
4950b253760K481303k68370k886275j776358J67468p67502k132255L86959M833813
$$ -2253760 227543 -40827 -2927102 -4703460 -4535992 -5303494 -7435749 -7048790 -2214977
4941b214977N132724K72840m050383l425317K7820J870407J397696R79574J326302
$$ -2214977 2917747 3190587 -859796 -4285113 -4257293 -2386886 -989190 -9616 1316686
4932A316686O05310j681601k818433p05913K191792J719389j541029k382463J297630
$$ 1316686 1921996 240395 -2578038 -3283951 -1092159 627230 -913799 -3296262 -1998632
4923a998632M719485L105710r25959j335051J961778L126974m14325m309652m201730
$$ -1998632 2720853 5826563 4900604 3565553 5527331 8654305 8239980 3930328 -271402
4914b71402j607805m69912j481357k640729k771152j755893O91262L900038N413613
$$ -271402 -1879207 -2349119 -3830476 -6471205 -9242357 -10998250 -10306988 -6406950 -993337
4905i93337L672075N25191q37143L45113K138776K551781J233697o35285j343134
$$ -993337 2678738 3203929 2366786 2711899 4850675 7402456 8636153 8000868 6657734
4896F657734m41074K03436j350143l764440l674064p82579J198556l3882k022968
$$ 6657734 6216660 6420096 5069953 1305513 -2368551 -3151130 -1952574 -1986456 -4009424
4887d009424j629221K95435R55561J14743m51801m52379r71258j745983j319677
$$ -4009424 -5638645 -5343210 -4387649 -4272906 -4724707 -5177086 -6148344 -7894327 -9214004
4878i214004M50665K167073K783727K110402K46393j866272k390063q22022R02366
$$ -9214004 -8763339 -6596266 -3812539 -1702137 -1455744 -3322016 -5712079 -6534101 -5631735
4869e631735J238915J356134K516685L090859J215744j161215o67417J861666
$$ -5631735 -4392820 -3036686 -520001 2570858 3786602 2625387 1957970 3819636
4861C819636K179389q80047l656315l172377p08748J388051K948700M102793L307933
$$ 3819636 5999025 5118978 1462663 -1709714 -2418462 -1030411 1918289 6021082 9329015
4852I329015j3227l042660k707390k4298J336937R0782j542999j430996J25836
$$ 9329015 9315788 6273128 3565738 3541440 4878377 4969159 3426160 1995164 2121000
4843B121000J793450K814336K627175P34528k032818l513245k678466j094564
$$ 2121000 3914450 6728786 9355961 10090489 8057671 4544426 1865960 771396
4835G71396o95336j052999n20019N89325K68744j506646j892651O67772L455792
$$ 771396 76060 -976939 -1496958 -907633 -638889 -2145535 -4038186 -3370414 85378
4826H5378K848373n74480k863149k148985n44866k94064o61960Q3146J519120
$$ 85378 2933751 2359271 -503878 -2652863 -3197729 -3491793 -4153753 -4070607 -2551487
4817b551487J651953j55988k180061k164706K59726K825891K580982p65312m034973
$$ -2551487 -899534 -1055522 -3235583 -5400289 -5140563 -2314672 266310 -499002 -4533975
4808d533975m193812j891870K37435J615310L316278M493919L068417K35190k338
$$ -4533975 -8727787 -10619657 -10382222 -8766912 -5450634 -956715 2111702 2346892 2344554
4799B344554K776616L751376P6768m204986l986277n34419J218060M48787N66986
$$ 2344554 5121170 8872546 8949314 4744328 758051 223632 1441692 1890479 2457465
4790B457465K611211L500377J297902j849146l148984k517471j343224k52454
$$ 2457465 5068676 8569053 9866955 8017809 4868825 2351354 1008130 755676
4782G55676P40108J445794J689252J359385L01453r57904j179262l82105n28931
$$ 755676 1495784 2941578 4630830 5990215 6291668 5333764 4154502 3772397 3243466
4773C243466k338887l051513k44977L462566L297802n40964k743628m40344K986000
$$ 3243466 904579 -2146934 -2391911 1070655 4368457 3827493 1083865 643521 3629521
4764C629521L021604l32209l813587n119963l996554j323028R94973R81298q86454
$$ 3629521 6651125 6318916 2505329 -2614634 -6611188 -7934216 -6939243 -5957945 -6844399
4755f844399j660363J59116K423127K634614J614101J703161K685495K169586
$$ -6844399 -8504762 -8345646 -5922519 -3287905 -1673804 29357 2714852 4884438
4747D884438l00029k049191r67333J262809J055466k335079n315777m033445O61105
$$ 4884438 4584409 2535218 1567885 2830694 3886160 1551081 -3764696 -7798141 -7137036
4738g137036L839817K400451j369766l257729k387575r26744J00813J665068L611801
$$ -7137036 -3297219 -896768 -2266534 -5524263 -7911838 -8838582 -8737769 -7072701 -3460900
4729c460900L816695J353440j827274l450163l313582k270170p03877Q63943J361192
$$ -3460900 355795 1709235 -118039 -3568202 -6881784 -9151954 -9855831 -8991888 -7630696
4720g630696P10597M79993J680598K967355K317094k48923k751576l519562k389055
$$ -7630696 -6920099 -6440106 -4759508 -1792153 524941 276018 -2475558 -5995120 -8384175
4711h384175n2818K719187M995494N481324L308720m11357k537725j050421J679791
$$ -8384175 -8436993 -5717806 -722312 4759012 8067732 7656375 5118650 4068229 5748020
4702E748020J073215l219475n829802k907746J870267K280826j359847l019068
$$ 5748020 6821235 3601760 -2228042 -5135788 -3265521 -984695 -2344542 -5363610
4694e363610m12541J860467J46523k311136n63206M247475O351172L361074p28385
$$ -5363610 -5776151 -3915684 -3769161 -6080297 -6643503 -2396028 3955144 7316218 6587833
4685F587833r40617K463788M417980J333304m156845o061873k567676J663306
$$ 6587833 5647216 8111004 12528984 13862288 9705443 3643570 1075894 2739200
4677B739200K027038n5067o11120J58945q01068l030304k991354n15861Q41357
$$ 2739200 4766238 4711171 4100051 4258996 3457928 427624 -2563730 -3079591 -2238234
4668b238234L18684R60784K992557K430995j463568l612017j288440J146336o6065
$$ -2238234 -1919550 -958766 2033791 4464786 3001218 -610799 -1899239 -752903 -818968
4659h18968j437820J191268M414261K336439l453362n953664k914880J525951
$$ -818968 -2256788 -1065520 3348741 5685180 2231818 -3721846 -6636726 -5110775
4651e110775M178037N484346N354040K457120j728520l440512k164817j188791
$$ -5110775 -932738 4551608 9905648 12362768 10634248 7193736 5028919 3840128
4643C840128j877751j827428J56539J477280m857k425551k643461l83368J840292
$$ 3840128 1962377 134949 291488 1768768 1763911 -661640 -3305101 -3688469 -1848177
4634a848177J608674j159064l757083k871961J445647N033368M554874J578813
$$ -1848177 -239503 -1398567 -5155650 -8027611 -6581964 -1548596 3006278 4585091
4626D585091m90626j321796k208239k003292R58902M296622L907481K77365k314402
$$ 4585091 4094465 2772669 564430 -1438862 -479960 3816662 7724143 8001508 5687106
4617E687106k409783k160791j890932L87512L598939L729147O22137j108685L09536
$$ 5687106 3277323 1116532 -774400 -386888 3212051 6941198 7563335 6454650 6764186
4608F764186J095209r48586k572652j486421p34172k552438l361848n9571L426101
$$ 6764186 7859395 6910809 4338157 2851736 2117564 -434874 -3796722 -3856293 -430192
4599d30192J959314k007051k128550J535589K835291m17941l250101j489264K369689
$$ -430192 1529122 -477929 -2606479 -1070890 1764401 1346460 -1903641 -3392905 -1023216
4590a023216L414327Q38996k004787k013701P80124L599231L553882O23678k272741
$$ -1023216 2391111 3230107 1225320 -788381 -8257 3590974 7144856 7768534 5495793
4581E495793k933611k394259k493887k712180j702732l50942l40411q39616Q6823
$$ 5495793 2562182 167923 -2325964 -5038144 -6740876 -7091818 -7432229 -8271845 -8185022
4572h185022J561203J048566q27325n82681K408256M301568K280129j586355l664297
$$ -8185022 -6623819 -5575253 -6402578 -6985259 -4577003 -275435 2004694 418339 -3245958
4563c245958l058134p60724K566554N424390M677231n99580n913100n673708l76141
$$ -3245958 -6304092 -7064816 -4498262 926128 5603359 5003779 -909321 -6583029 -6959170
4554f959170L951964L724394J674025J514691K280151R10223j875436k279473
$$ -6959170 -3007206 717188 2391213 3905904 6186055 7096278 5220842 2941369
4546B941369N05597K779014J716400r89367k418260k454102k302372j526313M35787
$$ 2941369 3446966 6225980 7942380 6953013 4534753 2080651 -221721 -1748034 -1312247
4537a312247J679163K81252j791531r70534K260343L914078K649217J156568Q63359
$$ -1312247 366916 648168 -1143363 -2113897 146446 4060524 6709741 7866309 8729668
4528H729668j38969k346096k688915J66684K502110J027892j778966j795267K10999
$$ 8729668 8590699 6244603 3555688 3722372 6224482 7252374 5473408 3678141 3889140
4519C889140O36398o31128q38915J07215k11667j694173j802123o40173r89557
$$ 3889140 4525538 3894410 3055495 3162710 2951043 1256870 -545253 -1185426 -2174983
4510b174983k691876k036607J747550M147959J952061j832135k621610o18383
$$ -2174983 -4866859 -6903466 -5155916 -1007957 944104 -888031 -3509641 -4128024
4502d128024P60242M28554J95726J155918K451821K887329J688488j304230m355498
$$ -4128024 -3367782 -2939228 -2743502 -1587584 864237 3751566 5440054 4135824 -219674
4493b19674m273976m93744K721588J118000l346376m435888J65350N782011O864211
$$ -219674 -4493650 -4987394 -2265806 -1147806 -4494182 -8930070 -8764720 -2982709 3881502
4484C881502L542097L59268K21825J748029K068256K91213k330944m382296n153783
$$ 3881502 7423599 7782867 8004692 9752721 11820977 12112190 9781246 5398950 245167
4475B45167l922105j40393M673544O752951L957625p65157k446484o93432k1190
$$ 245167 -3676938 -3817331 856213 7609164 11566789 10801632 8355148 7661716 7640526
4466G640526k641418m729294k480035J608869K614488Q46447N14122K034145J561968
$$ 7640526 4999108 269814 -2210221 -601352 2013136 2859583 3373705 5407850 6969818
4457F969818j467858k425907P68520L443626J203196l209019m298930j762812
$$ 6969818 5501960 3076053 3844573 7288199 8491395 5282376 983446 -779366
4449g79366N29228J022038J104688Q56284q62157k711712j959569P57937J995346
$$ -779366 -250138 771900 1876588 2732872 1870715 -840997 -2800566 -2042629 -47283
4440d7283R43403J69513P01105P45897p5919K32668J674139J508391n82621j311124
$$ -47283 896120 1065633 1766738 2512635 2436716 2669384 4343523 5851914 5269293 3958169
4430C958169J45232j06279l737840n923298k404524L209288M442537J306550r54765
$$ 3958169 4103401 3997122 259282 -5664016 -8068540 -4859252 -416715 889835 -64930
4421f4930n34387n46822k384157l209104r85234K285870L637612K479220J29493
$$ -64930 -599317 -1146139 -3530296 -6739400 -7724634 -5438764 -1801152 678068 807561
4412H07561j604506j263540O43082J316211p36189k830126j651760J592545L004983
$$ 807561 -796945 -2060485 -1417403 -101192 -837381 -3667507 -5319267 -3726722 -721739
4403g21739J857879P61389Q17384P30865K05527N2951n71296k731259m184751
$$ -721739 1136140 1897529 2714913 3445778 3651305 3704256 3132960 401701 -3783050
4394c783050k077161J493046J963465j85110n22515J045911L36731k199796r23878
$$ -3783050 -5860211 -4367165 -2403700 -2588810 -3111325 -2065414 -1728683 -3928479 -4852357
4385d852357M446483O353260J385614l542754k322978R01540J63113j669204R02865
$$ -4852357 -405874 5947386 7333000 3790246 1467268 2368808 2531921 862717 1765582
4376A765582M842274L264726k266779l906810k97047K095172N2880k601146k973358
$$ 1765582 6607856 9872582 7605803 3698993 3401946 5497118 5549998 2948852 -24506
4367b4506k957638l600625k631627K97004J935381J141666Q90476K503249K940247
$$ -24506 -2982144 -6582769 -9214396 -8917392 -6982011 -5840345 -4949869 -2446620 493627
4358D93627K03982l032177l636257k105216l70432J025230J743132R22904p02476
$$ 493627 697609 -2334568 -5970825 -8076041 -8446473 -7421243 -5678111 -4755207 -5457683
4349e457683r59587K76363P89784M3983K9380J262520J767897J129613J464454
$$ -5457683 -6417270 -6140907 -5351123 -5307140 -5277760 -4015240 -2247343 -1117730 346724
4340C46724K856044K056987k027983n362791l968900Q40731M775635N537928L510590
$$ 346724 3202768 5259755 3231772 -2131019 -6099919 -5259188 -483553 5054375 8564965
4331H564965R8593k615052k792112j015802M27150J038038K096254K905884J075138
$$ 8564965 8663558 6048506 3256394 2240592 2667742 3705780 5802034 8707918 9783056
4322I783056k430835l051439N40902L699771K479541r64658k551317k012524j170624
$$ 9783056 7352221 4300782 4841684 8541455 11020996 10056338 7505021 5492497 4321873
4313D321873n612J854381K577657P13934j892774k758942j988775m16774K297250
$$ 4321873 4316261 6170642 8748299 9462233 7569459 4810517 2821742 2404968 4702218
4304D702218M932708L862339j327874n048318k986606J178264J369333j617794
$$ 4702218 9634926 13497265 12169391 7121073 4134467 5312731 6682064 5064270
4296E064270k234591O65891L034440K750961J368599o63103m262076p097245n088686
$$ 5064270 2829679 3495570 6530010 9280971 10649570 9986467 5724391 -1372854 -6461540
4287f461540L68762K837386N04037n51086L937096Q763820O318564j993392p064274
$$ -6461540 -6092778 -3255392 -2751355 -3302441 634655 9398475 15717039 13723647 6659373
4278F659373m053444J879569K994507j372883n109466l732371N64445K856140
$$ 6659373 2605929 4485498 7480005 6107122 997656 -2734715 -2170270 685870
4270F85870J873664J48376o51138j065022q19841J410639M147661L358941j065538
$$ 685870 2559534 2707910 2056772 991750 171909 1582548 5730209 9089150 8023612
4261H023612l395534k72916L203676P66676m794821n280244L76513M318818J378528
$$ 8023612 4628078 4355162 7558838 8325514 3530693 -1749551 -1373038 2945780 4324308
4252D324308l958803m738336p21499K937502K913798L93397j604258j170729J191326
$$ 4324308 365505 -4372831 -5094330 -2156828 756970 1150367 -453891 -1624620 -433294
4243d33294K939019K110286j77686j325258r99318r45468j355018n31478J519144
$$ -433294 2505725 4616011 4438325 3113067 2113749 1168281 -186737 -718215 800929
4234H00929K521379J853678J766326L290171L975386J620031k136134l902418
$$ 800929 3322308 5175986 6942312 10232483 14207869 15827900 13691766 9789348
4226I789348k534494L94146K576869K390354r3216k704829l284666k451875k436672
$$ 9789348 7254854 7649000 10225869 12616223 12523007 9818178 6533512 4081637 1644965
4217A644965l327061l094365j329024K42434J262247L102879M970493L739995
$$ 1644965 -1682096 -4776461 -6105485 -5863051 -4600804 -1497925 3472568 7212563
4209G212563p08395l959409l110394p32602k64163r23041j94185J694269K969335
$$ 7212563 6504168 2544759 -565635 -1298237 -1562400 -2485441 -2679626 -985357 1983978
4200A983978L307594K621552k74388m480930n595473j623924K440963Q93349l885093
$$ 1983978 5291572 7913124 7638736 3157806 -2437667 -4061591 -1620628 -727279 -4612372
4191d612372m544477K59149M129534K855690J87308J184663M429354M713939R64292
$$ -4612372 -9156849 -8897700 -4768166 -1912476 -1725168 -540505 3888849 8602788 9567080
4182I567080k531746k318644k178P10223p29752j441226R3039J307282o12157
$$ 9567080 7035334 4716690 4714512 5424735 4694983 3253757 3346796 4654078 4041921
4173D041921l789159l760249k06561K295076J227327l18964P02983K233749J303239
$$ 4041921 252762 -3507487 -3714048 -1418972 -191645 -510609 192374 2426123 3729362
4164C729362l25280N15346K092711L83416l495519m383635j318863J146326N17453
$$ 3729362 3404082 3919428 6012139 6395555 2900036 -1483599 -2802462 -1656136 -1138683
4155a138683m09380N88177J421075K31726j059039p25577o31374k273477l066644
$$ -1138683 -1548063 -959886 461189 692915 -366124 -1091701 -1723075 -3996552 -7063196
4146g063196m98151K855083K737510j89504j342962J099651M218585M738664K350170
$$ -7063196 -7561347 -4706264 -1968754 -2158258 -3501220 -2401569 1817016 6555680 8905850
4137H905850j174505l607297l277927p93482O93661q06465k921039k103650Q04621
$$ 8905850 7731345 4124048 846121 52639 746300 -60165 -2981204 -5084854 -4280233
4128d280233J701332k15718j045116J534267M421500L903565J290667N04298J847959
$$ -4280233 -2578901 -2794619 -3839735 -2305468 2116032 6019597 7310264 7814562 9662521
4119I662521J836748j108192m141618m062667j452119P74070J369973J431530
$$ 9662521 11499269 10391077 6249459 2186792 734673 1508743 2878716 4310246
4111D310246J695842J193801q11229k913854k930843q59721Q11556J86296j577573
$$ 4310246 6006088 7199889 6388660 3474806 543963 -315758 495798 682094 -895479
4102h95479j769503L46340K585058K573855N40871j184469r68945N21768J476512
$$ -895479 -2664982 -2318642 266416 2840271 3381142 2196673 1227728 1749496 3226008
4093C226008J104229K50134J590K40740O0987o17020p37406J80824Q67482j56842
$$ 3226008 4330237 4580371 4581961 4822701 4883688 4266668 3529262 3710086 4577568 4420726
4083D420726k244223l083512j658038M31505J102134K10698r22478j500547j647594
$$ 4420726 2176503 -907009 -2565047 -2133542 -1031408 -820710 -1743188 -3243735 -4891329
4074d891329j367649l91964R77900J942225K255205K309710K030899P04974j573177
$$ -4891329 -6258978 -6650942 -5673042 -3730817 -1475612 834098 2864997 3569971 1996794
4065A996794l116280k235099N35423K541253J730047r18569k236123n42086K051897
$$ 1996794 -1119486 -3354585 -2819162 -277909 1452138 533569 -1702554 -2244640 -192743
4056a92743K158833j86575j272164R23545L310442K001343j540368k206461J151634
$$ -192743 1966090 1779515 507351 1430896 4741338 6742681 5202313 2995852 4147486
4047D147486L747064J706765k609189m392601k725133k91801J216474K164943
$$ 4147486 7894550 9601315 6992126 2599525 -125608 -417409 799065 2964008
4039B964008K530326J610409r410p91013o02043o65159j255141j418218q40648
$$ 2964008 5494334 7104743 7095333 6304320 5702277 5037118 3781977 2363759 1523111
4030A523111r0396P50180J697514J463095j185420m605585n243903k021726K118588
$$ 1523111 1432715 2182895 3880409 5343504 4158084 -447501 -5691404 -7713130 -5594542
4021e594542L631087J893616q90460j965873k70042K354190K741140M75534j000955
$$ -5594542 -1963455 -69839 -960299 -2926172 -3196214 -842024 1899116 2374650 1373695
4012A373695O21900K371803K16542m143255n211467j812466J677667K426057K263695
$$ 1373695 1995595 4367398 4583940 440685 -4770782 -6583248 -4905581 -2479524 -215829
4003b15829K703298K210986M37378P4726J831857K286657k06051k055791m24386
$$ -215829 2487469 4698455 5135833 5210559 7042416 9329073 9123022 7067231 6642845
3994F642845J717603O25775k101143k891399k078092j729643j032988J110450
$$ 6642845 8360448 8986223 6885080 3993681 1915589 185946 -847042 263408
3986B63408K105683k04359k369420l19274L076028K140900j862030k520039J054116
$$ 263408 2369091 2164732 -204688 -523962 2552066 4692966 2830936 310897 1365013
3977A365013L047600Q98683j101038J41657J712816O09988j267043j104147L61644
$$ 1365013 4412613 5311296 4210258 4351915 6064731 6674719 5407676 4303529 4665173
3968D665173J061579N81161r21533l133676l846376j041725K498109J787596k161505
$$ 4665173 5726752 6307913 5386380 2252704 -1593672 -2635397 -137288 1650308 -511197
3959e11197k819360J361660L770402K38123m080161l272221J39287P07540m66188
$$ -511197 -3330557 -1968897 1801505 2039628 -2040533 -5312754 -5173467 -4465927 -4932115
3950d932115J038078L996532L503872j30315j851412m47398K53418j105971j319104
$$ -4932115 -3894037 102495 3606367 3476052 1624640 1177242 1430660 324689 -994415
3941i94415P09615J215101j980685n006757l279243J710989M357183K324960r22261
$$ -994415 -284800 930301 -1050384 -6057141 -9336384 -7625395 -3268212 -943252 -1865513
3932a865513j065753J569582K792421M12614k634391k560135m67782n63020l164536
$$ -1865513 -2931266 -1361684 1430737 1843351 -791040 -3351175 -3818957 -4381977 -7546513
3923g546513l843932m81266L387884M316541L478269K619309K75795l884345n490993
$$ -7546513 -11390445 -11871711 -8483827 -4167286 -689017 1930292 2206087 -1678258 -7169251
3914g169251j609194L193848K896021p84896j710648N05732R04213j430469k006140
$$ -7169251 -8778445 -5584597 -2688576 -3473472 -5184120 -4678388 -3774175 -5204644 -7210784
3905g210784P78042L129428K800162J941523J505469p41732m407315m860837n15447
$$ -7210784 -6432742 -3303314 -503152 1438371 2943840 2202108 -2205207 -7066044 -7581491
3896g581491L596999K930673m06022j950222j315053q18791j003127q69539j19501
$$ -7581491 -3984492 -1053819 -1459841 -3410063 -4725116 -5543907 -6547034 -7416573 -7536074
3887g536074J272299L273182M053593J331990l000943l598932Q90170N188241
$$ -7536074 -6263775 -2990593 1063000 2394990 -605953 -4204885 -3314715 1873526
3879A873526M660220J073116j620441k841233l402718k323993M02588J730277
$$ 1873526 6533746 7606862 5986421 3145188 -257530 -2581523 -2178935 -448658
3871d48658L37448k72299K291830M259000J619331k651749l149537p40876k64289
$$ -448658 -111210 -383509 1908321 6167321 7786652 5134903 1985366 1244490 980201
3862I80201j761791r08351K771787M795622K925582l52382k842877m664546m884448
$$ 980201 -781590 -1689941 1081846 5877468 8803050 8450668 5607791 943245 -3941203
3853c941203j681650L082255M565077J722424j003737k45579K012123K206698
$$ -3941203 -5622853 -2540598 2024479 3746903 2743166 2497587 4509710 6716408
3845F716408j95484l174489m402275k462249J398525L063928M33182k448778n29151
$$ 6716408 6520924 3346435 -1055840 -3518089 -2119564 944364 1377546 -1071232 -1600383
3836a600383M080374M787943Q89388j619769l09569J91505k709532m552857j783923
$$ -1600383 2479991 7267934 8157322 6537553 6227984 6419489 3709957 -842900 -2626823
3827b626823K109975L122189L011401L681875J680989m744262q755835l759653
$$ -2626823 -516848 2605341 5616742 9298617 10979606 6235344 -2520491 -6280144
3819f280144M745793N761966o95089l857245O66191M416622J98658o405987n935053
$$ -6280144 -1534351 4227615 3532526 -324719 341472 4758094 4956752 -1449235 -7384288
3810g384288O60217M210156J091944k552229p31011M115134N441173J809113j943763
$$ -7384288 -6724071 -2513915 -1421971 -3974200 -4705211 -590077 4851096 6660209 4716446
3801D716446j968844k56882o86281k742261k465406R64338L400903J652988k061306
$$ 4716446 2747602 2490720 1804439 -937822 -3403228 -2438890 962013 2615001 553695
3792E53695l697046k711649j225386j64715P80690J175228Q09056R91866J982260
$$ 553695 -3143351 -5855000 -7080386 -7245101 -6464411 -5289183 -4480127 -3488261 -1506001
3783a506001J238074k264470m378198j188296L839517L961597m24930k060021
$$ -1506001 -267927 -2532397 -6910595 -8098891 -4259374 -297777 -722707 -2782728
3775b782728J842859N337940L151899j847142m187392l580539k756091j697740
$$ -2782728 -939869 4398071 7549970 5702828 1515436 -2065103 -4821194 -6518934
3767f518934R23705L392563L009389Q28879j9346N78071L81894o15388m72856
$$ -6518934 -5595229 -2202666 806723 1635602 1616256 2194327 2576221 1960833 1487977
3758A487977N50000L93092m53788O48332L209454L073084j248782n447129n062782
$$ 1487977 2037977 2431069 1977281 2625613 5835067 8908151 7659369 2212240 -2850542
3749b850542j445331Q26435N20175L42745J675569K343613O50499j267620n22875
$$ -2850542 -4295873 -3469438 -2949263 -2606518 -930949 1412664 2063163 795543 272668
3740B72668J660025J326724j989629l831349j197426K661482K897001L34494k26093
$$ 272668 1932693 3259417 1269788 -2561561 -3758987 -1097505 1799496 2133990 1907897
3731A907897J858854J858139k271532n673838l526011J641585L609481J026022
$$ 1907897 3766751 5624890 3353358 -2320480 -5846491 -4204906 -595425 430597
3723D30597j967752k325765j006678M42378K188215M152631M824519L329482P42308
$$ 430597 -1537155 -3862920 -4869598 -4427220 -2239005 1913626 6738145 10067627 10809935
3714A0809935j494632k801675k633650l90755K818234L906154Q47694m465280
$$ 10809935 9315303 6513628 3879978 3489223 6307457 10213611 11061305 6596025
3706F596025p521604n640509q47078K137386J059959j346892j034101J867173
$$ 6596025 -925579 -6566088 -7413166 -5275780 -4215821 -5562713 -6596814 -4729641
3698d729641L309516J091028k318164l577267k379494j77827K138718L409472
$$ -4729641 -1420125 -329097 -2647261 -6224528 -8604022 -8781849 -6643131 -3233659
3690c233659K062784p12197q35689K445244L660954j122222o841854n698405J124545
$$ -3233659 -1170875 -1883072 -2718761 -273517 3387437 2265215 -4576639 -10275044 -9150499
3681i150499M910155K152869j387447o14490J913776J812008k41394j285393j168951
$$ -9150499 -4240344 -2087475 -3474922 -4089412 -2175636 -363628 -605022 -1890415 -3059366
3672c059366r46330Q8363K015428K303305n2918j615706K74511K429268N94943
$$ -3059366 -4005696 -3917333 -1901905 401400 348482 -1267224 -992713 1436555 2031498
3663B031498l198692l392188L51437K659983P35729j965848j588042P71627J728599
$$ 2031498 -1167194 -4559382 -4207945 -1547962 -812233 -2778081 -4366123 -3594496 -1865897
3654a865897Q13915M40453J822654L062670J698808j591620k940310K0319M101148
$$ -1865897 -1051982 -611529 1211125 4273795 5972603 4380983 1440673 1460992 5562140
3645E562140L677575j592099n310003k667060K708484L678882o08026m173397
$$ 5562140 9239715 7647616 2337613 -329447 2379037 6057919 5449893 1276496
3637A276496k949771L08550R24013j348710k948679j620710J132784K289022Q85715
$$ 1276496 -1673275 -1364725 -440712 -1789422 -4738101 -6358811 -5226027 -2937005 -2051290
3628b051290r61095p30728J185192K077077R27793k60447o1184N7441j046293
$$ -2051290 -3012385 -3743113 -2557921 -480844 446949 186502 125318 182759 -863534
3619h63534j363912P94446K859769J569328j206695j011072J612524J544872k343922
$$ -863534 -2227446 -1433000 1426769 2996097 1789402 778330 2390854 3935726 1591804
3610A591804m696448j876752K334711K613692k92833j877663r41192J28900M82690
$$ 1591804 -3104644 -4981396 -2646685 -32993 -325826 -2203489 -3144681 -3015781 -2533091
3601b533091J607032L310964L057491J03489k871729l459776k434192j741578
$$ -2533091 -926059 2384905 5442396 5545885 2674156 -785620 -3219812 -4961390
3593d961390j611737j120386j04017R70315J917053K320356J347355l93079k25147
$$ -4961390 -6573127 -7693513 -7797530 -6827215 -4910162 -2589806 -1242451 -1635530 -1860677
3584a860677K980626N631768L241880k569357m955576j205086K970012J642152
$$ -1860677 1119949 6751717 9993597 7424240 2468664 1263578 4233590 5875742
3576E875742k667253l436126m72817O88498j266163j512703J682140L306270M30741
$$ 5875742 3208489 -227637 -700454 -11956 -1278119 -2790822 -1108682 2197588 2628329
3567B628329k248844o10688J403900r50147l737390m69389N666594N313307k106168
$$ 2628329 379485 -231203 1172697 222550 -3514840 -3984229 1682365 6995672 4889504
3558D889504o643876k742726K982450K608748j942456l853135j869292K26207
$$ 4889504 -1754372 -4497098 -1514648 1094100 -848356 -4701491 -6570783 -6344576
3550f344576J039810K423148M418497M454673J563248k023844l700758k839592
$$ -6344576 -5304766 -2881618 1536879 5991552 7554800 5530956 1830198 -1009394
3542a009394n97120J114112J014398j82655p09112m78862j081454k480693k296822
$$ -1009394 -1606514 -492402 521996 339341 -369771 -848633 -1930087 -4410780 -6707602
3533f707602L21085K740677K578248R64955O1605l21656j236541j834268q00801
$$ -6707602 -6386517 -3645840 -1067592 -102637 -41032 -362688 -1599229 -3433497 -4234298
3524d234298R54777J576964J074626O88214N97679K68646l2540R4598J12529l02068
$$ -4234298 -3279521 -1702557 -627931 60283 657962 926608 894068 988666 1101195 799127
3514G99127l55638K02617J61407r41863j570516p33677K79855L85665N92706J522195
$$ 799127 443489 646106 807513 -134350 -1704866 -2438543 -2158688 -1773023 -1180317 341878
3504C41878J610276O650j400845j265266j125920j776672q21282K530334L993453
$$ 341878 1952154 1958804 557959 -707307 -1833227 -3609899 -4431181 -1900847 2092606
3495B092606M38929l782627k835978R03724M48183l801692l989233K277921P190195
$$ 2092606 2531535 -1251092 -4087070 -3183346 -2735163 -6536855 -10526088 -8248167 -1057972
3486a057972M309489j989106l610375k49894J990836N37755j087223M6488K100541
$$ -1057972 3251517 1262411 -2347964 -2597858 -607022 -69267 -1156490 -1110002 990539
3477I90539K100045L58781o84524m20420p29202k639052m044481k329053J376016
$$ 990539 3090584 3449365 2764841 2344421 1615219 -1023833 -5068314 -7397367 -6021351
3468f021351K997485J171313p19448R9374J353396k68278l142458k960857N17143
$$ -6021351 -3023866 -1852553 -2572001 -2472627 -1119231 -1387509 -4529967 -7490824 -6973681
3459f973681L514017M267382M221973L438570J17201m444916n629635k128348
$$ -6973681 -3459664 807718 5029691 8468261 8585462 4140546 -1489089 -3617437
3451c617437J649229J920026K24302m27095m3826M01291J748141M161385M979744
$$ -3617437 -1968208 -48182 176120 -250975 -294801 106490 1854631 6016016 10995760
3442A0995760K352294j451334l303839l392850l328475k639882l77715J907269
$$ 10995760 13348054 11896720 8592881 5200031 1871556 -768326 -1146041 761228
3434G61228K040735M78569j015843k088612k583231r15531L159091O253185N328572
$$ 761228 2801963 3280532 2264689 176077 -2407154 -3322685 -163594 6089591 11418163
3425A1418163K220086O65370N93678o65925k977777l706295k722263k523060l265635
$$ 11418163 13638249 14303619 14897297 14231372 11253595 7547300 4825037 2301977 -963658
3416i63658k081941J751741M816584M216959J294380q33802j150961p67055q28636
$$ -963658 -3045599 -1293858 3522726 7739685 9034065 8200263 7049302 6282247 5453611
3407E453611j614088k584063k711710j624557l30757K11862O21389J744984K662252
$$ 5453611 3839523 1255460 -1456250 -3080807 -3411564 -3199702 -2578313 -833329 1828923
3398A828923J960015K00969j013724j558557j935675j056503J835411L783415
$$ 1828923 3788938 3989907 2976183 1417626 -518049 -1574552 260859 4044274
3390D044274Q32080n426917q195777l966395K773794N431799L066134k15786j413474
$$ 4044274 4876354 -550563 -8746340 -12712735 -9938941 -4507142 -1441008 -1656794 -3070268
3381c070268j230184j374785j793304j009974J694822M719670N111371J940800
$$ -3070268 -4300452 -5675237 -7468541 -8478515 -6783693 -2064023 3047348 4988148
3373D988148j792491k303472J33630J627984J18790k165053k485431j211833j24968
$$ 4988148 3195657 892185 1025815 2653799 2772589 607536 -1877895 -3089728 -3214696
3364c214696O07509J613597K064628O79578j641307k325927m34225J955882K157025
$$ -3214696 -2607187 -993590 1071038 1750616 109309 -2216618 -2650843 -694961 1462064
3355A462064K1548j869024j283347Q10789J469755m3043j093468J49554J520599
$$ 1462064 1483612 -385412 -1668759 -857970 611785 568742 -524726 -375172 1145427
3346A145427L22012j796914j018493K456457M490915L277174J292583L81199o77277
$$ 1145427 1467439 -329475 -1347968 1108489 5599404 8876578 10169161 10550360 9873083
3337I873083k304331k286523k7931J389608K5707j712116j405584m65896o53042
$$ 9873083 7568752 5282229 5254298 6643906 6669613 4957497 3551913 3086017 2432975
3328B432975o41006M29175k1489l173234m949861k062539J835325J934945O23509
$$ 2432975 1791969 2221144 2199655 -973579 -5923440 -7985979 -6150654 -4215709 -3592200
3319c592200K879873O287741M361177j537539l268405N04541J757749l193793
$$ -3592200 -712327 5575414 9936591 8399052 5130647 5635188 7392937 4199144
3311D199144p137587l922924J633681K255735n16102j017579K96768m33966j704746
$$ 4199144 -2938443 -6861367 -5227686 -2971951 -3488053 -4505632 -4208864 -4642830 -6347576
3302f347576O68575M576279M006421o28846k844568p48079O79319j035546k015490
$$ -6347576 -5679001 -1102722 2903699 2274853 -569715 -1317794 -638475 -1674021 -3689511
3293c689511J69464K047091R42474q8942J896961M189944L263192Q78428N24570
$$ -3689511 -3520047 -1472956 -530482 -619424 1277537 5467481 8730673 9609101 10133671
3284A0133671J134215n44890l606967m096233j319319J435261K003028J264348
$$ 10133671 11267886 10722996 7116029 3019796 1700477 3135738 5138766 6403114
3276F403114J21947j799358l951990m344039k161215R72523K955880L173075K401345
$$ 6403114 6525061 4725703 773713 -3570326 -5731541 -4759018 -1803138 1369937 3771282
3267C771282J779843J686192J085665j061283l297261k599593R76130L138859
$$ 3771282 5551125 7237317 8322982 7261699 3964438 1364845 2340975 5479834
3259E479834J068222k259040k535772n88067l45951k072630k473168r35393m97182
$$ 5479834 6548056 4289016 1753244 1165177 819226 -1253404 -3726572 -4661965 -5159147
3250e159147k024250k392981m2304K136391J753726R08048K331231M597496M426167
$$ -5159147 -7183397 -9576378 -9618682 -7482291 -5728565 -4820517 -2489286 2108210 6534377
3241F534377J748496o04148j091474p71125j067299k124517k962815k245445K97161
$$ 6534377 8282873 7678725 6587251 5816126 4748827 2624310 -338505 -2583950 -2286789
3232b286789K712271K615970O11852k53175Q08229R66970j402497l583310k659807
$$ -2286789 425482 3041452 3653304 3400129 4208358 5175328 3772831 189521 -2470286
3223b470286k10499K36084j411570k244826j072070M16860P62731M68237P23492
$$ -2470286 -2680785 -2444701 -3856271 -6101097 -7173167 -6756307 -5993576 -5525339 -4801847
3214d801847K061729L857236M247572J943208j104723j379489O18117J67845l853007
$$ -4801847 -2740118 1117118 5364690 7307898 6203175 4823686 5441803 5609648 1756641
3205A756641n527251p65828M722604K946118l846948o158843j597083K489475
$$ 1756641 -3770610 -4536438 186166 3132284 -714664 -6873507 -8470590 -5981115
3197e981115J494050l36858P84933J335629j930389m667829j786582L636664N221036
$$ -5981115 -4487065 -4823923 -4038990 -2703361 -4633750 -9301579 -11088161 -7451497 -2230461
3188b230461L110734J806039J246865k006312o126670m867263K128019P215537
$$ -2230461 880273 2686312 3933177 1926865 -4199805 -9067068 -6939049 276488
3180B76488N276710L51924j273616L52526R57476q49095k676959k719162j613194
$$ 276488 5553198 5905122 4631506 4984032 5941508 5092413 2415454 -303708 -1916902
3171a916902o83626n66957j083250j215960q0232J349080R70709j162572k232799
$$ -1916902 -2600528 -3167485 -4250735 -5466695 -5546927 -4197847 -3227138 -4389710 -6622509
3162f622509n67761J850928K440691J640015J392784J701237J226105J90088k1527
$$ -6622509 -7190270 -5339342 -2898651 -1258636 134148 1835385 3061490 3251578 3230051
3153C230051L95193m0485j144232r60699R60230K422124J561458p61674k443806
$$ 3230051 3625244 3584759 2440527 1479828 2440058 4862182 6423640 5661966 3218160
3144C218160k593315j653532l87185K88176l80779j694404j515876J078396L859828
$$ 3218160 624845 -1028687 -1415872 -1127696 -1508475 -3202879 -4718755 -3640359 219469
3135B19469L743094Q47824j349732l69457K146051K683724L92111k054728k058173
$$ 219469 3962563 4810387 3460655 3091198 5237249 7920973 8313084 6258356 4200183
3126D200183j60019J176833Q31027j40106m92380k24178J29658L15241m0864j411283
$$ 4200183 4040164 5216997 6048024 5907918 5415538 5191360 5321018 5636259 5595395 4184112
3116D184112l128544l357641j493421M86933O34580O2154J236191L693545M114274
$$ 4184112 1055568 -2302073 -3795494 -3308561 -2673981 -2611827 -1375636 2317909 6432183
3107F432183J177221k211832k882354j550774j227976k915087m795717m842988
$$ 6432183 7609404 5397572 2515218 964444 -263532 -3178619 -7974336 -12817324
3099a2817324k569304J078542M044671M197973J674202n59585j02850J813844
$$ -12817324 -15386628 -14308086 -10263415 -6065442 -4391240 -4950825 -5053675 -3239831
3091c239831K454956J555142O72400k97511k524096m547165l218691R17686L210855
$$ -3239831 -784875 770267 1442667 1145156 -1378940 -5926105 -9144796 -8227110 -5016255
3082e016255J509096o91914j69405P83972j162166l706362j842625L793326O868317
$$ -5016255 -3507159 -4199073 -4368478 -3584506 -4746672 -8453034 -10295659 -6502333 365984
3073C65984M230696J65843j03552K504037L199058M47540k378001k005293N71248
$$ 365984 4596680 4762523 4658971 7163008 10362066 10809606 8431605 6426312 6997560
3064F997560J647974o34100m227503n600861l585877j78281K214552L036395K726053
$$ 6997560 8645534 8011434 3783931 -1816930 -5402807 -5581088 -3366536 -330141 2395912
3055B395912J338146n59813j069187P98320K887495K308670k83857j393790K15576
$$ 2395912 3734058 3174245 2105058 2903378 5790873 8099543 7815686 6421896 6637472
3046F637472J780249O34543k345562m529322m732406l356103j107404R98280J801775
$$ 6637472 8417721 9052264 6706702 2177380 -2555026 -5911129 -7018533 -6020253 -4218478
3037d218478J503215J693212K709573K553185L0344k562196k112926Q04461K494757
$$ -4218478 -2715263 -1022051 1687522 4240707 4271051 1708855 -404071 400390 2895147
3028B895147J115090j113415j305446J92803O58828r20553k185101n93494K511807
$$ 2895147 4010237 2896822 1591376 1784179 2443007 1522454 -662647 -1256141 1255666
3019A255666K866113q95847m258190k141706L625462N666122P26877n542231n923543
$$ 1255666 4121779 3225932 -1032258 -3173964 451498 6117620 6844497 1302266 -4621277
3010d621277r76335K596060J428642j019771p22892J403076K290709J881125K253742
$$ -4621277 -5597612 -3001552 -1572910 -2592681 -3315573 -1912497 378212 2259337 4513079
3001D513079L120291J840328j822057m158709k344295J400855K742302R67846
$$ 4513079 7633370 9473698 7651641 3492932 1148637 2549492 5291794 6259640
2993F259640r09181j131479j015132j370388o51849J573100K529805M15685j936870
$$ 6259640 5350459 4218980 3203848 1833460 1181611 2754711 5284516 5700201 3763331
2984C763331j098714J306663J190624j187593j901432l14460J11449j443622j383069
$$ 3763331 2664617 3971280 5161904 3974311 2072879 1758419 1869868 426246 -956823
2975i56823J428038K689194j77959l056027j707463J096336M50632k089778j195012
$$ -956823 471215 3160409 2982450 -73577 -1781040 -684704 -234072 -2323850 -3518862
2966c518862K787063L845013j72337m267215l989655j148436N65312J343612L298803
$$ -3518862 -731799 3113214 2940877 -1326338 -5315993 -6464429 -5899117 -4555505 -1256702
2957a256702N476043M564338j5840m428483m554187p98915K179150R11952k509166
$$ -1256702 4219341 8783679 8767839 4339356 -214831 -1013746 1165404 2077356 -431810
2948d31810l174733k11562K112548J175850J5414J603298K934940j39759m764320
$$ -431810 -3606543 -3818105 -1705557 -529707 -514293 1089005 4023945 3884186 -880134
2939h80134m180298J626319N057854J939530k652939k260744K181138M849954
$$ -880134 -5060432 -3434113 1623741 3563271 910332 -1350412 830726 5680680
2931E680680K875111j534102m474642l572970J38201K314424j20817l930004l037779
$$ 5680680 8555791 7021689 2547047 -1025923 -887722 1426702 1305885 -2624119 -5661898
2922e661898K116591M134495j39402m129656j628660L384254L390931o36492j687582
$$ -5661898 -3545307 589188 449786 -3679870 -5308530 -1924276 1466655 830163 -857419
2913h57419J253048K130647j330724l833263j525069K073404K430756Q62311J034004
$$ -857419 395629 2526276 1195552 -2637711 -4162780 -2089376 341380 1203691 2237695
2904B237695K557464K395511L06002j143901r67927q41292j873139k743372j716643
$$ 2237695 4795159 7190670 7496672 6352771 5384844 4543552 2670413 -72959 -1789602
2895a789602P16858K078854Q29925j411828j577347P68746K730969K321320J047786
$$ -1789602 -1072744 1006110 1836035 424207 -1153140 -384394 2346575 4667895 5715681
2886E715681M37263j072814m345091n570940j418833L723610K474577l768695
$$ 5715681 6152944 5080130 735039 -4835901 -6254734 -2531124 -56547 -3825242
2878c825242n459894Q95346P073809N592066L64564j073641L79945j029428m749390
$$ -3825242 -9285136 -8389790 -1315981 4276085 4640649 3567008 3946953 2917525 -1831865
2869a831865n235896k197232n99499j013811J216457O202194P499318K537420
$$ -1831865 -7067761 -9264993 -9864492 -10878303 -9661846 -3459652 4039666 6577086
2861F577086k618844k693898n70335o36863r82193J842954N077221L555118j567298
$$ 6577086 3958242 1264344 694009 57146 -925047 917907 5995128 9550246 7982948
2852G982948m349806k813658l64988O04577J034885J353164M42227j115655j166887
$$ 7982948 3633142 819484 454496 1059073 2093958 3447122 3889349 2773694 1606807
2843A606807J01293K96426q16909j092161m66029j267817l205058k594899J641978
$$ 1606807 1708100 2004526 1187617 95456 -370573 -1638390 -4843448 -7438347 -5796369
2834e796369N316634M606498R73544j799726k327734j082089J630554M317249
$$ -5796369 -479735 4126763 5100307 3300581 972847 -109242 1521312 5838561
2826E838561L808982n76534m601260m169564r92603K63593j013058j131257J675306
$$ 5838561 9647543 9071009 4469749 300185 -692418 -428825 -1441883 -2573140 -897834
2817h97834M576003M279544R69804k765187m791388m305988j546315K154787M700241
$$ -897834 3678169 7957713 8927517 6162330 1370942 -2935046 -4481361 -2326574 2373667
2808B373667M525306J845398j263042k392762j227822j28283j051024k477342
$$ 2373667 6898973 8744371 7481329 5088567 3860745 3732462 2681438 204096
2800B04096j664502M63484K37260k302514k269784K439612O699900N190388L41202
$$ 204096 -1460406 -996922 -759662 -3062176 -5331960 -2892348 3807552 8997940 9339142
2791I339142j680035l73629n02499l408897m893515k454603P68971J164054m24527
$$ 9339142 7659107 7285478 6782979 3374082 -1519433 -3974036 -3205065 -2041011 -2465538
2782b465538j145228m07756M53675N82652k2363r18093j053145K43700J757722
$$ -2465538 -3610766 -4018522 -3564847 -2982195 -3004558 -3922651 -4975796 -4732096 -2974374
2773b974374J665894K79098o31608q72514j420674j384553J035121M350138M554932
$$ -2974374 -1308480 -1029382 -1660990 -2533504 -3954178 -5338731 -4303610 46528 4601460
2764D601460J095558j830481j470213k20754j047637k716608k325498J49245K593345
$$ 4601460 5697018 3866537 2396324 2175570 1127933 -1588675 -3914173 -3764928 -1171583
2755a171583L865588L660556J307922k633007n148365l763967Q2152K612747K006456
$$ -1171583 2694005 6354561 7662483 5029476 -118889 -3882856 -3800704 -1187957 818499
2746H18499j66625j068567N60932K803813J939059k934637p338098o379386j735535
$$ 818499 651874 -416693 144239 2948052 4887111 1952474 -5385624 -11765010 -13500545
2737a3500545M65198j170495j556853J953442M844692L031080k21547J52821K764482
$$ -13500545 -13035347 -14205842 -15762695 -13809253 -8964561 -5933481 -6155028 -6002207 -3237725
2728c237725K700872k45870k152813j946655k059532k941431k283716K73317K268177
$$ -3237725 -536853 -782723 -2935536 -4882191 -6941723 -9883154 -12166870 -11893553 -9625376
2719i625376K569834K501262K609733J912431N59387o7627k2709m74285q85855
$$ -9625376 -7055542 -4554280 -1944547 -32116 527271 459644 436935 -37350 -923205
2710i23205K35262J922215J541157p76033j801158J31839K975140L972004K367282
$$ -923205 -687943 1234272 2775429 1999396 198238 330077 3305217 7277221 9644503
2701I644503j026988m506815n684910l494019q2886J369485M13712j007494j595552
$$ 9644503 8617515 4110700 -1574210 -5068229 -5151115 -3781630 -3367918 -4375412 -5970964
2692e970964j059818J028823L771232M048080P71363j749467P40128N120023M581418
$$ -5970964 -7030782 -6001959 -2230727 1817353 2588716 839249 1579377 6699400 11280818
2683A1280818j036577m817285l159363j67478P5616o13194N79016K038014J163306
$$ 11280818 10244241 5426956 2267593 2100115 2175731 1562537 2141553 4179567 5342873
2674E342873p25738q48669N59481J594470K036792K414338J962516J36475j852448
$$ 5342873 4617135 3768466 4327947 5922417 7959209 10373547 12336063 12472538 10620090
2665A0620090k961217l424514k570695R38484M771970L360113l826364q756310
$$ 10620090 7658873 4234359 1663664 2602148 7374118 10734231 6907867 -1848443
2657a848443m624850M087165P252161K807014j739360j180455Q57906p09498m336626
$$ -1848443 -6473293 -2386128 4866033 7673047 5933687 4753232 5611138 4901640 565014
2648E65014n179154k941013j594709k501875k398142Q83620M285482L633343j02667
$$ 565014 -4614140 -7555153 -9149862 -11651737 -14049879 -13166259 -8880777 -5247434 -5350101
2639e350101j900333L76136L484619L992247K531016J040724p47843k916573k667399
$$ -5350101 -7250434 -6874298 -3389679 602568 3133584 4174308 3426465 509892 -2157507
2630b157507J379305M587623J777088l948961m517001P86784L615879p33560o170155
$$ -2157507 -778202 3809421 5586509 1637548 -2879453 -2092669 1523210 789650 -5380505
2621e380505n414297m54107K146182J513253J613005L344648M051461L191924
$$ -5380505 -10794802 -11248909 -9102727 -7589474 -5976469 -2631821 1419640 4611564
2613D611564K396557Q39085l511854q225149p871328k085551L049837L320167
$$ 4611564 7008121 7847206 4335352 -3889797 -11761125 -13846676 -10796839 -7476672
2605g476672J457052J623587K915014J761259j743938l635923j498174K689817
$$ -7476672 -6019620 -4396033 -1481019 280240 -1463698 -5099621 -6597795 -3907978
2597c907978N273086M641132J822572j244213l123477l197353j689036L48269
$$ -3907978 1365108 6006240 7828812 6584599 3461122 263769 -1425267 -1076998
2589a076998J670334J835495J184220j25805j991145l082548j572578J766318
$$ -1076998 593336 2428831 3613051 3487246 1496101 -1586447 -3159025 -1392707
2581a392707L317167J391609r70758o67424M36244r47262l137427j897057K012895
$$ -1392707 1924460 3316069 2345311 1677887 2114131 1166869 -1970558 -3867615 -1854720
2572a854720L714782K306045J507261J875588j76637m025671l687205J649960
$$ -1854720 1860062 4166107 5673368 7548956 7372319 3346648 -340557 1309403
2564A309403M146328n81439n606154l506299J944921K855353L1716n00108P22170
$$ 1309403 5455731 4874292 -731862 -4238161 -2293240 562113 593829 93721 815891
2555H15891j437832n474083m528201J382418M264504O01135l701448l018217P57002
$$ 815891 -621941 -6096024 -10624225 -9241807 -4977303 -4376168 -8077616 -11095833 -10338831
2546a0338831L311413L902961L399291J565099r63255k069206j436900r63733
$$ -10338831 -7027418 -3124457 274834 1839933 876678 -1192528 -2629428 -3593161
2538c593161j121036o64978p6579r35210j950070m82824K018313J397141k176396
$$ -3593161 -4714197 -5379175 -5455754 -6390964 -8341034 -8823858 -6805545 -5408404 -7584800
2529g584800l927582j626566K117922M646654N038901J969731l994043p263489
$$ -7584800 -11512382 -13138948 -11021026 -6374372 -1335471 634260 -3359783 -10623272
2521a0623272l920789Q0467k943692p250514N18190J8483244K6913924J4778188
$$ -10623272 -14544061 -14463594 -17407286 -24657800 -24139610 -5656366 21257558 36035746
2513C6035746m180447j0988434n696748j023199j440476k008539j657382l602280
$$ 36035746 31855299 20866865 15170117 14146918 12706442 10697903 9040521 5438241
2505E438241n563950k361875L095773L008008j831344k957486J257816L247867
$$ 5438241 -125709 -2487584 608189 3616197 1784853 -1172633 85183 3333050
2497C333050j54796k666625j58430K565266R20996j963961j900080o85970j216167
$$ 3333050 3178254 511629 353199 2918465 3839461 1875500 -24580 -710550 -1926717
2488a926717j434380J273677M151096K907199j624850n108350n443583l320395
$$ -1926717 -3361097 -2087420 2063676 4970875 3346025 -1762325 -7205908 -10526303
2480a0526303L07429L854998M673004K309068P5284M57574J350317j4470j896627
$$ -10526303 -10218874 -6363876 -1690872 618196 693480 1151054 2501371 2486901 590274
2471E90274p67851K467407L356236O74534j740700q50664J140099K24882l315146
$$ 590274 -177577 2289830 5646066 6320600 4579900 3729236 4869335 5094217 1779071
2462A779071m875821j758540K694635L083013p07867k976564N7166M926531N838574
$$ 1779071 -3096750 -4855290 -2160655 922358 214491 -2762073 -2704907 2221624 8060198
2453H060198K523644n87927j553110k510319m078471l296344R25538M517941L501381
$$ 8060198 10583842 9995915 8442805 5932486 1854015 -1442329 -516791 4001150 7502531
2444G502531k33724j617868P57007L504378L449955J177955o38518p84209o30843
$$ 7502531 7268807 5650939 6407946 9912324 13362279 14540234 13901716 13117507 12486664
2435A2486664k008477m368858m990576k713342j50822k80656j908975j422275
$$ 12486664 10478187 6109329 1118753 -1594589 -1745411 -2026067 -3935042 -5357317
2427e357317J360207K663692O80695j693907j633106m33449l75565m53311J561048
$$ -5357317 -3997110 -1333418 -652723 -2346630 -3979736 -4413185 -4788750 -5242061 -3681013
2418c681013M649070N466363K929944q42204l669918m939300m407622j878480
$$ -3681013 968057 6434420 9364364 8522160 4852242 -87058 -4494680 -6373160
2410f373160J488730L382041K631545M28505j033513n23257J499921L355311L386271
$$ -6373160 -4884430 -1502389 1129156 1557661 524148 891 1500812 4856123 8242394
2401H242394J426136q89063j656782n86831P76051N83577j519755l876709m260523
$$ 8242394 9668530 8779467 7122685 6535854 7311905 7895482 6375727 2499018 -1761505
2392a761505k163932O60079K199031J970485M43623j852130l523811k422365J355893
$$ -1761505 -3925437 -3265358 -1066327 904158 1347781 -504349 -4028160 -6450525 -5094632
2383e094632M149406L124318N56463L41953J612035M44971k623639k549330J680180
$$ -5094632 -945226 2179092 2735555 3077508 4689543 5134514 2510875 -38455 1641725
2374A641725M388110J810323k062799k123316J55090N12805o39889l90254K6607
$$ 1641725 6029835 7840158 5777359 3654043 3809133 4321938 3682049 3291795 3318402
2365C318402k621179o226199n050000J026719N340011L908658L96517n21223M38182
$$ 3318402 697223 -5528976 -10578976 -9552257 -4212246 -303588 92929 -428294 9888
2356I888N07742K53043J521384K869720J356408k386025m560260l307907m88267
$$ 9888 517630 770673 2292057 5161777 6518185 4132160 -428100 -3736007 -4224274
2347d224274J578178K571127K986094K700880J742867J081380J437710J940545
$$ -4224274 -2646096 -74969 2911125 5612005 7354872 8436252 9873962 11814507
2339A1814507J093989r95337k408410j927513q70717j257988k642605k595016
$$ 11814507 12908496 11913159 9504749 7577236 6706519 5448531 2805926 210910
2331B10910o32608N34036r43027k713284j306974K572308M575061K382147j572110
$$ 210910 -421698 112338 -830689 -3543973 -4850947 -2278639 2296422 4678569 3106459
2322C106459l435484k075938O01104J961921Q79511j240270j743761m753J445757
$$ 3106459 -329025 -2404963 -1803859 158062 1037573 -202697 -1946458 -1951211 -505454
2313e05454N53887r19367k37147J502222J047681j200804j496549Q58993K198353
$$ -505454 48433 -870934 -1108081 394141 1441822 241018 -1255531 -396538 1801815
2304A801815Q22260k42726R68492J727993P7829p57175K025828M716125K194345
$$ 1801815 2624075 2381349 3349841 5077834 5155663 4398488 6424316 11140441 13334786
2295A3334786l580921o206922m325031k279717k038395r93630J602497K447550
$$ 13334786 9753865 3546943 -778088 -3057805 -5096200 -6089830 -4487333 -2039783
2287b039783M07832o97707J634883M244059L472870P58870m83445l74290j231932
$$ -2039783 -1631951 -2329658 -694775 3549284 7022154 7781024 7297579 6923289 5691357
2278E691357l058629l926116l297642k016837l93437J226490J579639M78469j35682
$$ 5691357 2632728 -1293388 -4591030 -6607867 -7001304 -5774814 -4195175 -3716706 -3852388
2269c852388O81601J046900L1172K68502L214449M829312R68504m997316n754974
$$ -3852388 -3170787 -2123887 -2092715 -1824213 1390236 6219548 7188052 2190736 -3564238
2260c564238m91478M126182L689878R11693n01602j040687j909029j414179J548777
$$ -3564238 -4055716 70466 3760344 4672037 4170435 3129748 1220719 -193460 1355317
2251A355317M099495L150340m1163k260644k853417k804758j713036Q60491K833329
$$ 1355317 5454812 8605152 8563989 6303345 3449928 645170 -1067866 -207375 2625954
2242B625954J887069q40675k329504j776833l60545J604500M038085M916424K413472
$$ 2625954 4513023 3672348 1342844 -433989 -794534 809966 4848051 9764475 12177947
2233A2177947j436965k849078j711106j234048k286650k139604M00319K522020
$$ 12177947 10740982 7891904 6180798 4946750 2660100 520496 920815 3442835
2225C442835J637073j140544l414629m463150l999606j061969L315530M995539
$$ 3442835 5079908 3939364 524735 -3938415 -7938021 -8999990 -5684460 -688921
2217f88921J646052k887645k658553K545222O722159N159690m69916n166763o167186
$$ -688921 957131 -1930514 -4589067 -2043845 4678314 9838004 9368088 4201325 -1965861
2208a965861m185641j192682J115758J661076O71797j02403Q74701K926428L786904
$$ -1965861 -6151502 -7344184 -6228426 -4567350 -3895553 -3997956 -3123255 -196827 3590077
2199C590077K225134p32029l090058l448935j382514K279025N007175L986361
$$ 3590077 5815211 5083182 1993124 -1455811 -2838325 -559300 4447875 8434236
2191H434236o08762m721335m550071j145485R74154k91640k254947j577205J264993
$$ 8434236 7825474 3104139 -1445932 -2591417 -1617263 -1908903 -4163850 -5741055 -4476062
2182d476062L077429K171464j55782j715098j536312o2900J652538K763663L049137
$$ -4476062 -1398633 772831 617049 -1098049 -2634361 -2697261 -1044723 1718940 4768077
2173D768077K532150R67940j421870k873237j383712K259501M356056K431026
$$ 4768077 7300227 8268167 6846297 3973060 2589348 4848849 9204905 11635931
2165A1635931j643779l936760k942399n25452Q27062L87126p41227r52781J73273
$$ 11635931 9992152 6055392 3112993 2587541 3414603 3801729 3060502 2107721 2280994
2156B280994J208474O57758o69648o98426M13929K88123j412315j743582P39923
$$ 2280994 3489468 4147226 3477578 2779152 3193081 3481204 2068889 325307 1065230
2147A065230K995915J967632n80645j030156L79657N53755j188769k690926k875608
$$ 1065230 4061145 6028777 5448132 4417976 4797633 5351388 4162619 1471693 -1403915
2138a403915k364920r11811J990734M380934L541609L60723j568848j039382J07911
$$ -1403915 -3768835 -4680646 -2689912 1691022 5232631 5593354 4024506 2985124 3093035
2129C093035R63984K158389K729482Q48935k119600k843507j673316k142313m131857
$$ 3093035 4057019 6215408 8944890 9793825 7674225 4830718 3157402 1015089 -3116768
2120c116768l131267J928990N714789M194984L29470j284397r54487j309232k103590
$$ -3116768 -6248035 -4319045 1395744 5590728 5920198 4635801 3681314 2372082 268492
2111B68492j729860q46596o79490l61191P19830Q25635o19190p31891J923172
$$ 268492 -1461368 -2307964 -2987454 -3348645 -2628815 -1803180 -2422370 -3154261 -1231089
2102a231089L625543J128397k255194j434790K068025K243352k166834n988643
$$ -1231089 2394454 3522851 1267657 -167133 1900892 4144244 1977410 -4011233
2094d011233m927167j80896M086111M466139L55352m587988m704660O16292M693023
$$ -4011233 -8938400 -9119296 -5033185 -567046 -211694 -4799682 -9504342 -8888050 -4195027
2085d195027K443191j813749j135087K802691K968158o06991r95712K913190L752599
$$ -4195027 -1751836 -3565585 -4700672 -1897981 1070177 463186 -532526 2380664 6133263
2076F133263j612212n979050l245101J882926J907385j775649k351961J246605
$$ 6133263 4521051 -1457999 -4703100 -2820174 -912789 -2688438 -5040399 -3793794
2068c793794L854036K749147M61353m32998j59365N19494J334335J231051p37180
$$ -3793794 60242 2809389 3270742 2837744 2678379 3197873 4532208 5763259 5026079
2059E026079l337985m443673l778054k266891M730K717451L857647K352032O68890
$$ 5026079 1688094 -2755579 -6533633 -8800524 -8795794 -6078343 -2220696 131336 800226
2050H00226J467522L020737J732726j802852l449066j882184k8899J62720J81144
$$ 800226 2267748 5288485 7021211 5218359 1769293 -112891 -141790 20930 202074
2041B02074J190328J739679Q42785k1432J88732J63883q60647j244612l07733
$$ 202074 1392402 3132081 3974866 3953434 4142166 4306049 3445402 2200790 1893057
2032A893057p11843m319262p751685n829635J302792P821736Q977610N478481
$$ 1893057 1181214 -3138048 -10889733 -16719368 -15416576 -7594840 1382770 6861251
2024F861251J024362j794424k397994j337188J69910J028665J292155J465936
$$ 6861251 7885613 6091189 3693195 2356007 2525917 3554582 4846737 6312673
2016F312673R72095r04028k609969j486963J928034L645642J860892r5145R62998
$$ 6312673 7284768 6380740 3770771 2283808 4211842 7857484 9718376 9623231 10586229
2007A0586229K581178L59318m559643o436035l201958Q65816J681276K39613p55637
$$ 10586229 13167407 13526725 8967082 2531047 -670911 194905 1876181 2115794 1360157
1998A360157j111270j421025o50229J320904J617751j473214m484826k926140
$$ 1360157 248887 -1172138 -1822367 -501463 1116288 -356926 -4841752 -7767892
1990g767892K018739N035089M006387J672911M26310k22006p06917k23886N28862
$$ -7767892 -5749153 -714064 3292323 4965234 5391544 5169538 4462621 4238735 4767597
1981D767597o33922l183390l415612j24221K752131J686745j265347j926399k04748
$$ 4767597 4133675 950285 -2465327 -2589548 162583 1849328 583981 -1342418 -1547166
1972a547166P20584q5337m00974Q96083K080385J683851O86774M78476M74034
$$ -1547166 -826582 -911919 -1312893 -416810 1663575 3347426 4034200 4512676 4986710
1963D986710q12612l180659m491249l062761K41621K747423K918790K071752K362155
$$ 4986710 4174098 993439 -3497810 -6560571 -6318950 -3571527 -652737 1419015 3781170
1954C781170L458860K798388m98762l829976m496322l327649k944842l354913
$$ 3781170 7240030 10038418 9539656 5709680 1213358 -2114291 -5059133 -8414046
1946h414046j874958K255135N559338M183188j018846m984011m119081k71388
$$ -8414046 -10289004 -8033869 -2474531 1708657 689811 -4294200 -8413281 -8684669
1938h684669J717734j35273k726341j883201K366868N757595M807079N73771l002078
$$ -8684669 -6966935 -7102208 -9828549 -11711750 -9344882 -3587287 1219792 1793563 -1208515
1929a208515l393695j322791R21668J908906J914597K060709K779612L089877
$$ -1208515 -4602210 -5925001 -5003333 -3094427 -1179830 880879 3660491 6750368
1921F750368J744259q99546l013405l686570m021411m815816m367655o76515M551718
$$ 6750368 8494627 7595081 4581676 895106 -3126305 -7942121 -12309776 -12986291 -8434573
1912h434573O780597M413569J199250J005277K401828J469569j501661k363827
$$ -8434573 -1653976 2759593 3958843 4964120 7365948 8835517 7333856 4970029
1904D970029j82750Q26422j705431l943997k072102R37808j01350l679797l467563
$$ 4970029 4787279 5613701 3908270 -35727 -2107829 -1170021 -1271371 -4951168 -8418731
1895h418731J461014M718864K179886k393405l743045k026282j59096J259440
$$ -8418731 -6957717 -2238853 -58967 -2452372 -6195417 -8221699 -8380795 -7121355
1887g121355K579898K444012N78472j3714K123490L059846o77186n266600m415403
$$ -7121355 -4541457 -2097445 -1518973 -1532687 590803 3650649 2973463 -2293137 -6708540
1878f708540Q09047L349813Q67621j419300M04463L302455K981280M21238o66770
$$ -6708540 -5899493 -2549680 -1682059 -3101359 -2696896 605559 3586839 4008077 3341307
1869C341307K62174P33401k72513r72661K09696K038387J645097j668993m506776
$$ 3341307 3603481 4336882 4064369 3091708 3301404 5339791 6984888 5315895 809119
1860H09119k885725K126270M905358K688409o91935r31391M13934l73678k365224
$$ 809119 -2076606 49664 4955022 7643431 6951496 6020105 6434039 6060361 3695137
1851C695137k129668l75837m07690j285477Q96370N132834N656155R30326l751483
$$ 3695137 1565469 1189632 781942 -503535 392835 5525669 11181824 12112150 8360667
1842H360667m223218k199209l49442J512044L054230K018143r19480j266694K022828
$$ 8360667 4137449 1938240 1588798 3100842 6155072 8173215 7253735 5987041 8009869
1833H009869L604327j04465m682599m208725k336K146216N99129j236913r19517
$$ 8009869 11614196 11509731 6827132 2618407 2616071 4762287 5361416 4124503 3204986
1824C204986N00771J213050P35777k48674l40941J193272K524741R45511k591874
$$ 3204986 3705757 4918807 5654584 5405910 5064969 6258241 8782982 9728493 7136619
1815G136619l723823r61318J759702R32381j569256k005722j39191J682023K139659
$$ 7136619 3412796 2451478 4211180 5143561 3574305 1568583 1429392 3111415 5251074
1806E251074J180376p66468j753052M68432M146933M034583j265315o192090n575849
$$ 5251074 6431450 5664982 3911930 4380362 8527295 12561878 11296563 5104473 -471376
1797d71376j441186J179876J747526K960480M485451L069855j616533n366262
$$ -471376 -1912562 -732686 1014840 3975320 8460771 11530626 9914093 4547831
1789D547831m442373m3260L055247J855980j181962r51684L124381N426333K296118
$$ 4547831 105458 62198 3117445 4973425 3791463 2839779 5964160 11390493 13686611
1780A3686611j605167j72817M037594L795722p56130k822083j046196r60432l449452
$$ 13686611 12081444 11908627 15946221 19741943 18985813 16163730 15117534 14157102 10707650
1771A0707650k467778K990505N386775J358316k401133j160382J57700k594423
$$ 10707650 8239872 11230377 16617152 17975468 15574335 14413953 14571653 11977230
1763A1977230m787764k606269q70798l258585m126603J058613O158393M802040
$$ 11977230 7189466 4583197 3712399 453814 -3672789 -2614176 3544217 8346257
1755H346257J740652L474288N836069K195809l448165l514199m61390j268996
$$ 8346257 10086909 13561197 19397266 21593075 18144910 14630711 14169321 12900325
1747A2900325m077932k564176J377118J359975j523284j860906m70976q50428
$$ 12900325 8822393 6258217 7635335 8995310 7472026 5611120 5140144 4289716
1739D289716l97893L665000N665891N74459m901178k862221J483214j51136k881224
$$ 4289716 3891823 7556823 13222714 13797173 8895995 6033774 7516988 7365852 4484628
1730D484628J672171P349065L227711n270350m712796K347565K572059l211087
$$ 4484628 6156799 13505864 16733575 11463225 6750429 9097994 11670053 8458966
1722H458966k460597M161723L458751m991830p176426K60568N407062L604452
$$ 8458966 5998369 10160092 13618843 8627013 1450587 1711155 7118217 10722669
1714A0722669K864165M649948J190413n539224m190820M092816O242794J317397
$$ 10722669 13586834 18236782 19427195 13887971 9697151 13789967 20032761 21350158
1706B1350158Q76297M732487J804741m449602K19245J0851014Q228561m732050
$$ 21350158 22226455 26958942 28763683 24314081 24533326 35384340 43612901 38880851
1698C8880851o072952L759890K739709p233006j030936J7139896J4283180p083492
$$ 38880851 32807899 36567789 39307498 32074492 31043556 48183452 62466632 55383140
1690E5383140n722777J9314198J8730324o864012J6095442R6414776J07693780
$$ 55383140 49660363 68974561 87704885 80840873 96936315 193351091 301044871
1683C01044871m1222757k29294929k47580161p8047960Q4315587R6603504K4865658
$$ 301044871 259822114 30527185 -217052976 -295100936 -210785349 -114181845 -89316187
1676h9316187l375695J9422826K4615378K458806l472575J1028883J1584586l719395
$$ -89316187 -92691882 -73269056 -48653678 -46194872 -49667447 -38638564 -27053978 -30773373
1668c0773373n408052P636576R007953k688484m011758O062474N955225m710781
$$ -30773373 -36181425 -28544849 -19536896 -22225380 -26237138 -20174664 -14219439 -18930220
1660a8930220m547284P194691Q213364n008410j0568501p22409O411654J252853
$$ -18930220 -23477504 -16282813 -8069449 -13077859 -23646360 -24368769 -17957115 -16704262
1652a6704262k557740L601498Q368623L639032j373344M65534J671160l108992
$$ -16704262 -19262002 -15660504 -7291881 -3652849 -5026193 -4560659 -2889499 -5998491
1644e998491o228754k456089R82581j216489k486067K482706P351051N251097
$$ -5998491 -12227245 -14683334 -13700753 -14917242 -17403309 -14920603 -7569552 -2318455
1636b318455k54128k601566j711286k40300J667827L328732K355981l61300j176922
$$ -2318455 -2572583 -5174149 -6885435 -7125735 -5457908 -2129176 226805 -134495 -1311417
1627a311417m11991j349009k648663k81905L411080K227390k458714l083640R09367
$$ -1311417 -1723408 -3072417 -5721080 -6002985 -2591905 -364515 -2823229 -5906869 -4997502
1618d997502K108971j473632l117242K82247L208771J854096l12513n12684j132586
$$ -4997502 -2888531 -4362163 -7479405 -7197158 -3988387 -2134291 -2446804 -2959488 -4092074
1609d092074l048718l013126p42500m58411k547435j801085L119116O387528M287128
$$ -4092074 -7140792 -10153918 -10896418 -11354829 -13902264 -15703349 -12584233 -6196705 -1909577
1600a909577M02693j333795j724270j842325m54752J636159J357748n62453q2082
$$ -1909577 -1506884 -2840679 -4564949 -6407274 -6862026 -5225867 -3868119 -4430572 -4512654
1591d512654K202591J167946l173448m356884k01558L358494K198601j62425o8743
$$ -4512654 -2310063 -1142117 -4315565 -8672449 -8874007 -5515513 -3316912 -3479337 -3548080
1582c548080N04087n67242j296360m79482l07899r46320P31614M101741L930317
$$ -3548080 -3043993 -3611235 -4907595 -5387077 -5694976 -6641296 -5909682 -1807941 2122376
1573B122376j70684j490969K344310M023007j622733q125808o891376p4022L773671
$$ 2122376 1951692 460723 2805033 6828040 5205307 -2920501 -9811877 -9885899 -6112228
1564f112228K482066R59265J827963K603441J379049l53138q32338l70133k43315
$$ -6112228 -3630162 -2670897 -842934 1760507 3139556 2786418 1954080 1583947 1340632
1555A340632j012677j700504m62693K521054L743252R16198k485283j754367J183387
$$ 1340632 327955 -1372549 -1835242 685812 4429064 5345262 2859979 1105612 2288999
1546B288999N19233l378125m170584o54918O75789l156837o026674k659461K970486
$$ 2288999 2808232 -569893 -4740477 -5395395 -4719606 -7876443 -13903117 -16562578 -13592092
1537a3592092M401995J927395k04932p05929j66897K332602O279476P280677K631695
$$ -13592092 -9190097 -7262702 -7467634 -8173563 -8340460 -6007858 271618 7552295 10183990
1528A0183990l762514o322282m724416k320533q56118k24419m07654o49329L71948
$$ 10183990 6421476 99194 -4625222 -6945755 -7801873 -8026292 -8433946 -9083275 -8711327
1519h711327J598403N69758j438990n01020K346808J344515l696987n169882K14338
$$ -8711327 -7112924 -6543166 -7982156 -8483176 -6136368 -4791853 -8488840 -13658722 -13444384
1510a3444384N154705L222145j191521j351505O67157l14395j944918R92110N766307
$$ -13444384 -8289679 -5067534 -6259055 -7610560 -6943403 -7257798 -9202716 -8210606 -2444299
1501b444299N468044P87611j463968J13317N29643j865957l288756k199037j226724
$$ -2444299 3023745 3811356 2347388 2460705 2990348 1124391 -2164365 -4363402 -5590126
1492e590126r00316J290313M607734M525078O549m268538m495724j967530L09059
$$ -5590126 -6490442 -5200129 -592395 3932683 3939232 -329306 -4825030 -6792560 -6483501
1483f483501J089909L54087r99658p64731J864947L801215J905241j759691k623645
$$ -6483501 -5393592 -5039505 -6039163 -6803894 -4938947 -1137732 767509 -992182 -3615827
1474c615827m07781J210577O39757n92020j856562l600550m278247k045624J076091
$$ -3615827 -4023608 -2813031 -2173274 -2765294 -4621856 -8222406 -12500653 -14546277 -13470186
1465a3470186J566467K19394N63692K257795J653271j262132k233404L87209L332573
$$ -13470186 -11903719 -11684325 -11120633 -8862838 -7209567 -8471699 -10705103 -10317894 -6985321
1456f985321L760120K280434J67380j987647k606064n85301J598754Q39620j019649
$$ -6985321 -3225201 -944767 -777387 -2765034 -5371098 -5956399 -4357645 -3518025 -4537674
1447d537674K08586L421326L431422l5945j429108J271649L235868J254044j073385
$$ -4537674 -4329088 -907762 2523660 2487715 1058607 2330256 5566124 6820168 5746783
1438E746783j64472J275618p70828m732561o032568l622307j07365K411346L443443
$$ 5746783 5582311 6857929 6087101 1354540 -4678028 -8300335 -8407700 -5996354 -2552911
1429b552911K867426J206845j19067m01917j88239L35628J481473K367760J639985
$$ -2552911 314515 1521360 1402293 1000376 812137 1147765 2629238 4996998 6636983
1420F636983k4844r07083j337258k403599k431590O19280L820860K099301l296917
$$ 6636983 6612139 5705056 4367798 1964199 -467391 151889 3972749 6072050 2775133
1411B775133n484852k272101R40005O08849J89238K420436L644838P79538k335578
$$ 2775133 -2709719 -4981820 -4041815 -3432966 -3243728 -823292 2821546 3601084 1265506
1402A265506j424743P33661l37217k595330j559006J167398R16007j210032l41441
$$ 1265506 -159237 574424 237207 -2358123 -3917129 -2749731 -1833724 -3043756 -3385197
1393c385197K824166K661898j464160l556383o17500K843643K365936q2864m79957
$$ -3385197 -561031 2100867 636707 -2919676 -3537176 -693533 1672403 1589539 1109582
1384A109582Q56082Q96002p78040j646948j25514K418240L140015N04546l759972
$$ 1109582 1965664 2861666 2083626 436678 311164 2729404 5869419 6373965 2613993
1375B613993n673869l220351R30464K534998Q57100j428751k377245j949320P9490
$$ 2613993 -3059876 -6280227 -5349763 -2814765 -1957665 -3386416 -5763661 -7712981 -7633491
1366g633491L662373O048468L939300j123554l572972j393321J204490O86561
$$ -7633491 -3971118 2077350 6016650 4893096 1320124 -73197 1131293 1817854
1358A817854n74970P20445K563474J144059k083655k438953M9618O42992j835740
$$ 1817854 1242884 1963329 4526803 5670862 3587207 1148254 1197872 1840864 5124
1349E124k642393R46695M633694L514667o83035l064330l024519l215047l345430
$$ 5124 -2637269 -1690574 2943120 6457787 5774752 2710422 -314097 -3529144 -6874574
1340f874574r42241K452747K101894j986838l842731m47200L532577L148951M38615
$$ -6874574 -7816815 -5364068 -3262174 -5249012 -9091743 -9538943 -6006366 -2857415 -2418800
1331b418800j4075J269062O86436j523627j959482j82481J036450P87775N47243
$$ -2418800 -2432875 -1163813 -477377 -2001004 -3960486 -4142967 -3106517 -2318742 -1771499
1322a771499L21669q88764j341301J491696N263570M587984p49375m849041m176196
$$ -1771499 -1449830 -2338594 -3679895 -2188199 3075371 7663355 6913980 2064939 -2111257
1313b111257j552557l0992J492145L865501M359777J506931j250544q01647N23466
$$ -2111257 -3663814 -3694806 -2202661 1662840 6022617 7529548 6279004 5477357 6000823
1304F000823q32496l687749m594649l423400k265795j220567N94488J980329J602412
$$ 6000823 5168327 1480578 -3114071 -6537471 -8803266 -10023833 -9429345 -7449016 -5846604
1295e846604J015798J975200K877036J734401K88467Q49265J513281m85159k877581
$$ -5846604 -4830806 -2855606 21430 1755831 2044298 2893563 4406844 3921685 1044104
1286A044104j543318J974870K349698q70338k893209j968610j389165k323880
$$ 1044104 -499214 1475656 3825354 2955016 61807 -1906803 -3295968 -5619848
1278e619848j464587K080056M039959K278606Q65748K787182L992222q463n790626
$$ -5619848 -7084435 -5004379 -964420 1314186 2179934 4967116 8959338 8950875 3160249
1269C160249o379901j531914K392320J780371o71022j768606j846748j710959
$$ 3160249 -3219652 -4751566 -2359246 -578875 -1249897 -3018503 -4865251 -6576210
1261f576210j67945K953806M598586K263321j884450l504670j799085l4835m15916
$$ -6576210 -6744155 -3790349 808237 3071558 1187108 -2317562 -4116647 -4151482 -4567398
1252d567398j109025L86501K918262L104539M07188j984404j982454j532788k712321
$$ -4567398 -5676423 -5289922 -2371660 732879 1140067 -844337 -2826791 -4359579 -7071900
1243g071900l288079K27965N973872P493992K190464m599275o115171j994635
$$ -7071900 -10359979 -10132014 -4158142 3335850 5526314 927039 -5188132 -7182767
1235g182767K931483N166477M499155J254898l953640p821820o156143K55161
$$ -7182767 -4251284 915193 5414348 6669246 2715606 -5106214 -11262357 -11007196
1227a1007196M962160L482272q48417j543061K251467N204752L586473j48221
$$ -11007196 -6045036 -2562764 -3411181 -4954242 -2702775 2501977 6088450 5940229
1219E940229j660527n47932L69404k95258j219057j161339p07187r71207k112767
$$ 5940229 4279702 3731770 4101174 3805916 2586859 1425520 718333 -252874 -2365641
1210b365641l422727l759938j965548J756461M795538M134113L1158l654848l680116
$$ -2365641 -5788368 -9548306 -11513854 -9757393 -4961855 -827742 -796584 -4451432 -8131548
1201h131548q98050J344397J352604M91128Q42499K460300L231022J390693j927609
$$ -8131548 -9029598 -7685201 -6332597 -5841469 -4998970 -2538670 692352 2083045 155436
1192A55436l374642j322898J730350K181416R3108j228910l05522N91483n93260
$$ 155436 -3219206 -4542104 -2811754 -630338 -537230 -1766140 -2071662 -1480179 -2073439
1183b073439k429483k328233j55267K213089L328301K595483K3894k637832k337462
$$ -2073439 -4502922 -6831155 -6986422 -4773333 -1445032 1150451 1174345 -1463487 -3800949
1174c800949J385477M394245K484082k941588o263312m303439N96672L873609
$$ -3800949 -2415472 1978773 4462855 1521267 -4742045 -9045484 -8448812 -4575203
1166d575203L224564P1762j888247o7407L853922N235940K285645j260977j342189
$$ -4575203 -1350639 -1278877 -3167124 -3234531 619391 5855331 8140976 6879999 5537810
1157E537810O61055N02849k284590m251612l684100k294080j403263m19426N60223
$$ 5537810 6198865 6701714 4417124 165512 -3518588 -5812668 -7215931 -7635357 -7075134
1148g075134M13871j77311P98754K772545K857336P39675o06366j3151L13554
$$ -7075134 -6661263 -6838574 -6039820 -3267275 -409939 329736 -276630 -289781 23773
1139B3773l42246N79319L593309M624740J002250l845179n225760l440659j682644
$$ 23773 -318473 260846 3854155 8478895 9481145 5635966 410206 -3030453 -4713097
1130d713097q74313l89409q14032j808077k75903M526620P035982K434110m591407
$$ -4713097 -5587410 -5976819 -6790851 -8598928 -8874831 -4348211 2687771 5121881 530474
1121E30474n148529N97752L148371k081468p680596m947902M090084J0072532
$$ 530474 -4618055 -4020303 -871932 -2953400 -10633996 -15581898 -11491814 -1419282
1113a419282Q054623J332706m190795n340671k554106J142853K354170N76284
$$ -1419282 6635341 7968047 3777252 -1563419 -4117525 -2974672 -620502 -44218
1105d4218j367129j332536n75194q49081j065547N14433K593503K585978R67570
$$ -44218 -1411347 -2743883 -3319077 -4168158 -5233705 -4719272 -2125769 460209 1427779
1096A427779N06220J590682J717523j34919j868873j882101j392959j678725j500695
$$ 1427779 1933999 3524681 5242204 5107285 3238412 1356311 -36648 -1715373 -3216068
1087c216068N43152K754302K025259j586339m215569k728441J489813M256117
$$ -3216068 -2672916 81386 2106645 520306 -3695263 -6423704 -4933891 -677774
1079f77774L411369P35890r77148j380895j934462k665541j773913J028917L001709
$$ -677774 2733595 3469485 2492337 1111442 -823020 -3488561 -5262474 -4233557 -1231848
1070a231848J905165m89290p30543J322055K502953J235913l99489l02843N09886
$$ -1231848 673317 184027 -546516 775539 3278492 4514405 4114916 3812073 4321959
1061D321959J4763j454426j951246r62207K05164N93376N13858M26747K51529
$$ 4321959 4336722 2882296 931050 -31157 174007 767383 1281241 1707988 1959517
1052A959517n6902j89709J1720K38685N6169n47684q79607j06728J325646J400753
$$ 1959517 1902615 1712906 1724626 1963311 2019480 1471796 592189 485461 1811107 3211860
1042C211860r60868l444168k563351J329065L886726K779741R83543J823633L440639
$$ 3211860 2250992 -1193176 -3756527 -2427462 1459264 4239005 5222548 7046181 10486820
1033A0486820J695513l095485o393291n841286l428522j101196J655499M658196
$$ 10486820 12182333 9086848 2693557 -3147729 -6576251 -7677447 -6021948 -1363752
1025a363752N266804K123248j937978l185563j614730k23027p83338k096362j897333
$$ -1363752 3903052 6026300 4088322 902759 -711971 -934998 -1718336 -3814698 -5712031
1016e712031N21676L208429L121490r4895k608391j013736K190629J491758l005313
$$ -5712031 -5190355 -1981926 1139564 1044669 -1563722 -2577458 -386829 1104929 -1900384
1007a900384m731472m88747L960892K211548l059569m270884k55808K934800J781890
$$ -1900384 -6631856 -7120603 -3159711 -948163 -4007732 -8278616 -8534424 -5599624 -3817734
998c817734m61806k21232J306747J725768J658816K479416K974056J284216j740118
$$ -3817734 -4279540 -4500772 -3194025 -1468257 190559 2669975 5644031 6928247 5188129
989E188129l540298k872028k48170L019729M791082L072925j128439l723976k361450
$$ 5188129 1647831 -1224197 -1472367 1547362 6338444 9411369 8282930 4558954 2197504
980B197504L35013O55136p24165k89761K175521K800171l55097l843978l424898
$$ 2197504 2532517 3187653 2463488 2173727 4349248 7149419 6794322 2950344 -474554
971d74554N1726J948865J90938k284358j783247J479012M147523L962157J769473
$$ -474554 -422828 1526037 1716975 -567383 -2350630 -871618 3275905 7238062 9007535
962I007535k78015j182313j520194k148097k785316j886769J434029N071763M994007
$$ 9007535 8729520 7547207 6027013 3878916 1093600 -793169 640860 5712623 10706630
953A0706630R1776n341212o241930k943227J37512J140913K040454L177851J696058
$$ 10706630 10798406 5457194 -784736 -3727963 -3590451 -2449538 -409084 2768767 4464825
944D464825k511321m337162p22819L771053L403655j20255j096334O66726M66789
$$ 4464825 1953504 -2383658 -3106477 664576 4068231 3947976 2851642 3518368 3985157
935C985157k232822k610465P82080K889527J90032l813309m352988k078627m89300
$$ 3985157 1752335 -858130 -76050 2813477 3003509 -809800 -5162788 -7241415 -7730715
926g730715l61616k85468J00056O61321K150024M178278M224248J405987j258732
$$ -7730715 -8092331 -8377799 -8277743 -7616422 -5466398 -1288120 2936128 4342115 3083383
917C083383j231463m50695j622797l039099j162956L264011N867713M628846J600581
$$ 3083383 1851920 1401225 -221572 -3260671 -4423627 -1159616 4708097 9336943 10937524
908A0937524q33385k102368k218301j437583q90048j010527j86073K264504L157110
$$ 10937524 10104139 8001771 5783470 4345887 3455839 2445312 2259239 4523743 7680853
899G680853o15736o026358o458739p35338M893086N038132J298491j756560k752949
$$ 7680853 7065117 1038759 -5419980 -6155318 -1262232 3775900 5074391 3317831 564882
890E64882k844158k067481J14567K480445L426469L444992L513437K409914j134253
$$ 564882 -2279276 -4346757 -4232190 -1751745 1674724 5119716 8633153 11043067 9908814
881I908814m578900l773766P55170L561543J650341j425716j247025O87257m04821
$$ 9908814 5329914 1556148 2311318 5872861 7523202 6097486 4850461 5537718 5132897
872E132897m726749p099843m344147M91736K826884K235811J162479N85108m4123
$$ 5132897 406148 -6693695 -11037842 -10546106 -7719222 -5483411 -4320932 -3735824 -3779947
863c779947k71984O75684J592284P95785n92755m8773J885234J931601p19013
$$ -3779947 -4051931 -3376247 -1783963 -988178 -1580933 -1629706 255528 2187129 1468116
854A468116k892145k092572L56046K044671K482821J984657L91512j375105j130698
$$ 1468116 -1424029 -3516601 -3160555 -1115884 1366937 3351594 3743106 2368001 1237303
845A237303J243425K660692J004709j812599k932784k321456j313702Q4975J806977
$$ 1237303 2480728 5141420 6146129 4333530 1400746 -920710 -2234412 -2149437 -342460
836c42460J965649m57280l020766k948739j180485l07159k14488Q55811K398408
$$ -342460 1623189 1165909 -1854857 -4803596 -5984081 -6291240 -6505728 -5649917 -3251509
827c251509K435538J199609N63407O87112N41854O34259J607359J441774j657752
$$ -3251509 -815971 383638 947045 1634157 2176011 2810270 4417629 5859403 4201651
818D201651m652334k981507J876475L669497P24890j749708k94233J762050Q34918
$$ 4201651 -450683 -3432190 -1555715 2113782 2838672 1088964 794731 2556781 3391699
809C391699p77894L48590K169635O52972k873334l465746m34738J955736J672979
$$ 3391699 2613805 2962395 5132030 5785002 2911668 -554078 -988816 966920 2639899
800B639899J586983L501999M145535K83427n143398o120250j959865J392247n46769
$$ 2639899 4226882 7728881 11874416 12157843 7014445 894195 -1065670 326577 -220192
791b20192m690372m893002m55975L473378L425877J463466N19794l4202j565615
$$ -220192 -4910564 -9803566 -10259541 -6786163 -3360286 -1896820 -1377026 -1411228 -2976843
782b976843k375245o11057J402283L73500j801473l49818M083491N166898M50727
$$ -2976843 -5352088 -5963145 -4560862 -4187362 -5988835 -6338653 -2255162 2911736 3362463
773C362463m186291k848878J939995L484701P52061j139667O25719K622074R36764
$$ 3362463 -823828 -3672706 -1732711 1751990 2504051 1364384 1990103 4612177 5548941
764E548941k787889l665574l16230L376928L410845N30178j414320q49870N6225
$$ 5548941 2761052 -904522 -1220752 2156176 5567021 6097199 4682879 3833009 3889234
755C889234n35348j285078n25672L39689r06965l056601k847019r3398J986884
$$ 3889234 3353886 2068808 1543136 1882825 975860 -2080741 -4927760 -5021158 -3034274
746c034274J737184R12644Q67820L69418j324518k319257j052851J038469J915818
$$ -3034274 -1297090 -384446 483374 852792 -471726 -2790983 -3843834 -2805365 -889547
737h89547J942871K404539K838387K064815M75381q24198j997262l566357m476809
$$ -889547 1053324 3457863 6296250 8361065 8836446 8012248 6014986 2448629 -2028180
728b028180l115478K30245L513278N012741M042006N58087m133808o853905m844594
$$ -2028180 -5143658 -4913413 -1400135 3612606 7654612 8212699 4078891 -2775014 -7619608
719g619608Q56480N545763N202560N76072l429840k784930J241874L434942Q44431
$$ -7619608 -6763128 -1217365 3985195 4561267 1131427 -1653503 -411629 3023313 3867744
710C867744l605391m975956k392337R47550K741839L451234L500824K215200L23100
$$ 3867744 262353 -4713603 -7105940 -6158390 -3416551 34683 3535507 5750707 6073807
701F073807J44443J800980K199452l67351l234127l147967q54566N04413j2582
$$ 6073807 6218250 8019230 10218682 9851331 6617204 3469237 2614671 3119084 3106502
692C106502n83233J87329J513787J680241N4403j927223j867444N05168J989863
$$ 3106502 2523269 2710598 4224385 5904626 5959029 4031806 2164362 2669530 4659393
683D659393k83433m243294n010954j557034K248809L564366L533921L382321J985493
$$ 4659393 4375960 132666 -4878288 -6435322 -4186513 -622147 2911774 6294095 8279588
674H279588p59652k310828j570921p46060r19087j07680J732708Q53009l488456
$$ 8279588 7519936 5209108 3638187 2892127 1973040 1865360 3598068 4451077 962621
665I62621n610881j743668L085783K555440q53043n16533K818749K561694k099678
$$ 962621 -4648260 -6391928 -3306145 -750705 -1603748 -2120281 698468 3260162 1160484
656A160484m688307k088805J097081O56557j472750j979019j026197L12539K531734
$$ 1160484 -3527823 -5616628 -4519547 -3862990 -5335740 -7314759 -8340956 -8028417 -5496683
647e496683M844324M171861r1958l794933l220188K06532K542972K114779l3688
$$ -5496683 -652359 3519502 3427544 -367389 -3587577 -3381045 -838073 1276706 1243018
638A243018j987469j860326P65031L356933K911288L23585p72461K98368O09028
$$ 1243018 -744451 -2604777 -1839746 1517187 4428475 4752060 3979599 4277967 4886995
629D886995q36396j471760k49186L90084o10892q58991N00067O88724j102624
$$ 4886995 4050599 2578839 2329653 2719737 2108845 1249854 1749921 2438645 1336021
620A336021j306418J221084J480139l515363p836904m512416L240095O088534
$$ 1336021 29603 1250687 2730826 -784537 -8621441 -13133857 -9893762 -3805228
612c805228K021353j954507j241520Q87758P90995M05968K303387M114274K281022
$$ -3805228 -1783875 -3738382 -4979902 -4092144 -3301149 -2895181 -591794 3522480 5803502
603E803502j848333l812278k204254K90179J027672q6477j596892j891554j01333
$$ 5803502 3955169 142891 -2061363 -1771184 -743512 -829989 -2426881 -4318435 -4419768
594d419768K708350L877773K234017l9812m29980K7982j482084m352590m531163
$$ -4419768 -1711418 2166355 4400372 4360560 3930580 3958562 2476478 -1876112 -6407275
585f407275p08854K755887J545859k358873l440459l43519K978575L564065K759657
$$ -6407275 -7116129 -4360242 -2814383 -5173256 -8613715 -8957234 -5978659 -2414594 345063
576C45063K216852O70504k787536n459148m424234j068922J129065J677120K354037
$$ 345063 2561915 3232419 444883 -5014265 -9438499 -10507421 -9378356 -7701236 -5347199
567e347199K794245J024786j979831k643266l29288J393444K69394j367600n83535
$$ -5347199 -2552954 -1528168 -3507999 -6151265 -6480553 -5087109 -4817715 -6185315 -6768850
558f768850J806115K935275J839181j11577j197082n28441J329140K275559R42059
$$ -6768850 -4962735 -2027460 -188279 -299856 -1496938 -2025379 -696239 1579320 2521379
549B521379q35937l19106J317380J16496l845044n200579j219553L268195K633042
$$ 2521379 1685442 1366336 2683716 2800212 -1044832 -6245411 -7464964 -4196769 -1563727
540a563727j282355k389287L64061K272558P91307j077956k77020J802091K370810
$$ -1563727 -2846082 -5235369 -4871308 -2598750 -1807443 -2885399 -3162419 -1360328 1010482
531A010482J711157J956814L033568K425442j092190n211209o414190m047429
$$ 1010482 2721639 4678453 7712021 10137463 9045273 3834064 -2580126 -6627555
523f627555j063300j91093l82189J226042M204183M486250L22677m083997l498630
$$ -6627555 -7690855 -7881948 -8264137 -7038095 -2833912 1652338 1975015 -2108982 -5607612
514e607612J346156M702358L221965n92992k652416k124129p48643M34946J531686
$$ -5607612 -4261456 440902 3662867 3069875 417459 -1706670 -2455313 -2020367 -488681
505d88681J977947O25199k019827l372298j740307J225621K495704J573122N71011
$$ -488681 1489266 2114465 94638 -3277660 -5017967 -3792346 -1296642 276480 847491
496H47491M10240m62512k467527k887680l5666K912693J906060j584707k429091
$$ 847491 1257731 795219 -1672308 -4559988 -4595654 -1682961 223099 -1361608 -3790699
487c790699L77002K392468P08695k338860l724366l539699k365634O90207M594904
$$ -3790699 -3413697 -1021229 -312534 -2651394 -6375760 -9915459 -12281093 -11590886 -6995982
478f995982N209392J071885l086084k454429J198712L010136K324577J826571
$$ -6995982 -1786590 -714705 -3800789 -6255218 -5056506 -2046370 278207 2104778
470B104778J646778k52178k837714k568758O24056K637181J224444j309401k320390
$$ 2104778 3751556 3499378 661664 -1907094 -1283038 1354143 2578587 1269186 -1051204
461a051204j962898r77163J048171L451828L572630L07650l421851l940550j358386
$$ -1051204 -3014102 -3991265 -2943094 508734 4081364 4389014 967163 -2973387 -4331773
452d331773J016711J168802N53602J464332L309252K933932p46266l882999j864133
$$ -4331773 -3315062 -2146260 -1592658 -128326 3180926 6114858 5368592 1485593 -378540
443c78540L940904O904340L695457j367822k756190j076036n06105j776082k266939
$$ -378540 3562364 10466704 14162161 12794339 10038149 8962113 8456008 6679926 4412987
434D412987j443730j339585k132567j693297L34458J862600J934828J471619N72948
$$ 4412987 2969257 1629672 -502895 -2196192 -1861734 866 1935694 3407313 3980261
425C980261j243467k367067q02824J491341N87860k688626l108463O64127L391625
$$ 3980261 2736794 369727 -433097 1058244 1646104 -1042522 -4150985 -3486858 -95233
416i5233J199773k705840l437696j272004O59707J870736L351174L661125R66265
$$ -95233 1104540 -1601300 -5038996 -6311000 -5651293 -3780557 -429383 3231742 4198007
407D198007k543092k790330K27570K572695K211395R47769L38926m51401j587652
$$ 4198007 1654915 -1135415 -907845 1664850 3876245 4824014 5162940 4711539 3123887
398C123887r25025K226256M240093J288623m647673p208599l634559J606533K927807
$$ 3123887 2198862 4425118 8665211 9953834 5306161 -1902438 -5536997 -3930464 -1002657
389a002657R07463K89165K088993K256919j038139l544064j301412K820270L236842
$$ -1002657 -95194 193971 2282964 4539883 3501744 -42320 -1343732 1476538 4713380
380D713380l3952k003638n72529J225166R09499k20079n27581o05237r79160p63415
$$ 4713380 4679428 2675790 2103261 3328427 4237926 4017847 3490266 2885029 1905869 1142454
370A142454q6292o82982k601502l338819j743968J45814O39231P84222J622783
$$ 1142454 1056162 373180 -2228322 -5567141 -7311109 -7165295 -6526064 -5741842 -4119059
361d119059K037219J176211K36790j1222p10453k131914k384841r03432o0677
$$ -4119059 -2081840 -905629 -668839 -680061 -1390514 -3522428 -5907269 -6810701 -6871378
352f871378r65286r90286J571395L711973K305134l68153r5211K363387K676665
$$ -6871378 -7836664 -8826950 -7255555 -3543582 -1238448 -1606601 -1701812 661575 3338240
343C338240J27107j565187n92285M21039p02953k201849j591287M51675J540482
$$ 3338240 3465347 1900160 1307875 1728914 1025961 -1175888 -2767175 -2315500 -775018
334g75018J155370P17874Q95048O26083r55715k702837k450774J77798K886700
$$ -775018 380352 1098226 1993274 2619357 1663642 -1039195 -3489969 -3312171 -425471
325d25471L330045J799532J32204j069292k146687k195007j35077K165455J365854
$$ -425471 2904574 4704106 4836310 3767018 1620331 -574676 -709753 1455702 2821556
316B821556k013215l370366n97075K742350K866030Q44185m88760j247474k609886
$$ 2821556 808341 -2562025 -3159100 -416750 2449280 3293465 2804705 1557231 -1052655
307a052655l144481j190583J122613N37956j906862k277896J22536K006676J377442
$$ -1052655 -4197136 -5387719 -4265106 -3727150 -5634012 -7911908 -7789372 -5782696 -4405254
298d405254m7233n3549J385497L117665M115382L426412Q13089k283270l829366
$$ -4405254 -4452487 -4506036 -3120539 -2874 4112508 7538920 8352009 6068739 2239373
289B239373l130246q24741J960120L446245K074850q61971j631536Q57457K820239
$$ 2239373 -890873 -1715614 244506 3690751 5765601 4903630 3272094 4129551 6949790
280F949790R75456k514190l675955k596976j761994j074874Q10823K256802Q93861
$$ 6949790 7925246 5411056 1735101 -861875 -2623869 -3698743 -2887920 -631118 262743
271B62743j345631p52189J727257K091505L76140J12671J215194N6569l030374
$$ 262743 -1082888 -1835077 -107820 1983685 2359825 2472496 3687690 3744259 713885
262G13885l338550j95248J253177j080295k527421j05236K076235K54395k186158
$$ 713885 -2624665 -2819913 -1566736 -2647031 -5174452 -5279688 -3203453 -2949058 -5135216
253e135216p35761K427106K583903N14657K10236J456875R42678j134818j593841
$$ -5135216 -5870977 -3443871 -859968 -345311 -135075 1321800 2264478 1129660 -464181
244d64181l06442l7469p86731K31296K847037L376490O45832k000257j960546
$$ -464181 -770623 -808092 -1594823 -1363527 1483510 4860000 5505832 3505575 1545029
235A545029o78355k73803m48307l96176o76373j366160j041586N38139J164642
$$ 1545029 866674 592871 144564 -251612 -927985 -2294145 -3335731 -2797592 -1632950
226a632950l49145j604679J4986K999434L501762P60945j974848k071887o60000
$$ -1632950 -1982095 -3586774 -3571788 -572354 2929408 3690353 1715505 -356382 -1016382
217a016382k72791j187727j625418o03342J035337K108631K114872Q30955j457741
$$ -1016382 -1289173 -2476900 -4102318 -4705660 -3670323 -1561692 553180 1384135 -73606
208g3606k998702j725318J615860L265834R85491k701150l752748j752940N93300
$$ -73606 -3072308 -4797626 -3181766 84068 1069559 -1631591 -5384339 -7137279 -6543979
199f543979J900339K922929L502560K250018l09803j540389n37707O41825L98237
$$ -6543979 -4643640 -1720711 1781849 4031867 3722064 2181675 1643968 2285793 2684030
190B684030n83011j592244k789472l033565n57448K893310K804750j153256l376375
$$ 2684030 2101019 508775 -2280697 -5314262 -5871710 -2978400 -173650 -1326906 -4703281
181d703281n02934L208497K731632P7948r7532J181758Q162k051022k93369L485536
$$ -4703281 -5206215 -1997718 733914 811862 714330 1896088 1904250 -146772 -440141 3045395
171C045395K290775m124723p152378k261584L778095L482014k91672m01962K629203
$$ 3045395 5336170 1211447 -5940931 -8202515 -4424420 -942406 -1234078 -1636040 993163
162I93163K693286p15521j878904Q62564K212744q24675l708860j905376J787577
$$ 993163 3686449 2970928 1092024 1954588 4167332 3342657 -366203 -2271579 -484002
153d84002K117532k33833m80925K076039L167374O68034k252970k263435l42843
$$ -484002 1633530 1399697 918772 2994811 6162185 6830219 4577249 2313814 1970971
144A970971P25667M89997K69639M16754L16111q4047n15086j164288j749359j006529
$$ 1970971 2696638 3186635 3456274 3873028 4189139 4105092 3590006 2425718 676359 -330170
134c30170J294329L045453K363872L52679o97421p12505j024341j188884L23109
$$ -330170 964159 4009612 6373484 6726163 6028742 5316237 4291896 3103012 3426121
125C426121K593642K662487r2138k845460l270910j969880l54716J062822J433362
$$ 3426121 6019763 8682250 8590112 5744652 2473742 503862 149146 1211968 2645330
116B645330l16521k816746k754259K22827K131297L80867k136570j584597Q85474
$$ 2645330 2328809 -487937 -3242196 -3019369 -888072 -507205 -2643775 -4228372 -3342898
107c342898J410228k63112q34391R39493K621986K297569J148829J075747K068934
$$ -3342898 -1932670 -2195782 -3030173 -2090680 531306 2828875 3977704 5053451 7122385
98G122385K700726J744320q45324l367369l348947n32585K056785J819192Q6906
$$ 7122385 9823111 11567431 10722107 7354738 4005791 3473206 5529991 7349183 7436089
89G436089m00666j6738r00502k167361p77484K666039L510655q1426l838482l311925
$$ 7436089 7035423 7018685 6118183 3950822 3173338 5839377 9350032 9268606 5430124 2118199
79B118199N9697J662490J36860k030127k900866k900465k611174j465567Q03789
$$ 2118199 2177896 3840386 3977246 1947119 -953747 -3854212 -6465386 -7930953 -7127164
70g127164L020023L562719J979078m75873j748518r68565L30524J47j422189q57049
$$ -7127164 -4107141 -544422 1434656 958783 -789735 -1758300 -1427776 -1427629 -2849818 -3706867
60c706867K797308O035267M740282j60635l596551k885063p61108q78290k592914
$$ -3706867 -909559 5125708 9865990 9705355 6108804 3223741 2462633 1584343 -1008571
51a008571k467901J41515J859269K05532k635220k769217J3516K177288J559847
$$ -1008571 -3476472 -3334957 -1475688 -1270156 -3905376 -6674593 -6661077 -4483789 -2923942
42b923942R1270M95630K258233K595352M59751k125906k550591l50805K452387
$$ -2923942 -2832672 -2337042 -78809 2516543 2976294 850388 -1700203 -2051008 401379
33D01379L203258J165556j489323k001860m39043O25953J29603j8696J387339
$$ 401379 3604637 4770193 3280870 1279010 839967 1465920 1595523 1576827 2964166
24B964166K288785P17158j516656j503863M6878K37669r88418j063417M27406
$$ 2964166 5252951 5970109 4453453 2949590 2996468 3234137 2245719 1182302 1609708
15A609708J125676J81095p02370r15651j662277k306417l60885L416415M409115
$$ 1609708 2735384 2916479 2214109 1298458 -363819 -2670236 -3031121 385294 4794409
6D794409J008270k164086j071415J626356J310429j119903
$$ 4794409 5802679 3638593 2567178 4193534 5503963 4384060
0D384060
$$ 4384060
##END NTUPLES=NMR SPECTRUM
##END=
