##TITLE=31Pdec_LR-684B-1
 , 24 sc
 22.7.2019
##JCAMPDX= 6.0         $$ Bruker NMR JCAMP-DX V2.0
##DATA TYPE= NMR SPECTRUM
##DATA CLASS= NTUPLES
##ORIGIN= UXNMR, Bruker Analytische Messtechnik GmbH
##OWNER= root
$$ XWIN-NMR		Version 3.5
$$ Mon Jul 22 15:11:33 2019 Russian Standard Time (UT+4h)  she@DPX200
##.OBSERVE FREQUENCY= 81.013821
##.OBSERVE NUCLEUS= ^31P
##.ACQUISITION MODE= SIMULTANEOUS
##.ACQUISITION SCHEME= undefined
##.AVERAGES= 24
##.DIGITISER RES= 16
##SPECTROMETER/DATA SYSTEM= spect
##.PULSE SEQUENCE= zgpg30
##.SOLVENT NAME= Tol
##.SHIFT REFERENCE= (INTERNAL, Tol, 0, 248.564)
##AUDIT TRAIL= $$ (NUMBER, WHEN, WHO, WHERE, WHAT)
$$ ##TITLE= Audit trail, XWIN-NMR		Version 3.5
$$ ##JCAMPDX= 5.01
$$ ##ORIGIN= Bruker BioSpin GmbH
$$ ##OWNER= she
$$ F:/spectra/data/she/nmr/P31/1/pdata/1/auditp.txt
$$ ##AUDIT TRAIL=  $$ (NUMBER, WHEN, WHO, WHERE, WHAT)
(   1,<2019-07-22 15:09:55.28 +0400>,<she>,<DPX200>,
      <created by zg, POWCHK disabled, PULCHK disabled
       configuration hash MD5:
       00 E9 B6 7A A2 85 ED C7 34 08 36 98 17 FE 4E 26
       data hash MD5: 32K
       CF B5 B4 0A 7B 70 19 B8 2E 62 3B D4 5C 6E 38 87>)
(   2,<2019-07-22 15:09:57.56 +0400>,<she>,<DPX200>,
      <Start of raw data processing
       efp BC_mod = 2 LB = 1 FT_mod = 6 PKNL = 1 PHC0 = -2721.979 PHC1 = 98.59923 SI = 64K 
       data hash MD5: 64K
       4D 3B 09 01 15 01 A9 33 1E 20 F3 9D 28 8E 81 70>)
(   3,<2019-07-22 15:10:52.39 +0400>,<she>,<DPX200>,
      <pk PHC0 = 4.506914 PHC1 = -6.399999 
       data hash MD5: 64K
       5C E3 E6 44 DC C1 21 64 B3 3F 1A DE AD 1E B3 9C>)
(   4,<2019-07-22 15:10:55.67 +0400>,<she>,<DPX200>,
      <abs ABSG = 5 
       data hash MD5: 64K
       AE 12 60 4B FE 54 3F 9F 80 1D 0A 78 6E 60 3F 2C>)
$$ ##END=
$$ 
$$ hash MD5
$$ D2 7D FE 58 E3 33 47 2A 69 04 8E 7E E0 80 E3 C8
##$RELAX= 
##$RELAX= 
##$RELAX= 
##$RELAX= 
##$RELAX= 
##$RELAX= 
##$RELAX= 
##$RELAX= 
$$ Bruker specific parameters
$$ --------------------------
##$DU= <F:/spectra>
##$EXPNO= 1
##$NAME= <P31>
##$PROCNO= 1
##$TYPE= <nmr>
##$USER= <she>
##$AMP= (0..31)
100 100 100 100 100 100 100 100 100 100 100 100 100 100 100 100 100 100 
100 100 100 100 100 100 100 100 100 100 100 100 100 100 
##$AQSEQ= 0
##$AQ_mod= 1
##$AUNM= <au_zg>
##$AUTOPOS= <>
##$BF1= 81.014009
##$BF2= 200.13
##$BF3= 200.13
##$BF4= 200.13
##$BF5= 200.13
##$BF6= 200.13
##$BF7= 200.13
##$BF8= 200.13
##$BYTORDA= 1
##$CFDGTYP= 0
##$CFRGTYP= 5
##$CHEMSTR= <none>
##$CNST= (0..31)
1 1 145 1 1 1 1 1 1 1 1 1 1 1 1 1 1 1 1 1 1 1 1 1 1 1 1 1 1 1 1 1 
##$CPDPRG= <waltz16>
##$CPDPRG1= <>
##$CPDPRG2= <waltz16>
##$CPDPRG3= <>
##$CPDPRG4= <mlev>
##$CPDPRG5= <mlev>
##$CPDPRG6= <mlev>
##$CPDPRG7= <mlev>
##$CPDPRG8= <mlev>
##$CPDPRGB= <>
##$CPDPRGT= <>
##$D= (0..31)
0 1 0 0 0 0 0 0 0 0 0 0.03 2e-05 3e-06 0 0 0 0 0 0 0 0 0 0 0 0 0 0 0 0 
0 0 
##$DATE= 1563793794
##$DBL= (0..7)
120 120 120 11 120 120 24 19 
##$DBP= (0..7)
150 150 150 150 150 150 150 150 
##$DBP07= 0
##$DBPNAM0= <>
##$DBPNAM1= <>
##$DBPNAM2= <>
$$ [...]
##$SUBNAM3= <"">
##$SUBNAM4= <"">
##$SUBNAM5= <"">
##$SUBNAM6= <"">
##$SUBNAM7= <"">
##$SUBNAM8= <"">
##$SUBNAM9= <"">
##$SW= 501.771253377433
##$SWIBOX= (0..15)
0 1 3 0 0 0 0 0 0 0 0 0 0 0 0 0 
##$SW_h= 40650.406504065
##$TD= 32768
##$TD0= 1
##$TE= 0
##$TE2= 300
##$TE3= 300
##$TEG= 300
##$TL= (0..7)
0 120 53 12 22 120 120 120 
##$TP= (0..7)
150 150 150 150 150 150 150 150 
##$TP07= 0
##$TPNAME0= <>
##$TPNAME1= <>
##$TPNAME2= <>
##$TPNAME3= <>
##$TPNAME4= <>
##$TPNAME5= <>
##$TPNAME6= <>
##$TPNAME7= <>
##$TPOAL= (0..7)
0.5 0.5 0.5 0.5 0.5 0.5 0.5 0.5 
##$TPOFFS= (0..7)
0 0 0 0 0 0 0 0 
##$TUNHIN= 0
##$TUNHOUT= 0
##$TUNXOUT= 0
##$USERA1= <user>
##$USERA2= <user>
##$USERA3= <user>
##$USERA4= <user>
##$USERA5= <user>
##$V9= 5
##$VALIST= <valist>
##$VCLIST= <CCCCCCCCCCCCCCC>
##$VD= 0
##$VDLIST= <DDDDDDDDDDDDDDD>
##$VPLIST= <PPPPPPPPPPPPPPP>
##$VTLIST= <TTTTTTTTTTTTTTT>
##$WBST= 1024
##$WBSW= 4
##$XGAIN= (0..3)
0 0 0 0 
##$XL= 0
##$YL= 0
##$YMAX_a= 15468
##$YMIN_a= -26798
##$ZGOPTNS= <>
##$ZL1= 120
##$ZL2= 120
##$ZL3= 120
##$ZL4= 120
##$ABSF1= 248.5645
##$ABSF2= -253.2056
##$ABSG= 5
##$ABSL= 3
##$ALPHA= 0
##$AQORDER= 0
##$ASSFAC= 0
##$ASSFACI= 0
##$ASSFACX= 0
##$ASSWID= 0
##$AUNMP= <proc_1d>
##$AZFE= 0.1
##$AZFW= 0.5
##$BCFW= 0
##$BC_mod= 2
##$BYTORDP= 0
##$COROFFS= 0
##$CY= -3
##$DATMOD= 1
##$DC= 0
##$DFILT= <>
##$DTYPP= 0
##$F1P= 0
##$F2P= 0
##$FCOR= 1
##$FTSIZE= 65536
##$FT_mod= 6
##$GAMMA= 0
##$GB= 0
##$INTBC= 1
##$INTSCL= 5.30512e-09
##$ISEN= 30
##$LB= 1
##$LEV0= 0
##$LPBIN= 0
##$MAXI= 10000
##$MC2= 0
##$MEAN= 0
##$ME_mod= 0
##$MI= 50
##$NCOEF= 0
##$NC_proc= -5
##$NLEV= 6
##$NOISF1= 182.463
##$NOISF2= 159.3651
##$NSP= 0
##$NTH_PI= 0
##$NZP= 0
##$OFFSET= 248.5645
##$PC= 4
##$PHC0= -2717.472
##$PHC1= 92.19923
##$PH_mod= 1
##$PKNL= yes
##$PPARMOD= 0
##$PSCAL= 0
##$PSIGN= 0
##$REVERSE= no
##$SF= 81.0140089999434
##$SI= 65536
##$SIGF1= 159.3651
##$SIGF2= -187.1042
##$SINO= 113.3802
##$SIOLD= 16384
##$SREGLST= <1H.CDCl3>
##$SSB= 0
##$STSI= 65536
##$STSR= 0
##$SW_p= 40650.406504065
##$SYMM= 0
##$S_DEV= 0
##$TDeff= 32768
##$TDoff= 0
##$TI= <>
##$TILT= no
##$TM1= 0
##$TM2= 0
##$TOPLEV= 0
##$USERP1= <user>
##$USERP2= <user>
##$USERP3= <user>
##$USERP4= <user>
##$USERP5= <user>
##$WDW= 1
##$XDIM= 65536
##$YMAX_p= 457889229
##$YMIN_p= -128122431
$$ End of Bruker specific parameters
$$ ---------------------------------
##NTUPLES= NMR SPECTRUM
##VAR_NAME=  FREQUENCY,     SPECTRUM/REAL,   SPECTRUM/IMAG
##SYMBOL=    X,             R,               I
##VAR_TYPE=  INDEPENDENT,   DEPENDENT,       DEPENDENT
##VAR_FORM=  AFFN,          ASDF,            ASDF
##VAR_DIM=   65536,         65536,           65536
##UNITS=     HZ,            ARBITRARY UNITS, ARBITRARY UNITS
##FACTOR=    0.620285442955139, 1,           1
##FIRST=     20137.2065510618, 0,            0
##LAST=      -20513.1999530032, 0,           0
##MIN=       -20513.1999530032, -128122431,  0
##MAX=       20137.2065510618, 457889229,    0
$$ Real data points
##PAGE= N=1
##DATA TABLE= (X++(R..R)), XYDATA
$$ [...]
59768a423349k37012P5691P2215l98037p80221o65137k77415J43333O79438J169562
59758a640932J139637O57545L99917M82996K07088n34331p35700L1886N62026
59749E70132k21318j416341j427124l41340M67564N36827M75898L17328m56740
59740a495114j267111p27521J005306J932493R97102l68829m23671M75996P78577
59731I07228K7474r54231j453661j317979n46247N33642J089932P13193J38040
59722h62609K05804N87716M78128M7815N0867L52342J68260l71585l16801L44815
59712F84752M94151j70559m99902O2461L07568o52836j445820l44309J702514
59703A38020K066145L16033j115023o44687K47328k83744j446425j372581l05927
$$ y = [-1423349, -1660361, -1584670, -1512455, -1910492, -2690713, -3355850, -3633265, -3489932, -2810494, -1640932, -501295, 156250, 556167, 1039163, 1246251, 711920, -23780, 8106, 570132, 348814, -1067527, -2494651, -2835991, -2368427, -1831600, -1355702, -1038374, -1495114, -2762225, -3489746, -2484440, -551947, 445155, 76326, -347345, 128651, 907228, 934702, -19529, -1473190, -2791169, -3337416, -2803774, -1713842, -1000649, -862609, -656805, -69089, 409039, 456854, 507721, 860063, 1028323, 656738, 339937, 684752, 1178903, 1008344, 508442, 570903, 878471, 225635, -1220185, -1564494, 138020, 2204165, 2520198, 1405175, 760488, 1007816, 724072, -722353, -2094934, -2400861]
59694b400861P7840k17645L28277J572538J459601l38833j215590M25986K309019
59685B000332J531238j019927k082683q38436M56898L38183j33573J29748M91366
59676H73146K33403m1386K60348N59108L10610J8117P1645r5545o92418p60137
59666G36891J74575R29722M51553m58359o49542o34091j319936j814323p01851
59657c285361J103051J238972l80474j184055J35219J612822J121170m29653p48025
59648h16334K41068N39479n68803j347105l05104J472594J828574N60614m30919
59639A174064L4907Q11839L00834j119417j734702j019506q1720L09763N83390
59630g40548R55111P78496J2393k32108L41762K49331j316190k500634j254912
$$ y = [-2400861, -2323021, -2540666, -2212389, -639851, 819750, 480917, -734673, -308687, 2000332, 3531570, 2511643, 428960, -409476, 47422, 385605, 252032, 381780, 873146, 1106549, 1065163, 1325511, 1884619, 2195229, 2213346, 2284991, 2189446, 1497028, 736891, 911466, 1841188, 2292741, 1834382, 1184840, 550749, -769187, -2583510, -3285361, -2182310, -943338, -1323812, -2507867, -2372648, -759826, 361344, -68309, -816334, -575266, -35787, -604590, -1951695, -2256799, -784205, 1044369, 1604983, 1174064, 1208971, 2020810, 2321644, 1202227, -532475, -1551981, -1633701, -1323938, -740548, 214563, 993059, 1005452, 773344, 1115106, 1364437, 48247, -2452387, -3707299]
59621c707299J250199K006043M69495r36832o16582L18280M38999M6387p8027
59612h09337j02354k29463J22121J068648J451729M46636j022320j561607j164460
59603a800407p79791p47747o40530j68305N13046J021307Q80355r516q34223o17802
59593c183613L29708P61336M28075L07322O35134L88944o69340j237737o74600
59584b914771j28795l23997j44939J053016J702581O13168n02882L99899K035225
59575A788505J580244p53522k002187j004501L06076L46684j57836k16047r0208
59566b02792k6080L70556P47988L9077j394780j693368l84723P08280L80606k31436
59556a686672K4735M09299J76611K94978J395389J838724J38603k048262j911472
$$ y = [-3707299, -2457100, -451057, 18438, -918394, -1534976, -1216696, -777697, -731310, -809337, -911691, -1141154, -1019033, 49615, 1501344, 1947980, 925660, -635947, -1800407, -2580198, -3327945, -3968475, -4136780, -3623734, -2602427, -1722072, -1731588, -2565811, -3183613, -2853905, -2092569, -1664494, -1357172, -722038, -333094, -1002434, -2240171, -2914771, -3043566, -3367563, -3512502, -2459486, -756905, -143737, -646619, -246720, 1788505, 3368749, 2615227, 613040, -391461, -85385, 261299, 103463, -112584, -202792, -228872, 141684, 889672, 928749, -466031, -2159399, -2544122, -1835842, -1455236, -1686672, -1661937, -1252638, -1076027, -781049, 614340, 2453064, 2591667, 543405, -1368067]
59547a368067K88472J531410L88271j293932j369457o7136R77727Q88329n41q51046
59537h75970q93208J250R65623R71032J37941m72659l96739k17470l36383k75674
59527a392257L54800J010886R60405L55322o3853n8176j30370o99600j387321
59518a050164j287233J2927J695570K277388J204497l55763q05070l6733O06112
59509B261531K90596k84262k19901J27599r7637o48010n50743N7160j16195j308993
59499d88855j850336n54469J146300J036374n34155j057520L67683J734150J281000
59490A080172K6429j82083L89368J44525j083505j933051j690262q43135K16161
59481c875381J331950J643650L69361j358628j297403Q14915K627338K243895
$$ y = [-1368067, -1079595, 451815, 840086, -453846, -1823303, -1890439, -912712, -24383, -24924, -875970, -1769178, -1767928, -802305, 168727, 306668, -165991, -562730, -780200, -1116583, -1392257, -1037457, -26571, 933834, 1289156, 1225303, 1167127, 1036757, 337157, -1050164, -2337397, -2324470, -628900, 1648488, 2852985, 2497222, 1692152, 1655419, 2261531, 2552127, 2267865, 2047964, 2175563, 2077926, 1429916, 879173, 936333, 820138, -488855, -2339191, -2893660, -1747360, -710986, -1245141, -2302661, -1934978, -200828, 1080172, 1106601, 924518, 1313886, 1458411, 374906, -1558145, -3248407, -4091542, -3875381, -2543431, -899781, -530420, -1889048, -3186451, -2371536, 255802, 2499697]
59473B499697M25963r63527j285527j009351m98892N3450L06980K14424J62793
59464i3990K23816M6565k29934j1895M95731L38258m50046n75012M17680J251637
59454A412810R51038K65549O1523j97974j107434j847915j501169o38424j59711
59445b761707K69862J086713J342831J78448j210962j067517J69248N84937k14365
59436a622512q02431l59808M67956J014611J189040P63727k77478q62056k0876
59427e09827J204080Q85797q03629j696859q84572J51106J10742l59932k32701
59418b135795K93086O62050J000839J332145R91249j95436j175364j061027m34917
59409g23170m03990j007108j329770p50245M63409J440966J376422L75182l67712
$$ y = [2499697, 2925660, 1962133, 676606, -332745, -831637, -778187, -471207, -256783, -93990, 129826, 176391, -53543, -65438, 430293, 768551, 318505, -256507, 161173, 1412810, 2363848, 2629397, 2690920, 2492946, 1385512, -462403, -1963572, -2601996, -2761707, -2491845, -1405132, -62301, 116147, -1094815, -2162332, -1993084, -1408147, -1622512, -2424943, -2784751, -2316795, -1302184, -113144, 650583, 373105, -488951, -509827, 694253, 1580050, 776421, -920438, -1805010, -1653904, -1543162, -1903094, -2135795, -1842709, -1180659, -179820, 1152325, 2143574, 1948138, 772774, -288253, -723170, -1127160, -2134268, -3464038, -4214283, -3750874, -2309908, -933486, -558304, -926016]
59400i26016R5300J071156J095831Q0457o14037l10086J46947J5630k46082j02899
59390C06201O9407j39754l32776r1318K48246K84967K38020L36587K86762q4071
59380A122271l82146l50196k74538k61994M8159N90811O14823j06977o88294l90471
59370g8552L30981O68113N62005L29139k9500m59602n07471l4397L39288J05781
59360A225785m07932o63098n67130j15447P23632J273760M01281j674847k844215
59351b648211j489712J275870K847455K130042L38297p91591o33657K35999P52140
59342B016632K65302p49166j109907l79119N89922Q90311O44308L64841N3084
59333B586208l59904m49760m8365J16193n05174j135299o66039N83769J200417
$$ y = [-926016, -830716, 240440, 1336271, 1416728, 802691, 492605, 639552, 655182, 409100, 306201, 375608, 235854, -96922, -188240, 60006, 344973, 582993, 919580, 1206342, 1122271, 740125, 389929, 115391, -146603, -98444, 492367, 1107190, 1000213, 311919, -78552, 252429, 920542, 1482547, 1811686, 1782186, 1322584, 815113, 780716, 1120004, 1225785, 817853, 154755, -412375, -527822, 195810, 1469570, 1870851, 196004, -2648211, -4137923, -2862053, -14598, 2115444, 2453741, 1662150, 1028493, 1264492, 2016632, 2281934, 1532768, 422861, 43742, 633664, 1523975, 2168283, 2533124, 2586208, 2226304, 1776544, 1728179, 1844372, 1339198, 203899, -462140, 121629, 1322046]
59324A322046O06115l38820o62452l43995P7683K61763J83044q6731m56458p66514
59314b04319p51738k12951N79859R17344N34875J32614K87681K86825p38032j808296
59304i76138j007409J360304K520863J036824j018106j076156L66272R85895J64379
59295B356728p56517r69664q92435p20069j88255L14440P9574m87818l14553M79087
59285a099482P21441K35994R5113N74747N47023m75987j219563n20466Q00472
59276c40708J025070j43337j294236j069283M31895J882672K024230Q35123m97495
59267B853931r20291o39679n12715o33055l40764L96743O03938k83992j364127
59258h40011j276940P1255J380514J481966N65502k28878k02539J94249J03924
$$ y = [1322046, 1928161, 1589341, 926889, 582894, 660577, 922340, 1105384, 1018653, 562195, -204319, -956057, -1169008, -589149, 328195, 863070, 995684, 1283365, 1570190, 832158, -976138, -1983547, -623243, 1897620, 2934444, 1916338, 840182, 1206454, 2192349, 2356728, 1600211, 630547, -261888, -981957, -1170212, -855772, -776198, -1264016, -1578569, -1099482, -378041, -142047, -46934, 527813, 1074836, 598849, -620714, -1141180, -340708, 684362, 541025, -753211, -1822494, -1390599, 492073, 2516303, 3351426, 2853931, 1933640, 1293961, 781246, 148191, -192573, 204170, 808108, 524116, -840011, -2116951, -2045696, -665182, 816784, 1382286, 1153408, 950869, 1145118, 1249042]
59249A249042n53776r86211n77503L44165R02378N88085k68486p61185k78821
59240c42312O65034Q54900K0208o22303k70123o0558j176568k216180p99605K303551
59230a643956L443423J249410j261149j196837K40507M40477l45536k62402L79318
59221A043255j37807j384926j293517J22450O83931k19734p65469J2530Q42876
59212a096411Q28885Q33064J291657J074592k49470j193499p96392l09305q61344
59203d78223j268431j16289J412256J085037p51185j415544K14764K082536J883878
59194B648799J17266r41286m78060R2260l89750j039617n42239N19456N52139
59185E38968l39237n74387n6414m20351j607611j083025J780721L436228J123660
$$ y = [1249042, 695266, -290945, -868448, -524283, 378095, 966180, 697694, -63491, -342312, 322722, 1177622, 1197830, 575527, 305404, 244846, -931722, -3147902, -3947507, -1643956, 1799467, 3048877, 1787728, 590891, 831398, 1271875, 926339, 663937, 1043255, 905448, -479478, -1772995, -1650545, -966614, -1186348, -1951817, -1939287, -1096411, -267526, 565538, 1857195, 2931787, 2682317, 1488818, 692426, 383121, -478223, -1746654, -1862943, -450687, 634350, -116835, -1532379, -1317615, 764921, 2648799, 2766065, 1824779, 1346719, 1438979, 1049229, 9612, -532627, -13171, 538968, 199731, -374656, -431070, -851421, -2459032, -3542057, -1761336, 1674892, 2798552]
59176B798552k350965k499895L3461R92489k46513j39250K142258K756513j76737
59167C309913k916331j880884Q95157J424863k29793j192580o81099r6697J62168
59158a205283O15255O13825n57457j441960k39269J874435K139113M05875q57055
59149A347479m70218K36390R7412m68924r08854j232306j052572J19130J444025
59140h88438J442951K55163n07721k32963R7244j21440k70305J26478O93187J037585
59130A631741J010257K64190j070437j640061m56178J151541J081766l57190r89794
59121F25835l27653q0830q91689j214848k15102P31594N78576L62958R85960J291929
59111A846730J32573j276815j018786N75380J468897P75349m95527j166739j069407
$$ y = [2798552, 447587, -2052308, -2018847, -1026358, -1272871, -1412121, 730137, 3486650, 3309913, 393582, -1487302, -592145, 832718, 602925, -589655, -1270754, -1367451, -1205283, -590028, 23797, -533660, -1975620, -2214889, -340454, 1798659, 2204534, 1347479, 877261, 1113651, 1211063, 742139, -166715, -1399021, -2451593, -2332463, -888438, 554513, 809676, 301955, 68992, 166236, 44796, -225509, -99031, 594156, 1631741, 2641998, 2906188, 1835751, 195690, -260488, 891053, 1972819, 1615629, 625835, 298182, 217352, -674337, -1889185, -2104287, -1372693, -794117, -431159, 554801, 1846730, 1979303, 702488, -316298, 259082, 1727979, 2503328, 2007801, 841062, -228345]
59102b28345o56484l69950l18568j57582L97290Q55079N18396j98107k18723K50167
59092a26827j79656j529846j877861l46795J206979R87554p131L8799N92694j9061
59082a261151j312624j266925K01005J086864O77787M45857J063710J089227k82089
59073D41661j373066n21706J183139J415216j30974j615877j613025m06882R02260
59064a719254J393476O64226p68763j542076q07769O14488J229610P70026K25317
59055E9281J88273K34037q867k20962j32729l6453j49094j78636K0745j6359o26726
59044h67490j265459j091961j12882P34595O32128k03569o72896M4866J330066
59035a472602J496776q3241j629529q69527J720233L077736J505302j070891j872158
$$ y = [-228345, -884829, -1254779, -1573347, -1730929, -1333639, -478560, 39836, -158271, -376994, -126827, -306483, -1836329, -3714190, -4060985, -2854006, -1866452, -1873583, -1834784, -1242090, -1261151, -2573775, -3840700, -3639695, -2552831, -1875044, -1429187, -365477, 723750, 441661, -931405, -1453111, -269972, 1145244, 1014270, -601607, -2214632, -2621514, -1719254, -325778, 338448, -430315, -1972391, -2780160, -2165672, -936062, -166036, 59281, 247554, 481591, 472724, 251762, 119033, 82580, -66514, -245150, -224405, -240764, -867490, -2132949, -3224910, -3337792, -2603197, -1971069, -2174638, -2847534, -2802668, -1472602, 24174, -59067, -1688596, -2558123, -837890, 2239846, 3745148, 2674257, 802099]
59026H02099q96571j70210m46526p10811m83789m36895o49365k83587O30498R57599
59016a687558M98801M12223R66037Q55253l09635r02152k6835O53660l27817j503061
59006a371084q19487P46486P11749p06392r83057L81020J104242J55229n47736
58997a329030L51496J197308K37735j188941p35109J058604J481863k07886j708853
58988h42813j043696Q17505J529768M45450q96871r39821J31781R72830Q56555
58979A030688K80299j14743m43443r56240j217502p37681L1679L17066K93323
58970a516554O06083R22698L73283o53654q01563l1789J69787o13864q42177L42950
58960b044800J482240J180651M01169O26419J193294N42777r47707j612252j253388
$$ y = [802099, -94472, -264682, -711208, -1422019, -1905808, -2342703, -2992068, -3275655, -2645157, -1687558, -1188757, -776534, 189503, 1044756, 735121, -167031, -193866, 459794, 131977, -1371084, -2190571, -1444085, -732336, -1438728, -2421785, -2040765, -936523, -781294, -1329030, -977534, 219774, 457509, -731432, -1466541, -407937, 1073926, 866040, -842813, -1886509, -1069004, 460764, 906214, 9343, -930478, -798697, 174133, 1030688, 1310987, 1196244, 752801, -203439, -1420941, -2158622, -2126943, -1809877, -1516554, -910471, 12227, 385510, -268144, -1069707, -1101496, -931709, -1545573, -2387750, -2044800, -562560, 618091, 1019260, 1645679, 2838973, 3381750, 2434043, 821791, -431597]
58951d31597r82239p92066K86873J720298J644163j08235j399966q60723M18027
58942e05465R53381P22103J55006p79818j480860o15155J573827K614719J033299
58933C671037j277885j633193k00584P98357M78190j60309l94485m70880m38582
58924C71666p9831J71954j87021n01942J23120J024304Q14254k65487o98443k34669
58914E37905o1552m39581l49881K58951J85116n37724k86923J122455J544558
58905A973324L801j322649n06623R14504M99984j056058j218234J87816R83779
58896D59644L52773k85366j44309j88943q88538j123658j54251J083590J454149
58887E65091J005092K78998m57683q17398m11148K03275l0668r18943j086854
$$ y = [-431597, -1413836, -2205902, -1919029, -198731, 1445432, 1337197, -62769, -923492, -505465, 447916, 1170019, 1325025, 545207, -935653, -1550808, 23019, 2637738, 3671037, 2393152, 759959, 559375, 1357732, 1835922, 1675613, 1281128, 810248, 371666, 291835, 463789, 276768, -225174, -102054, 922250, 1736504, 1471017, 772574, 537905, 476353, 36772, -313109, -54158, 130958, -406766, -693689, 428766, 1973324, 1977125, 654476, 147853, 1062357, 1562341, 506283, -711951, -524135, 459644, 812417, 527051, 382742, 193799, -694739, -1818397, -1972648, -889058, 565091, 1570183, 1849181, 1391498, 574100, 162952, 366227, 335559, -583384, -1670238]
58878a670238j55526O52892N46282K03335J84254j2416m82962k20885J014243
58869E8979J733149R28945k05018k19165K82835p3809j004422j226280o68506
58860c93292k02504J28060P64087J095158K18133j101386j200812j58873L04097
58851e47332l05092m91344N92399J607109J093887l19163r09811j97178P16779
58842A240254O77693l41785j325713j156310K13323J458391J231419k11114j339631
58833D46527j237254l92838L48830P08083P07782L99578J25765K86030O12880
58824B005383M07625l45128q77459p79299l88311O3743O69486R96104K24825j312316
58814F64653j884192n21240J432438J908864O93396n60701n90201J29850L33890
$$ y = [-1670238, -1825764, -1172872, -626590, -423255, -239001, -251417, -734379, -955264, 58979, 1792128, 2721073, 2516055, 2296890, 2579725, 2505916, 1501494, 275214, -393292, -595796, -467736, 296351, 1391509, 1609642, 508256, -692556, -851429, -547332, -852424, -1343768, -751369, 855740, 1949627, 1630464, 720653, 523475, 1240254, 1917947, 1576162, 250449, -905861, -692538, 765853, 1997272, 1786158, 446527, -790727, -1183565, -834735, -126652, 581130, 980708, 1106473, 1392503, 2005383, 2413008, 2067880, 1190421, 411122, 22811, 86554, 756040, 1752144, 1976969, 664653, -1219539, -1740779, -308341, 1600523, 2293919, 1733218, 1143017, 1272867, 1606757]
58805A606757l94926j228369j183061l83038Q8067k67510n56578J14417J033964
58796a170277Q46835j83123m12925N34252J057357J46837r71386q44636l7674
58787a034740M2052n22478n93859j0823M42348O09952Q79625Q42873k22206j566572
58777a133828j464426J69094J348335Q45658j23947P28P59461P47374K9243j47012
58767A030680M31950O47450j7733p04902o93044m43959n34086n71730J1131Q45673
58757A430J180061R73914N61239k04207j360722j865512o65696J328784J928764
58748A878055O49433n93907m29139M8956m88176j081361j38561J461647J311828
58739B618775p37153k100162j194750M37573O58850l25582q22851k58626M73369
$$ y = [1606757, 1211831, -16538, -1199599, -1582637, -1494570, -1762080, -2318658, -2204241, -1170277, -323442, -506565, -919490, -385238, 672119, 818956, -152430, -997066, -1034740, -992688, -1515166, -2109025, -2119848, -1677500, -1067548, -187923, 654950, 432744, -1133828, -2598254, -2429160, -1080825, -235167, -359114, -358386, 401075, 1148449, 1177692, 1030680, 1462630, 2110080, 2092347, 1387445, 694401, 250442, -283644, -855374, -844243, 1430, 1181491, 2155405, 2716644, 2512437, 1151715, -713797, -1379493, -50709, 1878055, 2527488, 1933581, 1504442, 1553398, 1065222, -16139, -154700, 1306947, 2618775, 1881622, -218540, -1413290, -975717, -316867, -642449, -1465300, -1723926, -1250557]
58730a250557O59560N35326N62025P63097Q15967M47603j88737n03398j67477
58721A673409K93287J79177k88755l92681k45993n36386r94768n76459N92430
58712b96739J048649K93360l98739k22093j07706o55782o84720N32368J325792
58703H34390Q5621j691168j360226O79746J514100K18740r38035k37468J072231
58694A77931J078660q6327j018803j011375j89085J015449J574170L83266j870331
58685E3555k681083q64283J456177J560683j29302r26236N4924R35474M09561
58676a30530k00691N84764J599797O69662j695221k505401n26078J741186J517265
58667A054753l90875j067369J22245J026447M86187k8943N81391R09012l73168
$$ y = [-1250557, -590997, -55671, 506354, 1269451, 2085418, 2533021, 2344284, 1840886, 1673409, 1966696, 2145873, 1857118, 1464437, 1218444, 682058, -312710, -889169, -296739, 751910, 1045270, 646531, 424438, 316732, -339050, -1023770, -491402, 834390, 920011, -771157, -2131383, -1451637, 62463, 281203, -656832, -894300, 177931, 1256591, 1170264, 151461, -859914, -1048999, -33550, 1540620, 1923886, 53555, -2627528, -3491811, -2035634, -474951, -604253, -1530489, -1475565, -540091, -130530, -331221, 253543, 1853340, 2523002, 827781, -1677620, -2203698, -462512, 1054753, 663878, -403491, -281246, 745201, 1231388, 1202445, 1783836, 2692848, 2319680]
58658B319680j787326j260940K99589L36472j145719j537630J74876J889511J706046
58649I94559L95708m42000o69698q23364o68890R3985Q40525Q78498L96236j99812
58639G95747q33640j060801k00934J117233J137983l37728j165725j3276J462624
58630I01483J216088j00292o46318m75993p43658j036713j66237J134274J047206
58621A129840j68549n66057J05506K03719n30020m58676O57384Q43981n83712
58612F33416j525947n37039Q17196P53708O1838J17540K56331n82464j399641
58603a405062q03261L26829L64561j39275K86281R60226J81070j323129j261152
58594b812912J76628M44035r27005j354523M12721K056163J361944m71733j061794
$$ y = [2319680, 532354, -728586, -428997, -92525, -1238244, -2775874, -2600998, -711487, 994559, 1390267, 948267, 278569, -544795, -1213685, -1119700, -279175, 599323, 995559, 795747, -37893, -1098694, -1299628, -182395, 955588, 617860, -547865, -561141, 901483, 2117571, 2017279, 1370961, 894968, 151310, -885403, -1051640, 82634, 1129840, 961291, 395234, 500740, 704459, 174439, -284237, 373147, 1217128, 633416, -892531, -1429570, -612374, 141334, 203172, 320712, 577043, -5421, -1405062, -2208323, -1881494, -1516933, -1656208, -1369927, -409701, -228631, -1551760, -2812912, -2636284, -2192249, -3119254, -4473777, -4061056, -2004893, -642949, -1114682, -2176476]
58585b176476l06901L33215M13060M09135K51094k74386n62118j18383M16195
58576a615565M05243L18122N12076K52216o60247q04820N43906J558359N19955
58567A029245j063991o76592R61432R75909q63580j797575o64030N23909L28106
58558a247167J3377O50257J021352J52762o06437l0235O70485J48819m70790K56833
58548E59256J092687J03263j640100j500446K72876Q19735o18545j524948l40321
58539b776543J142489R53393n3666j68981K65315L2202m20679K5233O27944k16796
58529e90089j830722j710982N52856K272039J509321k32342o35422o505k9458
58520g01304m62875K79046J802548J860441J22374r42185K3764J021938K5500
$$ y = [-2176476, -2483377, -2150162, -1737102, -1327967, -1076873, -1351259, -1913377, -2031760, -1615565, -1210322, -892200, -380124, -127908, -788155, -1592975, -1049069, 509290, 1029245, -34746, -711338, 250094, 1226003, 362423, -1435152, -2099182, -1575273, -1247167, -1233790, -583533, 437819, 590581, -15856, -46091, 624394, 773213, 302423, 559256, 1651943, 1755206, 115106, -1385340, -1112464, -292729, -911274, -2436222, -2776543, -1634054, -680661, -734327, -903308, -637993, -605791, -1026470, -1001237, -373293, -590089, -2420811, -4131793, -3578937, -1306898, 202423, -29919, -665341, -671846, -701304, -1164179, -885133, 917415, 2777856, 2900230, 1958045, 1981809, 3003747, 3029247]
58511C029247j684031j730526m38255J78021p2032J07775N26506m5172r04577
58502a033044j95562J353840J010586j122406j615047O81387K351052Q41279j412031
58493H60054j177459L96861L76910p17673m00240P93615K72326j502806j410203
58484b508615Q03769J750149l4859j725665q65595J033948J421476M32114l48669
58475d1947o11401p77077m84295M58148R66282J98338r45393j183079n87802J45605
58465b862621Q79882J393153R68075k19369p43265j06383L33308j59100k15250
58456g31570R82489J617743J22707j632767r00563J423337K005419K05144j275613
58447A816326r12934k89249p63680j179139l00221Q18165O46944l19379o42338
$$ y = [3029247, 1345216, -385310, -823565, -645544, -717576, -609801, -83295, -128467, -1033044, -1228606, 125234, 1135820, 13414, -1601633, -920246, 1430806, 2272085, 860054, -317405, 79456, 456366, -261307, -661547, 132068, 404394, -1098412, -2508615, -1704846, 45303, 10444, -1715221, -2580816, -1546868, -125392, 306722, -41947, -653348, -1430425, -1914720, -1456572, -490290, -291952, -1237345, -2420424, -3008226, -2862621, -1982739, -589586, 378489, 159120, -584145, -690528, -357220, -516320, -731570, 250919, 1868662, 1991369, 358602, -541961, 881376, 2886795, 3091939, 1816326, 903392, 614143, -149537, -1328676, -1628897, -810732, -163788, -483167, -1125505]
58438a125505l18858l60239p64045n56720M35390J236169J177178P11517O12620
58429A047507J011702J391180J175455K94989o40900q63655l10463K53447J60287
58420C519549l97665p61266o56087l37960j18757r4634k35373m38871m97928k08979
58410b27971M20696J097698J381824R94812J15204p04606j059258j027786q31437
58401A59176l84730M23028J137864J013194K1000r16791j024910n94051l60717
58392e26937l09200J94364J090587J310307K74431r48842q91317J94432N95113
58383I82938l35280j159617n47713O63222P74899k14397q29973m66797R0104L79360
58373f63254P93234J169118N88832q27274j557584r34010k14589m06651o03253
$$ y = [-1125505, -1444363, -1804602, -2568647, -3125367, -2689977, -1453808, -276630, 434887, 1047507, 2059209, 3450389, 4625844, 4920833, 4279933, 3416278, 3105815, 3359262, 3519549, 3121884, 2360618, 1704531, 1366571, 1247814, 1153180, 917807, 478936, -18992, -227971, 192725, 1290423, 2672247, 3667059, 3782263, 3077657, 2018399, 990613, 159176, -225554, 197474, 1335338, 2348532, 2369532, 1452741, 427831, -166220, -526937, -836137, -641773, 448814, 1759121, 2033552, 1084710, 193393, 387825, 982938, 647658, -511959, -1059672, -396450, 378449, 164052, -665921, -1132718, -1042614, -663254, 129980, 1299098, 1887930, 1060656, -496928, -1430938, -1645527, -2052178, -2655431]
58364b655431J55791Q69696K37486q15041l96143J188729J719311L97339j104248
58355d02511j178177j50876P96809J097352O88659k92798j167618j082136j62214
58346a853510N64272O16277M78065M38090J54257l44969m09274M0766J71264l88384
58336e33146q41768m76176L03371P75635Q82320Q13900M22515l16018r10490r60972
58326h40829n86688N5080R17461J465983R37605l34737r13142k23035N05567Q3635
58316A066900q46441r21514j65619K33619j81213o25073l43650M71411J057182
58307b54398Q54381J2730o00112k43660O46721Q78993K11309k67013Q9763M41772
58297A770486R300m66708k6910O52424K20279j051537j508492n38094O49725P99988
$$ y = [-2655431, -2499640, -1629944, -1392458, -2207499, -2603642, -1414913, 304398, 701737, -402511, -1580688, -1731564, -934755, 162597, 851256, 558458, -609160, -1691296, -1853510, -1289238, -672961, -194896, 243194, 397451, 52482, -356792, -316026, -144762, -533146, -1374914, -1851090, -1547719, -772084, 110236, 924136, 1346651, 1030633, 120143, -840829, -1427517, -1372437, -454976, 1011007, 1948612, 1613875, 700733, 477698, 983265, 1066900, 220459, -701055, -866674, -633055, -814268, -1439341, -1782991, -1311580, -254398, 599983, 612713, 12601, -231059, 415662, 1294655, 1505964, 1238951, 1328714, 1770486, 1779786, 1313078, 1286168, 1938592, 2158871, 1107334, -401158, -939252, -289527, 510461]
58287E10461L5058o90217o61560J69967J092684J045462j26109j088391o00503
58278c13148O83456J158466O86684N51574J017688P09373j000869k571939k298543
58269a377258o43514N29245L35348n10560r50808n54553M51284J357321J371094
58260G599M20450o13117q59869l77889K11598N23583L98961l22312j305563j466342
58250c382901j48076J620012K020369P11997p14867q80249l26775l99691j089593
58241b589774j088708J10889J320693J307475M53457p202K05707L69731J77017
58232B59285M4058L3581l13617q25318o24681K96059O98836M5094m82106L5687
58222h33122N49072j73002j181665p21333P59437J184701J89469m29137J92414
$$ y = [510461, 545519, -144698, -806258, -636291, 456393, 1501855, 1375746, 287355, -313148, 370308, 1528774, 2215458, 2767032, 3784720, 4494093, 3493224, 921285, -1377258, -2020772, -1491527, -1156179, -1666739, -2617547, -3172100, -2720816, -1363495, 7599, 428049, -185068, -1044937, -1422826, -1211228, -687645, -288684, -610996, -1916559, -3382901, -3530977, -1910965, 109404, 821401, 106534, -773715, -1100490, -1500181, -2589774, -3678482, -3567593, -2246900, -939425, -485968, -493170, -287463, 82268, 259285, 303343, 336924, 23307, -802011, -1426692, -1130633, -431797, -386703, -868809, -833122, -284050, -457052, -1638717, -2360050, -1600613, -415912, -226443, -655580, -463166]
58213d63166P41001K52241k80390Q7206N08838K95o88703l98995L91148M09088
58203E58563l33017p67168n24703j78005j15782k11170k53332L0193Q09052J419475
58193D34106P67626p72407j141922N31867K170578J497813n81627j387607m53407
58184A065020K06147m61283j184108p47254K88124Q43403P28671K44082l21345
58175F61457m32093K12365P65597J59303r81419r54398K99512R22621N4848q90942
58165a83149o66279l6323o9871k74593J59018O57967L61844j69928Q0985P28944
58155E88615O09527k74052q16234m80423K44734P62916P99985K73358m63613p10076
58145E34737m35598m98988j104705j044018L99462J785846J289657n43604j477865
$$ y = [-463166, 277835, 530076, 249686, 336892, 845730, 846025, 157322, -241673, 149475, 558563, 225546, -541622, -1066325, -1244330, -1360112, -1571282, -1824614, -1794421, -985369, 434106, 1201732, 429325, -712597, -180730, 1989848, 3487661, 2906034, 1518427, 1065020, 1271167, 809884, -374224, -1121478, -833354, 10049, 738720, 982802, 661457, 229364, 441729, 1207326, 1366629, 385210, -569188, -269676, 652945, 707793, -183149, -849428, -885751, -955622, -1230215, -1071197, -413230, -51386, -221314, -140329, 588615, 1198142, 924090, 107856, -372567, -127833, 635083, 1435068, 1708426, 1244813, 534737, 99139, -399849, -1504554, -2548572, -2149110, -363264, 926393, 382789, -1095076]
58136a095076o68604N75863R86382O76861J78749l64093o66713k27671P16296
58127A11994J098041L29574r68452j775902j602726n67255P59071J532451J297770
58118B14566M79710k54802p99631j156352p78804N64372J742536J419482N7600
58109A488677o18327j07501L79563N0100l96146k69484m6558l09813o60328m76593
58099i66410O3223L85226L14689N752l45350m61916k79429l09535r00879j252208
58089c746837l39440J174631J442939J60698p97283j06378J185180J465321P38924
58080A177755j24211r71140j794112j696772q9554J755994J976702O30909m91493
58071C74078m06894R2487Q2075j67241K2950M76705L64492n31101j200904m14976
$$ y = [-1095076, -1763680, -1187817, -201435, 475426, 654175, 290082, -376631, -604302, 111994, 1210035, 1539609, 571157, -1204745, -2807471, -3374726, -2615655, -1083204, 214566, 694276, 439474, -360157, -1516509, -2295313, -1730941, 11595, 1431077, 1488677, 870350, 762849, 1142412, 1192512, 796366, 526882, 480324, 170511, -489817, -966410, -903187, -517961, -203272, -197520, -542870, -1004786, -1284215, -1593750, -2494629, -3746837, -4086277, -2911646, -1468707, -1308009, -2105292, -2211670, -1026490, 438831, 1177755, 1053544, 82404, -1711708, -3408480, -3498034, -1742040, 234662, 865571, 374078, -32816, 59671, 141746, -25495, -2545, 474160, 838652, 307551, -893353, -1308329]
58061a308329J521256K545426J155631j390205k429494j395183l27112n04999
58053b133009n63962Q43467K371209J925173N9039q17014m9687O21905m0076j228803
58043I88242j717305j365233n80536L65482J062307J113122Q43016Q35493P13808
58034B258396l64375j888539k154946o92258Q80953J102495M91771K71531M21342
58025C26370J41916n37489q49035o16549m22419n30211m95208N1355Q22785J247726
58015h60759J082801N44177J8543k82504m29095n43944n59931l66147j01401j7001
58005a515261o1865O8228L89419M60873j5569n99071m45084O13237J537622J121816
57995A554345l13537r38122K44854J726475J358425m75004j252298p7053R43877
$$ y = [-1308329, 212927, 2758353, 3913984, 2523779, 94285, -1300898, -1628010, -2133009, -2696971, -1853504, 517705, 2442878, 2501917, 1684903, 1635216, 2257121, 2217045, 988242, -729063, -2094296, -2674832, -2309350, -1247043, -133921, 709095, 1544588, 2258396, 1894021, 5482, -2149464, -2841722, -1960769, -858274, -366503, -94972, 326370, 468286, -69203, -918238, -1534787, -1957206, -2487417, -2982625, -2931270, -2108485, -860759, 222042, 766219, 784762, 502258, 73163, -470781, -1030712, -1396859, -1498260, -1515261, -1577126, -1508898, -1119479, -658606, -674175, -1273246, -1718330, -1105093, 432529, 1554345, 1240808, 302686, 547540, 2274015, 3632440, 3157436, 1905138, 1828085, 2771962]
57986B771962K5105j515042j450669j07673M99131P559j68779L58543L98997m59057
57976C60077j089328q62550n65911p20687o63530L3283P23214R30595J053070
57967h01767J208422P87833j62245n26265J15355O52480K39290l89062l47493
57958G76548o7550k32188m18676l6126L80328R0407m65537m54938j00068r7858
57948f25658k57567J72L43303N4905n42433n07190J17074L80827Q041k93805j30854
57937a453185O0881n3346k07124j90091k08142l17294j47188M94188J176579J277991
57927D33269O43361k64018p17776l33635M74021P90112J83840p62861j124119
57918f77806o46637J13829N09196M45856L50198N19703N75965n6032r96967j009731
$$ y = [2771962, 2797067, 1282025, -168644, -276317, 222814, 230373, 61594, 420137, 819134, 360077, -729251, -1591801, -2157712, -2878399, -3541929, -3508646, -2785432, -1854837, -801767, 406655, 1194488, 1032243, 505978, 621333, 1273813, 1513103, 1124041, 776548, 708998, 476810, 58134, 22008, 402336, 492743, 27206, -427732, -527800, -625658, -883225, -883053, -539750, -484845, -1027278, -1534468, -1417394, -1036567, -1028526, -1322331, -1453185, -1392304, -1445650, -1652774, -1842865, -2051007, -2368301, -2515489, -2021301, -844722, 433269, 1076630, 812612, 94836, -238799, 235222, 1025334, 1209174, 446313, -677806, -1324443, -1210614, -701418, -255562, 94636, 614339, 1190304, 1134272, 137305, -872426]
57908h72426J49919R08595P9712r86925k62598J519105J640519l54017j845550
57899b3666j254888k21081l31593m00158Q85385J982206R39972r00949p74716
57890i9488R90669J517517R713j293463r22333l3954Q7519j78923k86312n56346
57880g65401q52894k56302J035812J411112L87309m59525j55671Q9087o57894
57871b24367j013404L48377J900867J265645r17568j696457j99714J153976M02169
57862A019524j135957j042533O23301J604896P64145n35363o27975K01389N44212
57853A415639J20584q3809K58585J81280q17151j617538j031011L70182J095467
57844a07772P91197K44076j93131p80342j192657o38130O45759J336753Q25535
$$ y = [-872426, -722507, 186088, 265800, -721125, -983723, 535382, 2175901, 1821884, -23666, -1278554, -1499635, -1831228, -2231386, -1346001, 636205, 1576177, 675228, -99488, 891181, 2408698, 2418411, 1124948, 202615, 168661, 256180, 77257, -209055, -765401, -1618295, -1874597, -838785, 572327, 959636, 500111, 344440, 433527, -224367, -1237771, -889394, 1011473, 2277118, 1359550, -336907, -536621, 617355, 1019524, -116433, -1158966, -535665, 1069231, 1833376, 1298013, 670038, 871427, 1415639, 1536223, 1452414, 1710999, 1892279, 1075128, -542410, -1573421, -1203239, -107772, 683425, 927501, 734370, -45972, -1238629, -1876759, -1231000, 105753, 931288]
57835I31288n6062m36349m08874k48595J93496P14718M89223o09796j314196n35203
57825a280350R82498J537739O67043m24850n80794j06607j57775j004637j426068
57816a793801k60988J653343K079014L49484j388421r95494O11728R26499l09312
57807H72052r49955q6489O05793j23698j025081o02367M21681N49576j800n2583
57797c92871L18733J40373n02965o35169j73444K5481k53209l74250j74567j81446
57787b203334m43199l24716L64021J036179J271493J196969Q42685N5560p72865
57778A022793q20928j9241O41481L76806m22743q76444p45678m22612j54365J72516
57768a248415N34701N40938l4994p06367p05567m9560L54211M1125j78053M94730
$$ y = [931288, 875226, 438877, 30003, -218592, -25096, 689622, 1178845, 569049, -745147, -1280350, -297852, 1239887, 1906930, 1482080, 901286, 794679, 636904, -367733, -1793801, -2054789, -401446, 1677568, 2027052, 638631, -356863, 254865, 1181364, 872052, -77903, -164392, 441401, 317703, -707378, -1309745, -888064, -338488, -340288, -392871, -74138, 66235, -436730, -1071899, -1245343, -1219862, -1473071, -1847321, -2021888, -2203334, -2646533, -2971249, -2607228, -1571049, -299556, 897413, 1740098, 1795658, 1022793, 201865, 182624, 824105, 1200911, 778168, -98276, -843954, -1266566, -1420931, -1248415, -713714, -172776, -207770, -914137, -1619704, -1669264, -1315053, -1273928, -1451981, -957251]
57758i57251J260212P05816p87247j206548J50053J484877J068519m34508j314171
57749c0248j210669p96803j58540Q71430J511863Q88712l07252o12276M1455M76680
57739F74352L16995K41541L39790k7699o31969m25600M70915N73153o09048j650771
57729g28341j384085m60307J16914N13158J020286Q95924l33511j465196j054495
57720b879653M27533J323923J172758R05894R73599P59714o7930q79561j022463
57711G13814n44202J63716O77511N24188k91140q06066j47959R42571Q20417o12192
57701A440658j476156n42563R43536J060115j15526q81991m29876L43387M26829
57692G68413q4231n58876o82863m17826J79781P62533Q45812M09964r0030l96224
$$ y = [-957251, 302961, 1008777, 221530, -985018, -834965, 649912, 1718431, 1283923, -30248, -1240917, -2037720, -2196260, -1324830, 187033, 1075745, 768493, 156217, 197672, 674352, 991347, 1232888, 1572678, 1544979, 913010, 487410, 958325, 1531478, 922430, -728341, -2112426, -2572733, -2455819, -1942661, -922375, -26451, -359962, -1825158, -2879653, -2452120, -1128197, 44561, 950455, 1924054, 2683768, 2615838, 1736277, 713814, 169612, 333328, 1010839, 1535027, 1243887, 437821, 289862, 1232433, 2052850, 1440658, -35498, -578061, 365475, 1425590, 1310064, 428073, -1803, 341584, 768413, 684182, 125306, -557557, -975383, -795602, -33069, 812743, 1222707, 1132677, 736453]
57682G36453n69829m31952K91847J064640P56298o99677j796978j400578l76917
57673b426693k23184p20701l42579J203965K317740J715804J09442r28729q78458
57664a73393l40037J61969O03622R51086R64375N81870P3428l05727n64948p59138
57654A193107p02049j87943M30676K74733r53982k092196j572397M36733J847859
57645a325459J175682n65464j273376l69689R55998J525589J101199j1964j116057
57636I6459j197373k6377J102198Q84555j29927m85436j12116l5868k49588J14760
57626c8713O84355J89158r79263r99831J75650M94396n32965o87845J049160K273412
57616A627514Q99915j331117j598193k51628M00932l4733k57237j65758o00986
$$ y = [736453, 166624, -265328, 26519, 1091159, 1847457, 1147780, -649198, -2049776, -2426693, -2649877, -3370578, -3713157, -2509192, -191452, 1524352, 1633794, 705065, -173393, -513430, -351461, 252161, 1203247, 2167622, 2749492, 2822920, 2517193, 1952245, 1193107, 491058, 303115, 733791, 1008524, 54542, -2037654, -3610051, -3173318, -1325459, -149777, -715241, -1988617, -2358306, -1402308, 123281, 1224480, 1212516, 96459, -1100914, -1127291, -25093, 859462, 729535, 244099, 131983, 96115, -153473, -38713, 645642, 834800, -144463, -1144294, -968644, -474248, -1007213, -1695058, -645898, 1627514, 2527429, 1196312, -401881, -653509, -252577, -287310, -544547, -710305, -1311291]
57607a311291r72101l988J594954J878764P66161r5976k03079l81496m88425L19249
57597A102772J217844N19231j129193j327550O9360O58718k93097o60886N21852
57588F79051J201978M1328j091315m16952O79492K37640r12166r33016k51416
57579g65376l63496q28768j79352J163148J470773N67652k29601m99118q13531
57570d77669r14140p1296R55382N99286p90989j082558M14389J830877J495329
57561A958611R9132p43637p16132n54471n32089k59702L89444R43458R00133K83542
57551A768289m08181p47831p87569p45907m69975K13418P09426K01571q17144
57542a083903p92747N54267J493813Q06385l56163m41828K3174l09453j004100
$$ y = [-1311291, -2283392, -2287380, -692426, 1186338, 1952499, 1856523, 1653444, 1271948, 783523, 1102772, 2320616, 2839847, 1710654, 383104, 452464, 1111182, 818085, 157199, 679051, 1881029, 1922357, 831042, 414090, 1093582, 1331222, 419056, -513960, -765376, -1128872, -1957640, -2136992, -973844, 496929, 1064581, 834980, 335862, -477669, -1391809, -1463105, -507723, 91563, -699426, -1781984, -1367595, 463282, 1958611, 2057743, 1314106, 597974, 43503, -488586, -748288, -358844, 584614, 1484747, 1768289, 1360108, 612277, -175292, -921199, -1391174, -1177756, -468330, -266759, -1083903, -1876650, -1322383, 171430, 977815, 621652, 179824, 202998, -106455, -1110555]
57533a110555o51655M38280P12297K01109L97477J275558J032427o53464j651234
57524i760p04727N83232M98288j42687J17460O23286n9369j292125j236428M2196
57514a580634O64777j377n46527m0374O41847O28741M34564O29904O24157q0246
57504A374832o36393k04327L89140r8385j043443p35009P23339J250973j8304
57495A002423j280137q44271K96102K89179m82793k77189P57356P31350n16400
57486c24380p47180R50311K208681R04908j276825j143209J281413K861242J786327
57477F501288n26111k085178k569563k310510j140861O07293J537295R01585k21638
57468F93600n52955l53268m20981m45071J96139Q28288L44745p53484q71988K11569
$$ y = [-1110555, -1762210, -1323930, -611633, -410524, -13047, 1262511, 2294938, 1641474, -9760, -714487, -131255, 367033, 224346, 341806, 965092, 905723, -386402, -1622830, -1580634, -915857, -917234, -1463761, -1504135, -862288, -233547, 201017, 830921, 1455078, 1374832, 738439, 534112, 923252, 824867, -218576, -953585, -230246, 1020727, 1002423, -277714, -1121985, -825883, -536704, -1019497, -1296686, -539330, 192020, -324380, -1071560, -121249, 2087432, 2992340, 1715515, 572306, 1853719, 4714961, 6501288, 5975177, 3889999, 1320436, -990074, -2130935, -1523642, 13653, 915238, 693600, 140645, -212623, -633604, -1078675, -882536, -54248, 290497, -462987, -1334975, -1123406]
57458a123406J031583P62009K39688J61537j48660j190697j817863p41686J212506
57449a614989J862655N34921j116628j326351k02791Q63920R54643K83690l52628
57440a13558l30254K89298P58766M90418m4189J40181R56054J067152j96589j607251
57430A410028j584011l18914O96430Q06889O18293N06121J11001n06962n94154
57421A144721q6883k1618q29899j354865n70241O29303N81675p41970j724853
57412b974630j267509J20686J301791J610483J008685N7459k41444N59172J490555
57403A665248J191819j71961j036166o54208m3685k50955p99266o86142l0593
57394h15909L09341J74108P9902J20932j9261j48684K19204P43015N22741k98497
$$ y = [-1123406, -91823, 670186, 909874, 1071411, 922751, -267946, -2085809, -2827495, -1614989, 247666, 782587, -334041, -1660392, -1863183, -999263, -44620, 239070, -113558, -443812, -154514, 604252, 1094670, 1050481, 1190662, 2146716, 3213868, 3017279, 1410028, -173983, -492897, 203533, 1010422, 1628715, 2134836, 2245837, 1738875, 1144721, 1057838, 1036220, 206321, -1148544, -1718785, -1089482, -507807, -1249777, -2974630, -4242139, -4121453, -2819662, -1209179, -200494, -143035, -384479, 174693, 1665248, 2857067, 2685106, 1648940, 994732, 951047, 700092, -99174, -785316, -815909, -506568, -332460, -252558, -131626, -150887, -299571, -80367, 662648, 1185389, 886892]
57384H86892m47656M36634R37854K951j152125p17353Q23139J242155j19731j448874
57374D43886j296009n37347n25931q23885k45508R03574J315881Q16840L45329
57365C96830J23959m57412j201048j081276r9897M97766K79459K45163P90418
57356e06038Q00975k35531r02482m5984J135813R06933k17907m41473L17993N21430
57346A333729k10965n89154q2599K16633k54741l95790N73466J547427J192225
57337C330231N241o22831n64332p36402j207902j028042K3202P99957L27858q78423
57327e51443j520379j001214J81976J097633J066263Q5843r87378r96865K40916
57318b384648J418700J134254k42346q87040N6273J259796J094239n9982n54021
$$ y = [886892, 439236, 875870, 1813724, 1816675, 664550, -52803, 770336, 2012491, 1892760, 443886, -852123, -1389470, -1915401, -2739286, -2984794, -2081220, -765339, 51501, 396830, 520789, 63377, -1137671, -2218947, -2318844, -1821078, -1541619, -1296456, -506038, 294937, 59406, -843076, -889060, 246753, 1153686, 935779, 494306, 812299, 1333729, 1122764, 533610, 451011, 667644, 412903, 17113, 590579, 2138006, 3330231, 3335472, 2712641, 2148309, 1411907, 204005, -824037, -800835, -878, 326980, -551443, -2071822, -3073036, -2891060, -1793427, -727164, -641321, -1628699, -2625564, -2384648, -965948, 168306, -74040, -961080, -904807, 354989, 1449228, 1389246, 835225]
57309H35225j11392j61442j269974j848820m62434J746872K402455J081026l86432
57300A825084o58575l29603k79025j32531O25278J121808J43351j692327k305378
57291a681918r29962P36994Q23391k65052p03224O5070Q29143P10527L47629N12261
57281D44859P77543M50638r8124j45846m503m61229j217692j186061k23272O60514
57271a003173Q32795N99510K12389m08144q14757k68849Q11932R96399m7357q87910
57261B2835m35924N38668P81147K80821k51723n83465p23074m30275J70840L80903
57251b49247P6856O7422N86389O60596j53030p72581m19377m380l72278o50013
57241a229643K0373N48624k98796j383938p82466R81563J683468Q39986J1075
$$ y = [835225, 723833, 562391, -707583, -2556403, -3018837, -1271965, 1130490, 2211516, 1825084, 1166509, 836906, 557881, 425350, 1050628, 2172436, 2315787, 623460, -1681918, -2611880, -1874886, -1051495, -1316547, -2019771, -1954701, -1125558, -415031, -67402, 444859, 1222402, 1673040, 1574916, 1429070, 1424567, 963338, -254354, -1440415, -1663687, -1003173, -170378, 429132, 641521, 233377, -581380, -850229, -38297, 958102, 910745, 22835, -413089, 125579, 906726, 1187547, 935824, 352359, -370715, -800990, -630150, -249247, -172391, -104969, 481420, 1142016, 988986, 216405, -202972, -207352, -579630, -1229643, -1209270, -660646, -959442, -2343380, -3125846, -2144283, -460815, 379171, 390246]
57232C90246m0676r7193m23326k74825L13501L50835k16681l76358j8275o8794
57222d61546m65952j03993Q67033Q85951k91470q81299N6628J049443N89979o43285
57212F01489j090469m37741N53488J145043Q26880l56744j196401m45982J051408
57203F50971J074335o56557j849526j104996R7424K8040p07130p19955k11892
57194c399286o4666L6719Q23477J829122K097150J634999R25538k1495r85411
57185B876147j051907m8059O91648K38212m62071l21943R606m70164j110676p19456
57175c68663L14845P27702L91389M6381j64021l84926j61412O13590Q15636k35838
57165A594683j227901p54470K45719j7889j097978r66702O89360K019201J730131
$$ y = [390246, 349570, 252377, -170949, -445774, -132273, 218562, 1881, -374477, -392752, -461546, -927498, -1031491, -164458, 721493, 430023, -451276, -394648, 654795, 1244774, 601489, -488980, -926721, -373233, 771810, 1598690, 1241946, 45545, -400437, 650971, 1725306, 1068749, -780777, -1885773, -1788349, -1760309, -2467439, -3187394, -3399286, -3463952, -3427233, -2603756, -774634, 1322516, 2957515, 3883053, 3861558, 2876147, 1824240, 1776181, 2467829, 2706041, 2243970, 1922027, 1931633, 1461469, 350793, -368663, -53818, 673884, 1065273, 1111654, 947633, 562707, 401295, 1014885, 1830521, 1594683, 366782, -387688, -141969, -159858, -1257836, -2224538, -1535178, 484023, 2214154]
57156B214154L93474q62555j340293p23461M22199N87058o70154j439942r1295
57147a510815J760935J364244q24024j790552o75472L30703L4008j05029P62246
57138f53756J104544K419q50503k0373J108516P58937j80795J38402J215582J096403
57128C719376k65988r99174m12335R7463m89432j242594q55521M08365J169618
57119A129778P65272n5303j94181M18033P83586K14694o69006q14013k65514L8092
57109A351438j14368N5350O83793O27648p42553k090576j614466M44904J922555
57100E23725J359828l63609j296356p05668L92336P64539L87007J6734j62425
57091I16111n95946j098698o96602P18155J682481J106768k6052k00009K42744
$$ y = [2214154, 2607628, 1745073, 404780, -318681, 103518, 690576, 20422, -1419520, -1510815, 250120, 1614364, 790340, -1000212, -1675684, -1344981, -1310973, -1416002, -653756, 450788, 453207, -397296, -417669, 690847, 1449784, 1268989, 1407391, 2622973, 3719376, 3453388, 2454214, 2041879, 2139342, 1649910, 407316, -448205, -39840, 1129778, 1895050, 1839747, 1645566, 2063599, 2847185, 3061879, 2392873, 1578860, 1313346, 1351438, 1237070, 1292420, 1976213, 2603861, 1861308, -229268, -1843734, -1398830, 523725, 1883553, 1519944, 223588, -482080, -89744, 674795, 1061802, 1078536, 916111, 320165, -778533, -1475135, -756980, 925501, 2032269, 2006217, 1806208, 2048952]
57082B048952o3899q85440o85954N38936R62653q6438r78371m83846L52252K39229
57072I58074k33269p512M04170N7007l97659K60486J506499J700955O45044l03959
57062D589836m90094n60338p72763m73599L65463P02854J49022k67264J62964
57053C406081N80592M2699p99060p28581N6342L48776n4356j42784M76014Q60459
57043D046182K85589n39550m83500M70738J372015J501389Q36615k31991j031157
57034F226330q65109J66908R51535O53262j32843l04600P4894P1934l95874l77039
57024F069398M97380J403297J594143J237649P43972L09174L27548J079773J775623
57015A5037957J254257k6142k35693J081416K249318K245347K311926L501226
$$ y = [2048952, 1985053, 1099613, 413659, 952595, 1915248, 1828810, 850439, 366593, 718845, 958074, 724805, 717293, 1121463, 1178470, 780811, 1041297, 2547796, 4248751, 4893795, 4589836, 4099742, 3539404, 2766641, 2293042, 2658505, 3361359, 3510381, 3243117, 3406081, 3986673, 4029372, 3230312, 2501731, 2558073, 2906849, 2852493, 2709709, 3185723, 4046182, 4331771, 3792221, 3308721, 3779459, 5151474, 6652863, 7489478, 7257487, 6226330, 5361221, 5528129, 6479664, 7132926, 7000083, 6695483, 6770377, 6842311, 6446437, 6069398, 6566778, 7970075, 9564218, 10801867, 11545839, 11855013, 12182561, 13262334, 15037957, 16292214, 16266072, 16030379, 17111795, 19361113, 21606460, 23918386, 27419612]
57007B7419612M520179L887741K725162L249233N545980P993062J0094340J2720017
56999G8155326J6054503J9452397K3151757K8292539L5251454M3058408M9478012
56992B92894396N0159771L9603565J6497748j2001854l4470345m4595616m4732220
56985B63355445m0650195l5710464l0532831k5133804j9619259j4405127j0729503
56978H6574262r550219r669387q817051o800831n431216n171360m503020l097118
56970C3534060k648278l526487l552336j621617J84744o6072j191087j269033
56962A9843894p53771j041047j839015k125827k061604j969111j123916M83361
56954I412964J032255l43915j556494p16832O22189J31753j175010p40981R37646
$$ y = [27419612, 31939791, 35827532, 38552694, 41801927, 47347907, 55340969, 65435309, 78155326, 94209829, 113662226, 136813983, 165106522, 200357976, 243416384, 292894396, 343054167, 382657732, 399155480, 387153626, 352683281, 308087665, 263355445, 222705250, 186994786, 156461955, 131328151, 111708892, 97303765, 86574262, 77024043, 67354656, 58537605, 51736774, 46305558, 41134198, 36631178, 33534060, 30885782, 27359295, 23806959, 22185342, 22370086, 22304014, 21112927, 19843894, 19090123, 18049076, 16210061, 14084234, 12022630, 10053519, 8929603, 9412964, 10445219, 10101304, 8544810, 7827978, 8450167, 8581920, 7406910, 6665929, 7603575]
56945G603575J072815o91992j822260j098715m5616J71294L07832Q40589Q22113
56936G159635j23276p79766k97527M85069N01489j08310o51968q35155o27567
56927D722624j44706J42028r0982m26694m14692l68247n17806k28914O70325Q64646
56917D207582m44572j627380q44488Q37009J047950k9772l23233K15534k96011
56908B742619j720130j630887L82937J639000P32991k94159K93668J085292L82692
56899C614023q20139r29800m80309m88592k36915Q77207J290898j98335j587896
56890A040142l98901K007625K097886m93388k509540j899937j14824P86716O09729
56881A125508p4790j074980j701024q60066R28947J519569K58026p41299J76254
$$ y = [7603575, 8676390, 7984398, 6162138, 5063423, 5017807, 5189101, 5496933, 6337522, 7159635, 7036359, 6256593, 5959066, 6444135, 6945624, 6837314, 6185346, 5350191, 4722624, 4577918, 4719946, 4628964, 4202270, 3787578, 3419331, 2901525, 2672611, 3342936, 4207582, 3763010, 2135630, 1291142, 2128151, 3176101, 3146329, 2823096, 3038630, 2742619, 1022489, -608398, -225461, 1413539, 2146530, 1852371, 2146039, 3231331, 3614023, 2793884, 1864084, 1383775, 895183, 658268, 1535475, 2826373, 2628038, 1040142, 641241, 2648866, 4746752, 4253364, 1743824, -156113, -270937, 515779, 1125508, 1050718, -24262, -1725286, -2585352, -1656405, -136836, 121190, -620109, -443855]
56872d43855J506438J008870o08060q17713O40037J410586L59507p40319k37222
56863B078269Q01030N35669o27957q94451q2560L15841j37824j52446Q02054J245762
56853C883387q121j727287j821252j79349J402138J641294Q64470o9662p46478
56844C239140j031475q38203k76754M07713R63162R30067j35345j684887k148182
56835e74764q01238R44363J234295K50622k87688K61671Q33844N82706n0663m24511
56825A968637n22685l42297L46117J191778J272272L74174o15866r47825p81502
56816A942803m74013l2219M20183N22770L05471J11891j83656q77774j360038
56807C75418o64779P10385J060838J7175p64700k12570M92463J3866q56006n96357
$$ y = [-443855, 1062583, 2071453, 1463393, 645680, 1285717, 2696303, 3055810, 2315491, 2078269, 2879299, 3414968, 2787011, 1892560, 1810000, 2125841, 1988017, 1835571, 2637625, 3883387, 3875266, 2147979, 326727, 147378, 1549516, 3190810, 4055280, 3985618, 3239140, 2207665, 1369462, 1092708, 1500421, 2463583, 3393650, 3258305, 1573418, -574764, -1376002, -431639, 802656, 1053278, 765590, 1027261, 1861105, 2443811, 2393148, 1968637, 1445952, 1103655, 1449772, 2641550, 3913822, 4287996, 3672130, 2724305, 1942803, 1468790, 1436571, 1856754, 2379524, 2684995, 2796886, 2613230, 1735456, 375418, -289361, 421024, 1481862, 1499037, 734337, 521767, 1014230, 1028096, 172090, -424267]
56797d24267M26147N74724l30286p21987J97535J186426P71371o51722j301030
56788b73089k95142J173847J254288j67532j175108l90010R33526N94532j171002
56779D84310j762427l02K014977J868771R8479j009095p59538l93550o53546q45247
56769i57168l71783L08900O22602O53428N55089P5665q08280j399399j004005
56760b324951J00580Q63375O26165j38630l84314K79253J145412J305247O47065
56751B119202l35454j286188j925455j672100k98521J194506J443564N16418k29107
56742d73135j39859J23079J33212L58760P84408M61939o92127j158235n9445J192282
56732E30879R24167k55490n79362R3502M36363R0103M7424O42202Q74955J15039
$$ y = [-424267, 1880, 576604, 246318, -475669, -278134, 908292, 1679663, 1027941, -273089, -568231, 605616, 1859904, 1692372, 517264, 127254, 1060780, 1655312, 484310, -1278117, -1278419, 736558, 2605329, 2703808, 1694713, 935175, 541625, -111921, -957168, -1328951, -1020051, -397449, 255979, 811068, 886733, 78453, -1320946, -2324951, -2224371, -1360996, -734831, -873461, -1257775, -978522, 166890, 1472137, 2119202, 1783748, 497560, -1427895, -3099995, -3398516, -2204010, -760446, -244028, -473135, -612994, -489915, -356703, 2057, 786465, 1248404, 556277, -601958, -661403, 530879, 1455046, 1199556, 620194, 713696, 1150059, 1240162, 1287586, 1929788, 2804743, 2919782]
56722B919782q28536q56245K9692Q56190P09529m28534j499983j290200M2208
56713c46097R05493L67606m58263j02196R63153J083933l4852j109169j351860
56704h2252j147644o76430M26212J715957J892978P48592k63028j82529L3333
56695B465189p34169j717051j335725K72741J223219L95372j116996j452674k28990
56686b229084J178234J378045M74621l53544m18249r9049J16312L81973Q35448
56677A264707R03843J09106q66014r28754k40585n6978p78734j233712l74796
56668b201917J165998J927572J495462P56659M81836M14273k0671o34089o64891
56659B720232O69M20862j70047j165461j356206o77301k04993l53113k62027N50757
$$ y = [2919782, 2091246, 1235001, 1264693, 2120883, 2830412, 2401878, 901895, -388305, -346097, 559396, 927002, 468739, 366543, 1329696, 2413629, 2378777, 1269608, -82252, -1229896, -1906326, -1480114, 235843, 2128821, 2877413, 2614385, 2431856, 2465189, 1731020, 13969, -1321756, -1049015, 174204, 569576, -547420, -2000094, -2229084, -1050850, 327195, 801816, 448272, 30023, -69026, 47286, 429259, 1264707, 2168550, 2277656, 1411642, 482888, 242303, 185325, -593409, -1827121, -2201917, -1035919, 891653, 2387115, 3143774, 3625610, 4039883, 4019212, 3385123, 2720232, 2720901, 3141763, 2971716, 1806255, 450049, -227252, -432245, -785358, -1047385, -496628]
56649d96628J153697O97488j05506j58019K14600n951o22647n78077J10496L54479
56639E63932j03150l20649J08226L93603K3592m02765l64311k89838n71323o77128
56629a639811l8279Q63951J059390L57414m89483o57791j1917P69445P60179k03012
56619G70086j165897j128869k46617N97598J040553J239431J013890J21388q01516
56610A440047q24733k17155o5909m11763k48944M61206M73099n42642j183497
56601a120291n31470L90660M30194J11586L60597P19839L37769k77041r7107N42274
56591H67010M97033k02241m35423J61771P72925P10347L3619r50045j748386j540394
56581a833784j26114J225441J081084j91157r78861p35328l38042k26914K01974
$$ y = [-496628, 657069, 1354557, 1249051, 1091032, 1305632, 1299681, 677034, 98957, 209453, 563932, 460782, 140133, 248359, 641962, 665554, 262789, -101522, -391360, -962683, -1639811, -1678090, -814139, 245251, 602665, 113182, -544609, -556526, 212919, 973098, 770086, -395811, -1524680, -1771297, -1173699, -133146, 1106285, 2120175, 2241563, 1440047, 615314, 398159, 332250, -79513, -328457, 132749, 605848, 63206, -1120291, -1651761, -1261101, -830907, -719321, -358724, 361115, 698884, 421843, 324736, 867010, 1364043, 1161802, 726379, 888150, 1661075, 2371422, 2405041, 1454996, -293390, -1833784, -1959898, -734457, 346627, 155470, -823391, -1558719, -1896761, -2123675, -1921701]
56572a921701J046336J303319M79848m71741n66294o7219L45948O22394P45018
56563A515908J74809j038407j537648m03950J042846P62304r52574j651641k17018
56554b305371J505677J427303J60028j95772O38017Q60689l76843j525550j022935
56545h34757L08673N88462k91617p96196l49658K634k22826N3612J353125K076417
56535A887869O30350j804177k440616n89714J496700J727722O19714k8447K66095
56526A765496M50589k08043j060430r83112J28718J063832N90608r77806j913641
56517a143789j121079M01897Q56473L8036o03154k01339M89439O03000M29305
56508b51211M96896N01664P7345k66014j3293K99276J9259l09605J50313Q81412
$$ y = [-1921701, -875365, 427954, 907802, 436061, -130233, -197452, 148496, 770890, 1515908, 1690717, 652310, -885338, -1289288, -246442, 515862, -436712, -2088353, -2305371, -799694, 627609, 787637, 591865, 1229882, 2090571, 1713728, 188178, -834757, -526084, 62378, -229239, -1025435, -1375093, -1372459, -1595285, -1541673, -188548, 1887869, 2518219, 714042, -1726574, -2316288, -819588, 908134, 1527848, 1499401, 1765496, 2216085, 2008042, 947612, -35500, 93218, 1157050, 1747658, 769852, -1143789, -2264868, -1862971, -1006498, -968462, -1571616, -1772955, -1283516, -680516, -251211, 245685, 747349, 824694, 558680, 545387, 844663, 863922, 554317, 704630, 1586042]
56498A586042P41776k5321j63507L53354K79013n34088p20562L5838J07854j239751
56488D20648k093258p37698J350703J595075K65407k46212N00575N44106o97414
56479I01932j176098J94569J349898K71217j671166j806877k15281P66728L46167
56470a038911K3338N65479O95381m35207j431204o17244J378613K368539J396035
56461B904819l37609j179644p86605l7001K63530J96551K62841M16116Q2633p11054
56451A074577r40886j471J043144P08552o56504j179743j72731Q60823M93842
56442A229603o30588j013770m75411O9049K69696M57957N13391k4034p94699q33562
56432a232368o5966N47670N62276N91359R50691R63488K57879l66443k63534j21801
$$ y = [1586042, 2327818, 2302497, 2138990, 2492344, 2771357, 2237269, 1516707, 1552545, 1660399, 420648, -1672610, -2410308, -1059605, 535470, 800877, 554665, 1055240, 1599346, 901932, -274166, -79597, 1270301, 1541518, -129648, -1936525, -2151806, -1385078, -1038911, -1015573, -450094, 245287, -189920, -1621124, -2238368, -859755, 1508784, 2904819, 2567210, 1387566, 600961, 563960, 827490, 1024041, 1286882, 1702998, 1785631, 1074577, 133691, 132220, 1175364, 1883916, 1227412, 47669, -125062, 735761, 1229603, 599015, -414755, -890166, -821117, -551421, -93464, 419927, 395893, -398806, -1232368, -1298334, -750664, -188388, 402971, 1353662, 2317150, 2575029, 2208586, 1945052, 1823251]
56422A823251o63662j061571k03684J035905P23639r47251j505988Q5692J618413
56413I04744R12247q17849r00449O21004J211042j05476j431220j135095k5297
56404g66349N21461O37500R15485R11190J76881m80525k97597l7742o14074j217412
56394b51182n57425Q25033J344393Q62669M65609K42848n81977j557973j324413
56385e32418r6702M41519O744J17826J122162J340780J35827o59262K45144J472579
56375C594199J541008J301216J758283J577720o04564l015925k861950o09238
56367B680749P91446L39626l27394l65882p05489j355721q22763R33529J694517
56358B862618L32134j372965j569245q62796n51269l08645O07678J435906J080363
$$ y = [1823251, 1159589, 98018, -105666, 930239, 1653878, 706627, -799361, -713669, 904744, 1816991, 999142, 98693, 719697, 1930739, 1825263, 394043, -741052, -766349, -244888, 392612, 1308097, 2219287, 2396168, 1915643, 1618046, 1580304, 966230, -251182, -808607, 16426, 1360819, 2223488, 2689097, 2931945, 2349968, 791995, -532418, -629120, -187601, -180857, -63031, 1059131, 2399911, 2535738, 1876476, 2121620, 3594199, 5135207, 6436423, 8194706, 9772426, 9167862, 6151937, 3289987, 2680749, 3472195, 3811821, 3484427, 3118545, 2413056, 1057335, 234572, 1168101, 2862618, 3194752, 1821787, 252542, -610254, -1161523, -1470168, -862490, 573416, 1653779]
56349A653779N1259m77601n58640q12974q61719j11173P31537O73177K68010O59066
56339A214721J383728J036206k62383j004554p39396m30762l82783J65666J099182
56330B079625J104284r1668r89039o06852J66680L51987L12922L92137j47574
56321B572502j434935j871861m73050J042463N94950q61207p19066J059725J809600
56312A719121M01901j071091p50551K33874j8834j060146j110061j6045Q02641
56303h69191P44546M62236J82293n38414j278817q15579P28643J453891L57675
56294D27283r42181m83991J065035J393667K1625j104826p04640J5004l99515
56285g12539j109086l72242J327732J636914m8306j350762l14609J594436J582728
$$ y = [1653779, 1705038, 1227437, 668797, -144177, -1005896, -1117069, -385532, 287645, 555655, 1214721, 2598449, 3634655, 3372272, 2367718, 1628322, 1197560, 814777, 980443, 2079625, 3183909, 3092241, 2103202, 1496350, 1663030, 2015017, 2327939, 2720076, 2572502, 1137567, -734294, -1207344, -164881, 430069, -431138, -1150204, -90479, 1719121, 2121022, 1049931, 299380, 533254, 514420, -545726, -1655787, -1671832, -869191, -124645, 337591, 519884, -18530, -1297347, -2112926, -1384283, 69608, 427283, -514898, -998889, 66146, 1459813, 1481438, 376612, -328028, -313024, -712539, -1821625, -2193867, -866135, 770779, 722473, -628289, -942898, 651538, 2234266]
56276B234266l59109j546114o17465P42131P21115k715O4463M93057j73728j564189
56266h288j693227r4415J226534O66106o90077p60099N67676J476133Q43257l94680
56256A138920o97279O9239O02850o0096j236318j420605l01506P33314N38916
56247f32565o4369M47530J729938J776246p5846j917744j868092n60971J55425
56238a010448n9771j35411K59321L53271p5117k35666K70323Q25641Q40403L80961
56228A413507l83519j273914j550489n56896Q56244R99376j17848n26444O22854
56219e17129J447011J92779j791789j886997l1676J449342J387360Q54437O55545
56210A758883Q5800j069085j370476R9469J872196J918008M08576p89037p64680
$$ y = [2234266, 1875157, 329043, -288422, 453709, 1174824, 1172109, 1236572, 1729629, 1555901, -8288, -1701515, -1795930, -569396, 96710, -593367, -1353466, -785790, 690343, 1533600, 1138920, 441641, 510880, 1113730, 1053634, -182684, -1603289, -1904795, -1171481, -632565, -696934, -249404, 1480534, 3256780, 3180934, 1263190, -604902, -1165873, -1010448, -1070219, -1205630, -946309, -593038, -668155, -903821, -633498, 192143, 1032546, 1413507, 1029988, -243926, -1794415, -2351311, -1495067, -495691, -613539, -1139983, -517129, 929882, 1122661, -669128, -2556125, -2587801, -1138459, 248901, 1103338, 1758883, 1844683, 775598, -594878, -495409, 1376787, 3294795, 3703371, 2914334, 2149654]
56201B149654k99403k56059n66419q37441q86308n29066L06731J118233J214634
56192A414556O89149L14562L54061J98738n66855j388808j417547n46255N37211
56183d11188J074562Q54709L42074K09170M92235M02918n40449j458952j047652
56174h2573M39631J198292K70867j061728j046327J66034R31726M64402l64132
56165I16192n47175k16639m9099j73350k27269j03978r7919l85957p06194o16738
56155b208126J6359P81884J018111N17562q1740P0734Q81163J186455J96907j236095
56145A143214j500536l81857N33152N3757q92966o99604M08507P54004l7129m07390
56135a026848M82569J235431N37889n14266j66251R86528Q78594o30717j524604
$$ y = [2149654, 1850251, 1594192, 1027773, 190332, -695976, -1225042, -918311, 199922, 1414556, 2103705, 2418267, 2772328, 2971066, 2404211, 1015403, -402144, -948399, -411188, 663374, 1518083, 1860157, 2069327, 2561562, 2964480, 2424031, 965079, -82573, 357058, 1555350, 1826217, 764489, -281838, -115804, 815922, 1280324, 916192, 369017, 152378, 103279, -70071, -297340, -401318, -499237, -885194, -1591388, -2208126, -2191767, -1409883, -391772, 125790, 44050, 114784, 995947, 2182402, 2379309, 1143214, -357322, -739179, -206027, -152270, -1045236, -1744840, -1336333, -582329, -619458, -1026848, -544279, 691152, 1229041, 714775, 548524, 1535052, 2413646, 1782929, 258325]
56126B58325q55308K1911m3728l27980N2920N79118N67709M02037L93468p8148
56116I70324j058663j170409K53549J576417J088446l83217r28596n24898m84666
56107f61713p97553l31592P34503R66742J12109n79585n23236l59280l02185J03624
56097a638166M69995j26590j067281n79715J304669K352047J413927j1311m24386
56088A693189l94029p51047p65726K51148J211864Q67938j53046n54834m03425
56079A002032l78613k40093K77896K82329o97816j159526J64727J612152P11197
56070A574285j637716k038550K93115K270451J570685j97849m32903N85652P72567
56061B759737k67268j033923p85085l48803l03394q8302O13798R72036L01771
$$ y = [258325, -596983, -575072, -618800, -946780, -893860, -314742, 252967, 655004, 1048472, 970324, -88339, -1258748, -1005199, 571218, 1659664, 1276447, 347851, -177047, -661713, -1459266, -1790858, -1056355, -89613, 22496, -557089, -1080325, -1439605, -1741790, -1638166, -1168171, -1294761, -2362042, -2941757, -1637088, 714959, 2128886, 2117575, 1693189, 1299160, 548113, -217613, 33535, 1245399, 2113337, 1960291, 1405457, 1002032, 623419, 383326, 661222, 943551, 245735, -913791, -749064, 863088, 1574285, -63431, -2101981, -1808866, 461585, 2032270, 1834421, 1401518, 1987170, 2759737, 2492469, 1458546, 673461, 324658, 21264, -67038, 546760, 1518796, 1820567]
56052A820567o14698m90873N75292J171031N38050m54248o70893k43084l3434
56043A597710j54354j2600M05993M14424q7711k75626K48673P01745K93170o01517
56033B529907j061099p90043j08477O07213R20934M40133m74291p88380k20188
56024A055709J87269l44282j046324q89458k67819j18413j04531P23000J851218
56015A046369J663498k5320j408068j117528Q3008O28636J35905n85724p58694
56006c37918l15399J56458j20512j186615j853252r13335J073613K168788J505758
55997A77586L39718J41622O38357N76784k91359r98880q25720q6097M99544N48409
55987G19964R4651n19939p02140j1656J203626J831680J043832o44292j689009
$$ y = [1820567, 1205869, 714996, 1290288, 2461319, 2999369, 2545121, 1874228, 1631144, 1597710, 1443356, 1430756, 1836749, 2251173, 2163462, 1887836, 2136509, 2838254, 3131424, 2529907, 1468808, 678765, 570288, 1177501, 2098435, 2538568, 2064277, 1275897, 1055709, 1242978, 898696, -147628, -1037086, -1304905, -1423318, -1527849, -804849, 1046369, 2709867, 2684547, 1276479, 158951, 241959, 870595, 1006500, 420776, -337918, -653317, -496859, -617371, -1803986, -3657238, -4570573, -3496960, -1328172, 177586, 517304, 658926, 1297283, 1874067, 1582708, 583828, -241892, -327989, 171555, 719964, 814615, 294676, -407464, -419120, 784506, 2616186, 3660018, 3015726, 1326717]
55978A326717j155510J84659Q18765M02139j0134K42590L61298m94366j515153
55969A61005j153350N27267J676013J086116k71063p39844k01489R6974m25658
55960G55971q73299l74528M16721J61157j048330j454647J8103K041036K432909
55951B075093R33460p16604j224245r39519n59340j24763K54918J02981l41702
55942e39721r8536P64842Q09764l45994r41924J71119J325747N14086j285475
55933C73908j572908j88310P91774M97838L9752k806k84065p00408j95196R87363
55923b53058J232242L27085q9165M06154J00760j483340j952842K42585K654966
55914A185387J962558j126777k788954j323935J021345J566065M05924n82088
$$ y = [1326717, 171207, 355866, 1174631, 1576770, 1566636, 1809226, 2170524, 1676158, 161005, -992345, -465078, 1210935, 2297051, 2025988, 1286144, 1084655, 1181629, 755971, -117328, -491856, -75135, 86022, -962308, -2416955, -2398852, -357816, 2075093, 3008553, 2291949, 1067704, 128185, -431155, -555918, -301000, -198019, -539721, -638257, 126585, 936349, 590355, -351569, -180450, 1145297, 1659383, 373908, -1199000, -1387310, -595536, -97698, -57946, -60752, -344817, -1045225, -1240421, -253058, 979184, 1306269, 1217104, 1623258, 1724018, 240678, -1712164, -1469579, 1185387, 3147945, 2021168, -767786, -2091721, -1070376, 495689, 901613, 319525]
55906C19525m84477n3361j83097n38036k2745J493060K515378J657058l39427
55897D363878j424219j023337n88441j051586j345019l55238J057196J287343
55889I20577K83720o73096q25244m01548K30492P70220P50423P7617n32764m61660
55879A38737j07204j69897n45038o92232n33031j76490O07529J702531K050049
55870B274954Q63902r33980j587699o64753N58613P58927j31823j172114j356597
55861a390570m53013O84227R05370J53081m40513j18777N67282P74337M35654
55852A117078j97145j082449j764382j269320M50419J891465J784053O57239k57349
55843A329609o72287p92205l57807N72232R20927R0363p82364n13729J77056J9185
$$ y = [319525, -164952, -218313, -401410, -939446, -962191, 530869, 3046247, 4703305, 4363878, 2939659, 1916322, 1327881, 276295, -1068724, -1423962, -366766, 920577, 1204297, 531201, -294043, -695591, -465099, 305121, 1055544, 1133161, 600397, 138737, 31533, -138364, -683402, -1375634, -1908665, -2085155, -1477626, 224905, 2274954, 3138856, 2204876, 617177, -47576, 511037, 1269964, 1138141, -33973, -1390570, -1843583, -1159356, -253986, -100905, -541418, -660195, -92913, 681424, 1117078, 919933, -162516, -1926898, -3196218, -2745799, -854334, 929719, 1586958, 1329609, 657322, -134883, -492690, 79542, 1000469, 1090832, 308468, -205261, -28205, -9020]
55833i020n32098k65619M21479K54464m87506n19626l5816k38889o99382J59524
55823a952489J871525K031641J76921j179335m62955N73308o8115j388271j258852
55814a656622R4338P20886J31976l13200J07342N27776K41664j10145K81534R59576
55804I85125P45463n59494j691250j379968P0738J172528J112141M91520Q3617
55795A030420j71488m43374l85575p6435m45128j582747j822309j29396J692485
55786b333547J290549n60856j054333L08341J239369O02659q7179K43685M73327
55777A22015j94190n10394M46328J346582P92912l73770o81704l60813l51095
55768B35871m19979j0808L13755j1741j94719M80375J062137N30140k19958Q9883
$$ y = [-9020, -541118, -806737, -385258, -130794, -618300, -1137926, -1173742, -1412631, -2112013, -1952489, -80964, 1950677, 2127598, 948263, 485308, 1058616, 990501, -397770, -1656622, -1562284, -841398, -709422, -1022622, -915280, -387504, -145840, -255985, 25549, 985125, 1730588, 1171094, -520156, -1900124, -1829386, -656858, 455283, 946803, 1030420, 858932, 415558, 29983, -46452, -491580, -2074327, -3896636, -4026032, -2333547, -1042998, -1603854, -2658187, -2349846, -1110477, -507818, -594997, -351312, 122015, -72175, -582569, -136241, 1210341, 2003253, 1629483, 947779, 586966, 235871, -184108, -194916, 118839, 107098, -87621, 392754, 1454891, 1985031, 1765073, 1854956]
55758A854956P16954J64118j038545j110104l4942M84342j09806n61053q6708
55749B79212N29438L81498m73901j460869j815428p81974J203856K110673P46909
55740G19414j028143n80494J496340K119197L72959j297607j053243q7322O017
55731F67118k15155K58090P00797J40633n04125J18039J222093R15238p13332
55722B589396j575818o64296O19826O24669m31623j169939r72192l96814n4674
55713a431465K02121P95782J461603J272585r1853j477001j374827R0606J161589
55704F09140P65423o7813J31595R19207M84726j553169l196375k505206j20960
55695d533432J579967J448997N70856K43072K17694k53646o55471N2406J321316
$$ y = [1854956, 2571910, 2736028, 1697483, 587379, 552437, 1036779, 926973, 365920, 279212, 808650, 1190148, 716247, -744622, -2560050, -3342024, -2138168, -27495, 719414, -308729, -889223, 607117, 2726314, 3099273, 1801666, 748423, 661101, 667118, 451963, 710053, 1410850, 1551483, 1047358, 1165397, 2387490, 3302728, 2589396, 1013578, 349282, 969108, 1593777, 1162154, -7785, -979977, -1376791, -1431465, -1229344, -433562, 1028041, 2300626, 2208773, 731772, -643055, -552449, 609140, 1374563, 1306750, 1438345, 2357552, 2842278, 1289109, -1907266, -4412472, -4533432, -2953465, -1504468, -933612, -690540, -472846, -726492, -1381963, -1329557, -8241]
55686h241J342115k47419j603117j319866l24621o4808k10009L43273J257982
55677h34711J314315N16184j02516l06589n64499n56896L17742J233836Q20306
55668A837172l31850l03248Q67331J041827l14641r90140K37846J344486L54970
55659C743753j357458j363376l1700M45076l16559q19103n12129j88944L6836
55650c63604P28209J256777L39838j413256j817199m01228Q14760M83507k57278
55641f29474p2381M84103M56250L01507O46189O74571m16792j426792o59033J127252
55631D85400J403840m21634j968038j219092O86878J150578l69187j859833j506414
55622c617502K23052J500056J352917L99831l06568n18863o68344q42945m16731
$$ y = [-8241, 1333874, 1086455, -516662, -1836528, -2161149, -2225957, -2435966, -2092693, -834711, 479604, 995788, 893272, 586683, 22184, -534712, -216970, 1016866, 1837172, 1505322, 1202074, 2069405, 3111232, 2796591, 1806451, 2044297, 3388783, 3743753, 2386295, 1022919, 991219, 1436295, 1119736, 300633, -211496, -400440, -363604, 364605, 1621382, 1961220, 547964, -1269235, -1670463, -855703, -372196, -629474, -701855, -217752, 238498, 540005, 1186194, 1860765, 1443973, 17181, -641852, 485400, 1889240, 1467606, -500432, -1719524, -1032646, 117932, -251255, -2111088, -3617502, -3394450, -1894394, -541477, -141646, -448214, -967077, -1635421, -2478366, -2895097]
55613b895097J025070K625799K731666Q02948j525137k015505m86792R12103M48938
55604A623993j033144j511734o02761L00258L67859K57898N13594O09778K34875
55595G60616J02668N49521N95175m17794j379204j025117m4800O2966n07220l73206
55585a676395M89559P65447K78628L18710J151337J295432L8331j221822j190208
55576B49019n67568m93774n89291l4040O15090L70559k68121q0004P03311P17504
55566F22685k26111q19850l91161J71559P5405j14950L60419R89041O73741n25721
55556H15057j262026n86506Q34654J503146Q14723l89353r69789p30300k64591
55547b34985m115N9430k0096j89233k09001k7886q4365n10606m61067O41093J574677
$$ y = [-2895097, -1870027, 755772, 3487438, 4290386, 2765249, 749744, 262952, 1175055, 1623993, 590849, -920885, -1523646, -1223388, -855529, -597631, -84037, 525741, 760616, 863284, 1412805, 2007980, 1590186, 210982, -814135, -858935, -795969, -1303189, -1676395, -1186836, -421389, -142761, 175949, 1327286, 2622718, 2661049, 1439227, 249019, -318549, -812323, -1401614, -1435654, -820564, -450005, -718126, -798130, -94819, 622685, 396574, -423276, -814437, -642878, -567473, -682423, -322004, 667037, 1340778, 815057, -446969, -1033475, -198821, 1304325, 2119048, 1729695, 759906, 29606, -234985, -239100, -179670, -199766, -388999, -598000, -625886, -710251, -1220857, -1681924, -1040831, 533846]
55536E33846O62306j378757j879562j4292J885412J789513O97613M08133M94278
55527C198490l65470j501195j217680J57936P05171N0763l11352J80532L57194
55518A254389l23671p21907o103R70415J034803K05357o83932q82381r8577J016952
55508A765345R83581o49682k020051j232602N81454P35679p70268j264616R6008
55499a775152R62684o0977j001320m710J456653J151853k64658o59648J22150
55490g3125O54145N53260L76991q2620j137922j707856p08573P84284R31041J8728
55480c91647k34923L31823L46694m50543q66205m16226K40699Q34361J421609
55471H15642J167264n22360j977027j003483J407350J988361J30419j164388j15119
$$ y = [533846, 1196152, -182605, -2062167, -2076459, -191047, 1598466, 2296079, 2704212, 3198490, 2833020, 1331825, 114145, 272081, 977252, 1028015, 716663, 897195, 1254389, 930718, 208811, 202708, 1173123, 2207926, 2413283, 1729351, 846970, 748393, 1765345, 2748926, 2099244, 79193, -1153409, -571955, 163724, -606544, -1871160, -1775152, -812468, -873445, -1874765, -1879475, -422822, 729031, 464373, -195275, -73125, 581020, 1134280, 1511271, 1428651, 290729, -1417127, -2125700, -1341416, -410375, -391647, -626570, -294747, 51947, -398596, -1264801, -1681027, -1440328, -605967, 815642, 1982906, 1460546, -516481, -1519964, -112614, 1875747, 2006166, 841778, 726659]
55462G26659J194606N72305p58341o22532L89360K98661p08479q23973J15835
55453C84101M69124l30034r33470l15943Q75828J556053J469614R17083K84312
55444D376668J22760P66637J586686J453484K72079o97600n08857J22877j61051
55435G333683j335968j923618j154097k32516n53715j337730o33504J333402J855331
55426C351268k67713k441644j834323M12389J076145j32188n64949O81844J481291
55417A762120N96080m01044k87492k05114r11674r28647N08938J372729K21418
55408A727314q35140M24835K092295R50439j955666k612152l03364J484677O83952
55399A657190o77409m31415M95066M43257q4470J57119P88540P46278K25988K9947
$$ y = [726659, 1921265, 2493570, 1735229, 1112697, 1502057, 1800718, 1092239, 268266, 384101, 853225, 523191, -410279, -726222, 149606, 1705659, 3175273, 4092356, 4376668, 4499428, 5266065, 6852751, 8306235, 8578314, 7880714, 7371857, 7494734, 7333683, 5997715, 4074097, 2920000, 2687484, 2133769, 796039, 162535, 1495937, 3351268, 3083555, 641911, -1192412, -780023, 296122, 163934, -401015, 280829, 1762120, 2358200, 1957156, 1669664, 1464550, 552876, -375771, 133167, 1505896, 1727314, 892174, 1317009, 3409304, 4359743, 2404077, -208075, -511439, 973238, 1657190, 979781, 548366, 1043432, 1486689, 1402219, 1559338, 2347878, 3094156, 3320144, 3350091]
55389C350091j4917n46548j295797j393777n70139O90349J659210J637444M89148
55380D005064q06610j074395n86558n87297j053587o04103Q91432J553991L57843
55371B095780j098211j094387l79098m69625q18953P2537J607841J630929j23342
55362A423471j383265n94375J003934J340436K26391q25007p04669K22661Q38216
55353A547793M92045m52554j092899r69492m45108n7801J20698K16811R0276l89744
55343i39975r12760j044211p55212k82245K52196P54543J039281J090305J067380
55334B69302Q75766K95333l16417k83330J68594J0460q22004j038598j25239N59341
55324d06792j3285o63441L9028J174396Q87394m51079q02734K17849R39510N41221
$$ y = [3350091, 3335174, 2788626, 1492829, 99052, -471087, 219262, 1878472, 3515916, 4005064, 3198454, 2124059, 1537501, 950204, -103383, -707486, 183946, 1737937, 2095780, 997569, -96818, -475916, -945541, -1764494, -1691957, -84116, 1546813, 1423471, 40206, -554169, 449765, 1790201, 2016592, 1191585, 486916, 709577, 1547793, 2039838, 1587284, 494385, -475107, -920215, -978016, -857318, -640507, -550231, -939975, -1852735, -2896946, -3652158, -3934403, -3682207, -2927664, -1888383, -798078, 269302, 1145068, 1440401, 1123984, 840654, 1009248, 1019708, 197704, -840894, -966133, -406792, -420077, -1083518, -1044490, 129906, 1017300, 566221, -236513, -18664, 920846, 1462067]
55314A462067N4102J43214Q6906m44232o08961j22171R9988k32432j68224M54167
55304G24424L22302r20513j512882k69163J307441J256710L4152n91222k70975
55295H0274O8698P8851l0507m47490j063416p93940P07020J710175P18520r09217
55285A18968q66153M47248P39121k51514n16379N18898R62137k22498j457741
55276e27913j171691k1081O49570P42785O84328M04878J01577M48450J047387
55267B358290L47912j717487k747009j047634J671867K502697J083347n75015
55259A876968j057097n61149L46346J197062J213428N1865j213348j203597j60538
55250D89940M68870J57194k39593m9885L49906L23386k39812r54042j181876n10990
$$ y = [1462067, 1516169, 1659383, 1746289, 1302057, 693096, 570925, 670913, 438481, 270257, 724424, 1046726, 126213, -1386669, -1655832, -348391, 908319, 942471, 351249, 80274, 148972, 227823, 197316, -250174, -1313590, -2107530, -1400510, 309665, 1028185, 118968, -747185, -299937, 439184, 187670, -328709, 190189, 1152326, 929828, -527913, -1699604, -1720685, -1071115, -328330, 355998, 760876, 862453, 1310903, 2358290, 2706202, 988715, -1758294, -2805928, -1134061, 1368636, 2451983, 1876968, 819871, 258722, 605068, 1802130, 3015558, 3067423, 1854075, 650478, 489940, 958810, 1116004, 876411, 826526, 1176432, 1499818, 1260006, 305964, -875912, -1386902]
55240a386902N17878P36196k1853m75755J26390O97039J51089o14284k25279O71842
55230A76361M26183p52444j115075k48182N58867P07701Q15014Q08470q7249j141292
55220A48354m80895J560446K066810j83393k487566k043763R6596J060014M16389
55211A52992j14177m8544m33897j153476o89401J023249J840111M87404j316238
55202b51977j112558R47278K356935J509962m60175j335878n63297L27504o5339
55193A352455j161483j333855k42945P58550O15491q3855k57323M8304M874n38145
55183h37932q33144l67852M44454Q21884N31411J00852R4621K31903l39683j557950
55173a711436j921097m11548J588796J785076K33693o56320K87046J341447P17738
$$ y = [-1386902, -869024, -132828, -154681, -630436, -504046, 192993, 344082, -270202, -495481, 176361, 602544, -149900, -1264975, -1513157, -954290, -246589, 568425, 1376895, 1289646, 148354, -332541, 1227905, 3294715, 3111322, 623756, -1420007, -1323411, -263397, 152992, 38815, -9729, -443626, -1597102, -2286503, -1263254, 576857, 1064261, -251977, -1364535, -417257, 1939678, 3449640, 2989465, 1653587, 1090290, 1417794, 1352455, 190972, -1142883, -1385828, -627278, -11787, -95642, -352965, -304661, -299787, -837932, -1671076, -2038928, -1594474, -772590, -241179, -140327, -45706, 186197, -153486, -1711436, -3632533, -4044081, -2455285, -670209, -436516, -1092836, -805790, 535657, 1253395]
55164A253395p77396j296102o89455p1626J94484L66894J28941o84968r50187
55155b526020K47056J565227R59455j000551j590813R6381J795023J365976l81492
55146E30242j225307n42171M35755O18130J97412l4285J58684J76172n00685j225360
55136a411413p16692R42435J842905P70935q06842p88891L71604N46725m66740
55127B84026o88243N29588J302139L97375p54707o19439n1849m17229q94420J09512
55117h03247J859751J968985o0029k002671j890906k76617R35469P82874j41387
55108C72222o38604o1272J064214J453524M77667r28977j276981l47536N88393
55099G02650M21021m98925r37995k92406P75562J148750N26079k89359m42743
$$ y = [1253395, 475999, -820103, -1509558, -1581184, -1386700, -1019806, -890865, -1575833, -2526020, -2278964, -713737, 245718, -754833, -2345646, -2249265, -454242, 911734, 530242, -695065, -1237236, -801481, -183351, 14061, -20224, 138460, 314632, -186053, -1411413, -2128105, -1185670, 657235, 1428170, 621328, -167563, 204041, 750766, 284026, -404217, 125371, 1427510, 1824885, 1070178, 450739, 398890, -18339, -912759, -803247, 1056504, 3025489, 2965460, 962789, -928117, -1204734, -269265, 513609, 372222, -266382, -327654, 736560, 2190084, 2667751, 1738774, 461793, 114257, 702650, 1123671, 624746, -313249, -605655, 169907, 1318657, 1844736, 1555377, 1112634]
55090A112634p9348L7768k77854m84620l20586j78668k84718k64644J37185N96011
55080f840Q09132Q66890O81720j33063j316674j743412q60112L65538O91415J84521
55070d60885k00807n0764L08709N67076O29612M66211L28842N68390P92691J34239
55060C083314j047700j058515M72220J349664l1039j731736r78669J156378R93505
55051B207422j885420l500328j312345J964505K409624K76477j223651p95977
55043a859693J07273M09404N41371O25323M8632q21526o40700O01576J118000
55034A29660j8324j316643r91192N53733J473208R31684k16412p50323l04785
55025e09394M96060P04857J05056l64136J72241J001942O34417p63362j259837
$$ y = [1112634, 1033286, 1071054, 793200, 308580, -12006, -190674, -475392, -740036, -602851, -6840, 802292, 1669182, 2350902, 2217839, 901165, -842247, -1702359, -1336821, -645406, -460885, -661692, -712456, -403747, 163329, 792941, 1259152, 1587994, 2156384, 2949075, 3083314, 2035614, 977099, 1449319, 2798983, 2767944, 1036208, 57539, 1213917, 2207422, 322002, -3178326, -4490671, -2526166, -116542, 159935, -1063716, -1859693, -1752420, -1343016, -801645, -176322, -127690, -949216, -1589916, -988340, 129660, 111336, -1205307, -2196499, -1642766, -169558, 762126, 545714, -204609, -509394, -13334, 691523, 796579, 432443, 604684, 1606626, 2241043, 1477681, 217844]
55016B17844q4756J003844M29915p30903p01252m3192m66198j479884r71417R92251
55006a833748J762414J58984j643403j454264m4117P56873R48476J392067J539368
54997A582650M41338r60817r25926J85207L83285o94097j242766k99395Q10033
54988g20488P36210L8410j20724K05768L32064K74243L77775L53483k35547r55038
54978B86156r06745o580Q03057O18886m48766j311301q93694O66548J942421J764111
54968B514093N99060k56539n11281q63264j356346j135277m9596Q65157R42336
54959G48343O31769K47391n62469j439842j074612N71297J416094J50322j456932
54950g68639j040165P24421J231039J5678p90084l0294R08639O60787j36519l83776
$$ y = [217844, 133088, 1136932, 1566847, 835944, 134692, 91500, -374698, -1854582, -2825999, -1833748, -71334, 87650, -1555753, -3010017, -3054134, -2297261, -1348785, 43282, 1582650, 2023988, 1063171, 137245, 322452, 705737, 11640, -1231126, -1530521, -720488, 15722, 54132, -66592, 139176, 471240, 745483, 1123258, 1476741, 1241194, 286156, -620589, -627169, 175888, 794774, 346008, -965293, -1858987, -1192439, 749982, 2514093, 3113153, 2856614, 2345333, 1482069, 125723, -1009554, -1059150, -193993, 748343, 1380112, 1627503, 1065034, -374808, -1449420, -878123, 537971, 688293, -768639, -1808804, -1084383, 146656, 162334, -627750, -658044, 250595, 911382, 774863, 391087]
54940C91087k94773m50116m38057K53088R30586N66388n86533j316067j034719
54931a979116k08509M77199O76280L99632N4569J54054N44674M16546m18372r10920
54921g93963j90954R87436J185499K83106n09544m56935j7546K71861N28808Q36561
54911B124329P80953J76966m54659o34602n55815n11636l17360J29000L02632
54902A039808j91513p66572o02285M2882J90466k99012n15416L2409P18636R17415
54892E66818Q87916R64436O98321l24863j370561j283746j49434P20302N07036
54883A216225k42107o55463o56893o01466l98242L08662J250638J475674M49318
54874B146346j062485j608346o40295Q14698J352294Q00739J32594m7688j12259
$$ y = [391087, 96314, -353802, -791859, -538771, 391815, 958203, 371670, -944397, -1979116, -2187625, -1710426, -1034146, -634514, -579945, -425891, 118783, 535329, 116957, -793963, -984917, 2519, 1188018, 1471124, 961580, 504645, 487099, 758960, 1287768, 2124329, 2905282, 3082248, 2627589, 1992987, 1437172, 925536, 608176, 737176, 1039808, 848295, 81723, -520562, -477680, -287214, -586226, -1101642, -1069233, -350597, 566818, 1454734, 2419170, 3117491, 2792628, 1422067, 138321, -11113, 709189, 1216225, 974118, 318655, -338238, -939704, -1337946, -1029284, 221354, 1697028, 2146346, 1083861, -524485, -1164780, -350082, 1002212, 1802951, 1935545, 1887857, 1775598]
54865A775598l81684m47986l6725L21433K10965J33702M97874N88865k85847j298499
54855A077696j187432l73086l14642r50655o88509Q00965J732676R12061m30719
54846E78355o06189J40845M75542J16826k22618k82945l40015l18994L9582M38566
54836A8955L71519m6773l01532k06661J24935N58695P19447J67327p12499q41111
54826a47698n2800M25116j70678r17889p58352p4248L85895Q48233J398739R45117
54816A881435q51095j922661m53455J786174J562162q27104j795204M2131J812133
54807A234516R13006j258217j883486p95531J84987M39988P79652J284864J078332
54798A978111J01981n73581l84490K4556j1383k39652j22305K09055J14833n79005
$$ y = [1775598, 1393914, 945928, 909203, 1230636, 1441601, 1575303, 2073177, 2662042, 2376195, 1077696, -109736, -482822, -797464, -1748119, -2436628, -1635663, 97013, 1009074, 578355, -27834, 113011, 588553, 705379, 482761, 199816, -140199, -459193, -419611, 18955, 390474, 343701, 42169, -164492, -39557, 519138, 1238585, 1405912, 693413, -147698, -200498, 224618, 53940, -863949, -1622301, -1696549, -1310654, -462421, 936318, 1881435, 1030340, -892321, -1345776, 440398, 2002560, 1175456, -619748, -577617, 1234516, 2147522, 889305, -994181, -1789712, -1604725, -1164737, -385085, 899779, 1978111, 2080092, 1506511, 1122021, 1146577, 1135194, 895542, 773237, 982292, 1097125, 518120]
54788E18120j139127p57333K32418N77757q8448m57784N31387J724048J204453
54779B345491o35799j378832j46999J089812N54928q07359j086371k07063N34246
54770B62054O56330O12856M24369k49061j012052j051447l93314K00583L66571
54761a83111K49079j67254q39254j112365m40660N73978Q76265M73601K32703
54752c37018L73477L05690q8920j91783J63619L02593j59957o78984o60116k80904
54742a252303m2540m0153k9873J47027M25812N44599K17764l97060n93751l82
54732a020860O43601L33101o61261r89268j19384Q66200Q08676L2207k91963J73357
54722b25594O63226N57970J79948J65606N02648N78518J13711l05387R4248J139895
$$ y = [518120, -621007, -1378340, -1145922, -568165, -656613, -1114397, -583010, 1141038, 2345491, 1709692, 330860, 183861, 1273673, 1828601, 1021242, -65129, -272192, 262054, 918384, 1531240, 1955609, 1706548, 694496, -356951, -750265, -549682, -183111, 65968, -101286, -940540, -2052905, -2493565, -1919587, -1043322, -569721, -337018, 36459, 342149, 253229, 61446, 225065, 527658, 367701, -311283, -971399, -1252303, -1294843, -1334996, -1364869, -1217842, -792030, -247431, -29667, -426727, -1020478, -1020860, -377259, -44158, -705419, -1694687, -1814071, -947871, -139195, -106988, -398951, -225594, 437632, 995602, 1175550, 1341156, 1843804, 2422322, 2536033, 2230646, 2324894, 3464789]
54712C464789J674567R05539n01980j120866m71259M35710L82790o10883j400853
54703B757554j059529J88108J302067J416770M50239r66375j904975j682384m44004
54694E7471P27517P31094l05142j092432p53748J64350O42699N38845L02379n9729
54684I53304p11386j089362n43095K78984J11222p46380n31237J160462K289895
54675A172407J183101r21289j558138l62520Q43730Q09639J47512j06106J10562
54666A318898K81256K51751L38189Q24900J498232J625941O85904p71750j526963
54657D526358j167445m69975o4979K87853O44007L58430n24527o90806L83159
54648C282075J064281q9326j730979j546569J10301P96852j33475q08550k12151
$$ y = [3464789, 5139356, 6044895, 5542915, 4422049, 3950790, 4386500, 4769290, 4158407, 2757554, 1698025, 1886133, 3188200, 4604970, 5055209, 4088834, 2183859, 501475, 57471, 784988, 1516082, 1210940, 118508, -635240, -470890, 171809, 710654, 1013033, 953304, 241918, -847444, -1390539, -1111555, -1000333, -1746713, -2277950, -1117488, 1172407, 2355508, 1434219, -123919, -486439, 357291, 1166930, 1314442, 1208336, 1318898, 1600154, 1851905, 2190094, 3014994, 4513226, 6139167, 6825071, 6053321, 4526358, 3358913, 2888938, 2823959, 3111812, 3755819, 4114249, 3589722, 2898916, 3282075, 4346356, 4257030, 2526051, 979482, 1089783, 1886635, 1753160, 944610, 732459]
54639G32459L33287j41699n06162K01748Q10729K6207j163049r92296K17962O45508
54629A64694j58075q27655n06701L5140q6018n02071l36039M12349Q39574L11924
54619f52878o72944r49348q3348R31845Q60676m3099l40798M09649Q82211M8127
54609C90093j035524o93259P30127J167719k34011j858136j829363m34824N70637
54600c226541M79018K86332P95843J204812L55048j248246j807731o13141J034332
54591b740274J624312J144182L89239l75344j073047j065631r6761O65394P8040
54582a449890r14349m30040J290724J944162N52922j171970j484209p22883J02323
54573b283210R57491J768101J521909J4660r78083j11234J169123P01071r50100
$$ y = [732459, 1065746, 924047, 417885, 619633, 1430362, 1456569, 293520, -698776, -480814, 164694, 6619, -821036, -1327737, -1292597, -1378615, -1880686, -2216725, -1804376, -964802, -652878, -1325822, -2275170, -2358518, -1426673, -565997, -609096, -949894, -540245, 341966, 390093, -645431, -1338690, -608563, 559156, 325145, -1532991, -3362354, -3797178, -3226541, -2747523, -2461191, -1665348, -460536, -105488, -1353734, -3161465, -3774606, -2740274, -1115962, 28220, 417459, 42115, -1030932, -2096563, -2193324, -1527930, -1449890, -2364239, -2794279, -1503555, 440607, 993529, -178441, -1662650, -2385533, -2283210, -1325719, 442382, 1964291, 1978951, 1000868, 889634, 2058757, 2759828, 1809728]
54564A809728j423047l35604L67015k19537p36887k15800L34842k4544m52501
54555h96335J8242O23929K16151n87911k89748R71431J441276L30871j036274
54546G91632j140610k98941K3894n97886j013137k27052J107482J488868M94078
54537F28328p85217j184023o36956K26248Q91795R93541K95361p26879r20513
54528a218315J42736J301406J200683J17968n96169n42088n19749q39507p28862
54519a681897K03973J042130P57554l69527j127174p42368M87083J533023J401663
54510A504460K3461j455787j749384q61645J08599N24222P16346Q93901O70659
54501C74832P7814p5676M54597O57770j79540j113419q50124K59754Q01162M44238
$$ y = [1809728, 386681, 51077, 418092, 198555, -538332, -754132, -419290, -443834, -896335, -878093, -254164, -38013, -625924, -915672, 55759, 1497035, 1827906, 791632, -348978, -647919, -624025, -1221911, -2235048, -2462100, -1354618, 134250, 628328, -156889, -1340912, -1977868, -1751620, -859825, 133716, 429077, -297802, -1218315, -1075579, 225827, 1426510, 1544478, 948309, 406221, -113528, -953035, -1681897, -1477924, -435794, 321760, -47767, -1174941, -1917309, -1430226, 102797, 1504460, 1527921, 72134, -1677250, -2538895, -2430296, -1906074, -1189728, -295827, 374832, 452646, 376970, 831567, 1489337, 1309797, 196378, -653746, -393992, 407170, 851408]
54491H51408J39293K88719J63336n60487r74114l32757O30319O29075m02857j208504
54481g76569p42352O50819J567129R19384q36335j881192r19274J067944J698152
54472G47706J66702j518107j092306Q63374J650610J20285j794616j700434K22892
54463b333894J716554J335961j62343j140419q88581M1059O99931O41346J92955
54454A02569l6759L0375j54464q31840j299657p90919K59843O19379k6833n60982
54444b689288L0110J235596J639599O24214r58958j663477q08836Q20864J584173
54435a86003O43477r45421j314815o6259J176332Q03301q21920j928670j390613
54426d030591K88557J684152J726781O03599l11868J43764J388525J642473L26953
$$ y = [851408, 990701, 1279420, 1442756, 882269, -91845, -424602, 205717, 834792, 431935, -776569, -1518921, -868102, 699027, 1618411, 782076, -1099116, -2018390, -950446, 747706, 914408, -603699, -1696005, -832631, 817979, 938264, -856352, -2556786, -2333894, -617340, 718621, 556278, -584141, -1472722, -1431663, -731732, -90386, 102569, 65810, 96185, -58279, -890119, -2189776, -2980695, -2720852, -2101473, -2128306, -2689288, -2659178, -1423582, 216017, 840231, -118727, -1782204, -2591040, -1770176, -186003, 457474, -487947, -1802762, -1869021, -692689, 110612, -711308, -2639978, -4030591, -3742034, -2057882, -331101, 272498, -39370, 104394, 1492919, 3135392, 3462345]
54417C462345j042686j030072k94660l03947r03501p35322L25450Q63872J80500
54408E21979o79065o10096Q8586N32986N04903K22132k99391r43834j180456p09044
54398b551300K3968M51201N84945O72294O56257M74677M34266P12580Q18399J52156
54388B429443j023759j680675j146471J29176J004253P79443j16292o61315m57294
54379g43491p2600k1312J22L29097M44922j86519q56856m74481N15235N39250
54369e26633o26426j347527o22700M27113M39548j57691j65402L90046O03613
54360a586059L20279J24068J70381J86370K48810N02686N06758q2167n95666k51298
54350d55838M47413M38972j43053l30828j51660m88078j143680q24302N79743
$$ y = [3462345, 2419659, 1389587, 1094927, 790980, -112521, -847843, -522393, 341479, 521979, -157086, -767182, -678596, -145610, 359293, 581425, 282034, -661800, -1842256, -2551300, -2527332, -2076131, -1491186, -818892, -162635, 312042, 746308, 1458888, 2277287, 2429443, 1405684, -274991, -1421462, -1292286, -288033, 491410, 375118, -286197, -743491, -816091, -837403, -837281, -508184, -63262, -249781, -1106637, -1581118, -1065883, -526633, -1153059, -2500586, -3123286, -2696173, -2256625, -2414316, -2579718, -2189672, -1586059, -1265780, -1141712, -971331, -784961, -536151, -33465, 473293, 391126, -204540, -455838, -8425, 430547, 287494, -43334, -194994, -683072, -1826752, -2651054, -2071311]
54341b071311J426801P60950k62573l60334p0908m40578r94776o21679L44867
54332b289541O45312K56716L03941R21629R41759j8611p81800n03424R8650K01936
54322b23433K44010P77567J120619M94792l64248k79435K61389k13225j583985
54313B34051k056505q64476O60423J218633J094699Q48016J26948j066110j441607
54304a245928k79377R74372O80962l66422k15050J015780J341169J62872q75977
54295A192401n94089J53801K38889r7750j62594L274J29665K63322K07335m46289
54285H87965j248604j128151j63193L11989q0984q4385Q80971J486437P24054
54276A586099l23729l56475N6748j37418m71359j67075r550r10053j713581p86011
$$ y = [-2071311, -644510, 116440, -146133, -506467, -577375, -1017953, -2012729, -2634408, -2289541, -1644229, -1387513, -1083572, -161943, 779816, 761205, -20595, -524019, -425369, -223433, 20577, 798144, 1918763, 2413555, 2049307, 1769872, 2031261, 1818036, 234051, -1822454, -2686930, -2026507, -807874, 286825, 1134841, 1261789, 195679, -1245928, -1525305, -550933, 130029, -236393, -451443, 564337, 1905506, 2068378, 1192401, 598312, 752113, 991002, 893252, 730658, 733932, 863597, 1126919, 1334254, 887965, -360639, -1488790, -1651983, -1339994, -1420978, -1505363, -624392, 862045, 1586099, 1262370, 905895, 962643, 825225, 353866, 186791, 177241, -732812, -2446393, -3232404]
54266c232404R92477J308218P1269n49701K83649R84776M53710k54900j0321N69376
54256F16149M04954l52337q55261p35811q6171P99624J233947O29965n12810j051232
54246I1017p42501l14459l8290M87349J110690J105249N09741J13867N9746r2196
54236B290213n1880O35933Q86636p31012k942441k659212L35297K461202J412734
54227A637470o83706j023598k69677m22798r52473k03115J033756P58407m33548
54218e59282j94990J379143J763610K91350p88410j41439O99638K38964o79754
$$ y = [-3232404, -2239927, -931709, -860440, -1410141, -1126492, -141716, 311994, 57094, 46773, 616149, 1021103, 668766, -186495, -922306, -1008477, -208853, 1025094, 1655059, 1142249, 91017, -651484, -965943, -1004233, -516884, 593806, 1699055, 2208796, 2322663, 2382409, 2290213, 2238333, 2874266, 3760902, 3029890, 87449, -2571763, -2236466, 224736, 1637470, 953764, -69834, -339511, -762309, -1714782, -1917897, -884141, -125734, -559282, -754272, 624871, 2388481, 2679831, 1891421, 1749982, 2449620, 2688584, 2008830]
$$ [...]
##END NTUPLES=NMR SPECTRUM
##END=
