##TITLE=31Pdec_LR-684A-31(R)
 , 124 sc
 24.7.2019
##JCAMPDX= 6.0         $$ Bruker NMR JCAMP-DX V2.0
##DATA TYPE= NMR SPECTRUM
##DATA CLASS= NTUPLES
##ORIGIN= UXNMR, Bruker Analytische Messtechnik GmbH
##OWNER= root
$$ XWIN-NMR		Version 3.5
$$ Wed Jul 24 14:03:24 2019 Russian Standard Time (UT+4h)  she@DPX200
##.OBSERVE FREQUENCY= 81.013821
##.OBSERVE NUCLEUS= ^31P
##.ACQUISITION MODE= SIMULTANEOUS
##.ACQUISITION SCHEME= undefined
##.AVERAGES= 124
##.DIGITISER RES= 17
##SPECTROMETER/DATA SYSTEM= spect
##.PULSE SEQUENCE= zgpg30
##.SOLVENT NAME= DMSO
##.SHIFT REFERENCE= (INTERNAL, DMSO, 0, 182.463)
##AUDIT TRAIL= $$ (NUMBER, WHEN, WHO, WHERE, WHAT)
$$ ##TITLE= Audit trail, XWIN-NMR		Version 3.5
$$ ##JCAMPDX= 5.01
$$ ##ORIGIN= Bruker BioSpin GmbH
$$ ##OWNER= she
$$ F:/spectra/data/she/nmr/P31/1/pdata/1/auditp.txt
$$ ##AUDIT TRAIL=  $$ (NUMBER, WHEN, WHO, WHERE, WHAT)
(   1,<2019-07-24 14:02:09.64 +0400>,<she>,<DPX200>,
      <continue with go, POWCHK disabled, PULCHK disabled
       configuration hash MD5:
       00 E9 B6 7A A2 85 ED C7 34 08 36 98 17 FE 4E 26
       data hash MD5: 32K
       1C 94 A3 2D DA 1A 5E 50 90 BB A3 D4 6D 7C 55 D3>)
(   2,<2019-07-24 14:02:12.28 +0400>,<she>,<DPX200>,
      <Start of raw data processing
       efp BC_mod = 2 LB = 1 FT_mod = 6 PKNL = 1 PHC0 = -2551.67 PHC1 = 96.1992 SI = 64K 
       data hash MD5: 64K
       E2 ED B5 35 65 B3 E3 4C 88 FE E4 55 F3 2E AE F1>)
(   3,<2019-07-24 14:02:42.70 +0400>,<she>,<DPX200>,
      <pk PHC0 = -45.72398 PHC1 = 133 
       data hash MD5: 64K
       30 79 DD F7 A7 65 01 17 BA 62 63 55 BE 11 04 A7>)
(   4,<2019-07-24 14:02:45.87 +0400>,<she>,<DPX200>,
      <abs ABSG = 5 
       data hash MD5: 64K
       36 AF CC 79 73 F0 2B 0B BD 5C CD 61 E3 90 29 3E>)
$$ ##END=
$$ 
$$ hash MD5
$$ 69 E4 85 85 9F 30 09 3E AD 34 20 19 7C AA 2A B1
##$RELAX= 
##$RELAX= 
##$RELAX= 
##$RELAX= 
##$RELAX= 
##$RELAX= 
##$RELAX= 
##$RELAX= 
$$ Bruker specific parameters
$$ --------------------------
##$DU= <F:/spectra>
##$EXPNO= 1
##$NAME= <P31>
##$PROCNO= 1
##$TYPE= <nmr>
##$USER= <she>
##$AMP= (0..31)
100 100 100 100 100 100 100 100 100 100 100 100 100 100 100 100 100 100 
100 100 100 100 100 100 100 100 100 100 100 100 100 100 
##$AQSEQ= 0
##$AQ_mod= 1
##$AUNM= <au_zg>
##$AUTOPOS= <>
##$BF1= 81.014009
##$BF2= 200.13
##$BF3= 200.13
##$BF4= 200.13
##$BF5= 200.13
##$BF6= 200.13
##$BF7= 200.13
##$BF8= 200.13
##$BYTORDA= 1
##$CFDGTYP= 0
##$CFRGTYP= 5
##$CHEMSTR= <none>
##$CNST= (0..31)
1 1 145 1 1 1 1 1 1 1 1 1 1 1 1 1 1 1 1 1 1 1 1 1 1 1 1 1 1 1 1 1 
##$CPDPRG= <waltz16>
##$CPDPRG1= <>
##$CPDPRG2= <waltz16>
##$CPDPRG3= <>
##$CPDPRG4= <mlev>
##$CPDPRG5= <mlev>
##$CPDPRG6= <mlev>
##$CPDPRG7= <mlev>
##$CPDPRG8= <mlev>
##$CPDPRGB= <>
##$CPDPRGT= <>
##$D= (0..31)
0 1 0 0 0 0 0 0 0 0 0 0.03 2e-05 3e-06 0 0 0 0 0 0 0 0 0 0 0 0 0 0 0 0 
0 0 
##$DATE= 1563962300
##$DBL= (0..7)
120 120 120 11 120 120 24 19 
##$DBP= (0..7)
150 150 150 150 150 150 150 150 
##$DBP07= 0
##$DBPNAM0= <>
##$DBPNAM1= <>
##$DBPNAM2= <>
$$ [...]
##$SUBNAM3= <"">
##$SUBNAM4= <"">
##$SUBNAM5= <"">
##$SUBNAM6= <"">
##$SUBNAM7= <"">
##$SUBNAM8= <"">
##$SUBNAM9= <"">
##$SW= 369.568048894756
##$SWIBOX= (0..15)
0 1 3 0 0 0 0 0 0 0 0 0 0 0 0 0 
##$SW_h= 29940.119760479
##$TD= 32768
##$TD0= 1
##$TE= 0
##$TE2= 300
##$TE3= 300
##$TEG= 300
##$TL= (0..7)
0 120 53 12 22 120 120 120 
##$TP= (0..7)
150 150 150 150 150 150 150 150 
##$TP07= 0
##$TPNAME0= <>
##$TPNAME1= <>
##$TPNAME2= <>
##$TPNAME3= <>
##$TPNAME4= <>
##$TPNAME5= <>
##$TPNAME6= <>
##$TPNAME7= <>
##$TPOAL= (0..7)
0.5 0.5 0.5 0.5 0.5 0.5 0.5 0.5 
##$TPOFFS= (0..7)
0 0 0 0 0 0 0 0 
##$TUNHIN= 0
##$TUNHOUT= 0
##$TUNXOUT= 0
##$USERA1= <user>
##$USERA2= <user>
##$USERA3= <user>
##$USERA4= <user>
##$USERA5= <user>
##$V9= 5
##$VALIST= <valist>
##$VCLIST= <CCCCCCCCCCCCCCC>
##$VD= 0
##$VDLIST= <DDDDDDDDDDDDDDD>
##$VPLIST= <PPPPPPPPPPPPPPP>
##$VTLIST= <TTTTTTTTTTTTTTT>
##$WBST= 1024
##$WBSW= 4
##$XGAIN= (0..3)
0 0 0 0 
##$XL= 0
##$YL= 0
##$YMAX_a= 47148
##$YMIN_a= -39036
##$ZGOPTNS= <>
##$ZL1= 120
##$ZL2= 120
##$ZL3= 120
##$ZL4= 120
##$ABSF1= 182.463
##$ABSF2= -187.1042
##$ABSG= 5
##$ABSL= 3
##$ALPHA= 0
##$AQORDER= 0
##$ASSFAC= 0
##$ASSFACI= 0
##$ASSFACX= 0
##$ASSWID= 0
##$AUNMP= <proc_1d>
##$AZFE= 0.1
##$AZFW= 0.5
##$BCFW= 0
##$BC_mod= 2
##$BYTORDP= 0
##$COROFFS= 0
##$CY= -3
##$DATMOD= 1
##$DC= 0
##$DFILT= <>
##$DTYPP= 0
##$F1P= 0
##$F2P= 0
##$FCOR= 1
##$FTSIZE= 65536
##$FT_mod= 6
##$GAMMA= 0
##$GB= 0
##$INTBC= 1
##$INTSCL= 5.30512e-09
##$ISEN= 30
##$LB= 1
##$LEV0= 0
##$LPBIN= 0
##$MAXI= 10000
##$MC2= 0
##$MEAN= 0
##$ME_mod= 0
##$MI= 50
##$NCOEF= 0
##$NC_proc= -5
##$NLEV= 6
##$NOISF1= 182.463
##$NOISF2= 159.3651
##$NSP= 0
##$NTH_PI= 0
##$NZP= 0
##$OFFSET= 182.463
##$PC= 4
##$PHC0= -2597.394
##$PHC1= 229.1992
##$PH_mod= 1
##$PKNL= yes
##$PPARMOD= 0
##$PSCAL= 0
##$PSIGN= 0
##$REVERSE= no
##$SF= 81.0140089999434
##$SI= 65536
##$SIGF1= 159.3651
##$SIGF2= -187.1042
##$SINO= 113.3802
##$SIOLD= 16384
##$SREGLST= <1H.CDCl3>
##$SSB= 0
##$STSI= 65536
##$STSR= 0
##$SW_p= 29940.119760479
##$SYMM= 0
##$S_DEV= 0
##$TDeff= 32768
##$TDoff= 0
##$TI= <>
##$TILT= no
##$TM1= 0
##$TM2= 0
##$TOPLEV= 0
##$USERP1= <user>
##$USERP2= <user>
##$USERP3= <user>
##$USERP4= <user>
##$USERP5= <user>
##$WDW= 1
##$XDIM= 65536
##$YMAX_p= 442746231
##$YMIN_p= -13822418
$$ End of Bruker specific parameters
$$ ---------------------------------
##NTUPLES= NMR SPECTRUM
##VAR_NAME=  FREQUENCY,     SPECTRUM/REAL,   SPECTRUM/IMAG
##SYMBOL=    X,             R,               I
##VAR_TYPE=  INDEPENDENT,   DEPENDENT,       DEPENDENT
##VAR_FORM=  AFFN,          ASDF,            ASDF
##VAR_DIM=   65536,         65536,           65536
##UNITS=     HZ,            ARBITRARY UNITS, ARBITRARY UNITS
##FACTOR=    0.456856943014862, 1,           1
##FIRST=     14782.0589164792, 0,            0
##LAST=      -15158.0608439998, 0,           0
##MIN=       -15158.0608439998, -13822418,   0
##MAX=       14782.0589164792, 442746231,    0
$$ Real data points
##PAGE= N=1
##DATA TABLE= (X++(R..R)), XYDATA
$$ [...]
##PAGE= N=2
##DATA TABLE= (X++(I..I)), XYDATA
5476F157365k221871l11751Q18799L80365m44861j085938k065964k888629j930515
$$ 6157365 3935494 3623743 4442542 4822907 4378046 3292108 1226144 -1662485 -3593000
5467c593000P16385K425623J435109n31296o59858J052403K097773J135974m44748
$$ -3593000 -2876615 -450992 984117 452821 -207037 845366 2943139 4079113 3634365
5458C634365q42460k62001k14761j114550j607323n15385J230743J505409j05593
$$ 3634365 2791905 2529904 2315143 1200593 -406730 -922115 308628 1814037 1708444
5449A708444j423603n44917J338636J485963m52466j926593j184053M23042P47271
$$ 1708444 284841 -260076 1078560 2564523 2112057 185464 -998589 -575547 171724
5440A71724j26776n53737J3456N66148L11740l48906n25696K30288J472565J872237
$$ 171724 44948 -508789 -495333 70815 382555 33649 -492047 -261759 1210806 3083043
5430C083043L21589k331363l471809j634312J433652K742317J548182l29377j176285
$$ 3083043 3404632 1073269 -2398540 -4032852 -2599200 143117 1691299 1361922 185637
5421A85637r08326j30204P51310J213188P48733k09666n16143J30617P77442P12490
$$ 185637 -722689 -852893 -101583 1111605 1860338 1650672 1134529 1265146 2042588 2755078
5411B755078L74188L06991K49394n4863j11295L38855M19530o04848j718815j261950
$$ 2755078 3129266 3436257 3685651 3630788 3519493 3858348 4277878 3673030 1954215 692265
5401F92265M65676J244594K6696j439589j074825N33722J082420l2330r89710
$$ 692265 1157941 2402535 2429231 989642 -85183 448539 1530959 1498629 508919
5392E08919l78860R42263J537107J437052J323425Q91859l84520j656933j641774
$$ 508919 130059 1072322 2609429 4046481 5369906 6261765 5877245 4220312 2578538
5383B578538p69116n92312j205881j169022j36771M79183J6703k90897L96343
$$ 2578538 1809422 1217110 11229 -1157793 -1294564 -815381 -798678 -1089575 -693232
5374f93232R66752L57678m82437r1435J291035K363709K506630J702700r028j780307
$$ -693232 273520 631198 148761 57326 1348361 3712070 6218700 7921400 7912372 6132065
5364F132065k100281j038031o67997j700239j767779O75965K941429J789206j183452
$$ 6132065 4031784 2993753 2325756 625517 -1142262 -466297 2475132 4264338 3080886
5355C080886j744528L92195J533219L30248n06298M38348Q41834p15438j910265
$$ 3080886 1336358 1728553 3261772 3592020 3085722 3524070 4365904 3650466 1740201
5346A740201r50595M9901r82848j997300l05848K358399K335678k5377j103827
$$ 1740201 789606 839507 -143341 -2140641 -2446489 -88090 2247588 2222211 1118384
5337A118384P6250P98785l20244j123587J39694J757915J249552q87676k012771
$$ 1118384 1194634 1993419 1673175 549588 689282 2447197 3696749 2809073 796302
5328G96302r49303P96591J213906J86881o07627L8629J256068J359034L44371
$$ 796302 -153001 643590 1857496 2044377 1436750 1475379 2731447 4090481 4434852
5319D434852k04390J92743J44309r50077j509155m74933N58496o6775j111186
$$ 4434852 4230462 4423205 4567514 3617437 2108282 1633349 2191845 2125070 1013884
5310A013884n66842P03812M00677j140964j528288m43930J68738l6395O59118
$$ 1013884 447042 1150854 1551531 410567 -1117721 -1561651 -1392913 -1429308 -770190
5301g70190K130132J701407j270586l373786j735175J876248L711298K830849
$$ -770190 1359942 3061349 1790763 -1583023 -3318198 -1441950 2269348 5100197
5293E100197J048970l34807j416897k168407k088390j196151j65310L45251K0983
$$ 5100197 6149167 5814360 4397463 2229056 140666 -1055485 -1220795 -875544 -854561
5284h54561p90643r42729J59865J065294m6964k017628j562218J682010L800803
$$ -854561 -1645204 -2587933 -2428068 -1362774 -1409738 -3427366 -4989584 -3307574 493229
5275D93229J980410j430261k542447j246428r7511J46719N97978J159023P70267
$$ 493229 2473639 1043378 -1499069 -2745497 -2843008 -2696289 -2098311 -939288 -169021
5266a69021K6915L29751Q85190k06334k098536j880065O17230K151267J056708
$$ -169021 -142106 187645 1072835 866501 -1232035 -3112100 -2494870 -343603 713105
5257G13105l95556j418J031595O59892n79308j013520q52702j366491k231629
$$ 713105 317549 316131 1347726 2007618 1428310 414790 -437912 -1804403 -4036032
5248d036032j972021m47987R71935J402036J123555O06966J75596L60061J344144
$$ -4036032 -6008053 -6456040 -5484105 -4082069 -2958514 -2351548 -2175952 -1815891 -471747
5239d71747K227907J948330Q06228M9007L6140q7581p63514j147872m41627O12361
$$ -471747 1756160 3704490 4510718 4559725 4595865 4508284 3744770 2596898 2155271 2767632
5229B767632M59623j056744k035186p12571K047050L486639K335372K60898o89303
$$ 2767632 3227255 2170511 135325 -577246 1469804 4956443 7291815 7552713 6863410
5220F863410p34339j135043j606568j051423j29065n28928j769862j487746N46669
$$ 6863410 6129071 4994028 3387460 2336037 2206972 1678044 -91818 -1579564 -1032895
5211a032895J528573n1649j847135j244053P76662J588881Q63977J11956k16670
$$ -1032895 495678 444029 -1403106 -2647159 -1870497 -281616 582361 694317 477647
5202D77647n58969l61096Q62250J481718k78674k839383k828921q8047K018279
$$ 477647 -81322 -442418 419832 1901550 1622876 -1216507 -4045428 -4133475 -2115196
5193b115196J639070N97736O52658P97972q8812p16391K78431J574744J194884
$$ -2115196 -476126 121610 774268 1572240 1483428 767037 1045468 2620212 3815096
5184C815096j90199m28576N98196J004865j2930j280885j752725j659893j398034
$$ 3815096 3624897 3196321 3794517 4799382 4786452 3505567 1752842 92949 -1305085
5175a305085q22610O157N55980O29527N85163O06777M92814J94366j15061m32676
$$ -1305085 -2127695 -2121538 -1565558 -936031 -350868 255909 748723 943089 828028 395352
5165C95352p73360q43819m96056j40944k2260L62471J200492J402247M9645j638467
$$ 395352 -378008 -1221827 -1717883 -1858827 -1881087 -1518616 -318124 1084123 1133768 -504699
5155e04699j416200R18770L104030L268735J763236j42094j807604k824467k495947
$$ -504699 -1920899 -1002129 2101901 5370636 7133872 6991778 5184174 2359707 -136240
5146a36240p50798J264562K272833J938207O01190j024550j628534k38704J944473
$$ -136240 -887038 377524 2650357 4588564 5189754 4165204 2536670 2297966 4242439
5137D242439K182577k77096k755391k552317m49710Q35999M87246j48118k56245
$$ 4242439 6425016 6147920 3392529 840212 390502 1226501 1713747 1565629 1309384
5128A309384k47516j36480N01314J017502L48700p23449l20672J168852J067224
$$ 1309384 1061868 925388 1426702 2444204 2792904 2069455 1748783 2917635 3984859
5119C984859j343216l178383k152603k7434L57584m73849j478J719004K081125
$$ 3984859 2641643 -536740 -2689343 -2716777 -2359193 -2833042 -2834520 -1115516 965609
5110I65609L28845j131232m90274R23179J037409K8379n00581J8110Q51752J237138
$$ 965609 1294454 163222 -327052 596127 1633536 1661915 1161334 1179444 2031196 3268334
5100C268334P35244q45462k683909k882475o25274K017801K051051n55522k430514
$$ 3268334 4003578 3158116 474207 -2408268 -3033542 -1015741 1035310 479788 -1950726
5091a950726r35365K412661L807666J905680p14656j124278K46403O64159q03712
$$ -1950726 -2886091 -473430 3334236 5239916 4525260 3400982 3647385 4311544 3507832
5082C507832k040806j170608N94128P77909p22443j658936p66511P89542J513583
$$ 3507832 1467026 296418 890546 1668455 946012 -712924 -1479435 -689893 823690
5073H23690J374249R00895R5761q08642q63409J81911J062078P48779J9526M2509
$$ 823690 2197939 3098834 3194595 2385953 1522544 1704455 2766533 3515312 3534838 3577347
5063C577347L96007J751p77313o89447K39823P96988N32776m4542r29905k383809
$$ 3577347 3973354 3975105 3197792 2508345 2748168 3545156 4077932 4033390 3103485 719676
5053G19676l337398k181736M95232K072550J483337N82748R57624J481281O11335
$$ 719676 -2617722 -4799458 -4304226 -2231676 -748339 -165591 792033 2273314 2884649
5044B884649o92546m56578J018183J533771K01993j586416k225948j412484K03261
$$ 2884649 2192103 1735525 2753708 4287479 4489472 2903056 677108 -735376 -532115
5035e32115J459417J034665j124839k877174j985424Q12969K454112J464360m48104
$$ -532115 927302 1961967 837128 -2040046 -4025470 -3212501 -758389 705971 257867
5026B57867j148078o54103r5690K76814O85019O10916m05934j399626r84846M64047
$$ 257867 -890211 -1544314 -1640004 -1363190 -678171 -67255 -473189 -1872815 -2857661 -2393614
5016b393614J084753J31660r75467p19155M21253Q08287K5840o26028p1284J024817
$$ -2393614 -1308861 -1177201 -2152668 -2871823 -2450570 -1642283 -1616443 -2242471 -2313755 -1288938
5006a288938J284640O47108M11938J195337J845906J072055n41193j202710m22194
$$ -1288938 -4298 642810 1054748 2250085 4095991 5168046 4626853 3424143 3001949
4997C001949K86779m40494j858862k041775l88428J551184J868639M59035r81582
$$ 3001949 3288728 2848234 989372 -1052403 -1440831 110353 1978992 2438027 1456445
4988A456445j035188j24312M06714L10227N27116J259611J340942K48794o24332
$$ 1456445 421257 296945 703659 1013886 1541002 2800613 4141555 4390349 3766017
4979C766017r8587N07424p86790l074809l287482p23716J581331J083172p41000
$$ 3766017 3667430 4174854 3388064 313255 -2974227 -3697943 -2116612 -1033440 -1774440
4970a774440p57321J357400K987295K297251K86518q99856m60825N23398M17811
$$ -1774440 -2531761 -1174361 1812934 4110185 4396703 3496847 3036022 3559420 3977231
4961C977231j177335k761105k449982l43995J395808J216807m9756p04918l82549
$$ 3977231 2799896 38791 -2411191 -2755186 -1359378 -142571 -192327 -897245 -1279794
4952a279794K21035P86137J259588J061437j91836j581342j764585p16793M17098
$$ -1279794 -1058759 -272622 986966 2048403 1856567 275225 -1489360 -2206153 -1789055
4943a789055Q66707P07797K77468O7905O08286J482195J280081k98948j321371
$$ -1789055 -922348 -214551 62917 130822 739108 2221303 3501384 3202436 1881065
4934A881065j96623J594136J402313o26728j845611j088223J15629M41793L85442
$$ 1881065 1684442 3278578 4680891 4054163 2208552 1120329 1235958 1677751 2063193
4925B063193M17113q7813j130354j399519m52096K35633l77140j112587m96647
$$ 2063193 2480306 2392493 1262139 -137380 -589476 -353843 -730983 -1843570 -2340217
4916b340217Q77027J310986L95843p43625r44074j2943J087465Q19600j103861
$$ -2340217 -1463190 -152204 243639 -499986 -1444060 -1457003 -369538 450062 -653799
4907f53799k493421r92872K221421L311928J008516j565812j509455O0484O67003
$$ -653799 -3147220 -4140092 -1918671 1393257 2401773 835961 -673494 -613010 53993
4898E3993L64930M32993L33993r30005j941383o82727J615519J769710m83643
$$ 53993 418923 851916 1185909 255904 -1685479 -2368206 -752687 1017023 533380
4889E33380k077639j261516L01950O63632J30856k40839m18743n49957j99555
$$ 533380 -1544259 -2805775 -2503825 -1840193 -1709337 -1950176 -2368919 -2918876 -3118431
4880c118431M67640K92433j014004j900206r40856J180243K578445K384092J351156
$$ -3118431 -2650791 -2358358 -3372362 -5272568 -6213424 -5033181 -2454736 -70644 1280512
4871A280512P10343Q48384R34267j7173j482050j628216M0119J340985K18793
$$ 1280512 1990855 2839239 3773506 3756333 2274283 646067 686186 2027171 2245964
4862B245964k060366k546089q30966P09276O94115K19616L13718M44849K46010
$$ 2245964 185598 -2360491 -3191457 -2482181 -1788066 -1568450 -1254732 -809883 -563873
4853e63873L98410R05649O24703n15931q90127J86642J207361R92108M32697M59797
$$ -563873 -165463 740186 1364889 848958 -41169 145473 1352834 2344942 2777639 3237436
4843C237436L36743m93168q54301O0373Q17815n1994j518819j747133r60709n25928
$$ 3237436 3574179 3081011 2226710 2287083 3104898 3052904 1534085 -213048 -1173757 -1699685
4833a699685l97472L24708J265360J375811R00067P34432O20236m5618n11063
$$ -1699685 -2097157 -1772449 -507089 868722 1768789 2503221 3123457 3077839 2566776
4824B566776N9458N46514m67229j860679j563189l25023o99573k422021k329090
$$ 2566776 2626234 3172748 2705519 844840 -718349 -1043372 -1742945 -4164966 -6494056
4815f494056M97902K982198K752624J378706J011237P52460r42670k555479j545069
$$ -6494056 -5996154 -3013956 -261332 1117374 2128611 2881071 1938401 -617078 -2162147
4806b162147J094891J762855l98328k216256j255009Q50535J292407K40859l9066
$$ -2162147 -1067256 695599 297271 -1918985 -3173994 -2323459 -1031052 -790193 -829259
4797h29259Q99535J132192k32814j378999n76861J030802J184958R2255N3044
$$ -829259 70276 1202468 969654 -409345 -986206 44596 1229554 1321809 1374853
4788A374853J587219K271929L71194k308817k774561p88085J267384J637396N80298
$$ 1374853 2962072 5234001 5605195 3296378 521817 -266268 1001116 2638512 3218810
4779C218810r19854k005946j787552j34829J384255J057727m36053q00505M62275
$$ 3218810 2298956 293010 -1494542 -1629371 -245116 812611 376558 -423947 38328
4770C8328J409891Q81530J83677N35224Q83986j16119j553327j631496n38350
$$ 38328 1448219 2329749 2513426 3048650 3932636 3816517 2263190 631694 93344
4761I3344Q6719o1420K30677J237227J672770R13459R1629K04023N22240q1911
$$ 93344 180063 118643 349320 1586547 3259317 4172776 4264405 4468428 4990668 4908757
4751D908757j246795j757787j456199j240603j384746j139377k18650M95238L54366
$$ 4908757 3661962 1904175 447976 -792627 -2177373 -3316750 -3535400 -3040162 -2685796
4742b685796J25107Q23435J944814J987667N80767j020622j678393j555959j236033
$$ -2685796 -2560689 -1737254 207560 2195227 2775994 1755372 76979 -1478980 -2715013
4733b715013o84272K85752J291269J802283J733623J134113l9717j344720j860531
$$ -2715013 -3399285 -3113533 -1822264 -19981 1713642 2847755 2808038 1463318 -397213
4724c97213j409430r14953q54485m00687R32974J940219J407425J95595J072P85597
$$ -397213 -1806643 -2721596 -3576081 -3976768 -3043794 -1103575 303850 499445 500517 1286114
4714A286114J226523J089970J112761R60151l34477j913836j622069M80355J576477
$$ 1286114 2512637 3602607 4715368 5675519 5341042 3427206 1805137 2285492 3861969
4705C861969Q7218j973619j985790k04175J299552J638335J356284Q39133J86054
$$ 3861969 3949187 1975568 -10222 -214397 1085155 2723490 4079774 4918907 5104961
4696E104961j10708J44397J10191q27906j699559j190383K79721J033332L71422
$$ 5104961 4994253 5138650 5248841 4420935 2721376 1530993 1810714 2844046 3215468
4687C215468p74389j143172k15176J581047K897666K301801j269j931621j971401
$$ 3215468 2441079 1297907 1082731 2663778 5561444 7863245 7861976 5930355 3958954
4678C958954j031176p61978j008693n99950R7856m39287k059446k618611j027799
$$ 3958954 2927778 2165800 1157107 557157 655013 215726 -1843720 -4462331 -5490130
4669e490130J138080J883729J223665M10158q0681n57808q40741l29821P66557
$$ -5490130 -4352050 -2468321 -1244656 -834498 -915179 -1472987 -2313728 -2643549 -1876992
4660a876992J379993J025763N10995P13253J207051Q93846j69697n95861K76377
$$ -1876992 -496999 528764 1039759 1753012 2960063 3853909 3684212 3088351 3364728
4651C364728J136785M85570j057118j593485p42473N1057L3320J02923O95160
$$ 3364728 4501513 4987083 3929965 2336480 1594007 1645064 1678384 1781307 2476467
4642B476467N93363r78657k604541k480297q98928M51286P73630M60995M458r9388
$$ 2476467 3069830 2091173 -513368 -2993665 -3892593 -3441307 -2667677 -2206682 -2202224 -2301612
4632b301612P41065K076821K196422M77814j159523q46378L80416L91763m92259
$$ -2301612 -1560547 516274 2712696 3190510 2030987 1184609 1565025 1956788 1464529
4623A464529l69610N90319L56636j217370j895500p62349M10540L05721r3529
$$ 1464529 1094919 1685238 2041874 824504 -1070996 -1833345 -1422805 -1117084 -1210613
4614a210613J26642J28649n80231o79775O22565J754765J169955n9659k0653R69688
$$ -1210613 -1083971 -955322 -1535553 -2215328 -1592763 162002 1331957 1272298 1251645 2221333
4604B221333J105612J068j075814j308943r99268n43788j96638m69172j478526
$$ 2221333 3326945 3328013 2252199 943256 -56012 -599800 -796438 -1265610 -2744136
4595b744136k249663j782600m08777Q60908J691407K100584J614228R1516j252718
$$ -2744136 -4993799 -6776399 -7185176 -6324268 -4632861 -2532277 -918049 -826533 -2079251
4586b079251j099304J12382Q79555P66863N39624O14906P67826J013694J375630
$$ -2079251 -3178555 -3066173 -2186618 -1419755 -880131 -265225 502601 1516295 2891925
4577B891925J121301k81482j748685j732875o22326k68879j098883j507955m71853
$$ 2891925 4013226 3731744 1983059 250184 -372142 -641021 -1739904 -3247859 -3719712
4568c719712R81935J533050J271025Q68538L63247l64625r26457j030649r28334
$$ -3719712 -2737777 -1204727 66298 934836 1298083 933458 7001 -1023648 -1951982
4559a951982p04379n4581P30077O65400l56630r99832l23131Q41009J283780J180270
$$ -1951982 -2656361 -2710942 -1980865 -1315465 -1672095 -2671927 -2995058 -2154049 -870269 310001
4549C10001J315320J459714R03042j3253l66460l15720q14231j747045j846495
$$ 310001 1625321 3085035 3988077 3974824 3608364 3292644 2478413 731368 -1115127
4540a115127p14934M17582M69946q7644k75800q4943l9211J8993O62945J666563
$$ -1115127 -1830061 -1412479 -942533 -1030177 -1305977 -1390920 -1430131 -1411138 -748193 918370
4530I18370K005650J142669l55331j575195k054878j706917n85281Q90588J902184
$$ 918370 2924020 4066689 3711358 2136163 81285 -1625632 -2210913 -1320325 581859
4521E81859J873168R71776k44600j334359j846605j277817J54738J138780O39307
$$ 581859 2455027 3426803 3182203 1847844 1239 -1276578 -1121840 16940 656247
4512F56247n64385q54954k22270k18402j112868r64572J244097L259195K399845
$$ 656247 91862 -763092 -985362 -1203764 -2316632 -3281204 -2037107 1222088 3621933
4503C621933l31808j500643k10762R45350K82353n14949L37938J527318R09599
$$ 3621933 3290125 1789482 1578720 2524070 2806423 2291474 2629412 4156730 5066329
4494E066329p72316j054115K45300Q27487l78898j724777j583904o26737l98308
$$ 5066329 4294013 3239898 3485198 4312685 3933787 2209010 625106 -1631 -399939
4485c99939r84944j196766l86852P53885J004596n5479j339656j138600P49078
$$ -399939 -1384883 -2581649 -2968501 -2214616 -1210020 -1265499 -2605155 -3743755 -2994677
4476b994677K271201J512762o23804j554724o01362L44463n9291p82767m86826
$$ -2994677 -723476 789286 165482 -1389242 -1990604 -1646141 -1705432 -2488199 -2975025
4467b975025M00652Q39596Q97485R67247N63710o00430j418329q65796K00087
$$ -2975025 -2574373 -1734777 -837292 129955 693665 93235 -1325094 -2190890 -1990803
4458a990803L27702k55386m03012l44641j147822k259700j831232L34499K222340
$$ -1990803 -1663101 -1918487 -2321499 -2666140 -3813962 -6073662 -7904894 -7570395 -5348055
4449e348055K467223J904746J596041J107377j71586j423485j427391l58435N18399
$$ -5348055 -2880832 -976086 619955 1727332 1555746 132261 -1295130 -1653565 -1135166
4440a135166M43240k94732r37007q40808M2929R22875R29451K93910N6103N10549
$$ -1135166 -691926 -986658 -1923665 -2764473 -2721544 -1798669 -869218 -575308 -519205 -8656
4430h656R04531Q40016P92879Q70329L44769r04175j655381r06703P34236J947356
$$ -8656 895875 1735891 2528770 3399099 3743868 2839693 1184312 277609 1011845 2959201
4420B959201K129175J350397o5823j243594j132708L6969P50995L61364n0228
$$ 2959201 5088376 6438773 6372950 5129356 3996648 4033617 4784612 5145976 5095748
4411E095748K31154J97940q68654j644400p96751N42203M19589p73260j036942
$$ 5095748 5326902 5524842 4656188 3011788 2215037 2757240 3176829 2403569 1366627
4402A366627j03414L24664l81156p49850K86567J677884J795480M64529j185838
$$ 1366627 1263213 1587877 1206721 456871 743438 2421322 4216802 4681331 3495493
4393C495493k087943k017052j488556j003446k82091J177978K590545K254354
$$ 3495493 1407550 -609502 -2098058 -3101504 -3383595 -2205617 384928 2639282
4385B639282K59691q06138O01162K309048J452165j143475k285400j265908l44674
$$ 2639282 2898973 2092835 2693997 5003045 6455210 5311735 3026335 1760427 1415753
4376A415753o35179o76967M29593J345087Q82606k29168q71249q78767k64079
$$ 1415753 780574 103607 533200 1878287 2760893 2531725 1660476 781709 517630
4367E17630R24636J542317L32517j580120j580883M66464J709900N67007j182846
$$ 517630 1442266 2984583 3317100 1736980 156097 622561 2332461 2899468 1716622
4358A716622j600129j120960n72982N41516K090270K310032P03131n67403k06000
$$ 1716622 116493 -1004467 -1577449 -1035933 1054337 3364369 4067500 3500097 3294097
4349C294097j12896j801448l086820j372112J838712L000323J605204M150o54595
$$ 3294097 3181201 1379753 -1707067 -3079179 -1240467 1759856 3365060 3369210 2714615
4340B714615j079848j270221m92228N59202M51762l56217j70155R09297J132110
$$ 2714615 1634767 364546 -127682 431520 883282 527065 356910 1266207 2398317
4331B398317J06778p64615p90276o67725p06210m60561n6141R133Q3872N66393
$$ 2398317 2505095 1740480 950204 282479 -423731 -884292 -940433 -931300 -847428 -281035
4321b81035N42953p20199j765574q59496Q86222J071616J1432P4514J406566J687082
$$ -281035 261918 -458281 -2223855 -3083351 -2197129 -1125513 -1114081 -1039567 366999 2054081
4311B054081K48443r16069p01456k28716l6917Q32724K099720J793981k92437
$$ 2054081 2302524 1386455 684999 456283 419366 1252090 3351810 5145791 4853354
4302D853354j693691j100551k41867n78547j000694m31595O6780l27076k88451
$$ 4853354 3159663 2059112 1817245 1238698 238004 -193591 -126811 -453887 -742338
4293g42338J111035K260806J559572O1828n26529n54762r87757j139615j69900
$$ -742338 368697 2629503 4189075 4250903 3724374 3169612 2181855 1042240 872340
4284H72340P81224L31728o39084n58040J380n44461j762347j752136k46871R68122
$$ 872340 1653564 1985292 1346208 788168 789548 245087 -1517260 -3269396 -3516267 -2548145
4274b548145N92946p97697j724285j113754Q43688K407094J850049k0379m68369
$$ -2548145 -1955199 -2752896 -4477181 -5590935 -4747247 -2340153 -490104 -510483 -978852
4265i78852J158090K104305L97969j875247j697200M08325J648936J191899L32176
$$ -978852 179238 2283543 2681512 806265 -890935 -482610 1166326 2358225 2690401
4256B690401l64484j162534j242000L62305K357423K489362R51264j00756r7233
$$ 2690401 2325917 1163383 -78617 283688 2641111 5130473 6081737 5980981 5883748
4247E883748l85750j182400j069234K06232J084635P91069J82399l75271j535743
$$ 5883748 5497998 4315598 3246364 3452596 4537231 5328300 5510699 5135428 3599685
4238C599685k873009k708404q21600Q76246J171384R13769P75856l2517j611145
$$ 3599685 726676 -1981728 -2803328 -1927082 -755698 158071 933927 901410 -709735
4229g09735k111117l25159K017590K276687K68347j788454k019964n13296J280331
$$ -709735 -2820852 -3146011 -1128421 1148266 1416613 -371841 -2391805 -2905101 -1624770
4220a624770J932313J179052P4360l39576l27942o40573q51265K3639J436710
$$ -1624770 307543 1486595 1560955 1221379 893437 252864 -598401 -574762 861948
4211H61948J640755L17092r37664j142866j066513j227960p70493O33215J538439
$$ 861948 2502703 2819795 1882131 739265 -327248 -1555208 -2325701 -1692486 -154047
4202a54047P27637q98270j657658j165960l5097J284374K274887K149373R99478
$$ -154047 573590 -324680 -1982338 -3148298 -3183395 -1899021 375866 2525239 3524717
4193C524717P5762l3503k35057r47403q93583O14768J728820M71970j947776k555004
$$ 3524717 3600479 3566976 3331919 2384516 1490933 2105701 3834521 4306491 2358715 -196289
4183a96289q73989N46962m23j143626p98713Q33682J786257J019489m70155j075415
$$ -196289 -1070278 -523316 -523739 -1667365 -2466078 -1632396 153861 1173350 703195 -372220
4173c72220l95617O21023J038596Q80100N13777j79494j152820j283640L53863
$$ -372220 -767837 -146814 891782 1771882 2285659 2106165 953345 -330295 23568
4164B3568K352630J990198r78593l394182k731395l89978O56586L2692l27304
$$ 23568 2376198 4366396 3387803 -6379 -2737774 -3127752 -2471166 -2438474 -2765778
4155b765778L28575P87665L54676j42228j08217m1037j63104J19066P69130O74484
$$ -2765778 -2437203 -1649538 -1294862 -1437090 -1545307 -1586344 -1749448 -1630382 -861252 -186768
4145a86768n24459j464229r01798M99410J265994J178414J088780J205624Q27934
$$ -186768 -711227 -2175456 -3077254 -2577844 -1311850 -133436 955344 2160968 2988902
4136B988902k22223r69147n22971N99522R14740l05690k023908k362202o28551
$$ 2988902 2766679 1797532 1274561 1874083 2788823 2483133 459225 -1902977 -2531528
4127b531528J745087K581841J266781o73412j394558p11360R3019Q8984l14980
$$ -2531528 -786441 1795400 3062181 2388769 994211 282851 375870 464854 149874
4118A49874k80998J89112L83980R295l98813k23263N30643J376064J741516J133213
$$ 149874 -131124 57988 441968 451263 52450 -170813 359830 1735894 3477410 4610623
4108D610623m80976k139314k403326r91118O27133R31186J63404l28976n4085
$$ 4610623 4129647 1990333 -412993 -1404111 -776978 154208 317612 -11364 -65449
4099f5449L57402N16637P04193R70467R45875O40187L97847M3491p78658j427092
$$ -65449 291953 808590 1512783 2483250 3429125 4069312 4467159 4510650 3731992 2304900
4089B304900q65432L48904L48900j128779j798152M4631K786659L375677J151022
$$ 2304900 1439468 1788372 2137272 1008493 -789659 -745028 2041631 5417308 6568330
4080F568330j570014k329988q94174R31455J080858q28376k839375k546924m0536
$$ 6568330 4998316 2668328 1774154 2705609 3786467 2958091 118716 -2428208 -2468744
4071b468744J994813J645514k3526r68942r01408o32590n0932J306853K482014
$$ -2468744 -473931 1171583 1148057 179115 -722293 -1354883 -1405815 -98962 2383052
4062B383052J967682Q0830j345065j497219j153079q66686l48114K81788L36636
$$ 2383052 4350734 4431564 3086499 1589280 436201 -430485 -778599 -496811 -160175
4053a60175p3985q9524K21851j85140j288977j509263K2371K011925K604770J422895
$$ -160175 -234160 -323684 -101833 -286973 -1575950 -3085213 -3062842 -1050917 1553853 2976748
4043B976748n77820k250895k711675j714495k01218M78625L79626Q89750K352025
$$ 2976748 2398928 148033 -2563642 -4278137 -4479355 -4000730 -3621104 -2731354 -379329
4034c79329L171477K236693Q47308P76544J422824O98216j619110l243440k412243
$$ -379329 2792148 5028841 5876149 6652693 8075517 8773733 7154623 3911183 1498940
4025A498940j63857J097263M21993j065484j858542j546203o84085N8386K81487
$$ 1498940 1335083 2432346 2854339 1788855 -69687 -1615890 -2299975 -2241589 -1960102
4016a960102j33817q17705r09547L0933J086895Q24624o06708j209454K64065
$$ -1960102 -2093919 -2911624 -3821171 -3790238 -2703343 -1878719 -2485427 -3694881 -3430816
4007c430816K353437K685470J051943p26739j544967j847489j774849n51107J531121
$$ -3430816 -1077379 1608091 2660034 1933295 388328 -1459161 -3234010 -3785117 -2253996
3998b253996K357848O41103j839579k192518l8268K215562K481645J096197k64541
$$ -2253996 103852 744955 -1094624 -3287142 -3325410 -1109848 1371797 2467994 2203453
3989B203453o44877l08167J11775K60187J4063o09130j179101q31856P98908K558508
$$ 2203453 1558576 1250409 1362184 1622371 1636434 1027304 -151797 -983653 -184745 2373763
3979B373763K552479N24721j363138j096944N39836J201108L23863n27643n24513
$$ 2373763 4926242 5450963 4087825 2990881 3530717 4731825 5055688 4528045 4003532
3970D003532o53250j392550j446320n1422J209687O22085q58745r32077N84607
$$ 4003532 3350282 1957732 511412 459990 1669677 2291762 1433017 500940 1085547
3961A085547J519807M78194j384406j996517p21438J200829J942721Q14926r05841
$$ 1085547 2605354 3083548 1699142 -297375 -1018813 182016 2124737 2939663 2033822
3952B033822j251111l8221P63372j53881j397812r77935N71265J049863K8111
$$ 2033822 782711 744490 1507862 1353981 -43831 -1021766 -450501 599362 627473
3943F27473p15687j86564N43336N30138M61464J059230J594613J098564j38729
$$ 627473 -88214 -274778 268558 798696 1260160 2319390 3914003 5012567 4873838
3934D873838j236998j827148j688911n33728Q98610Q72931r27224k251308j117581
$$ 4873838 3636840 1809692 120781 -412947 485663 1358594 431370 -1819938 -2937519
3925b937519J231175K005329P05786p36887j149042j166585j145119l94199R63115
$$ -2937519 -1706344 298985 1004771 267884 -881158 -2047743 -3192862 -3587061 -2623946
3916b623946J528094Q96671M42792Q08402O07849r39318k046031j032097O67320
$$ -2623946 -1095852 -199181 243611 1052013 1659862 720544 -1325487 -2357584 -1690264
3907a690264O46098m81252j18328J807024K523959R01147q18853p79632j94601
$$ -1690264 -1044166 -1525418 -1643746 163278 2687237 3588384 2769531 1989899 1795298
3898A795298o49299j192984l72645O96901k3572j854604k149319l59096J218707
$$ 1795298 1145999 -46985 -419630 277271 253699 -1600905 -3750224 -4109320 -2890613
3889b890613J011402K03426M15775J177123R26253n14542j655003j200237M93662
$$ -2890613 -1879211 -1675785 -1260010 -82887 843366 328824 -1326179 -2526416 -2032754
3880b032754J787580J391833l24935j791237k025510j430592o36414M17949J569526
$$ -2032754 -245174 1146659 821724 -969513 -2995023 -4425615 -5062029 -4644080 -3074554
3871c074554J776288O10780n51643k95861P38359J127682J069183J489367J661938
$$ -3074554 -1298266 -687486 -1239129 -1534990 -796631 331051 1400234 2889601 4551539
3862D551539L03155j496299j418217R8535K96686j107898j215348Q61817J910549
$$ 4551539 4854694 3358395 1940178 2038713 2335399 1227501 12153 873970 2784519
3853B784519j47559k423285j444245J432035K440857J145496P4298Q4527j30795
$$ 2784519 2636960 213675 -1230570 201465 2642322 3787818 3862116 3946643 3815848
3844C815848p09514m56690K90288M3035o78224P7262J800713J643172r46332k966869
$$ 3815848 3106334 2649644 2939932 2982967 2304743 2382005 4182718 5825890 4879558 1912689
3834A912689k275779l02576Q17840R97400O92078n90697k471831k796453o18720
$$ 1912689 -363090 -665666 152174 1149574 1841652 1250955 -1220876 -4017329 -4636049
3825d636049J837800K197056J165525P54902R70408N70276k06815j31537O01407
$$ -4636049 -2798249 -601193 564332 1319234 2289642 2859918 2653103 2521566 3122973
3816C122973O92503l3531o57701r30593j182459j005028R2388J165656R22268
$$ 3122973 3815476 3781945 3124244 2193651 1011192 6164 98552 1264208 2186476
3807B186476m963J24384J244047J479875J61741j230020j503738j202611j043338
$$ 2186476 2181513 2305897 3549944 5029819 5191560 3961540 2457802 1255191 211853
3798B11853p31836j15029J22844j73149k2652R36209J421865L91555j143119j401005
$$ 211853 -519983 -635012 -512168 -685317 -707969 228240 1650105 2041660 898541 -502464
3788e02464j33798J427341K192871J773242J86113j848342k925491k403822j324298
$$ -502464 -636262 791079 2983950 4757192 4943305 3094963 169472 -2234350 -3558648
3779c558648q45614m77446P54381K048463J626970k89447j288192o9110J780522
$$ -3558648 -4404262 -4881708 -4127327 -2078864 -451894 -741341 -2029533 -2098643 -318121
3770c18121K164249J133905O5086n26224r34887r95712m50803m139m10573q82490
$$ -318121 1846128 2980033 3045119 2518895 1584008 588296 137493 133354 -277219 -1159709
3760a159709j02644J335524J429271k5643p84789M29552J804970J180016o78477
$$ -1159709 -1262353 73171 1502442 1476799 692010 1121562 2926532 4106548 3428071
3751C428071j437506p38454k00234m50284m79457J3685o5287r35719j042709M66049
$$ 3428071 1990565 1252111 1051877 601593 122136 135821 70534 -865185 -1907894 -1441845
3741a441845K002569J668242k1368r63565k85557R55700J409521O73191p13343
$$ -1441845 560724 2228966 2207598 1244033 958476 1914176 3323697 3996888 3283545
3732C283545j597005r72685P44546J750099J010277k95791n08295J46971K71752
$$ 3283545 1686540 713855 1458401 3208500 4218777 3922986 3414691 3561662 3833414
3723C833414l53000q14658r96302j537178k012523j222550M60303J129523L19204
$$ 3833414 3480414 2665756 1669454 132276 -1880247 -3102797 -2642494 -1512971 -1193767
3714a193767j50419P45258J392965K58518j382105j377092l2005O56880K68569
$$ -1193767 -1344186 -598928 794037 1052555 -329550 -1706642 -1738647 -1081767 -813198
3705h13198K18572J074215J729957J391252N84035j17701q33727j494078j571537
$$ -813198 -594626 479589 2209546 3600798 4184833 4067132 3233405 1739327 167790
3696A67790j061679n49631r3851O98913J341963P18838r35972j826773j005824
$$ 167790 -893889 -1443520 -1537371 -838458 503505 1222343 286371 -1540402 -2546226
3687b546226L90348J007689R98878J053830J047068O59163K15930j7103k70510
$$ -2546226 -2155878 -1148189 -149311 904519 1951587 2610750 2826680 2809577 2539067
3678B539067k59545P92993K189896J654695j279014l578797k495961M88089J927521
$$ 2539067 2279522 3072515 5262411 6917106 5638092 2059295 -436666 51423 1978944
3669A978944J305479P69292R06123J83131j516548k225111j352273p12350j171911
$$ 1978944 3284423 4053715 4959838 5142969 3626421 1401310 49037 -663313 -1835224
3660a835224j201163M2378J039103Q25886Q30041J922383K289320N64934j295849
$$ -1835224 -3036387 -2994009 -1954906 -1129020 -298979 1623404 3912724 4477658 3181809
3651C181809r84914L55101L24975m33440L84754K129540J720952j317019l798025
$$ 3181809 2196895 2551996 2876971 2443531 2828285 4957825 6678777 5361758 1563733
3642A563733l368154j151270P75329J881572K248563J551782K15297k79790O08352
$$ 1563733 -1804421 -2955691 -2180362 -298790 1949773 3501555 3716852 3437062 4045414
3633D045414J624682J633780R22947J1076j147232k061523j579724K08576J539727
$$ 4045414 5670096 7303876 8226823 8237899 7090667 5029144 3449420 3657996 5197723
3624E197723J341207M53890k96339j350814k624896k492621k72016J925551J794792
$$ 5197723 6538930 6992820 6696481 5345667 2720771 228150 -43866 1881685 3676477
3615C676477O2792q51373m17482j45256p42710j207874p12969K72148R09372Q75455
$$ 3676477 3739269 2887896 2470414 2325158 1582448 374574 -338395 -66247 843125 1718580
3605A718580K88954l43029k87149N09472J040983N36491m15327q40197p56985
$$ 1718580 2007534 1664505 1377356 1886828 2927811 3464302 3048975 2208778 1451793
3596A451793o42067l35502L78851Q64834N11600k10457p10264j329182k120430
$$ 1451793 809726 474224 853075 1717909 2229509 2019052 1308788 -20394 -2140824
3587b140824j795401K88954K193053J674277l98919j315662n56375J20622J69812
$$ -2140824 -3936225 -3647271 -1454218 220059 -178860 -1494522 -2050897 -1930275 -1760463
3578a760463P30563J573215R51877q00529r39048J112274K159120J73898k245658
$$ -1760463 -1029900 543315 1495192 694663 -244385 867889 3027009 3200907 955249
3569I55249j945370m2327N23876J02871J118317K945866K256091j401926m221410
$$ 955249 -990121 -1032448 -508572 -405701 712616 3658482 5914573 4512647 291237
3560B91237l427611q01106O39197Q31619J444634K375021K039434L89109p12502
$$ 291237 -3136374 -3937480 -3298283 -2466664 -1022030 1352991 3392425 3781534 3069032
3551C069032k36113O38638M24067o17617j085482m12543O00945R92001O42732
$$ 3069032 2832919 3471557 3895624 3278007 2192525 1779982 2380927 3372928 4015660
3542D015660J7268m60753m38140L81017J627876K033228P23610j312666k082841
$$ 4015660 4032928 3572175 3134035 3515052 5142928 7176156 7899766 6587100 4504259
3533D504259j113854k5868j39786p33434n68439j0205k41849j090004j227749
$$ 4504259 3390405 3364537 3224751 2491317 1922878 1912673 1670824 580820 -646929
3524f46929l07778N90362O73076K76437j00023l20923k5816J107306K151436J417994
$$ -646929 -954707 -364345 308731 585168 485145 164222 138406 1245712 3397148 4815142
3514D815142j131704l208521k881169r80550K06218r8850o36115j54204J081421
$$ 4815142 3683438 474917 -2406252 -3386802 -3180584 -3279434 -3915549 -4069753 -2988332
3505b988332J849936J407572K57774l49912J31105P01508O0185j385154j859008
$$ -2988332 -1138396 269176 526950 177038 308143 1009651 1069836 -315318 -2174326
3496b174326q24648J40048j87958p70243j30205J156190J479936Q62503O98412
$$ -2174326 -2998974 -2858926 -3046884 -3817127 -3947332 -2791142 -1311206 -448703 249709
3487B49709J247788J300571L01068r44874j767730k162170j742407l5208J875795
$$ 249709 1497497 2798068 3099136 2154262 386532 -1775638 -3518045 -3553253 -1677458
3478a677458J984343K99306p75242J02339J289938R11734l28707p01559k22449
$$ -1677458 306885 606191 -169051 -66712 1223226 2134960 1806253 1104694 882245
3469H82245J2371j8875K11060J37709q71061j673284q18313P38650Q37383k99588
$$ 882245 894616 875741 1086801 1224510 353449 -1319835 -2138148 -1399498 -562115 -861703
3459h61703l54325J124295J899686Q79795m9318O21284J359689K49721j643665
$$ -861703 -1216028 -91733 1807953 2687748 2638430 3259714 4619403 4869124 3225459
3450C225459j903525n22821L27638l10973j202840j182718n13350J86547P81117
$$ 3225459 1321934 799113 1126751 815778 -387062 -1569780 -2083130 -1896583 -1115466
3441a115466J021639M17192p78579j409056p84765M24476J102436J028510Q89280
$$ -1115466 -93827 323365 -455214 -1864270 -2649035 -2224559 -1122123 -93613 795667
3432G95667J159241J345196N76271j015370j957304j128907M95205R08950p2560
$$ 795667 1954908 3300104 3876375 2861005 903701 -225206 269999 1178949 1106389
3423A106389n00065O29870J665927Q92037p04062j049022k31774L2386m99697
$$ 1106389 606324 1236194 2902121 3794158 3090096 2041074 1809300 1841686 1341989
3414A341989m51729L51594L80262q43319j737265j234211l69054k38425j73904
$$ 1341989 890260 1241854 1622116 778797 -958468 -2192679 -2561733 -2800158 -2974062
3405b974062P27302J759190J789863J140668Q29352Q74275P29540N20348M46826
$$ -2974062 -2246760 -487570 1302293 2442961 3272313 4146588 4876128 5396476 5843302
3396E843302j24771j390246j832752j93179J898489J587788r77557k538745j370799
$$ 5843302 5718531 4328285 2495533 2302354 4200843 5788631 4811074 2272329 901530
3387I01530M00584L23597p74078o62490M68961O31126k82517k28658J310633J986995
$$ 901530 1302114 1625711 851633 189143 658104 1289230 1006713 778055 2088688 4075683
3377D075683J17542k428291k649592n15248J283896J091074j35460q80463q06114
$$ 4075683 4193225 1764934 -884658 -1399906 -116010 975064 839604 -40859 -846973
3368h46973q3183J206170K205726J425324j077481k931492k268673l12787M19661
$$ -846973 -930156 276014 2481740 3907064 2829583 -101909 -2370582 -2683369 -2263708
3359b263708k69489l31209J125157K474031J996521Q8123j562033j833597p12722
$$ -2263708 -2533197 -2864406 -1739249 734782 2731303 2819426 1257393 -576204 -1288926
3350a288926R75398J892377J224024j75249o24919P6036L36367p74853k033645
$$ -1288926 -313528 1578849 2802873 2627624 2002705 2078741 2415108 1640255 -393390
3341c93390j794866j52917J460868J934398J017591q07104k259575k085409o60882
$$ -393390 -2188256 -2341173 -880305 1054093 2071684 1264580 -994995 -3080404 -3741286
3332c741286L39458M60475J021717K267936K154487k10682k077067p79975J679121
$$ -3741286 -3401828 -2941353 -1919636 348300 2502787 2292105 215038 -564937 1114184
3323A114184J270509j718167k963727q63461J136724K17415j650766j425350L05098
$$ 1114184 2384693 666526 -2297201 -3160662 -2023938 -1806523 -3457289 -4882639 -4577541
3314d577541J140752R50978J035301J008131j96534j404605o37123J180709J271149
$$ -4577541 -3436789 -2485811 -1450510 -442379 -638913 -2043518 -2680641 -1499932 -228783
3305b28783m48992j229120j24057O73699k5986l74188Q37108J632589L02184j246497
$$ -228783 -677775 -1906895 -2030952 -1357253 -1383239 -1757427 -920319 712270 1014454 -232043
3295b32043m50712J535707J613882l48403j679800j385479j077390j329956n02679
$$ -232043 -682755 852952 2466834 2118431 438631 -946848 -2024238 -3354194 -3856873
3286c856873J808420L120068J562531j165219k192342j173746K24100J079991
$$ -3856873 -2048453 1071615 2634146 1468927 -723415 -1897161 -1673061 -593070
3278e93070J404388O79208j407286l181386k292089R01609L173561K324473k42839
$$ -593070 811318 1490526 83240 -3098146 -5390235 -4488626 -1315065 1009408 766569
3269G66569j629565r21609M24791Q60400K70394n33492r15106q06603m75716j91707
$$ 766569 -862996 -1784605 -1359814 -499414 -229020 -762512 -1677618 -2484221 -2959937 -3151644
3259c151644l4747R7435L17976N41306M59891p9315n81721j95727J051765J751924
$$ -3151644 -3186391 -3088956 -2770980 -2229674 -1769783 -1849098 -2430819 -2626546 -1574781 177143
3249A77143P33246j075556j646473p22711r4085n90740p32166N22240J655645
$$ 177143 910389 -165167 -1811640 -2534351 -2628436 -3219176 -3951342 -3429102 -1773457
3240a773457J090680R4797O77220J842524J036539j238446j730286L20576J733568
$$ -1773457 -682777 -587980 89240 1931764 2968303 1729857 -429 320147 2053715
3231B053715L64078j675075j648322l04235Q3044l73859l0639R20183P94792n24278
$$ 2053715 2417793 742718 -905604 -1209839 -1126795 -1500654 -1531293 -611110 183682 -340596
3221c40596j377569q87326L34040J666119K676262K270204j27160k694248k780258
$$ -340596 -1718165 -2605491 -2271451 -605332 2070930 4341134 4213974 1519726 -1260532
3212a260532n10700J303705J119111K99708K75520L89825k68159q55311j89432
$$ -1260532 -1771232 -467527 651584 951292 1226812 1616637 1348478 493167 303735
3203C03735J109270J392992J24277j838504l286630l084981o00039L057623N066637
$$ 303735 1413005 2805997 2930274 1091770 -2194860 -5279841 -5879880 -2822257 2244380
3194B244380L621450K31588j924663j615382l48857J34513k35638n89965m86684
$$ 2244380 5865830 6097418 4172755 2557373 2208516 2343029 2107391 1517426 1030742
3185A030742l0371N49934R01930O42383j34923q06746r49759p56279n07979j08591
$$ 1030742 1000371 1550305 2452235 3094618 2959695 2152949 1203190 446911 -61068 -169659
3175a69659M91066Q42195N26510j21931m32595l86226m54951m64907L87426J928504
$$ -169659 321407 1163602 1690112 1568181 1135586 749360 294409 -170498 216928 2145432
3165B145432K434945P18274j839529k682250j328999K08547M00181O91K40767
$$ 2145432 4580377 5298651 3459122 776872 -552127 -343580 56601 57292 298059
3156B98059P60499N56216j43555l84430j36678k3471N6009N76597J042700N24705
$$ 298059 1058558 1614774 1471219 1086789 950111 926640 982649 1559246 2601946 3126651
3146C126651o04275r63631k34875M64826L83542n5598l84544o38183n77065J90718
$$ 3126651 2522376 1558745 1323870 1788696 2172238 2116640 1732096 1093913 516848 707566
3136G07566J035980P68865l72746q23677k47764j46818j144193j685495p47442
$$ 707566 1743546 2512411 2139665 1315988 1068224 921406 -222787 -1908282 -2655724
3127b655724J16221o98064j893258j174736R65450J929271J044379L54072J184318
$$ -2655724 -2539503 -3237567 -5130825 -6305561 -5340111 -3410840 -2366461 -2012389 -828071
3118h28071K256976J974619P28055j07400j65080m5352j55788m64679q52551j106990
$$ -828071 1428905 3403524 4131579 4024179 3859099 3813747 3657959 3193280 2340729 1233739
3108A233739r80205n49323q7033M21079R61538Q66966m06837j865733j701163
$$ 1233739 253534 -295789 -382822 38257 999795 1866761 1459924 -405809 -2106972
3099b106972K04207J871123J909846J165091Q00995K99379j141831k429932j755958
$$ -2106972 -1902765 -31642 1878204 3043295 3844290 4143669 3001838 571906 -1184052
3090a184052N55057K226733J987314P48779j83318n12363l96241m3645j97946
$$ -1184052 -628995 1597738 3585052 4333831 4150513 3638150 3241909 3198264 3000318
3081C000318j491161k859155k245080L66873K302056J709163J12614j08032O60833
$$ 3000318 1509157 -1349998 -3595078 -3228205 -926149 783014 895628 787596 1448429
3072A448429L19561j149602j474559K70920K090612J814738k32115k089182k420415
$$ 1448429 1767990 618388 -856171 -585251 1505361 3320099 3087984 998802 -1421613
3063a421613j235643N43609J602461J265283M58861O38331J494716J149748q42305
$$ -1421613 -2657256 -2113647 -511186 754097 1212958 1851289 3346005 4495753 3653448
3054C653448k355391j599597L38411J246700Q17919L17833K09775r8434o89522
$$ 3653448 1298057 -301540 36871 1283571 2101490 2419323 2629098 2530664 1841142
3045A841142r82028q40342m86541K40267J206210J267780j12124j251939l25555
$$ 1841142 859114 18772 -467769 -227502 978708 2246488 2134364 882425 556870
3036E56870J474447J354154o05078j301883M06303J625540m7753k593343k638321
$$ 556870 2031317 3385471 2780393 1478510 1884813 3510353 3462600 869257 -1769064
3027a769064n60348M81577l47609o78832O88041J629203K39417j814321j607864
$$ -1769064 -2329412 -1847835 -2195444 -2874276 -2186235 -557032 -317615 -2131936 -3739800
3018c739800O35245J854935O53206q52777m20324J073319J377955M85931K51583
$$ -3739800 -3104555 -1249620 -596414 -1449191 -1869515 -796196 581759 1067690 1319273
3009A319273R36506P35795q31524j647851m10455R52583K66320j297116j112155
$$ 1319273 2255779 2991574 2160050 512199 101744 1054327 1320647 23531 -1088624
3000a088624O39657J424516M70289m94240n49738o91919j171788o37005J025928
$$ -1088624 -448967 975549 1445838 951598 401860 -290059 -1461847 -2098852 -1072924
2991a072924J646132J04825j510739r31285Q94265J449036M03504l86300R2350
$$ -1072924 573208 678033 -832706 -1763991 -869726 579310 982814 596514 688864
2982F88864R32800J056367N02085j11910l96612l61441l46643p21305j374955
$$ 688864 1621664 2678031 3180116 3068206 2671594 2310153 1963510 1242205 -132750
2973a32750j778920j612960q59140N41951K279709L163945K258535M25936o29113
$$ -132750 -1911670 -3524630 -4383770 -3841819 -1562110 1601835 3860370 4286306 3657193
2964C657193p06253q65915j097924m45928N15174L157j642932j848088k6702J094054
$$ 3657193 2950940 2085025 987101 541173 1056347 1059504 -583428 -2431516 -2458218 -1364164
2954a364164r1772j356855m76911J104651J091445K42064L99226P82005l45582
$$ -1364164 -1455936 -2812791 -3289702 -2185051 -1093606 -851542 -452316 329689 -15893
2945a5893j908482j425149Q31749K302206K022040J137263L30213m54365n52429
$$ -15893 -1924375 -3349524 -2517775 -215569 1806471 2943734 3273947 2819582 2267153
2936B267153L62351O88410q46955k478444j940486l57718j82567p00815L41130
$$ 2267153 2629504 3317914 2470959 -7485 -1947971 -2305689 -2488256 -3189071 -2847941
2927b847941J876499J025697j252194j208894J052965J467703q22865j844002
$$ -2847941 -971442 54255 -1197939 -2406833 -1353868 113835 -709030 -2553032
2919b553032K11790J974688J128899K27760J283187J678268o87090k702943j001772
$$ -2553032 -2341242 -366554 762345 990105 2273292 3951560 3264470 561527 -440245
2910d40245K057718K130724k46456j334771n23265j86777q04547q59472n29239
$$ -440245 1617473 3748197 3501741 2166970 1643705 1456928 652381 -207091 -736330
2901g36330j099964j523650J46890K456807K008767r22064k456141j041107P63330
$$ -736330 -1836294 -3359944 -3213054 -756247 1252520 330456 -2125685 -3166792 -2403462
2892b403462J022732R36280J506321J485405L15822j67275J012965J768811K20647
$$ -2403462 -1380730 -444450 1061871 2547276 2863098 2695823 3708788 5477599 5698246
2883E698246k025165k215786m45697R82938J026124M66296k58779j489007k629385
$$ 5698246 3673081 1457295 1011598 1994536 3020660 3486956 3228177 1739170 -890215
2874h90215k087265L19561K292284J576797j029606k439612j105805J114896J601290
$$ -890215 -2977480 -2657919 -365635 1211162 181556 -2258056 -3363861 -2248965 -647675
2865f47675L73712n15032k66922k1622l09782j03295R38639J505523J030508Q59518
$$ -647675 -273963 -788995 -1055917 -1077539 -1387321 -1490616 -551977 953546 1984054 2843572
2855B843572J544903J256049j024405k895274j872725M54213Q47440l19172M1037
$$ 2843572 4388475 5644524 4620119 1724845 -147880 306333 1153773 834601 875638
2846H75638K155482K754866M41717k050025k158139q75590k60957k63830P3126
$$ 875638 3031120 5785986 6227703 4177678 2019539 1143949 882992 619162 692288
2837F92288L38177l02935j267411j393782o79075J00310O27746Q77835N67270
$$ 692288 1030465 727530 -539881 -1933663 -2612738 -2512428 -1884682 -1006847 -439577
2828d39577l21372j169866j466606j221519m70128O08192J081030K11627r28807
$$ -439577 -760949 -1930815 -3397421 -4618940 -5089068 -4480876 -3399846 -3188219 -4117026
2819d117026n72364Q29582R47280o31286j375165K87806K418583K583102J326778
$$ -4117026 -4689390 -3859808 -2912528 -3543814 -4918979 -4631173 -2212590 370512 1697290
2810A697290N89327M03642m24331j549945j530429m64190R3007l08294m82092
$$ 1697290 2286617 2690259 2265928 715983 -814446 -1278636 -1185629 -1493923 -1976015
2801a976015K85621J205795J254847K80975j192471k264123j903932P5070K406610
$$ -1976015 -1690394 -484599 770248 1051223 -141248 -2405371 -4309303 -4234233 -1827623
2792a827623L554574L219416J969039R8196k023436l181814k433906p06908J79511
$$ -1827623 1726951 4946367 6915406 7013602 4990166 1808352 -625554 -1332462 -1152951
2783a152951l0238K6211R45090J652667J242434L65562J17750M68457N04102k81437
$$ -1152951 -1183189 -1156978 -211888 1440779 2683213 3048775 3166525 3634982 4139084 3857647
2773C857647j437624k016125j383934J38853J414386J541357P06476k28008o69684
$$ 3857647 2420023 403898 -980036 -841183 573203 2114560 2821036 2593028 1923344
2764A923344n10220J03632O73467N28982k46629o14926o1209L91849k94030j272153
$$ 1923344 1413124 1516756 2190223 2719205 2472576 1857650 1796441 2188290 1894260 622107
2754F22107q84093O65270J360562K70611j189943j424574o82965j12940M8623
$$ 622107 -261986 403284 1763846 2034457 844514 -580060 -1263025 -1375965 -1327342
2745a327342K39095K90751l44558j268416j145680N68387K500293K600959N78388
$$ -1327342 -1088247 -797496 -1142054 -2410470 -3556150 -2987763 -487470 2113489 2691877
2736B691877j437015j242321O46222J547058J99955j497291j291256J47949M97990
$$ 2691877 1254862 12541 658763 2205821 2405776 908485 -382771 -234822 263168
2727B63168m24874m75851J085198K046752M78102k314362l510813k260443n1248
$$ 263168 -161706 -637557 447641 2494393 2972495 658133 -2852680 -5113123 -5164371
2718e164371J489883J793247J029735l3961k71027N65171J230221O29566n06230
$$ -5164371 -3674488 -1881241 -851506 -885467 -1156494 -591323 638898 1268464 762234
2709G62234p55626j73469J43090J36290O39199J308270O87351j297426k726492
$$ 762234 6608 -166861 -23771 112519 751718 2059988 2747339 1449913 -1276579
2700a276579k246603o63491P29906J743310K222676J178931j367280l023434j586731
$$ -1276579 -3523182 -4186673 -3456767 -1713457 509219 1688150 320870 -2702564 -4289295
2691d289295J653311L148140J474128j233702k257227j085540R96008K558626
$$ -4289295 -2635984 512156 1986284 752582 -1504645 -2590185 -1594177 964449
2683I64449K730505J482785j27867q41817o99672q20358j494262j630818n18750
$$ 964449 3694954 5177739 5049872 4208055 3508383 2688025 1193763 -437055 -955805
2674i55805J007841J771249J619846J002741J91736m29758l71192o7309p46885
$$ -955805 52036 1823285 3443131 4445872 4637608 4207850 3836658 3769349 3022464
2665C022464k348679k846641r85587J462453J894906M86126l95701R8299M42970
$$ 3022464 673785 -2172856 -3158443 -1695990 198916 685042 289341 387640 830610
2656H30610k57609p12811K04376J406294J263906J02256m74333p8975R7255p04046
$$ 830610 573001 -139810 64566 1470860 2734766 2837022 2362689 2283714 2380969 1676923
2646A676923j637832j416713L4813J494449J800565J044890L23712L32811N29689
$$ 1676923 39091 -1377622 -1342809 151640 1952205 2997095 3320807 3653618 4183307
2637D183307N5704q20967r90444k78083O8492p52879j602603q25043J230080K387809
$$ 4183307 4239011 3418044 2427600 2149517 2218009 1465130 -137473 -962516 267564 2655373
2627B655373J525786M4713k61646K17932k01154j520844j772973j51713J326093
$$ 2655373 4181159 4225872 3964226 4182158 3981004 2460160 687187 535474 1861567
2618A861567O29950j090013j064674R24748K183898J067960r32642j851858j879344
$$ 1861567 2491517 1401504 336830 1261578 3445476 4513436 3580794 1728936 -150408
2609a50408j934918j412212O48503L181641L954734K424197J10158j524904k065434
$$ -150408 -2085326 -3497538 -2849035 332606 4287340 6711537 6821695 5296791 3231357
2600C231357j434364R5939J302506J018348k18924q92418p21733o17367o24655
$$ 3231357 1796993 1892932 3195438 4213786 3994862 3102444 2380711 1763344 1138689
2591A138689J35350J259116R18710j205743k668461j274552J846404L568482K487525
$$ 1138689 1274039 2533155 3451865 2246122 -422339 -1696891 149513 3717995 6205520
2582F205520J02707j350151j153006j51809O31732R12487P81917M1936j384414
$$ 6205520 6308227 4958076 3805070 3653261 4284993 5197480 5979397 6021333 4636919
2573D636919k507661j904305K12295J751781J434262M60602L34307M69423k83118
$$ 4636919 2129258 224953 437248 2189029 3623291 4083893 4418200 4887623 4604505
2564D604505j133832p53267o5105p67985j765364m27195K621920L589112J173396
$$ 4604505 3470673 2717406 2652301 1884316 118952 -308243 2313677 5902789 7076185
2555G076185j319927r64822Q16082J207084K33637k79948O7234M15450N23187
$$ 7076185 5756258 4791436 5607518 6814602 7048239 6768291 6835525 7250975 7774162
2546G774162M11894n62169k368435l216609j681547R74976K198058J143903q32566
$$ 7774162 8186056 7623887 5255452 2038843 357296 1332272 3530330 4674233 3841667
2537C841667j839492q57703J321631K114457j61102l215830k870145J051305L905389
$$ 3841667 2002175 1144472 2466103 4580560 4419458 1203628 -1666517 -615212 3290177
2528C290177K636371k98315j336296o69501r6944N08573J410725J161157J98688
$$ 3290177 5926548 5628233 4291937 3622436 3525492 4034065 5444790 6605947 6804635
2519F804635K378407P986151R266595M5955j2671913j5253664n491049M417594
$$ 6804635 9183042 17169193 26435788 26481743 13809830 -1443834 -6934883 -2517289
2511b517289M716838m37368k215763j53684M30125j209201j081894J488417K589836
$$ -2517289 2199549 1762181 -453582 -607266 -177141 -1386342 -2468236 -979819 1610017
2502A610017N11454j675167j359854L15Q6925o41818m83952L88530M17821o08603
$$ 1610017 2121471 446304 -913550 -913235 -826310 -1468128 -1952080 -1563550 -1145729 -1754332
2492a754332j029966L91602K588841L151931J063162k006278l485775k643350
$$ -1754332 -2784298 -2392696 196145 3348076 4411238 2404960 -1080815 -3724165
2484c724165r12006K21336O48377Q96489J023451P61259J53680l56932k47347
$$ -3724165 -4636171 -4414835 -3766458 -2869969 -1846518 -1085259 -931579 -1288511 -1535858
2475a535858N94918J412441J107804k35044j124516p56250k88070q01393j240872
$$ -1535858 -940940 471501 1579305 1344261 219745 -536505 -824575 -1625968 -2866840
2466b866840k35047J179091J061396n6184j07856P37128M50295q29312p09641
$$ -2866840 -3101887 -1922796 -861400 -917584 -1025440 -288312 161983 -667329 -1376970
2457a376970J016017J567948j1527r34168N92613K130750J007647j355846j955202
$$ -1376970 -360953 1206995 1195468 261300 853913 2984663 3992310 2636464 681262
2448F81262p16199M09544R33711J445718J301521k82955j944315j812832n60454
$$ 681262 -34937 374607 1308318 2754036 4055557 3772602 1828287 15455 -544999
2439e44999j78826o15471l68173L46745K048j023839o56054J281581K454080J552105
$$ -544999 -723825 -1339296 -1707469 -1360724 -1358676 -2382515 -3038569 -1756988 697092 2249197
2429B249197K8184m63412k55230l29409n27908k42183K95128M52360K21297N3986
$$ 2249197 2277381 1813969 1558739 1229330 701422 459239 754367 1206727 1428024 1482010
2419A482010J27933K38537J62344n7602r6922J88937K45544o08298j869159k052119
$$ 1482010 1609943 1848480 2010824 1953222 1856300 2045237 2290781 1682483 -186676 -2238795
2409b238795p15540P67618J153626Q58324O60000K55030n97826q37306L16004
$$ -2238795 -2954335 -2186717 -1033091 -174767 485233 740263 142437 -694869 -378865
2400c78865J630581J539105N88943K70686L10619n78900j871442j726590k12890
$$ -378865 1251716 2790821 3379764 3650450 3961069 3382169 1510727 -215863 -428753
2391d28753N56391j00636k80978J277299K931806K473911K94813j246577q80608
$$ -428753 127638 27002 -253976 1023323 3955129 6429040 6723853 5477276 4596668
2382D596668L47796O64421m27726j831971k264239j699544j075635p38093j37747
$$ 4596668 4944464 5608885 5181159 3349188 1084949 -614595 -1690230 -2428323 -2566070
2373b566070O93665P11304k97428q28216J35720J369102J416659R99976J387746
$$ -2566070 -1872405 -1161101 -1458529 -2286745 -2151025 -781923 634736 1634712 3022458
2364C022458J622965K1571k322737k563567n79191O19521m64466j636030o52991
$$ 3022458 4645423 4666994 2344257 -219310 -798501 -178980 -643446 -2279476 -2932467
2355b932467J409775K077794R88424k09270l52302K51681O71294K64937p14356
$$ -2932467 -1522692 555102 1543526 1334256 981954 1233635 1904929 2169866 1455510
2346A455510j052257Q9128J672862J834751N53726k62009L05426R18442L16825
$$ 1455510 403253 492381 2165243 3999994 4553720 4291711 4597137 5515579 5832404
2337E832404q04401j228709r98078o55773r1886O66763P59706j59412r71541p38238
$$ 5832404 5028003 3799294 2801216 2145443 2053557 2720320 3480026 3320614 2349073 1610835
2327A610835k61144o53756j284679o63957J193832K707576K718802J414144l83579
$$ 1610835 1349691 695935 -588744 -1252701 -58869 2648707 5367509 6781653 6398074
2318F398074j763365j877543o18476R68569J726887J605879J197279N76196m91031
$$ 6398074 4634709 2757166 2138690 3107259 4834146 6440025 7637304 8213500 7722469
2309G722469j613974k095049j960346j710714j238427m6318J473191K087910J365761
$$ 7722469 6108495 4013446 2053100 342386 -896041 -942359 530832 2618742 3984503
2300C984503L53112J07324K46826l32379j644464k322042j303786P07270J893232
$$ 3984503 4337615 4444939 4691765 4359386 2714922 392880 -910906 -203636 1689596
2291A689596J255671m90688j873171k007146r41818O46060J697601J329141j66626
$$ 1689596 2945267 2454579 581408 -1425738 -2367556 -1721496 -23895 1305246 1138620
2282A138620j232629o59294R24700J788383J113526l10324j159439p79486L69463
$$ 1138620 -94009 -753303 171397 1959780 3073306 2762982 1603543 824057 1193520
2273A193520R51006l8108j708922j797525K95911K066619J109554j165292j291326
$$ 1193520 2144526 2106418 397496 -1400029 -1104118 962501 2072055 906763 -384563
2264c84563J139061K762645J288409j504755k690827j878104m83678P56413J686766
$$ -384563 754498 3517143 4805552 3300797 609970 -1268134 -1751812 -995399 691367
2255F91367J556702k9041j806992k265111j693948j224804o11654J059126K924474
$$ 691367 2248069 2219028 412036 -1853075 -3547023 -4771827 -5383481 -4324355 -1399881
2246a399881K885391Q10680q77273n23702O14246N68283m93921j037114p18282
$$ -1399881 1485510 2296190 1418917 895215 1509461 2077744 1583823 546709 -171573
2237a71573m70004m95802J6503J054725J379743O02438P5026N90780O88528r42021
$$ -171573 -641577 -1137379 -1120876 -66151 1313592 1916030 1991056 2581836 3270364 2328343
2227B328343k515985j216812K090314L236750O11466k350802k246422m78627k87528
$$ 2328343 -187642 -1404454 685860 3922610 4534076 2183274 -63148 -541775 -829303
2218h29303j302826p17816J353282J863879J73365p03468P66900J989027O40624
$$ -829303 -2132129 -2849945 -1496663 367216 540581 -162887 604013 2593040 3233664
2209C233664j465896j544292l96925o65141k062178j799068O34871K364722J439103
$$ 3233664 1767768 223476 -173449 -838590 -2900768 -4699836 -4064965 -1700243 -261140
2200b61140l56591l30036J271149J999217R32693k01731K16640J363046J364609
$$ -261140 -617731 -947767 323382 2322599 3255292 3053561 3270201 4633247 5997856
2191E997856J60156n14916Q1090N40608l74633j695295j787490q67594l89013
$$ 5997856 6158012 5643096 5724186 6264794 5890161 4194866 2407376 1539782 1150769
2182A150769o06458m97991K07416O59595M83839J62758j55841p06405j041642
$$ 1150769 544311 46320 253736 913331 1397170 1559928 1404087 697682 -343960
2173c43960n25042K13985M5569n51964q6409J261081J671695N80721o48674j155741
$$ -343960 -869002 -655017 -609448 -1161412 -1247821 13260 1684955 2265676 1617002 461261
2163D61261j350411j035485N18008K130443J413580j115347j828801O12665K886833
$$ 461261 -889150 -1924635 -1406627 723816 2137396 1022049 -806752 -194087 2692746
2154B692746K049526k11092r42351n90148j082649j734125p82892P05030K94236
$$ 2692746 4742272 4531180 3588829 2998681 1916032 181907 -600985 104045 398281
2145C98281j505481k010387p75338K37975M39041J037970J825133J089062q45744
$$ 398281 -1107200 -3117587 -3892925 -3654950 -3215909 -2177939 -352806 736256 -109488
2136a09488j361169L31790J806247J226916j43418m86731n7184J54896K78504
$$ -109488 -1470657 -1138867 667380 1894296 1750878 1264147 1206963 1361859 1640363
2127A640363N49295K28273r08588j532563p80281O4127m04275j182286l31681
$$ 1640363 2189658 2417931 1509343 -23220 -803501 -739374 -1143649 -2325935 -2657616
2118b657616J716011K461672R60151p96510p63356M06817O33117n27307j553116
$$ -2657616 -941605 1520067 2480218 1683708 920352 1327169 1960286 1432979 -120137
2109a20137j427123q46414n32662J55405J748260K934438K057129j35598j170009
$$ -120137 -1547260 -2393674 -2926336 -2770931 -1022671 1911767 3968896 3833298 2663289
2100B663289l47612L76759m49936j628147j361365M0889Q32746K45691r15109
$$ 2663289 2315677 2692436 2242500 614353 -747012 -706123 126623 372314 -542795
2091e42795j463986q54885M23945J121125O29846N5312O43982J477686P88879
$$ -542795 -2006781 -2861666 -2437721 -1316596 -686750 -631438 12544 1490230 2279109
2082B279109n51478K13421K823999L245597m05635m341785m151669q09863J414840
$$ 2279109 1727631 1941052 4765051 8010648 7605013 3263228 -888441 -1698304 -283464
2073b83464J051226J21703J33041O62056J164646J327136K72209k022554l327813
$$ -283464 767762 889465 1022506 1684562 2849208 4176344 4448553 2425999 -901814
2064i01814j759782J074186K127709J195025M10264M43277K37391k01189O0723
$$ -901814 -2661596 -1587410 540299 1735324 2145588 2588865 2826256 2625067 2685790
2055B685790M31882l86323j522387j043894M02190M03607r25093r81174Q10496
$$ 2685790 3117672 2731349 1208962 165068 567258 970865 45772 -935402 -124906
2046a24906K029217J336578J99658j69323m33978q68277m77627O86919J091161
$$ -124906 1904311 3240889 3440547 3271224 2837246 1968969 1491342 2178261 3269422
2037C269422L97049p2372q2780p92845j786078j064873J137943J912350K22162
$$ 3269422 3666471 3594099 3511319 2718474 932396 -132477 1005466 2917816 3139978
2028C139978j417597j208469o31012r86409p64707J177992K779560J862274k14227
$$ 3139978 1722381 513912 -117100 -1103509 -1868216 -690224 2089336 3951610 3737383
2019C737383o97948N00824J367903J000919Q7103o83217q90514j78520Q32047
$$ 3737383 3039435 3540259 4908162 5909081 5996184 5312967 4422453 4243933 5075980
2010E075980P26443m47173p71635M65438J286919K04890j156570o72312P77315
$$ 5075980 5802423 5355250 4583615 5049053 6335972 6540862 5384292 4711980 5489295
2001E489295P83607p43097j555260m35955J308599J718892M12754j086786r09441
$$ 5489295 6272902 5529805 3974545 3538590 4847189 6566081 6978835 5892049 4982608
1992D982608R55867K273832J306496o76538j301262p81287j176232k375220k093355
$$ 4982608 5938475 8212307 9518803 8842265 7541003 6759716 5583484 3208264 1114909
1983A114909j58689P67738k97324j005011N0182R70270L48033q8752R96674J671277
$$ 1114909 956220 1723958 1426634 421623 471805 1442075 1790108 1701356 2698030 4369307
1973D369307J91502j568314j206697J81486J90441q56441j137794o84256n25806
$$ 4369307 4560809 2992495 1785798 1967284 2157725 1301284 163490 -520766 -1046572
1964a046572l00898M41951M50589q47356j210759J028436L480654L047441Q40073
$$ -1046572 -1347470 -905519 -454930 -1302286 -2513045 -1484609 1996045 5043486 5883559
1955E883559L988M06490k91568j633247j088708Q27807Q65013j370663k539595
$$ 5883559 5887547 6294037 6002469 4369222 3280514 4108321 4973334 3602671 1063076
1946A063076j028328P32159N56282m80383p65944p25120r55944m89065J148903
$$ 1063076 34748 766907 1323189 842806 76862 -648258 -1604202 -2093267 -944364
1937i44364K209921J046280j241880k209162j186259M04156J198306J132056P82996
$$ -944364 1265557 2311837 1069957 -1139205 -2325464 -1921308 -723002 409054 1192050
1928A192050M10135j12645p00948q01985j33456N45611K74732m89633l20716Q64278
$$ 1192050 1602185 1489540 788592 -13393 -146849 398762 673494 183861 -136855 727423
1918G27423J487992Q76758L20362N97221M51406r26473j840021n97512J464782
$$ 727423 2215415 3092173 3412535 4009756 4461162 3534689 1694668 1097156 2561938
1909B561938J819683M94610m18954k36776k41546j058814j649832j083737K33440
$$ 2561938 4381621 4876231 4457277 4220501 3978955 2920141 1270309 186572 420012
1900D20012J257822J285861M33588k43216K62497J343050J300707r1320j105862
$$ 420012 1677834 2963695 3397283 3154067 3416564 4759614 6060321 5969001 4863139
1891D863139p85016k49765m01182m55248Q1102K68069j06005K75738J382222R84986
$$ 4863139 4078123 3828358 3427176 2971928 3053030 3321099 3215094 3490832 4873054 5858040
1881E858040j386196k677872r87294J025689M13933j238100p83034J203533J927962
$$ 5858040 4471844 1793972 806678 1832367 2246300 1008200 225166 1428699 3356661
1872C356661J133421N19481J61217p31854j134547m5193O41059j017548k902093
$$ 3356661 4490082 5009563 5170780 4438926 3304379 3259186 3900245 2882697 -19396
1863a9396j708357J469927K718111J352040J09182J82777L14936J73080N35987
$$ -19396 -1727753 -257826 2460285 3812325 3921507 4104284 4419220 4592300 5128287
1854E128287O95517m60881j532081n77554J035704P50073n17912k22793P15063
$$ 5128287 5823804 5362923 3830842 3253288 4288992 5039065 4521153 4298360 5013423
1845E013423l36509k076153r79520J994560K341886l30505j597488J84757J511968
$$ 5013423 4676914 2600761 1621241 3615801 5957687 5627182 4029694 4214451 5726419
1836E726419K65445j039696m29538K28846o23075j228978n1146J381792J305185
$$ 5726419 5991864 4952168 4522630 4751476 4128401 2899423 2848277 4230069 5535254
1827E535254L26019l79361o90576m43971M70773O20294j195751k849759j365432
$$ 5535254 5861273 5481912 4791336 4347365 4818138 5438432 4242681 1392922 27490
1818B7490J779960K276886j30997j304411L78739J984026J781284J741858K790678
$$ 27490 1807450 4084336 3953339 2648928 3027667 5011693 6792977 8534835 11325513
1809A1325513K622073K32199j829061j718970q77262p17758n19947L7936r2502
$$ 11325513 13947586 14179785 12350724 10631754 9754492 9036734 8516787 8554723 8462221
1800H462221p68452o76428k57894p58021o94015J974462M646303K819326k051720
$$ 8462221 7693769 7017341 6759447 6001426 5307411 7281873 11928176 14747502 12695782
1791A2695782l863285j452061P5975j384829j837339O23109K044794J35563j436139
$$ 12695782 8832497 7380436 7456411 6071582 4234243 4857352 6902146 7037709 5601570
1782E601570Q1800J683520N35538j016392l12011R70992P77745M67854J237582
$$ 5601570 5683370 7366890 7902428 6886036 6574025 7545017 8322762 8790616 10028198
1773A0028198J344618r6204j026701n61299n08010r90824J34316K009703J042045
$$ 10028198 11372816 11276612 10249911 9688612 9180602 8189778 8324094 10333797 11375842
1764A1375842k018122k095816J316530K740304L14280j258963j2318k91091l540079
$$ 11375842 9357720 7261904 8578434 11318738 11633018 10374055 10361737 10070646 6530567
1755F530567m372205k19524L594943L088000J579012J801407P36815k664170l441576
$$ 6530567 2158362 1938838 5533781 8621781 10200793 12002200 12739015 10074845 6633269
1746F633269K76989K855505J146347j47870J646288J827782j415082k016172K189629
$$ 6633269 6910258 9765763 10912110 10764240 12410528 14238310 12823228 10807056 12996685
1737A2996685L793973q10815l915334m16601K745868Q2076k007571J525928L516874
$$ 12996685 16790658 15979843 12064509 11647908 14393776 14475852 12468281 13994209 17511083
1728A7511083j450739n060611k15432M700125Q12690m376244q35499N122173K866622
$$ 17511083 16060344 10999733 10784301 15484426 16297116 11920872 11085373 16207546 19074168
1719A9074168k574185n76327M950581L932777n84281o0232J803982k164374n611626
$$ 19074168 16499983 15923656 20874237 24807014 24222733 24162501 25966483 23802109 18190483
1710A8190483p3383O501628L209480k418834J545636P510778K683167m739043
$$ 18190483 18117100 24618728 27828208 25409374 26955010 34465788 37148955 32409912
1702C2409912n40956O636702J192280p186476n52853J0548274N143920n560403
$$ 32409912 31868956 38505658 39697938 32511462 31958609 42506883 47650803 42090400
1694D2090400L092173J9115462J2674758m117655N118670K8920947K3563844K637389
$$ 42090400 45182573 64298035 76972793 72855138 77973808 106894755 130458599 133095988
1686A33095988K4865832P1451822L5249831j10983127k26994122j74958043j2976728
$$ 133095988 157961820 229413642 264663473 153680346 -73313776 -248271819 -261248547
1679b61248547Q3829485N5792704J522918L417199K7608231J9653283k284939
$$ -261248547 -177419062 -121626358 -120103440 -116686241 -89078010 -69424727 -71709666
1672g1709666O97315J5445927J0848002l304131j199048R549308O913390l086956
$$ -71709666 -71012351 -55566424 -44718422 -48022553 -49221601 -39672293 -32758903 -35845859
1664c5845859j364725P208744N817285j820672j317412M002093J908425l670168
$$ -35845859 -37210584 -30001840 -24184555 -26005227 -27322639 -23320546 -21412121 -25082289
1656b5082289j329676M766087L402669j870865o81778L612262J528810l041595
$$ -25082289 -26411965 -21645878 -18243209 -20114074 -20795852 -17183590 -15654780 -18696375
1648a8696375o20392M463099J780462m952102m275489K042916K870503j885678
$$ -18696375 -19316767 -14853668 -13073206 -18025308 -22300797 -20257881 -17387378 -19273056
1640a9273056k511381J994031L464712O97790M17922L219292K900198p13609j411576
$$ -19273056 -21784437 -19790406 -16325694 -15627904 -15209982 -11990690 -9090492 -9804101 -11215677
1631a1215677J250227J496402j220010j522506J304796K402079P89760J62396
$$ -11215677 -9965450 -8469048 -9689058 -11211564 -9906768 -7504689 -6714929 -6552533
1623f552533P11397p38190l078656k174820R44378J477219m93914p85696O39267
$$ -6552533 -5841136 -6579326 -9657982 -11832802 -10888424 -9411205 -9905119 -10690815 -10051548
1614a0051548K52058j429604q06558J352969J261307k66873O42319K897565J880054
$$ -10051548 -9799490 -11229094 -12035652 -10682683 -9421376 -9688249 -9045930 -6148365 -4268311
1605d268311j916332l447133j766200o57965j119063n01452J174036J090540l94642
$$ -4268311 -6184643 -9631776 -11397976 -12055941 -13175004 -13676456 -12502420 -11411880 -11806522
1596a1806522k60634J136722R52800m124J354717L712182K895006n10815j981923
$$ -11806522 -12067156 -10930434 -9977634 -9981758 -8627041 -4914859 -2019853 -2530668 -4512591
1587d512591r69588r84733k152625r80060K253737L110616P76838n74043P34964
$$ -4512591 -5482179 -6466912 -8619537 -9599597 -7345860 -4235244 -3458406 -4032449 -3297485
1578c297485J458735k14293j836571j654912j026883o80179M34512J631112O98312
$$ -3297485 -1838750 -2053043 -3889614 -5544526 -6571409 -7251588 -6817076 -5185964 -4487652
1569d487652j613890j998833j6506J427483J199851Q94917P44964n47924j978128
$$ -4487652 -6101542 -8100375 -8116881 -6689398 -5489547 -4594630 -3849666 -4397590 -6375718
1560f375718j194753Q50915J190483L25592J077109K513899J034160k612162l670044
$$ -6375718 -7570471 -6719556 -5529073 -5203481 -4126372 -1612473 -578313 -3190475 -6860519
1551f860519j159529Q85658O00110M60272J341026P26867j658342k428493m86874
$$ -6860519 -8020048 -7134390 -6534280 -6074008 -4732982 -4006115 -5664457 -8092950 -8579824
1542h579824J118187Q40341P09249J389153P92812q96411n72555J792978K318739
$$ -8579824 -7461637 -6621296 -5912047 -4522894 -3730082 -4626493 -5199048 -3406070 -1087331
1533a087331J02699j082662R1778P7809k379559l169170k05676K324172R98309
$$ -1087331 -984632 -2067294 -1975516 -1897707 -4277266 -7446436 -7652112 -5327940 -4329631
1524d329631j280364r65409K50229k05224m89653J576087L375822J656514j540466
$$ -4329631 -5609995 -6575404 -6325175 -6530399 -7020052 -5443965 -2068143 -411629 -1952095
1515a952095k078668j44806J058226O56930J3138n39455j128895o47692J014615
$$ -1952095 -4030763 -4175569 -3117343 -2460413 -2447275 -2986730 -4115625 -4763317 -3748702
1506c748702J371533p93627k548885j195189J166263J164509l00120j13161J572959
$$ -3748702 -2377169 -3170796 -5719681 -6914870 -5748607 -4584098 -4884218 -4997379 -3424420
1497c424420K122612J162779N52978O72318L30004m13169m52435O5599K52289
$$ -3424420 -1301808 -139029 413949 1086267 1416271 1003102 550667 616266 868555
1488H68555L15901O43738M41114n07511n38172R93873J637222m11545k611631
$$ 868555 1184456 1828194 2269308 1761797 1223625 2217498 3854720 3443175 831544
1479H31544j628588J144724J533276r65400k629034j229780J217696J882997N75877
$$ 831544 -797044 347680 1880956 915556 -1713478 -2943258 -1725562 157435 733312
1470G33312r07702j099931n5208Q24889L49514o84960m53160P87319P19066r98225
$$ 733312 -174390 -1274321 -1329529 -504640 -155126 -840086 -1293246 -505927 213139 -785086
1460g85086j581064K50563J632118J80889j759744r78353J100648R30519j036429
$$ -785086 -2366150 -2115587 -483469 -302580 -2062324 -3040677 -1940029 -1009510 -2045939
1451b045939j312221N59146J498141K79259q66368m77970J42193k0162n8562L41726
$$ -2045939 -3358160 -2799014 -1300873 -1021614 -1887982 -2365952 -2223759 -2243921 -2302483 -1960757
1441a960757k28659k138801l311627k141817O1024J076954Q56970J071511K273370
$$ -1960757 -2189416 -4328217 -7639844 -9781661 -9720637 -8643683 -7786713 -6715202 -4441832
1432d441832K884215J243562j895258l635088k201637O52359J778653Q09894K17119
$$ -4441832 -1557617 -314055 -2209313 -5844401 -8046038 -7393679 -5615026 -4805132 -4588013
1423d588013J126386J747053Q59341k8380L15169M70473p48105j627503n02732
$$ -4588013 -3461627 -1714574 -855233 -883613 -568444 -97971 -846076 -2473579 -2976311
1414b976311R40921L79939j129471j116986P2243M66314L30813J158823K070311
$$ -2976311 -2035390 -1655451 -2784922 -3901908 -3829665 -3363351 -3032538 -1873715 196596
1405A96596J098296q31432j100351Q6377K73893p18363r17519m58036j350113
$$ 196596 1294892 463460 -636891 -550514 -276621 -994984 -1912503 -2370539 -3720652
1396c720652k939056k148553J077561K996435J857432L07091N98913J409666J155838
$$ -3720652 -6659708 -8808261 -7730700 -4734265 -2876833 -2569742 -1970829 -561163 594675
1387E94675O65189N31009n74338k653122k888511o6969K572175J861498n47237
$$ 594675 1259864 1790873 1216535 -1436587 -4325098 -4392067 -1819892 41606 -505631
1378e05631j098038J95160N58847p34639j676542r71092N12027J421718J119535
$$ -505631 -1603669 -1408509 -849662 -1584301 -3260843 -4231935 -3719908 -2298190 -1178655
1369a178655l09895j721201j444873M19100J462621K87860j137521m27815J410315
$$ -1178655 -1488550 -3209751 -4654624 -4235524 -2772903 -2485043 -3622564 -4050379 -2640064
1360b640064J598361r3325j389312j253830q07078o57832m4883J025406J258000
$$ -2640064 -1041703 -1135028 -2524340 -3778170 -4585248 -5243080 -5287963 -4262557 -3004557
1351c004557M11405Q0081J196005K420377K039144J85645j706411k560838k003512
$$ -3004557 -2593152 -2513071 -1317066 1103311 3142455 3328100 1621689 -939149 -2942661
1342b942661j99449J700890J945008J63568j674942j446707L98234J471227O51032
$$ -2942661 -3142110 -1441220 503788 667356 -1007586 -2454293 -2056059 -584832 66200
1333F6200o37758o75686K12672M65527k86964q15447k43549P35073J002461M82499
$$ 66200 -571558 -1247244 -1034572 -569045 -856009 -1671456 -1915005 -1179932 -177471 305028
1323C05028k05178q52655j512909j683598p58768P15468J287692M38205o30818
$$ 305028 99850 -752805 -2265714 -3949312 -4708080 -3992612 -2704920 -2266715 -2897533
1314b897533n07759P11583J733961J676807P87658k51350j120384j778370j986589
$$ -2897533 -3405292 -2693709 -959748 717059 1504717 1253367 132983 -1645387 -3631976
1305c631976j415195k92097N23368N19043K41023M20204P00577J86775q71160
$$ -3631976 -5047171 -5339268 -4815900 -4296857 -4055834 -3635630 -2935053 -2748278 -3619438
1296c619438j224267o59585l76096p23585k74265J641978L103083K102303l29219
$$ -3619438 -4843705 -5503290 -5879386 -6602971 -6877236 -5235258 -2132175 -29872 -359091
1287c59091j585074j164291n98986l69621M34758J494108J132561o13849j405086
$$ -359091 -1944165 -3108456 -3707442 -4077063 -3642305 -2148197 -1015636 -1629485 -3034571
1278c034571q4946J509502J453689M11740j3440K02782K26485P3267j5252n38354
$$ -3034571 -3119517 -1610015 -156326 255414 241974 444756 671241 744508 729256 190902
1268A90902j462068j347781L97077J657805K00516k758635l940191k486143o17490
$$ 190902 -1271166 -2618947 -2221870 -564065 -363549 -3122184 -7062375 -9548518 -10166008
1259a0166008J04454N89655J727430K518839J974388J026741R65655J268491O88219
$$ -10166008 -10061554 -9471899 -7744469 -5225630 -3251242 -2224501 -1258846 9645 697864
1250F97864l93472n67465N1466j39080j410682j857173l15560J476497J241126
$$ 697864 304392 -263073 -211607 -350687 -1761369 -3618542 -3934102 -2457605 -1216479
1241a216479l77251q16481K52632K74175j922166l598828j828361J860923L238853
$$ -1216479 -1593730 -2410211 -2157579 -1883404 -3805570 -7404398 -9232759 -7371836 -4132983
1232d132983J264499o28870L11533K356840K216716j46893j830475j258889P5198
$$ -4132983 -2868484 -3497354 -3185821 -828981 1387735 1240842 -589633 -1848522 -1773324
1223a773324K05903p85583j513443j331457o91561n9004N89215J237427J508177
$$ -1773324 -1567421 -2353004 -3866447 -5197904 -5889465 -5948469 -5359254 -4121827 -2613650
1214b613650J169396O26787N14837Q54701R80612M01201n83499j296707j401989
$$ -2613650 -1444254 -817467 -302630 552071 1532683 1933884 1350385 53678 -1348311
1205a348311r71626j90914O30850J034509Q28640L51627j6254l07717n63472m18502
$$ -1348311 -2319937 -2510851 -1880001 -845492 -16852 334775 318521 10804 -552668 -971170
1195i71170K86268Q32301L43088r41585j791059j361116L1242J340707J583278
$$ -971170 -684902 147399 490487 -451098 -2242157 -3603273 -3572031 -2231324 -648046
1186f48046N74186o22752n38666P75498J435577K49860j373586j429607l41875
$$ -648046 -73860 -696612 -1235278 -459780 975797 1225657 -147929 -1577536 -1919411
1177a919411o0747o95519m49095R99913J590906J60210j628797j846640q56634
$$ -1919411 -1980158 -2675677 -3124772 -2124859 -533953 -373743 -2002540 -3849180 -4705814
1168d705814R5184J049910K300484K654333R27562j588496k294165p41785Q66214
$$ -4705814 -4610630 -3560720 -1260236 1394097 2321659 733163 -1561002 -2302787 -1436573
1159a436573P43886m45950r89969l60809N18955N91300k11051r37129o46475M79145
$$ -1436573 -692687 -1138637 -2128606 -2489415 -1970460 -1379160 -1590211 -2527340 -3173815 -2694670
1149b694670J391566J641701J830587K170038J623302m44152k530616k476929
$$ -2694670 -1303104 338597 2169184 4339222 5962524 5518372 2987756 510827
1141E10827n42161O08394n21263k082682j389158J211974K512399O56793k196021
$$ 510827 -31334 577060 55797 -2026885 -3416043 -2204069 308330 965123 -1230898
1132a230898k506120N6819K245641J616926m34313j082626o5308N98549J05388
$$ -1230898 -3737018 -3680199 -1434558 182368 -251945 -1334571 -1399879 -801330 -695942
1123f95942k27438L44031O33942l10518j505685j643912j005284n12352k8289
$$ -695942 -923380 -579349 54593 -255925 -1761610 -3405522 -4410806 -4923158 -4951447
1114d951447J014044K083214K046003Q17436n65407j256653j185693o49681n211
$$ -4951447 -3937403 -1854189 191814 1009250 443843 -812810 -1998503 -2648184 -2653395
1105b653395N21242J113695J954979K333039J151667j176255k529533j638483
$$ -2653395 -2132153 -1018458 936521 3269560 4421227 3244972 715439 -923044
1097i23044K18549J069122P35288K72123n7374o94112j308585j040076l1572N95120
$$ -923044 -704495 364627 1099915 1372038 1314664 620552 -688033 -1728109 -1759681 -1164561
1087a164561K70092n01093r96952q35009K8788J063052J347992P63402L69450
$$ -1164561 -894469 -1395562 -2392514 -3227523 -3198735 -2135683 -787691 -24289 345161
1078C45161P46179Q06134n20777k215681k336667p83188P00236J048824Q39222
$$ 345161 1091340 1897474 1376697 -838984 -3175651 -3958839 -3258603 -2209779 -1370557
1069a370557P62550O43239K14003l15345o76442o48797J27002J475358K147347
$$ -1370557 -608007 35232 249235 -66110 -742552 -1391349 -1264347 211011 2358358
1060B358358J176235n00194j127258o11113l79418q99288j116473n76366k47492
$$ 2358358 3534593 3034399 1907141 1296028 916610 17322 -1099151 -1675517 -1923009
1051a923009o11736o54033K80868J095980O53901k32123R805J123501J170742
$$ -1923009 -2534745 -3188778 -2907910 -1811930 -1158029 -1390152 -1380347 -256846 913896
1042I13896o42671k527842k214059O8529J682178Q87997q39528q06126J098492
$$ 913896 271225 -2256617 -4470676 -4402147 -2719969 -1831972 -2671500 -3477626 -2379134
1033b379134K259270J246899j24934J59056J073954M00736j484949k239477j390820
$$ -2379134 -119864 1127035 1002101 1161157 2235111 2635847 1150898 -1088579 -2479399
1024b479399q20816j314974j310062J86667J804738K096827J665902J652814J697246
$$ -2479399 -3300215 -4615189 -5925251 -5738584 -3933846 -1837019 -171117 1481697 3178943
1015C178943R11002k98546q67725p42741o26337o72331n36703k24506N0904L71951
$$ 3178943 4089945 3791399 2923674 2180933 1554596 882265 345562 121056 171960 543911
1005E43911O76787L74515p47287j730735j471037k40316N88484J87193r14878
$$ 543911 1220698 1595213 847926 -882809 -2353846 -2594162 -2005678 -1818485 -2733363
996b733363j520023r10061M90052J428223J137870L23278K28838P86439O86670
$$ -2733363 -4253386 -5163447 -4673395 -3245172 -2107302 -1784024 -1555186 -768747 -82077
987h2077m90196j397260q06487O43413J417973J006913R28j050331j844622j851607
$$ -82077 -572273 -1969533 -2776020 -2132607 -714634 292279 293207 -757124 -2601746 -4453353
977d453353p22069Q50488J484100N56798j022147j621826m88686J366164K088934
$$ -4453353 -5175422 -4324934 -2840834 -2284036 -3306183 -4928009 -5416695 -4050531 -1961597
968a961597J100869j36519j26521N10679J64476r29958q89838O06607J487593
$$ -1961597 -860728 -997247 -1123768 -613089 -448613 -1378571 -2268409 -1661802 -174209
959a74209N62148m95362k631P64643k62926k075865j676343J188230L119116J651660
$$ -174209 387939 -107423 -110054 654589 391663 -1684202 -3360545 -2172315 946801 2598461
949B598461j393097k477700q78475R44779R20953k56242o07639L35488J100348
$$ 2598461 1205364 -1272336 -2150811 -1206032 -285079 -541321 -1148960 -813472 286876
940B86876M48841r14020j372519o36368L1238j87534n71548k84320J56197j51689
$$ 286876 735717 -178303 -1550822 -2187190 -2155952 -2343486 -2915034 -3199354 -3043157 -3194846
930c194846p31667k50218J328861K375579J733177K55760m18978K407L62069j75835
$$ -3194846 -3926513 -4176731 -2847870 -472291 1260886 1516646 1097668 1100075 1462144 1286309
920A286309j091666j446570j133294o14449Q6260J177871K001415J368852n13310
$$ 1286309 194643 -1251927 -2385221 -2999670 -2913410 -1735539 265876 1634728 1121418
911A121418j641363p26781Q28528P96347p15325j578518q03125M12439Q94180
$$ 1121418 -519945 -1246726 -418198 378149 -337176 -1915694 -2718819 -2306380 -1412200
902a412200R58609J141235J068851M19790k65555n60742q62289j386915j505348
$$ -1412200 -453591 687644 1756495 2176285 1910730 1349988 487699 -899216 -2404564
893b404564q06099J60402Q40105J329076J489048O73827q74597j632782p63371
$$ -2404564 -3210663 -3050261 -2210156 -881080 607968 1281795 407198 -1225584 -1988955
884a988955O61160J296371J157275P03409k48812j506001j870086r73168l06612
$$ -1988955 -1327795 -31424 1125851 1829260 1580448 74447 -1795639 -2768807 -3075419
875c075419q06788r52449O78838K406819J648175p84203j523869L89834K234384
$$ -3075419 -3882207 -4834656 -4155818 -1748999 -100824 -885027 -2408896 -2019062 215322
866B15322J700455k29500j304472q81411J68365Q80383O92262k73967r01821k05947
$$ 215322 1915777 1686277 381805 -499606 -331241 549142 1241404 967437 65616 -140331
856a40331J015406J055488j3359k98886P93457J368986J4025j779507j681468
$$ -140331 875075 1930563 1917204 1618318 2411775 3780761 3794786 2015279 333811
847C33811J43733J389985P14098r35184j916224j681699q25622j02443K33234
$$ 333811 477544 1867529 2581627 1646443 -269781 -1951480 -2777102 -2879545 -2646311
838b646311L26036K91248J80635L11388R87725J625981J058786o00455j446234
$$ -2646311 -2320275 -2029027 -1848392 -1537004 -549279 1076702 2135488 1535033 88799
829H8799l20387J164143Q34657o52860q33173O11752J474307O97502k42977k45859
$$ 88799 -231588 932555 1767212 1114352 281179 892931 2367238 3064740 2821763 2575904
819B575904k30634q07956q27613K60950Q89682j9322r92897n10129L76170J31912
$$ 2575904 2345270 1537314 709701 970651 1860333 1841011 848114 337985 714155 846067
809H46067l75326L18328J153598K36772j457445j346119L52257Q69816m37996
$$ 846067 470741 789069 1942667 2179439 721994 -624125 -271868 597948 159952
800A59952j126572k6027P83346k70445j484968q20184P75575J221496O80624O78383
$$ 159952 -966620 -992647 -209301 -479746 -1964714 -2784898 -2009323 -787827 -107203 571180
790E71180J096880N14649j074081k104476j779709p03083O15025K031344K640801
$$ 571180 1668060 2182709 1108628 -995848 -2775557 -3478640 -2863615 -832271 1808530
781A808530J372746r17771j786782l54048J394388J315920j93981j237985j030386
$$ 1808530 3181276 2263505 476723 122675 1517063 2832983 2639002 1401017 370631
772C70631k55339L90815P11205N01950k42274q03618n00170J13106j68767j370370
$$ 370631 115292 506107 1217312 1719262 1476988 673370 173200 286306 117539 -1252831
762a252831k087336j292003M59653J901938K364781J880252P60764m02640q94922
$$ -1252831 -3340167 -4632170 -4172517 -2270579 94202 1974454 2735218 2332578 1437656
753A437656o17740l38362p23720j387866j338841k35084J138777J637997R11803
$$ 1437656 819916 481554 -242166 -1630032 -2968873 -3203957 -2065180 -427183 484620
744D84620j55608l09741N48181J051825J22382j389810j770032q84100k34762
$$ 484620 329012 19271 567452 1619277 1741659 351849 -1418183 -2302283 -2537045
735b537045m91489n37621M23081J370871J165518M43943M62874J027260J037015
$$ -2537045 -3028534 -3566155 -3143074 -1772203 -606685 -162742 300132 1327392 2364407
726B364407L71013k43565o60257j140587j257793m97585M56706N89101L01969
$$ 2364407 2735420 2491855 1831598 691011 -566782 -1064367 -607661 -18560 283409
717B83409O36182J138462M64078j056492j600179p42612L8319J10687N56940J527878
$$ 283409 919591 2058053 2522131 1465639 -134540 -877152 -838833 -728146 -171206 1356672
707A356672J216263j104725l159366k599257k22249J533164J853793J429201M47354
$$ 1356672 2572935 1468210 -1691156 -4290413 -4512662 -2979498 -1125705 303496 750850
698G50850j054169j806495o55336J185387J442497J11762o49098J05635R91589
$$ 750850 -303319 -2109814 -2765150 -1579763 -137266 -25504 -674602 -568967 422622
689D22622P99094O4723m08824p54683j013019n43137O07380J117961J86155j171320
$$ 422622 1221716 1286439 877615 122932 -890087 -1433224 -825844 292117 478272 -693048
679f93048j509494o96487N16836J645555K315085J972348P88515k4448J33958
$$ -693048 -2202542 -2899029 -2382193 -736638 1578447 3550795 4339310 4314862 4448820
670D448820J53222j016712k351022k073038m37641N75118J84477l87520k13680
$$ 4448820 4602042 3585330 1234308 -838730 -1276371 -701253 -516776 -904296 -1117976
661a117976R4567L3250K88943J118325J241287j73828j677551j452650j46800
$$ -1117976 -1023409 -990159 -701216 417109 1658396 1484568 -192983 -1645633 -1792433
652a792433K04222m92508m31477P77462J335266M06947l79503J86441P38968j62817
$$ -1792433 -1588211 -2080719 -2512196 -1734734 -399468 7479 -372024 -185583 553385 390568
642C90568j277105p09117P31941Q37823k72671o06510Q21j96620j093447l06036
$$ 390568 -886537 -1595654 -863713 -25890 -298561 -905071 -904250 -1100870 -2194317 -2500353
632b500353K434314L719505J261297k393448l381379j685769o2109N48786J337199
$$ -2500353 -66039 3653466 4914763 2521315 -860064 -2545833 -2607942 -2059156 -721957
623g21957K209453J465378q83945k378748j519348K92003J091128P79768L20333
$$ -721957 1487496 2952874 2068929 -309819 -1829167 -1537164 -446036 333732 654065
614F54065J44680L31297R78288J496112Q36027p01875j262728q6879J008469J72829
$$ 654065 798745 1130042 2108330 3604442 4440469 3738594 2475866 2388987 3397456 3570285
604C570285j619793j955924n05565O62373J33323j107962j271878P6759J850710
$$ 3570285 1950492 -5432 -510997 151376 284699 -823263 -2095141 -2018382 -167672
595a67672K652587J885776K24697r16465q37320l33242m90400j068030r83870
$$ -167672 2484915 4370691 4595388 3678923 2841603 2508361 2017961 949931 -33939
586c3939j67612K63381j92465o34132k27004N63763Q42756N56912J86231j54750
$$ -33939 -201551 61830 -130635 -764767 -991771 -428008 414748 971660 1157891 1003141
576A003141n36027o74846l80066j31513m39712r53978r72934n48422k73771k23251
$$ 1003141 467114 -207732 -587798 -719311 -1159023 -2113001 -3085935 -3634357 -3908128 -4131379
566d131379M179L27788K36876j74113j72972M22616Q85773O73674J16954k45004
$$ -4131379 -4127200 -3799412 -3562536 -3736649 -3909621 -3487005 -2601232 -1927558 -1810604 -2055608
556b055608k83657J4186O99854J426333J593329J195025P74042L84639m08815
$$ -2055608 -2339265 -2325079 -1625225 -198892 1394437 2589462 3363504 3748143 3339328
547C339328j296987j261866l10490K37388q2258K0570J217034J925675P11601
$$ 3339328 2042341 780475 469985 707373 625115 645685 1862719 3788394 4499995
538D499995j093045j269673j73693P7348p65579q96368K09885R32414L82916l27996
$$ 4499995 3406950 2137277 1963584 2040932 1275353 378985 588870 1521284 1904200 1576204
528A576204m17993o84451j433883j389905j3293J055286M48117p08753p16667
$$ 1576204 1158211 473760 -960123 -2350028 -2363321 -1308035 -859918 -1568671 -2285338
519b285338K2678J15500k41236J75786J220172J530151P35075k16936p60934j200722
$$ -2285338 -2262660 -2147160 -2388396 -2212610 -992438 537713 1272788 1055852 294918 -905804
509i05804j529186j147430N3968J304849J751874J066997m07457j515250r73674
$$ -905804 -2434990 -3582420 -3528452 -2223603 -471729 595268 187811 -1327439 -2301113
500b301113Q83297J801151K47237k281040k971521j236313R59560J962018J934767
$$ -2301113 -1417816 383335 630572 -1650468 -4621989 -5858302 -4898742 -2936724 -1001957
491a001957J507939O65748m67469j050107n12290N99353J284266J128987M57239
$$ -1001957 505982 1171730 704261 -345846 -858136 -258783 1025483 2154470 2611709
482B611709j33315k90156k63014n92720j200781j295607o04383M4292L4223l1985
$$ 2611709 2478394 2188238 1925224 1332504 131723 -1163884 -1768267 -1723975 -1689752 -1721737
472a721737L97349N18175m91742j651422j385904k9197P08307M81633N58261J312512
$$ -1721737 -1324388 -806213 -1297955 -2949377 -4335281 -4364478 -3656171 -3174538 -2616277 -1303765
462a303765J517170N93786k87210j36122L45123R3428o35833q27445j78919O48115
$$ -1303765 213405 807191 519981 383859 728982 822410 186577 -640868 -819787 -171672
452a71672P60633j73297j326143j173044N32859J740181N07722j952107k559779
$$ -171672 588961 415664 -910479 -2083523 -1550664 189517 697239 -1254868 -3814647
443c814647o55841J212745J185210L79913L42561N36863m8839p28237m86231p7072
$$ -3814647 -4470488 -3257743 -2072533 -1692620 -1350059 -813196 -862035 -1590272 -2076503 -2153575
433b153575o74115j409500m17892K082385L706935K953972Q42704o63240p27883
$$ -2153575 -2827690 -4237190 -4655082 -2572697 1134238 4088210 4930914 4267674 3539791
424C539791K9467M03624l29652j619997k006493q15770P74115J031314j90668
$$ 3539791 3569258 3972882 3643230 2023233 16740 -799030 -24915 1006399 815731
415H15731j319645j009880L66865J247606N75961j082187k099938j579613l42812
$$ 815731 -503914 -1513794 -1146929 100677 676638 -405549 -2505487 -4085100 -4427912
406d427912K90305K82076M92301Q14640J75389j336740j880463k29040K412046
$$ -4427912 -4137607 -3855531 -3363230 -2548590 -2373201 -3709941 -5590404 -5819444 -3407398
397c407398L838113L211916J287180p45050j812393j316020J20575R72051O16181
$$ -3407398 430715 3642631 4929811 4184761 2372368 1056348 1176923 2148974 2765155
388B765155K7085O5341J74611l70332j062188j111615q15694q11998q36155l95008
$$ 2765155 2792240 2857581 3032192 2661860 1599672 488057 -327637 -1139635 -1975790 -2370798
378b370798J23958J79438J52669N65647R78278P63584K05335k01054o10737r67023
$$ -2370798 -2246840 -2067402 -1914733 -1349086 -370808 392776 598111 397057 -213680 -1180703
368a180703m79635P75972J107643l30422j691648j000476P37536J267550P23696
$$ -1180703 -1660338 -884366 223277 -107145 -1798793 -2799269 -2061733 -794183 -70487
359g0487Q15824J295656M07750j460204j921373o61764p4844j046147j337104
$$ -70487 745337 2040993 2448743 988539 -932834 -1594598 -1669442 -2715589 -4052693
350d052693M39697K194258J656118j20053p68378k37721n1829l58108j56120L69621
$$ -4052693 -3612996 -1418738 237380 117327 -651051 -888772 -940601 -1298709 -1454829 -1085208
340a085208P1123r24718j189185k14094R23915J237658R01757N21382L59078M26906
$$ -1085208 -1014085 -1938803 -3127988 -3342082 -2418167 -1180509 -278752 242630 601708 1028614
330A028614N76774M68103K0916k94540j84352j48520o51025j122185p17591K49824
$$ 1028614 1605388 2073491 2094407 1799867 1615515 1466995 815970 -306215 -1023806 -773982
320g73982O64570K29657l35522o92510j302573k145369k144907o22256J383534
$$ -773982 -109412 120245 -215277 -907787 -2210360 -4355729 -6500636 -7122892 -5739358
311e739358K135411J288253J87657O4258O18766P38945J50407k67447K11727J104388
$$ -5739358 -3603947 -2315694 -2128037 -2063779 -1445013 -706068 -555661 -823108 -611381 493007
301D93007J289572L62807r26031j484410q89054K94788R94499N83874m34429q96652
$$ 493007 1782579 2145386 1219355 -265055 -1154109 -859321 135178 719052 284623 -612029
291f12029l23809N24465P22942L46294M5255q6351m25684q41497p17251K814O18650
$$ -612029 -935838 -411373 311569 657863 703118 616767 191083 -650414 -1367665 -1364851 -746201
280g46201P11029O44534P72972Q08727L74291l08493p02761o52216m66720m35224
$$ -746201 -35172 609362 1382334 2191061 2565352 2256859 1554098 901882 435162 -62
270f2m30952k6558Q80823J568384J077862m16735j433942r66991J44478M67713
$$ -62 -431014 -457572 423251 1991635 3069497 2652762 1218820 251829 396307 864020
260H64020N5600R9324Q14749J099738M18677l61246m81558m34324q95527j459852
$$ 864020 919620 1018944 1833693 2933431 3352108 2990862 2509304 2074980 1179453 -280399
250b80399j268625l26756N10150N46982j53826q60430o85597N07188J626814J434943
$$ -280399 -1549024 -1875780 -1365630 -818648 -972474 -1832904 -2518501 -2011313 -384499 1050444
240A050444J88226o28467l70795N261l24078o96575j99784O41516N79528l88839
$$ 1050444 1238670 610203 239408 244669 -79409 -775984 -975768 -334252 245276 -143563
230a43563r38969l19288O11397N91515l78030j083145o68387L11786O71368J45605
$$ -143563 -1082532 -1401820 -790423 -198908 -576938 -1660083 -2328470 -2016684 -1345316 -1199711
220a199711l82992k05774L83549Q39960J109816J102418L71461q16386j085704
$$ -1199711 -1582703 -1788477 -1404928 -564968 544848 1647266 2018727 1202341 116637
211A16637J26295J167719L30399j328958j364983K57508J093795M7091j185712
$$ 116637 242932 1410651 1741050 412092 -952891 -695383 398412 445503 -740209
202g40209j089705l72940k6550M21083J325149J567459M35781p45726n67772K61283
$$ -740209 -1829914 -2202854 -2229404 -1808321 -483172 1084287 1520068 774342 206570 467853
192D67853L61094J6001K07915M58322k92982j421561j306622R2864J190400J087891
$$ 467853 828947 844948 1052863 1511185 1218203 -203358 -1509980 -1417116 -226716 861175
182H61175L30700m41045j067978j249544p66504k20004l00603n46889p3387P94331
$$ 861175 1191875 750830 -317148 -1566692 -2333196 -2553200 -2853803 -3400692 -3474079 -2679748
172b679748R79898M75609K64790N90070P34544M67593L07966L21798p09n74520
$$ -2679748 -1699850 -1224241 -959451 -369381 365163 832756 1140722 1462520 1461811 887291
162H87291o76063k07934J09968p8791l82103m40463j78192N09467J342213J341797
$$ 887291 211228 3294 113262 34471 -347632 -788095 -966287 -456820 885393 2227190
152B227190J23030r94832o10518N03958M95542n82648r12944L642O23148J00015
$$ 2227190 2350220 1355388 744870 1248828 1744370 1161722 248778 252420 875568 975583
142I75583m32505q9890K68020j67923o11301j72598N29940N02911n5150m55226
$$ 975583 543078 453188 721208 553285 -58016 -230614 299326 802237 747087 291861
132B91861o74145p25380l4980J331114J913541P39134r36960j251963l87692j5041
$$ 291861 -382284 -1107664 -1142644 188470 2102011 2841145 1904185 652222 264530 249489
122B49489n57689p42042J15121R95447Q65446K58876L57999J150744J375780K54704
$$ 249489 -308200 -1050242 -935121 60326 925772 1184648 1542647 2693391 4069171 4323875
112D323875j325834j743309o19826O27233N06938p17357j533581j192140l11988
$$ 4323875 2998041 1254732 634906 1262139 1769077 1051720 -481861 -1674001 -1985989
103a985989M38230J141060J774882J621040K65092j464517k287832j845982p99738
$$ -1985989 -1547759 -406699 1368183 2989223 3254315 1789798 -498034 -2344016 -3143754
94c143754N3030L20404O2180k54963r5453N59837J188386J371289J114646N59740
$$ -3143754 -3090724 -2770320 -2708140 -2963103 -3058556 -2498719 -1310333 60956 1175602 1735342
84A735342r3354m15984j89040J7687m61787j116278p27858P02037J672568J259347
$$ 1735342 1641988 1226004 1036964 1054651 592864 -523414 -1251272 -549235 1123333 2382680
74B382680L04086r5758j48342n46142j045558r20793k21516L59443M51312J34526
$$ 2382680 2686766 2591008 2442666 1896524 850966 -69827 -291343 68100 519412 653938
64F53938m29018q89580p46067k7543O04067Q20546R48802R85414L77184o41923
$$ 653938 224920 -664660 -1410727 -1438270 -834203 -13657 935145 1920559 2297743 1655820
54A655820p88225K65769R36415O4698j027485m93149J001000J213952j78111j164854
$$ 1655820 867595 1133364 2069779 2134477 1106992 613843 1614843 2828795 2650684 1485830
44A485830n49779M59815L70494m67185o99412O6370R36283Q71113k64896j479296
$$ 1485830 936051 1395866 1766360 1299175 599763 666133 1602416 2473529 2208633 729337
34G29337j470581q8689J266838J290601L95089j39429j31416l94665r66709r15906
$$ 729337 -741244 -829933 436905 1727506 2122595 1983166 1851750 1457085 490376 -425530
24d25530k7500P16799O96797M44013M28747K51202l42517p02400l12908K20841
$$ -425530 -453030 263769 960566 1404579 1833326 2084528 1742011 1039611 726703 947544
14I47544K8688p38936j181395q23006J1575O77074O87243N0060n97093n46873
$$ 947544 976232 237296 -944099 -1767105 -1755530 -1078456 -391213 -341153 -938246 -1485119
4a485119Q4813M39758N6205n41991
$$ -1485119 -1400306 -960548 -904343 -1446334
0a446334
$$ -1446334
##END NTUPLES=NMR SPECTRUM
##END=
