##TITLE=31Pdec_LR-684A-2(R)
 , 24 sc
 22.7.2019
##JCAMPDX= 6.0         $$ Bruker NMR JCAMP-DX V2.0
##DATA TYPE= NMR SPECTRUM
##DATA CLASS= NTUPLES
##ORIGIN= UXNMR, Bruker Analytische Messtechnik GmbH
##OWNER= root
$$ XWIN-NMR		Version 3.5
$$ Mon Jul 22 16:40:35 2019 Russian Standard Time (UT+4h)  she@DPX200
##.OBSERVE FREQUENCY= 81.013821
##.OBSERVE NUCLEUS= ^31P
##.ACQUISITION MODE= SIMULTANEOUS
##.ACQUISITION SCHEME= undefined
##.AVERAGES= 24
##.DIGITISER RES= 17
##SPECTROMETER/DATA SYSTEM= spect
##.PULSE SEQUENCE= zgpg30
##.SOLVENT NAME= CDCl3
##.SHIFT REFERENCE= (INTERNAL, CDCl3, 0, 182.463)
##AUDIT TRAIL= $$ (NUMBER, WHEN, WHO, WHERE, WHAT)
$$ ##TITLE= Audit trail, XWIN-NMR		Version 3.5
$$ ##JCAMPDX= 5.01
$$ ##ORIGIN= Bruker BioSpin GmbH
$$ ##OWNER= she
$$ F:/spectra/data/she/nmr/P31/1/pdata/1/auditp.txt
$$ ##AUDIT TRAIL=  $$ (NUMBER, WHEN, WHO, WHERE, WHAT)
(   1,<2019-07-22 16:39:27.04 +0400>,<she>,<DPX200>,
      <created by zg, POWCHK disabled, PULCHK disabled
       configuration hash MD5:
       00 E9 B6 7A A2 85 ED C7 34 08 36 98 17 FE 4E 26
       data hash MD5: 32K
       A1 0D 3F 95 90 B0 A7 7A 50 D6 6F 92 74 BE 79 10>)
(   2,<2019-07-22 16:39:31.34 +0400>,<she>,<DPX200>,
      <Start of raw data processing
       efp BC_mod = 2 LB = 1 FT_mod = 6 PKNL = 1 PHC0 = -2570.622 PHC1 = 86.99923 SI = 64K 
       data hash MD5: 64K
       3B B8 4E AC B0 A4 3A 86 DF 47 EE C0 43 92 B7 C1>)
(   3,<2019-07-22 16:39:46.29 +0400>,<she>,<DPX200>,
      <pk PHC0 = 29.96215 PHC1 = -5.2 
       data hash MD5: 64K
       96 6A 3E CD 5B 16 BE A8 A7 DB FA A6 19 FE D9 2C>)
$$ ##END=
$$ 
$$ hash MD5
$$ D9 DE 35 5C 81 A1 CB 26 14 CE A8 1F BA E9 21 19
##$RELAX= 
##$RELAX= 
##$RELAX= 
##$RELAX= 
##$RELAX= 
##$RELAX= 
##$RELAX= 
##$RELAX= 
$$ Bruker specific parameters
$$ --------------------------
##$DU= <F:/spectra>
##$EXPNO= 1
##$NAME= <P31>
##$PROCNO= 1
##$TYPE= <nmr>
##$USER= <she>
##$AMP= (0..31)
100 100 100 100 100 100 100 100 100 100 100 100 100 100 100 100 100 100 
100 100 100 100 100 100 100 100 100 100 100 100 100 100 
##$AQSEQ= 0
##$AQ_mod= 1
##$AUNM= <au_zg>
##$AUTOPOS= <>
##$BF1= 81.014009
##$BF2= 200.13
##$BF3= 200.13
##$BF4= 200.13
##$BF5= 200.13
##$BF6= 200.13
##$BF7= 200.13
##$BF8= 200.13
##$BYTORDA= 1
##$CFDGTYP= 0
##$CFRGTYP= 5
##$CHEMSTR= <none>
##$CNST= (0..31)
1 1 145 1 1 1 1 1 1 1 1 1 1 1 1 1 1 1 1 1 1 1 1 1 1 1 1 1 1 1 1 1 
##$CPDPRG= <waltz16>
##$CPDPRG1= <>
##$CPDPRG2= <waltz16>
##$CPDPRG3= <>
##$CPDPRG4= <mlev>
##$CPDPRG5= <mlev>
##$CPDPRG6= <mlev>
##$CPDPRG7= <mlev>
##$CPDPRG8= <mlev>
##$CPDPRGB= <>
##$CPDPRGT= <>
##$D= (0..31)
0 1 0 0 0 0 0 0 0 0 0 0.03 2e-05 3e-06 0 0 0 0 0 0 0 0 0 0 0 0 0 0 0 0 
0 0 
##$DATE= 1563799166
##$DBL= (0..7)
120 120 120 11 120 120 24 19 
##$DBP= (0..7)
150 150 150 150 150 150 150 150 
##$DBP07= 0
##$DBPNAM0= <>
##$DBPNAM1= <>
##$DBPNAM2= <>
##$DBPNAM3= <>
##$DBPNAM4= <>
##$DBPNAM5= <>
##$DBPNAM6= <>
##$DBPNAM7= <>
##$DBPOAL= (0..7)
0.5 0.5 0.5 0.5 0.5 0.5 0.5 0.5 
##$DBPOFFS= (0..7)
0 0 0 0 0 0 0 0 
$$ [...]
##$SUBNAM2= <"">
##$SUBNAM3= <"">
##$SUBNAM4= <"">
##$SUBNAM5= <"">
##$SUBNAM6= <"">
##$SUBNAM7= <"">
##$SUBNAM8= <"">
##$SUBNAM9= <"">
##$SW= 369.568048894756
##$SWIBOX= (0..15)
0 1 3 0 0 0 0 0 0 0 0 0 0 0 0 0 
##$SW_h= 29940.119760479
##$TD= 32768
##$TD0= 1
##$TE= 0
##$TE2= 300
##$TE3= 300
##$TEG= 300
##$TL= (0..7)
0 120 53 12 22 120 120 120 
##$TP= (0..7)
150 150 150 150 150 150 150 150 
##$TP07= 0
##$TPNAME0= <>
##$TPNAME1= <>
##$TPNAME2= <>
##$TPNAME3= <>
##$TPNAME4= <>
##$TPNAME5= <>
##$TPNAME6= <>
##$TPNAME7= <>
##$TPOAL= (0..7)
0.5 0.5 0.5 0.5 0.5 0.5 0.5 0.5 
##$TPOFFS= (0..7)
0 0 0 0 0 0 0 0 
##$TUNHIN= 0
##$TUNHOUT= 0
##$TUNXOUT= 0
##$USERA1= <user>
##$USERA2= <user>
##$USERA3= <user>
##$USERA4= <user>
##$USERA5= <user>
##$V9= 5
##$VALIST= <valist>
##$VCLIST= <CCCCCCCCCCCCCCC>
##$VD= 0
##$VDLIST= <DDDDDDDDDDDDDDD>
##$VPLIST= <PPPPPPPPPPPPPPP>
##$VTLIST= <TTTTTTTTTTTTTTT>
##$WBST= 1024
##$WBSW= 4
##$XGAIN= (0..3)
0 0 0 0 
##$XL= 0
##$YL= 0
##$YMAX_a= 22747
##$YMIN_a= -14059
##$ZGOPTNS= <>
##$ZL1= 120
##$ZL2= 120
##$ZL3= 120
##$ZL4= 120
##$ABSF1= 0
##$ABSF2= 0
##$ABSG= 0
##$ABSL= 0
##$ALPHA= 0
##$AQORDER= 0
##$ASSFAC= 0
##$ASSFACI= 0
##$ASSFACX= 0
##$ASSWID= 0
##$AUNMP= <proc_1d>
##$AZFE= 0.1
##$AZFW= 0.5
##$BCFW= 0
##$BC_mod= 2
##$BYTORDP= 0
##$COROFFS= 0
##$CY= -3
##$DATMOD= 1
##$DC= 0
##$DFILT= <>
##$DTYPP= 0
##$F1P= 0
##$F2P= 0
##$FCOR= 1
##$FTSIZE= 65536
##$FT_mod= 6
##$GAMMA= 0
##$GB= 0
##$INTBC= 1
##$INTSCL= 5.30512e-09
##$ISEN= 30
##$LB= 1
##$LEV0= 0
##$LPBIN= 0
##$MAXI= 10000
##$MC2= 0
##$MEAN= 0
##$ME_mod= 0
##$MI= 50
##$NCOEF= 0
##$NC_proc= -6
##$NLEV= 6
##$NOISF1= 182.463
##$NOISF2= 159.3651
##$NSP= 0
##$NTH_PI= 0
##$NZP= 0
##$OFFSET= 182.463
##$PC= 4
##$PHC0= -2540.66
##$PHC1= 81.79923
##$PH_mod= 1
##$PKNL= yes
##$PPARMOD= 0
##$PSCAL= 0
##$PSIGN= 0
##$REVERSE= no
##$SF= 81.0140089999434
##$SI= 65536
##$SIGF1= 159.3651
##$SIGF2= -187.1042
##$SINO= 113.3802
##$SIOLD= 16384
##$SREGLST= <1H.CDCl3>
##$SSB= 0
##$STSI= 65536
##$STSR= 0
##$SW_p= 29940.119760479
##$SYMM= 0
##$S_DEV= 0
##$TDeff= 32768
##$TDoff= 0
##$TI= <>
##$TILT= no
##$TM1= 0
##$TM2= 0
##$TOPLEV= 0
##$USERP1= <user>
##$USERP2= <user>
##$USERP3= <user>
##$USERP4= <user>
##$USERP5= <user>
##$WDW= 1
##$XDIM= 65536
##$YMAX_p= 423547323
##$YMIN_p= -115260715
$$ End of Bruker specific parameters
$$ ---------------------------------
##NTUPLES= NMR SPECTRUM
##VAR_NAME=  FREQUENCY,     SPECTRUM/REAL,   SPECTRUM/IMAG
##SYMBOL=    X,             R,               I
##VAR_TYPE=  INDEPENDENT,   DEPENDENT,       DEPENDENT
##VAR_FORM=  AFFN,          ASDF,            ASDF
##VAR_DIM=   65536,         65536,           65536
##UNITS=     HZ,            ARBITRARY UNITS, ARBITRARY UNITS
##FACTOR=    0.456856943014862, 1,           1
##FIRST=     14782.0589164792, 0,            0
##LAST=      -15158.0608439998, 0,           0
##MIN=       -15158.0608439998, -115260715,  0
##MAX=       14782.0589164792, 423547323,    0
$$ Real data points
##PAGE= N=1
##DATA TABLE= (X++(R..R)), XYDATA
$$ [...]
44776 4641327 3288507 683608 -445074 221726 269469 -2024108 -5256363 -6607302 -5172660
44767 -5172660 -2651639 -1012178 -460169 57906 1152214 2420124 3156137 2916293 1539039
44758 1539039 -649679 -2611278 -3316676 -2903311 -2436145 -2310100 -1758244 -405204 681144
44749 681144 424269 -507427 -593190 273034 743650 249082 -78198 821835 2317309 3006166
44739 3006166 2589812 2009719 2027337 2411223 2518825 2104294 1341038 394912 -671300
44730 -671300 -1636281 -2144857 -2199361 -2312395 -2756766 -2918912 -2075163 -728069 -259765 -1040768
44720 -1040768 -1890448 -1921778 -1849144 -2577289 -3480579 -3385514 -2624398 -2630309 -3718025 -4646651
44710 -4646651 -4368034 -3001014 -1148541 451903 654731 -1173266 -3697470 -4596437 -3470084
44701 -3470084 -2304349 -2448248 -2748053 -1740897 -231358 -114585 -1498969 -2614781 -2273980
44692 -2273980 -1077639 -195638 39129 212475 1135371 3025146 4968615 5530242 4375605
44683 4375605 2836516 2279996 2438934 2097897 926009 -301048 -982055 -1230103 -1258993
44674 -1258993 -1076143 -729831 -158413 1030291 2834202 4095707 3479228 1368647 -90061
44665 -90061 741127 3150682 4779725 3907872 1027097 -1570895 -1869475 -81512 1657664
44656 1657664 1748586 723161 -50286 -370047 -812547 -1005953 45436 1838758 2178059
44647 2178059 -182110 -3711712 -5642841 -4706447 -1915914 660383 1449379 394970
44639 394970 -1009206 -1155372 -91634 660711 152833 -978743 -1752591 -1992526 -1731889
44630 -1731889 -655483 984186 1924032 1452904 564792 382837 281662 -939397 -2646430
44621 -2646430 -2914447 -1330462 456522 1122107 992030 702029 193108 -373274 -262562
44612 -262562 446411 523980 -454799 -1226221 -977884 -833933 -1694089 -2114683 -531645 1499579
44602 1499579 1047301 -1532289 -2665751 -848496 1068615 319057 -1610022 -1527638 513442
44593 513442 1576776 351878 -1452360 -2232627 -2473875 -2920776 -2906717 -1761804 -417488
44584 -417488 -179757 -740685 -674520 571181 2213084 3268870 3209740 1841255 -398995
44575 -398995 -2138834 -2128734 -781569 211353 63465 -146203 836002 2540445 3368480
44566 3368480 2703778 1524357 902021 779092 649833 720374 1509512 2512319 2275162
44557 2275162 212756 -2304767 -3305826 -2358542 -800329 -37978 -246009 -725789 -916565
44548 -916565 -814431 -765200 -1041472 -1431376 -1286268 -290956 928866 1442380 1172256 813304
44538 813304 635778 198106 -540775 -756948 -237 856092 739549 -8650 -70546 919619
44528 919619 1715631 924004 -1344942 -3482456 -3867359 -2389183 -597595 -116487 -845137
44519 -845137 -1228628 -473982 373285 200812 -266528 397436 1836453 2229140 1146178
44510 1146178 359434 1117149 2138420 1545630 -293692 -1422563 -1263710 -1230886 -2251329
44501 -2251329 -3230460 -2707936 -950466 624198 1504133 2426144 3748559 4538115 3728550
44492 3728550 1573643 -636978 -2019993 -2654998 -2784476 -2210846 -936175 81650 -347139
44483 -347139 -2022162 -3156519 -2346954 -348078 833056 467071 -162873 228807 1168403
44474 1168403 1429373 1057561 1187209 2052822 2499456 1778463 684356 271902 337183
44465 337183 -45738 -1147626 -2521032 -3711628 -4226272 -3408666 -1313799 811496 1939796
44456 1939796 2597187 3601797 4159784 2997195 1102065 1156133 3758816 6213905 5993296
44447 5993296 3676786 1330336 -340101 -1630399 -2012963 -691237 1611022 3157318
44439 3157318 3254034 2491845 1400944 312297 139992 1628372 3865447 5065468 4892768
44430 4892768 4556519 4516425 3738761 1728616 -176046 -396920 953316 2440120 2877350
44421 2877350 2008730 341890 -1150224 -1663478 -1254252 -545531 162454 804785 813505
44412 813505 -381507 -2061016 -2715101 -2148057 -1788926 -2402363 -2825141 -1778568 245660
44403 245660 1883041 2688784 2994902 2835045 2171611 1604892 1751849 2287155 2473255
44394 2473255 2223296 1863572 1425308 1088745 1704621 3678965 5704458 5867290 3977144
44385 3977144 1728609 527094 180296 -105765 -441341 -437024 -44599 325728 389257 460595
44375 460595 1241931 2918943 4500252 4616819 3204959 1738387 1393760 1718574 1666514
44366 1666514 1120154 594222 255224 240170 1136064 2873849 3867468 2834245 1026877
44357 1026877 895246 2649529 3979976 3387012 1952606 1260174 1301467 1370188 1594975
44348 1594975 2450208 3723875 4903241 5724209 5630383 3809996 734037 -1441327 -1263033
44339 -1263033 35771 214593 -979168 -1863397 -1416902 -365696 254698 353178 406891
44330 406891 728234 1268409 1568561 1042189 -105024 -609965 399022 2076534 2902756
44321 2902756 2644593 2219984 2072048 2035211 2442446 3622170 4316533 2624872 -888236
44312 -888236 -2943996 -1485839 1722436 3705116 4015284 4220340 4811988 4702899 3381696
44303 3381696 1637968 83718 -1424013 -2633073 -2603795 -1058989 1014679 2515938
44295 2515938 3157986 3120761 2778863 2945949 4249530 5893464 6135902 4469453 2298476
44286 2298476 1011357 565030 554287 1232004 2338537 2210677 -276017 -3546905 -4763213
44277 -4763213 -3179041 -657542 960833 1523898 1629106 1626188 1955650 3055526 4254800
44268 4254800 3951893 1759619 -457849 -660483 921077 2419027 2928747 3282089 4221383
44259 4221383 4955879 4208909 2184093 651590 908575 2187430 2590793 1389337 -292662
44250 -292662 -1158043 -1275244 -1438998 -1726026 -1548130 -756329 163664 762977 758741 -115404
44240 -115404 -1470739 -1932156 -690327 921300 903760 -451087 -862882 408538 1345240
44231 1345240 371480 -1133323 -1042447 213986 407722 -1194893 -3087253 -3793165 -3373338
44222 -3373338 -2666182 -2209516 -2061663 -1956602 -1663332 -1571585 -2358562 -3553115 -3407604
44213 -3407604 -1217600 1172239 1543350 213363 -773123 -659811 -313010 -16844 812467
44204 812467 1613381 714003 -1835145 -3431941 -2138473 660754 2028037 908868 -1260919
44195 -1260919 -2563655 -2190995 -603135 998682 1630949 1417707 1178487 1087607 588064
44186 588064 -211558 -226585 1009675 2551748 3495538 4166490 5110198 5929248 5980681 5298867
44176 5298867 4027258 2003434 -155932 -765730 826862 2857427 3280029 2372140 1671724
44167 1671724 1298798 353913 -664934 -242589 1373827 2153502 1519927 1319441 2574584
44158 2574584 3416117 1915545 -585167 -1073146 905520 2657702 2047500 131118 -500150
44149 -500150 1060482 3249111 3972411 2676385 601218 -553954 -108654 1184979 1941516
44140 1941516 1369950 -63742 -1088323 -900365 -50950 196360 -558460 -1438272 -1713390
44131 -1713390 -1884050 -2581439 -3056359 -2038231 96091 1440521 1100063 258370 184702
44122 184702 532431 506421 454178 977403 1403241 731943 -428371 -569468 246914 376888
44112 376888 -729841 -1574937 -970866 239620 850923 1295355 2524768 3856346 3687134
44103 3687134 2024865 639505 598452 1154318 1446238 1831500 2687841 3060226 1737847
44094 1737847 -853279 -2947085 -3431970 -2652289 -1380955 -862 1139205 1508528 1086785
44085 1086785 719776 1179524 2094404 2294435 1149347 -790000 -2444969 -3172769 -3042352
44076 -3042352 -2476550 -1841603 -1273114 -712278 -117624 269186 -29894 -1166414 -2432551
44067 -2432551 -2660650 -1485977 -43966 29275 -1605376 -3470886 -3705552 -1886779 615114
44058 615114 1966061 1572637 636813 952064 2957702 5173949 5890252 5117401 4259538
44049 4259538 4113081 4157671 3853642 3433212 2914664 1519992 -972982 -3186302 -3613404
44040 -3613404 -2573151 -1544795 -1023880 -359409 518291 698677 -159008 -1155096 -1485273
44031 -1485273 -1440928 -1596229 -1883413 -2035202 -2217995 -2612820 -2880173 -2599054 -1923428 -1412280
44021 -1412280 -1414258 -1780102 -1950143 -1366107 -142586 862400 1142818 1346366 2164706
44012 2164706 2816637 1915469 -202545 -1491428 -897383 369725 890950 979889 1580122
44003 1580122 2345172 2078986 494936 -1516177 -2996316 -3509735 -3011757 -1824305 -479431
43994 -479431 760398 1783079 1993475 810448 -955694 -1577155 -868084 -675980 -1973833
43985 -1973833 -3098874 -2356232 -829233 -573449 -1202867 -742606 727626 981837 -641614
43976 -641614 -1922314 -929424 1429900 2991912 2942836 1865234 438324 -829574 -1402356
43967 -1402356 -1172491 -634405 -137420 404665 752001 183912 -1334654 -2590107 -2387856
43958 -2387856 -939277 416670 439281 -1230192 -3816180 -5647016 -5354989 -3254007 -995333
43949 -995333 366046 1281432 2449831 3519912 3648488 2793407 1851406 1764769 2762209
43940 2762209 4142953 4671323 3666160 1876713 805277 1043770 1808748 2180368 2096071
43931 2096071 1894603 1572930 910382 -89370 -1159835 -1901649 -1952956 -1399076 -850503
43922 -850503 -633966 -251999 636873 1180427 422714 -856701 -829208 793903 2326492
43913 2326492 2566698 2219513 2311932 2602440 2398135 1790513 1171608 452523 -397330 -837762
43903 -837762 -518452 179132 896297 1740819 2559804 2896638 3180116 4550978 6685442
43894 6685442 7324671 5238258 2292973 1032742 1387965 1576999 1250245 1514408 2298710
43885 2298710 2080487 505089 -778341 -599756 75682 -74588 -629825 -381927 382847
43876 382847 17756 -2031668 -4060022 -4042676 -2183106 -595705 -451811 -538556 661368
43867 661368 2458744 2915203 1816372 947685 1324195 1940571 1797147 1414812 1452497
43858 1452497 1461649 1191622 1645118 3408295 5171441 5433778 4656474 4239854 4341914
43849 4341914 4225740 3802191 3243217 2050757 219553 -689727 435915 2128760 2325637
43840 2325637 1538370 1599947 2088819 987111 -1380961 -2296210 -943180 317459 -110506
43831 -110506 -714419 159695 1527944 1713675 1062062 835309 911514 392519 -604844 -1353754
43821 -1353754 -1834982 -2332270 -2533348 -2148135 -1576220 -1027132 -11533 1351922 1760386
43812 1760386 625073 -665715 -706136 -143819 -333375 -1030444 -1123261 -749275 -812304 -1022226
43802 -1022226 -366083 775891 899073 -240961 -1253003 -1284417 -950478 -779959 -296313
43793 -296313 744611 1497138 1198947 322686 -116819 251109 1135562 2058238 2327679
43784 2327679 1206408 -1182680 -3449008 -4066305 -2874975 -1136739 -162735 -99201 -8003
43775 -8003 1005587 2770566 4198260 4516818 4183726 4276221 5026383 5361234 4127372
43766 4127372 1581791 -652139 -1193270 -251260 858766 1367415 1675148 2211608 2435127
43757 2435127 1667409 427594 -66587 403381 900611 954923 1183694 1843503 1877381 343461
43747 343461 -1837680 -2597011 -1097236 1270657 2341302 1281371 -780088 -2034967
43739 -2034967 -1812696 -966890 -447219 -86392 651459 1372191 1305306 826491 1079879 2076383
43729 2076383 2571359 2043855 1310361 762684 -365713 -2171227 -3081364 -1888228 374784
43720 374784 1768706 1720924 963673 258390 251808 1492455 3372048 4110359 3038800
43711 3038800 1736004 1521365 1225013 -652593 -2853828 -2896075 -928562 583542 738683
43702 738683 1028959 2078597 2287190 609876 -1609185 -2778755 -3181091 -3666274 -3797950
43693 -3797950 -2776106 -1126495 -75644 84806 -82873 -298082 -651582 -1002399 -1099159
43684 -1099159 -1003625 -850749 -543944 -74748 310763 580146 1011650 1561627 1794484 1736716
43674 1736716 2022626 2746329 2952419 1906231 260131 -745934 -843586 -839972 -1370394
43665 -1370394 -2088739 -2118926 -1082275 372615 1165198 1018818 789255 1235289 1909584
43656 1909584 1869777 1049294 120347 -602410 -1173567 -1348542 -1067708 -1239081 -2593119
43647 -2593119 -3924612 -3143353 -266879 2274604 2742605 1950024 1490917 1662435 1878717
43638 1878717 1746025 945728 -645229 -2011109 -1602519 305116 1351370 150386 -1887865
43629 -1887865 -2849578 -2800272 -2631446 -2065823 -573905 1038683 1816196 2307019 3203474
43620 3203474 3528928 2313445 968175 1443354 2767005 2255658 -70457 -1239020 200927
43611 200927 2328022 3223247 3392528 3543162 2612139 28747 -2127552 -1714563 -25975
43602 -25975 -183143 -2609503 -4547031 -4113138 -2558628 -1804525 -1636671 -658554 1123269
43593 1123269 2204047 1746233 593449 10925 338382 1170351 2084523 2696374 2595106
43584 2595106 1874976 1334523 1481627 1693822 1134291 131311 -386730 -549911 -1254911
43575 -1254911 -2218839 -2063360 -887563 -884662 -3147614 -5493517 -5265098 -3103748 -1813225
43566 -1813225 -2230559 -2646588 -2160467 -2014523 -2908443 -3244566 -1421326 1600961 3479330
43557 3479330 3376583 2449687 2025298 2368529 2968186 3178726 2665276 1719469 987402
43548 987402 627127 138835 -641194 -897904 231411 2336321 3890739 3771192 2394419
43539 2394419 1283271 1449109 2189605 1831561 -84661 -1919916 -1903540 -494703 244643
43530 244643 -616330 -1999634 -2719631 -2936760 -3270472 -3605426 -3468431 -2802903 -1788430
43521 -1788430 -548949 527458 863139 459631 -87508 -559229 -1235505 -1876258 -1730141
43512 -1730141 -919931 -539505 -860193 -882325 -373332 -638261 -2088475 -2865825 -1726408
43503 -1726408 -671944 -2155956 -4686333 -4291680 -361512 2984244 2229472 -1345760
43495 -1345760 -4109775 -4550939 -3507262 -1603454 1173508 3926706 5022491 4063102
43487 4063102 2331994 1042506 211284 -535153 -1074407 -1118891 -666502 259890 1658852
43478 1658852 2970590 3164122 1992475 620409 311785 877134 1180297 888182 756594
43469 756594 1186526 1528761 1171558 439259 -90646 -363310 -339863 438774 1927510 2993188
43459 2993188 2843755 2356118 2647880 2965342 1805833 -125254 -300058 1856637 3781008
43450 3781008 3388610 1873193 1381165 1643558 953944 -699954 -1731065 -1568199 -1063745
43441 -1063745 -613092 93695 602748 108182 -530663 647895 3604391 5796211 5576039
43432 5576039 4176631 3291779 2627737 1395153 542841 1395741 3021155 3121711 1266888
43423 1266888 -636828 -1105763 -637085 -304711 -364219 -728860 -1441150 -1965576 -1217938
43414 -1217938 759838 2114592 1336978 -494835 -894471 824721 2775431 3031577 1699187
43405 1699187 28124 -1280044 -1916140 -1166365 1153971 3328296 3051285 501866 -1370051
43396 -1370051 -405315 2117425 3387427 2560732 1046380 73957 -394696 -540681 -68161
43387 -68161 970188 1856702 2078914 1739412 1028889 157425 -209491 511245 1756973
43378 1756973 2338604 2102647 1958514 2228797 2360063 2441035 3359060 4938863 5640732
43369 5640732 4922522 4172232 4198065 3607432 1301399 -1038174 -1083422 603241 1429734
43360 1429734 513273 -732738 -1423757 -2229796 -3386248 -3878803 -3208239 -2160534 -1186118
43351 -1186118 292568 2177514 2910975 1518129 -710999 -1690725 -946626 287078 741732
43342 741732 214868 -465988 -166866 1262248 2278135 1197967 -1311758 -2580375 -1352363
43333 -1352363 420648 115260 -2309350 -4630293 -5072007 -3655727 -1577502 -311375
43325 -311375 -783984 -2472588 -3742063 -3758845 -3397056 -3563080 -3637039 -2695048 -1358160
43316 -1358160 -980847 -1586307 -2059232 -1980079 -1827034 -1669640 -1158834 -651610 -835106 -1257256
43306 -1257256 -741314 633810 1469023 1166917 594961 303327 -296918 -1367464 -1864442
43297 -1864442 -1294477 -866069 -1684577 -2905417 -3037004 -2249675 -1895225 -2204306 -2037314
43288 -2037314 -949217 -64948 -358123 -1057133 -626717 1030636 2190258 1341591 -904504
43279 -904504 -2516526 -2508158 -1886878 -1825180 -1844391 -795185 1027682 2161674 2154320 1926500
43269 1926500 1833795 1047574 -534145 -1391450 -473261 1103953 1679426 1309780 1072451
43260 1072451 1026711 430722 -558028 -941915 -396956 578056 1731733 2933285 3258648
43251 3258648 1770908 -709793 -2054514 -1314092 431598 1850300 2669708 2964962 2553826
43242 2553826 1683598 1145807 1092194 775330 7826 -257505 506616 1392609 1518355 1504520
43232 1504520 2437467 4131919 5515381 6145441 6277136 5912060 4872799 3504830 2316082
43223 2316082 1208328 -1807 -696677 -255950 498162 -538 -1793289 -3101867 -2710945
43214 -2710945 -1509005 -987269 -1132243 -754599 592302 2026776 2639437 2587656 2594772
43205 2594772 2829319 2777596 2172730 1553311 1540023 1826322 1494867 373541 -597514 -623757
43195 -623757 6274 679638 1362376 1979612 1692397 35638 -1695558 -1706058 -260795
43186 -260795 638205 364030 598415 2306619 3632351 2511800 148020 -293802 1940834
43177 1940834 4275295 4505050 3441825 3003051 3299059 3061660 2050333 1417281 1813729
43168 1813729 2431111 2230831 1268883 379820 86901 241855 419312 294749 -192475
43159 -192475 -745660 -877200 -422627 179361 369948 179664 139500 478243 862856 1152072
43149 1152072 1852793 3219272 4327655 4078397 3108454 3460437 5841224 8453233 9531746
43140 9531746 9839138 11039758 12533803 12222077 10222952 9103918 9611583 8863912 4634549
43131 4634549 -718181 -3171436 -2526355 -2088798 -3488125 -4879442 -4523175 -3241292 -2383278
43122 -2383278 -1820825 -1236195 -1281511 -1985029 -1896586 -480882 375965 -827515 -2457264
43113 -2457264 -2065731 -205908 695819 459540 1168989 3152450 3984333 2304125 51190
43104 51190 -442273 427454 876984 634262 720640 1298458 1494949 1043123 727784 1229576
43094 1229576 2445523 3869835 4900358 4906983 3772579 2433009 2264689 3644135 5309110
43085 5309110 5359330 3047510 -331049 -2539632 -2614124 -1683224 -1274362 -1387077 -1022332
43076 -1022332 -123237 192660 -733812 -2295280 -3446433 -3423164 -1886892 464813 1733390
43067 1733390 768509 -930860 -1018643 204944 343244 -1038897 -1762418 -1115915 -1358520
43058 -1358520 -3515407 -4833811 -3012431 -315095 -245748 -2112861 -2479070 -679902 853556
43049 853556 1044370 1163333 1556223 1061013 -29552 57100 1057773 580513 -1579678
43040 -1579678 -2460490 -602036 1567033 1737222 1048061 1281585 1511596 160991 -1763345
43031 -1763345 -2213409 -1313803 -570498 -229056 241150 310891 -559739 -1096833 203370
43022 203370 2502494 3773949 3633805 2960958 1865863 475273 580148 3504569 6968350
43013 6968350 7232347 4266808 1745646 1747575 2576470 2399081 1856524 1802538 1246953 -670882
43003 -670882 -2733028 -3416301 -3044826 -2686786 -2359785 -1773024 -1492994 -1849985 -1807741 -418680
42993 -418680 1461594 2241777 1648940 620625 -64515 -31037 951898 2430210 3298384
42984 3298384 3300308 3478971 4153037 3781761 1332493 -1409993 -1805941 70506 1705947
42975 1705947 1538900 202051 -1356183 -2982803 -4338203 -4564647 -3480478 -1885283
42967 -1885283 -389774 913348 1562388 952516 -275426 -528561 581284 1726495 2001594
42958 2001594 2100625 2635268 2827219 2052280 1357748 1886330 2690086 1859894 -548466
42949 -548466 -2396557 -2308069 -1166375 -502061 -710962 -1376464 -2167687 -2627190 -2008893
42940 -2008893 -337129 989369 757522 -225733 -64029 1446928 2237364 669627 -2241438
42931 -2241438 -4171910 -4262491 -3458534 -2629890 -1775348 -1069477 -1195193 -2054105 -2323398
42922 -2323398 -1138676 631784 1633358 1754010 1642549 1285886 401927 -214991 675469
42913 675469 2699352 3864715 3053399 1376596 497942 583576 616890 29773 -724575
42904 -724575 -857363 -48781 1112872 1358633 7823 -1849176 -2272605 -869154 705990
42895 705990 1107964 1019962 1647879 2552753 2252753 359317 -2112570 -4084970 -4869919
42886 -4869919 -3823111 -1083218 1510870 1825169 -28636 -1863827 -2273557 -1874889 -1433318
42877 -1433318 -476729 1312970 2755830 2518437 960881 -479433 -1081891 -1031564 -535013
42868 -535013 104092 85950 -972308 -2046767 -1788468 -377438 795697 1082003 1050323
42859 1050323 1180300 1380037 1830796 2929628 4087116 3906396 2112052 161626 -689196
42850 -689196 -858161 -1239709 -1581313 -1074145 137520 1045056 962343 -102478 -1750817
42841 -1750817 -3183788 -3502993 -2773442 -2140674 -2159734 -1924856 -855308 -164480 -896743
42832 -896743 -1518534 199489 3319659 4470809 2767842 1181448 1894030 3009221 1849948
42823 1849948 -717428 -1886546 -1306937 -898901 -1074776 -310145 1511411 2432077 1861494
42814 1861494 1893951 3833865 5774627 5456008 3701045 2945256 3655538 4353733 4312807
42805 4312807 4038036 3535411 2271340 820975 572544 1521531 2073796 1389421 329119
42796 329119 -291591 -704440 -881093 7023 1823934 2720822 1489647 -481820 -993514
42787 -993514 92619 1119947 1070329 313201 -601005 -1484383 -2039739 -2024296 -1724126 -1279384
42777 -1279384 57835 2765866 5505023 6209702 4728718 2996372 2457578 2680452 2744953
42768 2744953 2604786 2596026 2788389 3303710 4235604 5015689 5170639 5936537 9289274 14525942
42758 14525942 17669856 15803497 10649119 6206313 4000269 2598930 932354 -338554
42750 -338554 -732519 -1011894 -1707899 -2177182 -1857414 -1254576 -966337 -685443 117587 1239830
42740 1239830 2096068 2482193 2488182 2077273 1154021 -220360 -1823829 -3174909 -3528666
42731 -3528666 -2520930 -786684 618168 1293617 1392755 798609 -589984 -1972446 -2318630
42722 -2318630 -1943486 -2032512 -2460977 -1755172 258129 1615054 1128965 432338 1466962
42713 1466962 3275857 3358124 1460972 -179541 -208253 339342 192404 -386148 -679583
42704 -679583 -778144 -769062 124113 2375100 4774421 5334035 3440742 486185 -1505222
42695 -1505222 -1521718 -152402 1075255 1137715 443332 5511 -189319 -1100283 -2671242
42686 -2671242 -3114180 -1101736 2095662 3876425 3367936 2029948 1343380 1225969 1023339
42677 1023339 795947 868026 995932 893392 997122 1767008 2612608 2541315 1720830 1294919
42667 1294919 1496869 1083634 -759635 -2863393 -3364572 -2082825 -592885 -10566 312206
42658 312206 1551369 3587259 5049690 4993069 4011269 3498289 3969877 4428624 3620829
42649 3620829 1733419 297736 289193 999649 1265969 1144981 1508908 2430026 3092957
42640 3092957 3199278 3272929 3421666 3011863 1999240 1427789 1949155 2850311 3262416
42631 3262416 3313129 3255505 2629807 1525110 1570200 3942010 7085223 8371828 7714504
42622 7714504 7386484 8151147 7966508 5418477 2256804 947819 1319135 1493943 1009651
42613 1009651 893190 1219356 831967 -378771 -888390 200585 1897820 3049043 3866472
42604 3866472 4728276 4750258 3046892 678723 -295431 456056 1273918 1153630 1143133
42595 1143133 2349024 3772281 3441793 1234629 -712638 -503990 1543164 3668676
42587 3668676 4597799 4239310 3106687 1790223 848853 617977 947923 1337040 1397152
42578 1397152 1153694 984221 1302241 2127123 2924645 3126445 2848906 2711950 2834905
42569 2834905 2561812 1518171 357618 -133789 -194828 -565502 -1138840 -1104443 -362586
42560 -362586 268673 515913 1307928 3352436 5766735 6912543 6287399 4954440 4228212
42551 4228212 4406170 4740298 4339761 3131757 2033081 1966331 2683517 3032490 2542723
42542 2542723 2083501 2502418 3284720 3332023 2581199 1872102 1448102 705426 -470650
42533 -470650 -1237866 -1114604 -822433 -1111887 -1459174 -831400 616812 1518963 925909
42524 925909 -733446 -2313089 -2936532 -2331703 -917377 265775 406110 1222 434572
42515 434572 2129881 3910503 4786466 5474182 6982150 8305642 7243821 3719254 651820
42506 651820 647506 2991311 5027226 5569418 5485633 5443834 4889701 3550227 2440838 2548306
42496 2548306 3424111 3914975 3686730 3248185 2923911 2633013 2441771 2518656 2582355 2141635
42486 2141635 1379414 1077914 1394669 1415376 494136 -474876 14858 1976805 3655970
42477 3655970 3665064 2613560 2008232 2191124 2296443 1839707 1139586 220149 -1303599
42468 -1303599 -2863176 -2946286 -1403676 -420524 -1752410 -3972085 -4260112 -2377822 -785100
42459 -785100 -799735 -831121 831748 3371004 4837537 4848280 4460388 4210887 3689801 2645324
42449 2645324 1339660 -4662 -1242202 -1995530 -2013047 -1582751 -1035128 -258231 740006
42440 740006 1396673 1424923 1398279 1648914 1361971 -42982 -1310497 -706382 1267224
42431 1267224 2156476 748357 -1471713 -2465136 -1954647 -1001790 -385322 -220796 -477068
42422 -477068 -1054568 -1597947 -1624719 -700673 1369060 3967948 5525297 4930684 3122596
42413 3122596 2195719 2770700 3457841 3233539 2867365 3170861 3221028 1679444 -983010
42404 -983010 -2996002 -3577822 -3460271 -3403853 -3376457 -3144381 -2674672 -1936431 -1086621 -694896
42394 -694896 -944468 -878448 456738 2220446 2414645 558796 -1495904 -1942285 -1098685
42385 -1098685 -354338 -9085 685396 1805432 2328979 1597189 357321 -79828 658545
42376 658545 1708883 2057945 1665431 1389521 1849990 2591652 2597660 1501733 -70429
42367 -70429 -1338126 -2063559 -2263709 -1754662 -434775 1237692 2496974 2939032 2691400
42358 2691400 2074431 1363116 714051 48515 -798934 -1544873 -1416409 -149044 1269235
42349 1269235 1577656 886474 546342 1275764 2275025 2533277 2145025 1705150 1163105
42340 1163105 206149 -700563 -751716 -171597 -104248 -959720 -1771187 -1568253 -672088 -147725
42330 -147725 -469097 -1181619 -1547696 -1177920 -307588 324757 199774 -254454 -140295 555009
42320 555009 769262 -98852 -1192166 -1363432 -729934 -258225 -251300 -208343 -10007 -245558
42310 -245558 -1168017 -2062138 -2030001 -1076929 -184304 -369543 -1603145 -2640666 -2285293
42301 -2285293 -896547 -13338 -249023 -504815 141475 924417 898213 831123 1846517
42292 1846517 2928108 1993183 -713422 -2677937 -2934428 -3351183 -5121959 -6404733 -5227788
42283 -5227788 -2814393 -1744967 -2086589 -1810371 -383294 599111 377378 292835 1455760
42274 1455760 2936491 3181543 2046631 643986 2741 408535 1322752 1591500 502131
42265 502131 -1092722 -1545052 -549822 468953 468003 174154 716472 1887663 2680015 2790099
42255 2790099 2572651 2007953 778245 -825004 -1995715 -2421716 -2511116 -2613271 -2624677
42246 -2624677 -2411611 -2088429 -1767350 -1414491 -1005604 -514220 220374 1282417 2401584
42237 2401584 3243931 3886385 4548856 4912398 4318326 2834929 1532606 1233085 1368077
42228 1368077 712115 -828619 -1825933 -1028773 990702 2418595 2315023 1594411 1699547
42219 1699547 2739220 3402537 2593673 692749 -926527 -1335792 -809332 -294255 -351885
42210 -351885 -681847 -619269 31752 780835 1003347 487038 -578597 -1807753 -2625353
42201 -2625353 -2446281 -1268462 107750 872322 1054613 1113587 885544 -290412 -2255325
42192 -2255325 -3617654 -3189300 -1400454 259490 935394 980836 1018012 1134988 1201851
42183 1201851 1379967 1784640 1864403 720297 -1754827 -4377397 -5581176 -4707952 -2308935
42174 -2308935 475814 2483502 2856896 1589187 -152032 -872835 -180581 1060606 2034774
42165 2034774 2722205 3176514 3029769 2313422 1902194 2297809 2677746 2079595 842227
42156 842227 -214456 -1326123 -3075356 -4686428 -4760285 -3530425 -2559014 -2137037 -1021447
42147 -1021447 823540 1473987 115585 -1191781 -440812 1296301 1729800 976640 1037471
42138 1037471 2320929 3090717 2433149 1640521 2020893 2926754 2824522 1354602 -391569
42129 -391569 -1113156 -452821 716514 1143166 702074 661582 1783817 2763322 1755286
42120 1755286 -866614 -2684631 -2184329 -202292 1684679 2814587 3117220 2468810 1043807
42111 1043807 -570696 -2047891 -3334532 -3897392 -3053770 -1237259 262689 1018334 1595070
42102 1595070 1854803 910267 -770204 -1260541 -131789 569992 -305056 -766469 1166580
42093 1166580 3921344 4621452 3600690 3619357 5112335 5442025 3265744 716208 104754
42084 104754 729503 431032 -1243612 -2868024 -3137429 -1921883 -26644 1312874 1313539
42075 1313539 505188 66902 180132 35050 -486653 -566960 -149010 -167810 -487968 481731
42065 481731 3012495 4763763 3901474 1968913 1695311 3113222 3994669 3320017 2014403
42056 2014403 675881 -1010328 -2510990 -2393984 -589690 1190606 1914685 2357851 3096746
42047 3096746 3205933 2034572 683705 350945 481450 70317 -237127 894595 3014575
42038 3014575 4199178 3793101 3179382 3453365 3756621 2710036 548680 -1139407 -1392253
42029 -1392253 -744862 -171594 159691 775905 1854549 2718471 2517527 1265233 -10924
42020 -10924 -179327 1021920 2830589 4058499 3905103 2552123 1098953 600276 938278
42011 938278 902762 -317882 -1943274 -2341526 -981142 798050 1271736 357544 -334534
42002 -334534 435714 1988210 2760984 2503007 2464307 3312589 3996506 3369462 2011732
41993 2011732 1363291 1664446 2006929 2013107 1984691 1531072 -198136 -2542665 -3338036 -1761591
41983 -1761591 317109 935439 596111 777216 1149237 348978 -1044324 -618124 2419736
41974 2419736 5741379 6693977 5344167 3834685 3580230 4039923 3819609 2216340 -181556
41965 -181556 -1974730 -2138034 -946415 444296 1365606 2200091 3490018 4980505 5848482
41956 5848482 5589584 4485946 3459730 3514784 4862932 6390774 6435998 4470722 1799042
41947 1799042 306654 657508 1885380 2569233 2192953 1415535 1151408 1492446 1721505
41938 1721505 1410994 1058236 1246793 1605783 1327995 560904 434323 1541121 3093304
41929 3093304 3860350 3380249 2014191 436801 -561068 -371423 742915 1582044 1170463
41920 1170463 -109039 -873589 -186112 1498792 2748816 2537740 1407072 1054155 2323359
41911 2323359 3865781 3633134 1682298 361547 1224866 2844449 2680802 463651 -1472838
41902 -1472838 -1076559 1203528 3214742 3373707 1907111 344312 57749 1068424 2171615
41893 2171615 2340582 1859261 1824604 2742314 4035024 4838198 4805810 4095894 3040940
41884 3040940 2067239 1614758 1767519 1998847 1585013 471350 -398819 26738 1567756
41875 1567756 2752942 2475999 1352555 806288 1080889 1124089 513096 326991 1450774
41866 1450774 2913747 2919086 1109344 -1117866 -2354393 -2389261 -1738569 -841956 7969
41857 7969 514590 520008 101085 -562105 -1210684 -1444415 -961632 57614 1015018 1410493
41847 1410493 1213847 766534 394501 69047 -509722 -1326131 -1699533 -977892 429342
41838 429342 1300196 1040095 285623 -116963 -32547 348129 959055 1401909 929613 -329124
41828 -329124 -952700 -50994 1176895 905143 -812861 -2327851 -2804976 -2789786 -2435111
41819 -2435111 -938136 1683079 3743655 3809829 2533092 1677117 2021615 3054281 4088560
41810 4088560 4695978 4389255 2905026 869234 -536397 -786769 -505870 -632047 -1374141
41801 -1374141 -2087128 -1982432 -888511 551218 1367701 1056327 -4540 -910793 -1073079
41792 -1073079 -722459 -485545 -455880 -2155 1238272 2536119 2817853 2028149 1015029
41783 1015029 208447 -589232 -1097570 -589851 546039 734039 -452958 -1307720 -543592
41774 -543592 576945 329733 -518286 -32031 1446170 1711245 306954 -887720 -932413
41765 -932413 -1092890 -2104232 -2641248 -1745201 -622684 -483757 -396310 936607 2674469
41756 2674469 2994194 1800757 559975 99292 107078 280118 584674 810709 1015475
41747 1015475 1857924 3409633 4349204 3549662 1756101 443119 -163403 -476354 120368
41738 120368 2387590 5159814 6212862 5186392 3833292 3318412 3120409 2835853 3095477
41729 3095477 3961240 4089481 2531707 217749 -1298127 -1717863 -1854388 -2308029 -2937409
41720 -2937409 -3139154 -2317496 -663788 432843 -353704 -2422465 -3659253 -3002464 -1489092
41711 -1489092 -375323 454489 1458810 2114201 1795061 1087191 966172 1222488 893014
41702 893014 -104878 -921928 -1182569 -1345226 -1615392 -1469866 -534891 742907 1597971
41693 1597971 1685500 1154295 372705 -241096 -406863 -190962 76015 125183 -80505 -433530
41683 -433530 -843966 -1391850 -2317292 -3620651 -4640959 -4450118 -2936492 -1164869 -297012
41674 -297012 -377259 -550478 -295513 -656 -321406 -1313330 -2317428 -2586403 -2018446 -1311413
41664 -1311413 -1273743 -1927768 -2482500 -2252178 -1288553 58433 1766495 3842099 5635661
41655 5635661 6128930 5096607 3551724 2718832 2760683 2788507 1995377 454856 -1183037
41646 -1183037 -2382897 -2867669 -2375898 -766963 1587183 3891427 5558756 6497973 6730436
41637 6730436 6186223 5163755 4534395 4912672 5752694 5777949 4356199 2127877 281867
41628 281867 -486656 -312778 210611 627967 974644 1559516 2402106 3094054 3286929 2988815
41618 2988815 2230956 903035 -736214 -1836591 -1775852 -953326 -336379 -462223 -1208768
41609 -1208768 -2124708 -2578555 -2117369 -1187803 -856664 -1198982 -841535 905337 2422629
41600 2422629 1821936 -61086 -619895 808214 2259869 2378798 2148433 2657174 3217625
41591 3217625 2985652 2705152 3206460 3494599 2190277 47090 -844346 -1445 1012034
41582 1012034 1037599 655365 796138 1305182 1446061 1038101 551007 424362 572757 449519
41572 449519 -316996 -1218493 -1151580 276831 2117104 3118366 2974848 2186344 1288961
41563 1288961 728155 801802 1039268 330942 -1480809 -2822668 -2218680 -292047 1195699
41554 1195699 1717093 2033593 2388119 2356224 2379357 3559495 5499580 6070185 4162474
41545 4162474 1316570 -322897 -503617 -280634 7 771846 1894767 2580646 2510114
41536 2510114 1975329 1030773 -490965 -2128129 -2977487 -2958081 -2989995 -3537657 -3797024
41527 -3797024 -2931213 -1452077 -528875 -266079 378958 1942671 3622439 4407830 4260134
41518 4260134 3641638 2576227 990163 -494065 -1116789 -1164111 -1575061 -2367632 -2537430
41509 -2537430 -1716704 -778927 -343544 144292 1096510 1674787 1119316 330340 769225
41500 769225 2242612 3114854 2509777 1019833 -681107 -2535583 -4157455 -4505352 -3195255
41491 -3195255 -1324050 -328676 -520702 -1184099 -1610453 -1557004 -1075895 -432166 -98243
41482 -98243 -488165 -1608405 -2968701 -3833493 -3752038 -2995107 -2265715 -1854374 -1422851 -719831
41472 -719831 144636 1423064 3762215 6739412 8325948 7077222 4229047 2187754
41464 2187754 1400474 405114 -1220487 -1970755 -905731 781220 1529844 1310056 863975
41455 863975 351202 -242190 -479889 -342157 -713246 -1871049 -2435950 -1142189 1091546
41446 1091546 2312046 2270772 2493876 3762761 5031480 5155790 4493252 4196766 4670321
41437 4670321 5339932 5626480 5679988 6100948 7011464 7589289 6922752 5330941 4131716
41428 4131716 3776295 3075262 1053573 -1168570 -1550713 96978 1785430 1925003 1100419
41419 1100419 813155 1346896 1629616 808236 -729016 -1886297 -2010361 -1358837 -546699
41410 -546699 238204 1202439 2167351 2339961 1256620 -389460 -1422140 -1543655 -1462450
41401 -1462450 -1693633 -1842082 -1277789 -45954 1237252 2137551 2693640 2990907 2731366
41392 2731366 1477379 -586176 -2316900 -2439244 -885086 969745 1710695 1376643 1232487
41383 1232487 2118687 3387654 3650945 2451193 984671 992319 2873239 5092209 5728680
41374 5728680 4518557 2991119 2596066 3187761 3557766 2987977 1839733 853545 375143
41365 375143 343671 699011 1479278 2463726 3013031 2724066 2260773 2872259 4660043 5961576
41355 5961576 5236964 3112902 1560121 1328446 1399509 937271 391115 297232 312772 154453
41345 154453 405206 1487931 2620652 2666958 1483618 -226431 -1786903 -2654698 -2353862
41336 -2353862 -1061140 261446 925495 1167097 1307619 1080101 367769 -288150 -607050
41327 -607050 -1054104 -1698491 -1736676 -1075548 -1061597 -2302475 -3061174 -1601356 870745
41318 870745 1639279 196296 -1569248 -2447504 -2894843 -3039755 -2093504 -235098 966216
41309 966216 717521 -86865 -685326 -1463237 -2492780 -2822720 -2154944 -1649159 -2013623
41300 -2013623 -2247085 -1427389 -371116 -149484 -143468 825155 2250616 2526676 1407327
41291 1407327 305341 101652 22307 -875666 -2068137 -2141989 -709011 874074 953499
41282 953499 -497612 -1949645 -2422654 -2702945 -3774981 -4860557 -4358513 -2397137 -882871
41273 -882871 -849188 -1222970 -663313 674616 1765958 1967542 1125645 -457745 -1678882
41264 -1678882 -1420059 -212626 97984 -1087071 -2200125 -1813116 -464598 671005 1522600
41255 1522600 2445371 3078776 3047552 2672067 1935520 75467 -2577167 -3852783 -2504601
41246 -2504601 -440555 -299806 -1824974 -2658524 -1895984 -641507 395783 1474109 2107341
41237 2107341 1114196 -1229486 -2994825 -3069312 -2282493 -1719180 -1467693 -1472310 -2063551 -2933393
41227 -2933393 -2863993 -1301882 661691 1516891 915103 -322599 -1155820 -1064570 -391649
41218 -391649 -13873 -250508 -413302 -21 336171 -23841 -249554 789525 2526818
41209 2526818 3421564 3247724 2972175 2756748 2050487 1433195 2103261 3400694 3204865
41200 3204865 1288214 -75880 366130 1046523 413028 -633457 -587775 285792 1017338
41191 1017338 1680456 2401670 2133795 217409 -2050964 -3097162 -3162598 -3106779 -2425486
41182 -2425486 -397497 1895744 2802305 2541119 2382093 2198897 1073748 -324436 -501539
41173 -501539 -12959 -907804 -3068742 -3765570 -1682913 961676 1560772 434893 -464093
41164 -464093 -568659 -624626 -623252 262725 1901868 2940866 2599044 1690668 1430813 1862305
41154 1862305 1992329 1261483 342499 208526 659623 388840 -1235576 -3038043 -3332486
41145 -3332486 -2042522 -737982 -599622 -1169877 -1392473 -1195177 -1432683 -2476774 -3449877
41136 -3449877 -3140716 -1490423 297453 1318778 2085135 3428373 4785905 4797350 3551342
41127 3551342 2727434 3048215 3173087 2046310 781756 782575 1321912 822037 -453473
41118 -453473 -1061882 -1073355 -1794116 -2986364 -2752034 -600069 1461487 1633739 446061
41109 446061 -572234 -879258 -854236 -996278 -1776997 -3152546 -3916104 -2875523 -867963
41100 -867963 41340 -417129 -530293 142066 -138192 -1849474 -2555559 -627237 1714030
41091 1714030 1595346 -91038 -380796 908834 1206008 -457570 -2259102 -2871945 -3033767
41082 -3033767 -3232394 -2460075 -367446 1435704 1505707 476429 -186071 26172 1013349
41073 1013349 2755775 4544065 4817320 3060811 898099 78673 235112 -123456 -1175072
41064 -1175072 -1764448 -1337740 -474809 318252 1014547 1268600 542797 -642678 -750705
41055 -750705 854642 2868904 3642338 3173682 2641621 2368115 1418565 -593982 -2424045
41046 -2424045 -2708682 -1892504 -1543912 -1969915 -1780614 -142869 1775949 2485781 2369859
41037 2369859 2960334 4464437 5378909 4646126 3002084 1755952 1123676 382515 -826478
41028 -826478 -1906865 -1856919 -199924 2442252 4630323 5191518 4084795 2165167 444163
41019 444163 -202218 709219 2529841 3505097 2557313 763421 7716 449141 625248
41010 625248 -67377 -592142 -250245 126517 -437769 -1842731 -3669875 -5685487 -6826425
41001 -6826425 -5389451 -1595666 1452889 1110804 -1463448 -3014255 -2445538 -1440764
40993 -1440764 -1307245 -1371785 -740693 209110 740113 823753 685432 290587 -257361 -698383
40983 -698383 -1286074 -2496844 -3784046 -3752908 -2101508 -322351 250409 173098 786503
40974 786503 2074231 2665509 1723246 -13962 -1076027 -627383 973713 2561748 3073573
40965 3073573 2320011 948214 -274136 -969941 -1124849 -1010139 -1140068 -1820725 -2657726
40956 -2657726 -2975535 -2769663 -2672144 -2877694 -2796646 -2045014 -1103397 -580247 -406220 -220119
40946 -220119 -3349 212347 780171 1941692 3224535 3928904 3933767 3456162 2366398
40937 2366398 533730 -1303765 -1939079 -1205819 -374402 -611316 -1523819 -1764550 -834591
40928 -834591 306776 504584 -181573 -636151 -37544 1309745 2442498 2667282 1951970
40919 1951970 796132 -42003 -34671 521149 622366 -323439 -1643071 -2044781 -1007036
40910 -1007036 814651 2355404 2869351 2128541 546757 -897686 -1421163 -1172592 -803739
40901 -803739 -463408 155416 880671 1003746 333855 -379746 -336386 505840 1592826 2180609
40891 2180609 1587562 -201470 -2068508 -2669020 -1951855 -1006349 -372875 416633 1413402
40882 1413402 1701708 925973 151417 259429 515504 -113656 -1040137 -837116 455614
40873 455614 1189724 351752 -1113043 -1559362 -594564 608969 766764 -8892 -439308
40864 -439308 37593 275218 -795179 -1980189 -1123052 1404910 2596810 926647 -1518706
40855 -1518706 -2304549 -1970597 -2165056 -2314953 -823592 1513776 2170156 604904 -1270338
40846 -1270338 -2204603 -2646692 -2638379 -1361687 685826 1573138 837120 293351 1077148
40837 1077148 2054868 2206975 2382191 3303487 3858054 3061801 2068972 2457253 3826935
40828 3826935 4749861 4895097 4615613 3637669 1895702 626652 888464 1890057 2403833
40819 2403833 2754985 3595909 3899661 2479760 611856 507201 1616343 1235647 -1157247
40810 -1157247 -2973910 -2473552 -1020277 -445240 -626458 -1037160 -2393070 -4821632 -6150500
40801 -6150500 -4335325 -662311 1586847 1173808 -281644 -1173026 -1544311 -1671119 -986742
40792 -986742 660160 2028732 1954044 1124972 1355614 3340908 5933336 7546862 7603848
40783 7603848 6581033 5266935 4214444 3502410 2761021 1681559 625552 342029 882713
40774 882713 1330459 1061978 746068 1319059 2358456 2551966 1724130 1162649 1598337
40765 1598337 2117165 1829667 1485305 2241612 3593332 3947543 2966061 1939860 1764127
40756 1764127 1830029 1321316 530481 227107 447308 630842 546745 421531 334846 85048
40746 85048 -294786 -370689 23265 183094 -837952 -2774051 -3878088 -2830264 -641089
40737 -641089 369313 -463806 -1461742 -1327945 -1086802 -2126303 -3537408 -3216457 -1077191
40728 -1077191 746050 901901 234502 -162719 -587097 -1593388 -2586354 -2684311 -2186610
40719 -2186610 -2121691 -2719190 -3114597 -2399004 -550316 1439784 2219678 1355911 110525
40710 110525 290296 2098811 3876456 4265634 3760156 3602072 4007415 4239136 3802369
40701 3802369 2794389 1547487 622778 688179 1659910 2365538 1852086 760642 616132
40692 616132 1870036 3359224 3728674 2847765 1761539 1618555 2645215 3886922 4018059
40683 4018059 2661628 868377 164154 1203424 3284454 4842191 4475915 2083273
40675 2083273 -844352 -2556683 -2792823 -2638084 -2663973 -2170052 -559233 1585566 3364928
40666 3364928 4523809 4887685 3928114 1893883 423923 776898 2123892 2846021 2864153
40657 2864153 3211654 3802940 3393318 1740952 138812 -528934 -840993 -1537351 -2443788
40648 -2443788 -3154797 -3558815 -3152672 -1105835 2201392 4823131 5399714 4775318 4473663
40639 4473663 4405207 3357881 1235687 -620833 -1292461 -1172418 -755600 269792 2035368
40630 2035368 3422992 2986582 770667 -1591032 -2703001 -2685126 -2356300 -1830480 -661695
40621 -661695 952331 2097296 2405050 2473217 2637674 2238262 804993 -829698 -1570135
40612 -1570135 -1589979 -1708283 -1772343 -1100131 -276858 -772633 -2473970 -3289687 -1980078
40603 -1980078 88074 1063601 1208251 1972511 3388479 4056586 3424842 2522833 2265517
40594 2265517 2260414 1695782 539891 -580283 -1141983 -1066673 -684031 -487558 -597421 -520777
40584 -520777 148596 977708 1240890 1050432 1128131 1439662 1013093 -541465 -2191814
40575 -2191814 -2748700 -2325575 -1838313 -1513725 -746774 663894 1942051 2278865 1900287
40566 1900287 1785474 2394713 2999824 2528907 1018520 -207059 -142794 473463 41101
40557 41101 -1674565 -3093149 -2945320 -1998487 -1917049 -2963237 -3786613 -3339707 -2105237
40548 -2105237 -1264945 -1289756 -1591557 -1211200 209465 1857334 2352292 1394810 465457
40539 465457 1056140 2479323 2682357 1339898 602301 2012995 4111952 4499545 3314271
40530 3314271 2842210 3939233 4733956 3411498 826695 -638373 -778 1551392 2492145
40521 2492145 2666800 2980938 3838019 4342273 3294146 836137 -1459959 -2406445 -2447794
40512 -2447794 -2505660 -2304877 -979564 1066031 2360346 2514612 2750420 3871859 5032918
40503 5032918 5160485 4388979 3271463 1710124 -273946 -1645738 -1464122 -318891 407736
40494 407736 261192 -192111 -398410 14344 1428030 3437246 4458132 3458035 1642487
40485 1642487 1035712 1732313 2083120 1404372 775833 995854 1462346 1579396 1710817
40476 1710817 2008565 1692096 438540 -669822 -678832 -354702 -1044800 -2487792 -2985627
40467 -2985627 -1692968 231492 1046643 495861 46628 1032274 2802785 3243251 1354434
40458 1354434 -1335507 -2572673 -1963649 -800360 80837 813245 1163077 460024 -866195
40449 -866195 -1359655 -718183 -359959 -1104792 -1810163 -1248659 63135 982286 1392335
40440 1392335 1623101 1542656 1510645 2853077 5703039 7533954 5898519 2010406 -388266
40431 -388266 531823 3130553 4944995 5061599 3798510 1805053 -10039 -855530 -777133
40422 -777133 -291386 492432 1470476 1787465 820858 -521883 -1027934 -1252859 -2509226
40413 -2509226 -4113921 -3949145 -1943076 -581440 -1277450 -2500921 -2480880 -1571406 -662253
40404 -662253 628399 2469995 3360916 2165155 242842 -440154 -159635 -349709 -768232
40395 -768232 -127842 1102952 1067802 -380885 -1270108 -453152 1086325 2255801 3185271
40386 3185271 3922488 3698648 2448305 1475676 1524643 1523404 420152 -875524 -714833
40377 -714833 907289 2473682 2954607 2552446 1785494 914922 171463 -309631 -738422
40368 -738422 -1252533 -1492739 -1254192 -1221109 -2145184 -3404805 -3349398 -1280751 1665563
40359 1665563 3889262 4922444 5299325 5420386 5158002 4379147 3291930 2177570 1127453
40350 1127453 223006 -299118 -408290 -648261 -1540072 -2454361 -1864017 582870 2920967
40341 2920967 3027304 1630492 1544913 3614482 5222932 3882917 729922 -1165438 -796226
40332 -796226 410946 1403899 2334265 2766805 1566898 -828243 -2204564 -1628878 -850608
40323 -850608 -1460433 -2383742 -1778111 -45276 888220 432822 -292554 -445594 -244269
40314 -244269 -92180 -256325 -1051792 -2136090 -2182813 -619841 948754 651548 -944275
40305 -944275 -1894990 -2058125 -2864206 -4118404 -3783517 -1520124 209462 -260627 -1437773
40296 -1437773 -1437462 -1001471 -1711069 -2754113 -1877256 1083736 3688134 3807838 1644923
40287 1644923 -1000225 -2307107 -1484519 711571 2562215 3051348 2578814 1727867 347037
40278 347037 -1487734 -2841692 -3294582 -3753510 -4675727 -4722918 -2705061 252737 2149009
40269 2149009 2663352 2546791 1668445 -185200 -1670229 -1573495 -1253888 -2567469 -4095880
40260 -4095880 -2854105 430319 1614800 -564089 -2374665 -885694 1694562 1881019
40252 1881019 112562 -907939 -829718 -1259843 -2098647 -1632581 125088 1081191 196439
40243 196439 -1267601 -1858829 -1463891 -571079 330762 409786 -956137 -2980937 -4011656
40234 -4011656 -3456804 -2201512 -1196817 -720742 -848102 -1356130 -1201944 551168 3120093
40225 3120093 4551826 4117935 3000821 2364466 2019864 1518966 1370437 2254088 3727887
40216 3727887 4620450 4438708 3729088 3143718 2684270 2005702 1129651 471099 146148
40207 146148 -243964 -750951 -563411 768399 2013706 1548797 -62192 -463800 1066057
40198 1066057 2412652 1738850 -95001 -1579521 -3047110 -5058774 -6015334 -4125422
40190 -4125422 -762046 1046725 987093 1336281 2575777 2386388 -247298 -2945325 -3357055
40181 -3357055 -2276938 -1725142 -1885761 -1732183 -1203339 -951277 -897476 -564326 -119603
40172 -119603 124175 558702 1573970 2635334 2930247 2336590 1176220 -177317 -987193
40163 -987193 -534481 676288 1321204 1330590 1973889 3240487 3157877 960491 -1099287
40154 -1099287 -907178 345175 350700 -462843 107916 2185240 3666998 3573857 2938971
40145 2938971 2335467 964675 -1344012 -3266887 -3743106 -3088963 -2040377 -1107544 -964970
40136 -964970 -1895345 -2735386 -2013573 -231718 729443 547814 787988 2023207 2857349
40127 2857349 2468630 1893065 1803738 1242349 -79877 -357079 1588201 3894034 4078097
40118 4078097 2582481 1738113 2156880 2445761 2003985 1847298 2660297 3932580 5153002
40109 5153002 6183586 6360111 4992876 3085619 2782409 4435794 5845803 5401928 4568120
40100 4568120 5835404 9097013 11671148 11723320 10244591 9353877 9804628 10893084 12039276
40091 12039276 13284268 14288930 14086735 12566121 11344014 11920572 13279946 12844293
40083 12844293 10089661 7589195 7497021 8448364 7611000 4906376 3090101 3762777 5431555
40074 5431555 6149008 6206403 6937927 8129104 8237074 6710532 4662585 3238419 2446223
40065 2446223 1853192 1508074 1604823 1733423 1122714 -378799 -1949139 -2574156 -2010334
40056 -2010334 -791317 581604 2053626 3501084 4293929 3908577 2774324 1875283 1487302
40047 1487302 957950 -40511 -685786 29175 1819922 3159176 2811754 1021424 -846116
40038 -846116 -1625624 -1241753 -395925 400323 1192914 2001890 2418938 2221367 1954720 2233855
40028 2233855 2780815 3003294 3256464 4322318 5597828 5288204 3013211 847261 743714
40019 743714 2047514 2788647 2427879 1768605 958257 -433310 -1607375 -952231 1331587
40010 1331587 2916858 2444193 1292294 1228633 1794514 1486276 442529 177821 1070073
40001 1070073 1795803 1385190 514053 360066 1118141 2122046 2816174 3153011 3352830
39992 3352830 3574408 3705397 3441983 2710821 1891753 1422693 1368894 1580626 1947758 2217264
39982 2217264 2036735 1666315 2119750 3828017 5543575 5528769 3716620 1767851 973405
39973 973405 1000693 811327 -90856 -1527712 -2875380 -3152713 -1758128 512739 1997076
39964 1997076 2081989 1756331 1891574 2031617 1567107 1072376 1449501 2473098 3227783
39955 3227783 3394769 3075832 2006503 258596 -772421 309980 2634412 3676597
39947 3676597 2439817 627648 188324 1029181 1863899 2117633 2061996 2012389 2376946
39938 2376946 3716453 5738414 6909924 6146017 4321624 3040198 2540064 2146460 2184945
39929 2184945 3571261 5513578 5651137 3236972 574366 202976 1860219 3408034
39921 3408034 3776452 3616292 3697256 4136587 4997437 6358710 7754301 8539511 8830978
39912 8830978 9257496 9923849 10509860 11192633 12486233 14394323 16783761 20215716 25009425
39903 25009425 29892923 33543121 37437997 44846344 56493605 69807936 83631521 101188463
39895 101188463 126888547 162947106 210977769 272417697 341528917 399590358 423547323
39888 423547323 404233074 353740449 293637943 238918521 193998585 158394374 130585616
39881 130585616 108009853 88475592 72544972 62011511 56021376 51163348 45415061
39874 45415061 39580449 34681493 30437474 26856966 24895135 24478726 23850941 22045210
39866 22045210 20323012 19909981 19831940 18481475 16153352 14424937 13782287 13378900 12674352
39857 12674352 11887585 11044367 9870033 8652490 8162651 8595478 9374406 9998724 10298345
39848 10298345 9893792 8342260 6027351 4081290 3097264 2614456 2193057 2172412 2731063
39839 2731063 2945621 1857658 180671 -301970 729079 1409490 259431 -1530304 -1645641
39830 -1645641 65880 1455214 1249816 642976 1015194 1676909 1238433 87106 -233365
39821 -233365 464071 932603 802226 1159799 2502363 3768706 4081300 4033587 4346182
39812 4346182 4437851 3454293 1871570 902772 820599 933160 892967 1015871 1408759 1652883
39802 1652883 1447221 988422 631376 530245 598985 626966 605968 1029861 2408204 4268317
39792 4268317 5290008 4915719 4202609 4372726 5018874 4666995 2972804 1512791 2171140
39783 2171140 5093954 8310431 9331323 7463467 4675350 3592844 4391120 4541521
39775 4541521 2231410 -990101 -2136142 -604642 1452941 2306644 2492922 3143191 3969264
39766 3969264 3824503 2444924 769020 -115909 170455 1176816 1976706 1940301 1410111
39757 1410111 1321647 2018493 2828192 2924867 2138297 782962 -692178 -1569634 -1036455
39748 -1036455 864696 2774208 3145796 1809770 -1652 -1126239 -1524913 -1807060 -2182154
39739 -2182154 -2280497 -1867673 -1270025 -895741 -639937 -97622 815165 1831022 2739577
39730 2739577 3312577 3000073 1489222 -393389 -1261534 -933294 -669494 -1240634 -1855660
39721 -1855660 -1711200 -1421367 -1814024 -2388297 -2379931 -2407409 -3302214 -4026500 -2870406 -423524
39711 -423524 938598 664754 737850 2170918 3200221 2188558 206293 -935055 -1471230
39702 -1471230 -2545035 -3628451 -3338539 -2092333 -1683131 -2352828 -2329196 -604846 1483639
39693 1483639 2081688 1094443 19184 180369 1524690 2744107 2499905 901450 -389812
39684 -389812 19976 1655600 2934181 3028149 2188672 779625 -853613 -1846503 -1429061
39675 -1429061 -124475 741725 772118 684916 763794 353974 -803707 -1859893 -1952331 -1180274
39665 -1180274 -165778 553377 516197 -314659 -979971 -367462 1067305 1592915 643921
39656 643921 -320597 -65624 665920 655374 197114 206358 335235 -331988 -1227716 -712846
39646 -712846 1462801 3654398 4567016 4709493 5151441 5948685 6474466 6506915 6243256
39637 6243256 5718570 4881051 3992636 3405653 3032657 2458004 1607001 1013572 1254339
39628 1254339 2175500 2872889 2618237 1702024 1012699 791872 374203 -573214 -1197348
39619 -1197348 -487256 1236643 2602536 2775430 2082608 1220424 621836 575530 1125592
39610 1125592 1677499 1442323 510514 -178794 -151164 55260 -38158 -43426 465011 1013402
39600 1013402 915282 485998 722555 1842093 2823392 2553483 1052969 -560344 -1146054
39591 -1146054 -549956 393510 892718 1084243 1604637 2518342 3339250 4029777 4975219
39582 4975219 5710285 4889026 2324407 -12772 -231924 997087 1553284 868579 218423
39573 218423 304343 388531 37975 -95221 138479 -294664 -1720364 -2640982 -1777522 -92278
39563 -92278 593804 89581 -496267 -760537 -976438 -540302 1643691 5098022 7709983
39554 7709983 8132149 6988029 5406100 3690788 1922721 602607 -6737 -209755 -29223
39545 -29223 897411 2056604 2063545 865867 574019 2647715 5315021 5608834 3383378
39536 3383378 1312736 996177 1168009 316346 -900292 -1104781 -641994 -901074 -1885784
39527 -1885784 -2156127 -1155839 -120223 -231701 -1029564 -1396960 -1268190 -1285197 -1169791
39518 -1169791 225335 2900534 4866908 4299270 2029399 745123 1658841 3065846
39510 3065846 2728923 812455 -490487 136796 1619589 2010187 795631 -689972 -862010
39501 -862010 373013 1459431 849415 -1140461 -2505507 -1891234 -247493 542683 248478
39492 248478 339973 1408443 1899296 203730 -2907151 -5001437 -4706916 -2740982 -493685
39483 -493685 1330299 2563968 3104553 3116106 3145332 3566975 4213078 4760806 5046862 4781399
39473 4781399 3572217 1707989 328639 106254 228633 -377496 -1147228 -479755 1636089
39464 1636089 3011522 2019266 -194698 -1416993 -1450384 -1971001 -3592612 -4713580 -3683699
39455 -3683699 -877630 1985191 3646174 3851134 2987662 1960805 1812966 2720494 3752405
39446 3752405 4074969 3816403 3321417 2418735 1139725 269763 230713 266521 -123295 140130
39436 140130 2037036 4171292 4169508 2132800 585808 818680 1486492 1443658 1659100
39427 1659100 3042416 4400705 4342940 3644642 3683393 3750232 2282219 59486 -428714
39418 -428714 1174285 2366190 1534512 237488 571400 2010796 2485461 1544012 713324
39409 713324 1029377 1666943 1229281 -523100 -2528859 -3486600 -2891117 -1402885 -334890
39400 -334890 -518857 -1553907 -2254776 -1808896 -437909 911367 1376799 850938 60784
39391 60784 -90304 628592 1715143 2770076 4028536 5700965 7056644 6843658 4867444
39382 4867444 2660969 1992105 2748253 2895841 865278 -2446670 -4606242 -4342417 -2573396
39373 -2573396 -748639 791081 2217276 2946617 2236191 763347 259833 1247936 2225227
39364 2225227 1718691 303220 -279459 525196 1615223 1973187 1884191 2127941 2707549
39355 2707549 2978399 2691466 2238834 1834701 1071503 -283007 -1400857 -1028810 837283
39346 837283 2543785 2551746 1244381 339092 714955 1612152 2030225 2047710 2346716 3138733
39336 3138733 4166742 5228226 5957369 5511289 3459031 922617 -187048 611624 1761520
39327 1761520 1764585 1084859 1130017 1931894 2060592 816582 -717648 -1274948 -1040725 -932061
39317 -932061 -1051667 -920544 -735722 -1089713 -1531769 -801250 1132678 2533031 2134839
39308 2134839 904631 622437 1522211 2473741 2920816 3286605 3637652 3329747 2272930
39299 2272930 1457974 1710131 2628504 3190501 2870309 1868038 798557 467107 1385733
39290 1385733 3068858 4176487 3748529 2109886 395240 -541290 -613146 -204812 432538
39281 432538 1553136 3492999 5683197 6618352 5486797 3421220 2214244 2106410 1988431
39272 1988431 1574230 1840946 3051955 3892633 3275514 1764150 474364 -259420 -366321
39263 -366321 512507 2006969 2603677 1466513 -267424 -1161691 -1430397 -1908927 -2138542
39254 -2138542 -1131956 726598 2246129 3232988 3985815 3722192 1695462 -487840 -121884
39245 -121884 2770059 5080943 4640684 2641778 1491178 2182930 4455290 7500543 9553840
39236 9553840 8785240 5893445 4042396 4850909 6205542 5642529 4085040 4076435 5742724
39227 5742724 7066602 7381619 7999474 9557443 11094174 11930990 12445762 12755842 12610395
39218 12610395 12961450 15598085 20404333 24730923 26538354 26748018 27385057 28668784
39210 28668784 29284853 28664570 27595623 26943345 26829347 26844908 26289530 24486922 21557700
39201 21557700 18560888 16277342 14342977 12285901 10769670 10691145 11442940 11439834 10395217
39192 10395217 9674428 9954964 9911723 8243199 6020450 5551100 7152297 8495982 7550552
39183 7550552 5047845 3255885 3073022 3415567 3217912 2855767 3220518 4225488 4921510
39174 4921510 4742248 4032628 3464475 3409053 3850617 4474252 4748514 4286369 3344770 2772709
39164 2772709 3191091 4195049 4579078 3602638 2018509 1449973 2453461 3594899 3103947
39155 3103947 1254911 151705 928353 2204589 2039329 580171 -325006 286580 1540771
39146 1540771 2348817 2772806 3346352 3962324 4120195 3771486 3307522 2990955 2872822
39137 2872822 3021388 3348178 3375276 2699501 1678533 1163922 1436992 1906022 2162316
39128 2162316 2814582 4548419 6564446 6986548 5197732 2827272 1664606 1456116 927121
39119 927121 211915 453473 1198952 416885 -2240683 -4278432 -3713019 -1802752 -815292
39110 -815292 -693547 -47080 815132 413151 -1002758 -1741644 -1667463 -2193037 -3075740 -2082361
39100 -2082361 1254401 4165125 4323258 2799739 1777860 1360098 611253 100209 1043718
39091 1043718 2851947 3724813 3239859 2497859 2026229 1252227 -81925 -1467255 -2514663
39082 -2514663 -3059602 -2604611 -909700 1053104 1926565 1566814 777257 -106759 -1099903
39073 -1099903 -1502552 -536895 1065694 1602744 596465 -800830 -1531692 -1490877 -811322
39064 -811322 281108 964098 624019 120732 758790 2112990 2590812 2100803 2155877
39055 2155877 3122574 3561268 2849762 2222930 2353329 2186254 1384632 1599827 3556508
39046 3556508 4958799 3521089 478303 -1303349 -1427201 -1593898 -2070552 -1428494 408121
39037 408121 1633771 1486914 1337733 2176641 3080775 3078908 2751133 2850023 2777568 1731634
39027 1731634 378119 75004 915319 1588898 1035893 -440881 -1674673 -1882696 -1381617
39018 -1381617 -1031863 -957648 -358099 971592 1763047 1022082 -33427 562452 2397143
39009 2397143 2996913 1501465 -94340 -138454 336153 -200547 -1109041 -932670 -18988
39000 -18988 257494 -96526 -196647 -483211 -2093160 -4293322 -4901178 -3465602 -1849270
38991 -1849270 -1262934 -950842 -510013 -1129802 -3136576 -4366931 -2924688 -146257 1183460
38982 1183460 549495 -383001 -763775 -1168438 -1507964 -692337 1246867 2686637 2696191
38973 2696191 2120655 1744388 1082824 -47483 -392343 885358 2393806 2148079 329136
38964 329136 -1082335 -1011158 -205323 366479 667682 1016349 1472645 2089011 2978592 3931378
38954 3931378 4570483 4899627 5058935 4664756 3234674 1259704 -58299 -277961 -50804
38945 -50804 205060 977171 2516028 3869545 3850923 2600763 1525236 1740291 2936213
38936 2936213 3789712 3361236 2048049 1071310 1091798 1785670 2872121 4686947 7190710
38927 7190710 9524706 11802589 16321019 24853483 34866823 40669277 39034153 32082249
38919 32082249 24107091 17469240 12485562 9187985 7312099 5815275 4171486 3289260
38911 3289260 3747138 4231623 3398939 2223635 2488947 3734415 3950856 2904566 2403346
38902 2403346 3189232 3858191 3381718 2672790 2822822 3436447 3651785 3538429 3632135 4073417
38892 4073417 4802296 5663777 5977067 5128045 3870758 3694525 4547114 4732929 3561933
38883 3561933 2304712 1725230 714233 -1210657 -2038563 -76352 2763729 3070457 732308
38874 732308 -928341 134713 2233123 2833684 1880231 1088265 1353432 2222519 3147817
38865 3147817 3942894 4227574 3526764 2154331 1315561 1879277 3293982 4176476 4001772
38856 4001772 3684586 4096497 4560026 3787666 2144376 1578744 2755923 3602836 1920125
38847 1920125 -1427592 -3408368 -2526519 -170747 1638320 2317014 2227250 1596860 801346
38838 801346 757082 1976637 3588110 4074888 2904773 1017764 -108075 436205 2452029
38829 2452029 4651648 5365533 3847011 1089814 -951463 -1168683 -174358 770659 1393489
38820 1393489 2415735 3909230 4513053 3082405 628875 -594035 1834 655250 5598
38811 5598 -828793 -117678 1527100 1803866 139105 -1247880 -231253 2460349 4176378
38802 4176378 3394869 1085224 -727169 -1130431 -890537 -1089062 -1656000 -1719338 -1171738
38793 -1171738 -870318 -979389 -386167 1292834 2379377 1414656 -156810 283249 2519897
38784 2519897 3681139 2602441 1366250 1607609 1971249 980259 82973 1332156 3664112
38775 3664112 4391148 3502021 3397522 4525726 4446837 1952365 -731369 -1263991 -436030
38766 -436030 -306374 -867139 -682318 276395 637606 -14713 -760415 -1129854 -1440196 -1338910
38756 -1338910 114619 2520220 4045201 3982019 3818514 4780886 5783981 5191097 3413309
38747 3413309 2055478 1294532 87430 -1338304 -1395062 69636 920696 -273411 -1961750
38738 -1961750 -1741924 263342 1740766 1418766 446227 516241 1836365 3307868 3935247
38729 3935247 3687260 3343697 3601037 4106402 3641515 1698749 -514425 -1356776 -782989
38720 -782989 -277822 -877646 -2081059 -2710543 -2064523 -212021 2045811 3479561 3526901
38711 3526901 3110274 3493572 4388966 4350997 3139831 2263225 2656897 3250424 2757129
38702 2757129 1661793 1219447 1432831 1453165 1406492 2286420 4111035 5498346 5335710
38693 5335710 4001891 2720458 2327864 2753988 3169798 2663533 1275325 237823 645179
38684 645179 2045047 2920512 2366559 700819 -1257572 -2699882 -2866305 -1580834 187896
38675 187896 1135447 1072174 829746 806302 607569 234438 460464 1517755 2376739 2085684
38665 2085684 1195268 1090816 2250877 3784159 4506450 4036546 2969047 2272450 2407425
38656 2407425 2895875 2906064 2223876 1331754 649180 234032 157761 418439 374641 -857537
38646 -857537 -3048723 -4650501 -4464495 -2937440 -1368860 -508454 -454416 -1146292 -2101258
38637 -2101258 -2240332 -1009750 569262 937883 55037 -466399 530796 2204128 2685576
38628 2685576 1307013 -502508 -687750 1009075 2386796 1131713 -2247393 -4775934
38620 -4775934 -4604562 -3072292 -2358921 -2302792 -1164489 1091250 2297022 1124824 -1038879
38611 -1038879 -1952133 -1060729 506778 1455316 1073270 -615466 -2520735 -2950235 -1332619
38602 -1332619 916956 2003040 1799251 1524654 1833784 2249907 2327384 2282380 2247537 1810366
38592 1810366 776237 -236998 -568496 -523739 -942945 -1800085 -1909716 -422021 1785718
38583 1785718 2844601 2013515 461200 -255756 131720 824691 1148406 844726 -171136
38574 -171136 -1364696 -1434499 105147 1546375 788331 -1529607 -2552047 -1220228 322370
38565 322370 256529 -161910 927189 2661886 3017469 2481609 3395511 6010018 7904960
38556 7904960 7622552 6529641 6478798 7711302 9866974 13120338 17177126 20638906 22471936
38547 22471936 22954855 22431881 20571451 17785173 15826527 15648166 15892326 14849172 12786888
38538 12786888 10929071 9218425 6790040 3933988 1916251 1268852 1627207 2695814
38530 2695814 3936976 3956500 1963603 -500447 -1070354 338795 1668697 1890252 2089246
38521 2089246 3050734 3752818 3257046 2620722 3618839 6272435 8699835 9203956 7948953
38512 7948953 6673412 6916377 8465756 9867224 10743789 12879699 18168523 26158139
38504 26158139 34739429 42519908 48900327 52363446 50945791 44830511 36743193 29272553
38496 29272553 23212344 18662485 15787197 13843214 11345368 8142460 5738428 4768364
38488 4768364 3981901 2740829 2497877 4217509 6107999 5900689 4095779 2935718 3151977
38479 3151977 3748621 4217508 4820699 5074525 4044857 2187626 1160058 1587483 2346600
38470 2346600 2176828 899006 -886856 -2239132 -2190216 -719476 768287 926168 107378
38461 107378 -433377 -403582 -341218 -247947 187864 496839 111841 -288953 198287 715116
38451 715116 -422380 -2902911 -4473166 -3941478 -2283690 -583180 1152481 2688795
38443 2688795 3077206 2294074 1720614 2131691 2624752 2308371 1648669 1332467 1147189
38434 1147189 876926 1085499 2080479 3109371 3367693 2894374 1934633 495487 -959307
38425 -959307 -1562278 -1310633 -1057139 -836721 283722 2153046 3081217 2297512 1176314
38416 1176314 1030275 1406718 1683508 2474016 3983627 4808335 4161351 3625589 4671021
38407 4671021 5946084 5298062 3174228 1554293 639910 -623088 -1546430 -369283 2174479
38398 2174479 3025940 1103512 -1183108 -1536648 -560038 112360 417948 1213088 2470981
38389 2470981 3486677 3991775 4082897 3699747 2803677 1528277 -9002 -1285397 -967436
38380 -967436 1705309 5058100 6099861 3977190 931052 -592709 -287006 984764
38372 984764 2664119 4056491 4079799 2762360 1776764 2290404 3388734 3729688 3535370
38363 3535370 3640301 3730905 3056533 1965194 1208913 566427 -279610 -380349 1093611
38354 1093611 2761112 2433436 361591 -1022790 -648439 43148 -171061 -591119 -443602
38345 -443602 -422921 -1084706 -1294481 158901 2491699 3979785 4269650 4173623 3856059
38336 3856059 2860071 1601915 1198299 1749411 2171476 1868318 1286059 654769 -432563
38327 -432563 -1804768 -2445895 -2041824 -1500321 -1212910 -224358 1734465 2778500 1185413
38318 1185413 -1682119 -2789085 -1483137 -108304 -370643 -1105722 -479333 1267255 2546006
38309 2546006 2810825 2845534 3167154 3307375 2614151 1079626 -587680 -1426404 -1058446
38300 -1058446 -244446 -102649 -639027 -788036 -82481 732076 1118148 1576189 2391214
38291 2391214 2821565 2505291 2408854 3092691 3242444 1590663 -686133 -1471154 -966546
38282 -966546 -1270274 -2934055 -4229059 -4086568 -3550898 -3593492 -3452898 -2234271 -612699
38273 -612699 263076 420144 508669 555558 345347 272932 748964 1253975 878495 -498632
38263 -498632 -2139258 -3171061 -3016938 -1696535 -142764 375622 -397319 -1432820 -1745590
38254 -1745590 -1339713 -654548 17735 200055 -720677 -2558557 -4218797 -4959333 -4995079
38245 -4995079 -4610011 -3718330 -2616832 -1932079 -1409071 -180038 1256647 1117338 -685644
38236 -685644 -1626789 -169241 1567864 843518 -1504287 -2449150 -1418185 -716420 -1543140
38227 -1543140 -2349968 -1658539 -222408 465632 122506 -644343 -1265734 -1251247 -486647
38218 -486647 179778 -131152 -714857 -131185 1208964 1238816 -455817 -1602976 -548297
38209 -548297 1396084 2385327 3000936 4704355 6597008 6199128 3132320 -183186 -1735364
38200 -1735364 -1991860 -2241715 -2475534 -1949009 -879871 -384140 -960130 -1932475 -2559375
38191 -2559375 -3088183 -4216091 -5683298 -6122212 -4766546 -2794858 -2065437 -2644851 -2735633
38182 -2735633 -1356639 164888 219836 -666189 -807852 -113300 -189831 -1665223 -3002184
38173 -3002184 -2652655 -1247207 -660335 -1492185 -2451487 -2108899 -518692 1032700 1429020
38164 1429020 648307 -497052 -1279042 -1622607 -1848354 -2107043 -2266217 -2203242 -1922375
38155 -1922375 -1445020 -862075 -414358 -202534 49404 492202 575267 -306079 -1564660
38146 -1564660 -1764871 -600229 435081 97228 -775645 -632513 234957 45865 -1686779
38137 -1686779 -3356494 -3619803 -3031712 -2584528 -2013510 -725904 651177 1093708 948512
38128 948512 1479354 2954771 4429647 5156798 4965901 3552422 931894 -1424615 -1592965
38119 -1592965 269120 1899149 1978143 1690356 2470971 3739893 4106615 3594019 3160980
38110 3160980 2851146 2015751 927180 592561 1040445 1210682 726166 519579 1266358
38101 1266358 2209200 2218062 1428829 1110852 2025854 3422411 3876337 2969172 1741682
38092 1741682 1255861 1159889 390860 -939259 -1450316 -494987 869779 1461071 1495074
38083 1495074 1775883 2279035 2485421 2408913 2327527 2063668 1401478 634105 -104850 -1305178
38073 -1305178 -2967247 -3912253 -3381338 -2496099 -2741949 -3698746 -3802722 -2791010 -1743989
38064 -1743989 -1110403 -408168 344389 599926 551870 793082 902401 160522 -508365 578641
38054 578641 2887114 3800800 2316931 533171 569695 1848597 2501811 1936232 875578
38045 875578 72135 -54918 498061 961744 571233 -2639 576399 1881979 1996336
38036 1996336 764359 532247 2499620 4490665 3968364 1456233 -793600 -1936784
38028 -1936784 -2475782 -2500721 -2012585 -1877568 -2503404 -2556579 -920461 1025603 1122238 -337703
38018 -337703 -1122264 -213942 1486022 3056606 4231310 4647782 4310282 4373206 5679549
38009 5679549 7096329 7179499 6752844 7646216 9596665 10929489 11724136 13487964 16307821
38000 16307821 19919077 27353263 42527949 62194822 74764026 71228099 55203932
37993 55203932 38597231 28774263 23711522 18858303 13923536 11156194 10431733 9355938
37985 9355938 7160756 5591311 5616543 5500712 3379495 323297 -947648 183034 1736739
37976 1736739 2457353 3373610 5087787 5712880 3540204 273070 -915268 212676 1123237
37967 1123237 769034 775815 1956133 2570866 1385493 49992 603591 2347522 3148788
37958 3148788 2624982 2074296 2045649 1925812 1624625 1921797 3015771 4040760 4301311
37949 4301311 4075085 3946114 3996172 3888423 3394828 2749432 2598200 3404057 4773499
37940 4773499 5709420 5684916 5064275 4342102 3515738 2445149 1315370 484621 267838
37931 267838 877982 1995607 2467995 1286504 -1031111 -2841932 -3202507 -2452845 -1176731
37922 -1176731 151385 553465 -770973 -2803457 -3376862 -2013924 -449200 250350 1109521
37913 1109521 2790456 3809480 2852868 1172222 781144 1605522 2319315 2764585 3472225
37904 3472225 3852595 3116956 2207396 2523913 3353982 2947012 1688700 1620847 2890803
37895 2890803 3357289 2147742 1105411 1853356 3515030 4327086 3780293 2274645 274535
37886 274535 -1292565 -1304982 -42700 781031 294618 -588607 -1039328 -1375840 -1472263 -138428
37876 -138428 2517742 3970908 2405777 -434435 -1543893 -699652 -39118 -397454 -518640
37867 -518640 250370 881005 754888 852105 2006674 3412254 3726252 2640360 746710
37858 746710 -1130339 -1917964 -809486 1343429 2229046 789777 -1101898 -976647 868866
37849 868866 1937089 1220745 469383 1265477 2549819 2298935 549258 -809977 -772538
37840 -772538 -182045 20893 41970 295998 427775 -40873 -887699 -1578816 -1770071 -1024518
37830 -1024518 982644 3333874 4046004 2454553 568430 782969 2867252 4567285
37822 4567285 4689084 4023408 3436848 2740078 1679407 571146 -482383 -1780798 -3038858
37813 -3038858 -3404970 -2891796 -2590390 -2933872 -2940691 -1869176 -522016 -74732 -507527
37804 -507527 -1021132 -1241067 -1241614 -1065825 -922608 -1228500 -1899106 -2296019 -2273346 -2312372
37794 -2312372 -2212833 -1019159 967561 1658273 9336 -1941925 -1596534 626477 2098936
37785 2098936 1665655 496718 -359576 -1130958 -1921551 -2139748 -1812063 -1863248 -2539400
37776 -2539400 -2904781 -2392423 -1596756 -1088519 -708440 -516312 -1160951 -2664325 -3906666
37767 -3906666 -3890463 -2609873 -459872 1949020 3186037 1968050 -550734 -1223369 1218508
37758 1218508 4293146 5049307 3670449 2233438 1404213 498406 -235099 185513 1418612
37749 1418612 2182406 2530374 3574423 4912150 4600544 2172151 -371991 -1274416 -874692
37740 -874692 -15839 1453259 3455174 4745534 4688197 4575573 5596355 6644715 5887169
37731 5887169 3660846 1988947 1706498 1861486 1778476 1949004 2654026 3198131 2997332
37722 2997332 2363884 1795499 1322988 888312 688381 917931 1659658 2927317 4238309
37713 4238309 4536063 3478472 2406482 2754424 3761944 3379572 1493687 369958 1322264
37704 1322264 2819975 2984853 2269624 2102197 2203396 1189970 -884972 -2541596 -3146825
37695 -3146825 -3354579 -3276610 -2065282 203522 1883014 1902237 1338784 1746680 2749418
37686 2749418 2552795 540470 -1785623 -2569942 -1496340 293781 1475354 1333474 -123903
37677 -123903 -2108817 -3282742 -2850984 -1659289 -1511605 -2920437 -4159015 -3344492 -1036149
37668 -1036149 329600 -457733 -2026016 -2495285 -1779302 -1103713 -1092152 -1260480 -952768
37659 -952768 20577 1389498 2466327 2524302 1688823 1062796 1424052 2251445 2602546
37650 2602546 2393509 2116193 1883451 1620396 1679694 2287663 2787284 2436246 1607658 1172280
37640 1172280 1032791 398393 -748474 -1644495 -2019225 -2183478 -2037289 -1319006 -741605
37631 -741605 -1387467 -2821089 -3275921 -2049800 -338242 670867 1087443 1220405 723348
37622 723348 -343687 -942254 -540000 -85218 -521651 -1299854 -1393155 -984210 -1093330 -2087364
37612 -2087364 -3386278 -4132662 -3572226 -1532241 833467 1675001 645080 -379596 343535
37603 343535 2205132 3387438 3378293 3110079 3176083 3162886 2462408 763464 -1887569 -4580676
37593 -4580676 -5587040 -4035947 -1291735 333632 33944 -1150855 -2051088 -2411491 -2460801
37584 -2460801 -2447047 -2588284 -2795867 -2591364 -1826046 -1103218 -943279 -1081566 -1181074 -1487819
37574 -1487819 -2029056 -2023812 -1016562 284322 1249347 2270993 3271231 2715401 -18989
37565 -18989 -2582723 -2412065 -689902 -757957 -2959180 -4154529 -2653487 -482870 218183
37556 218183 113784 420740 335067 -1160459 -2820718 -2792600 -1542492 -990387 -1522097
37547 -1522097 -1836909 -1281219 -535819 -183665 -99187 -162448 -324340 -104979 779794 1416808
37537 1416808 543641 -1526186 -2944172 -2593079 -1449960 -1266309 -2458739 -3803306 -4038033
37528 -4038033 -3330819 -2875112 -3153719 -3285385 -2575460 -1945339 -2632896 -3904935 -3712118
37519 -3712118 -1688375 336298 1296761 2330766 4171082 5129365 3555022 841431
37511 841431 -235859 668471 1510706 1207244 683149 623975 372868 -461744 -1094107 -920165
37501 -920165 -386615 95524 847395 1913219 2477961 1978566 947505 252938 291903
37492 291903 1203724 2820770 4007828 3279133 818963 -1189799 -1174912 -188142 -246909
37483 -246909 -1467019 -2218423 -1752254 -1156052 -1450393 -2007283 -1632104 -508967 -100714
37474 -100714 -1178290 -2753451 -3376420 -3019237 -2964176 -3853015 -4620071 -3786241 -1281548
37465 -1281548 1578360 3541463 4232309 3892443 3130620 2790165 3254397 3892666 3913743
37456 3913743 3656849 4111457 5140845 5294749 3759914 1534934 159136 91970 846439
37447 846439 1861868 2602939 2617000 2259666 2599610 3750970 4125412 2516448 259489
37438 259489 -200854 1352679 2637756 2134183 1009840 1099022 2336290 3323356 3515432
37429 3515432 3513900 3606625 3307961 2384356 1346302 727962 580057 749433 948603 522732
37419 522732 -965264 -2715838 -3207511 -2138785 -925950 -726403 -1010637 -938592 -1013385
37410 -1013385 -1950757 -2771812 -1938991 -96875 440178 -764581 -1380296 118092 1965175
37401 1965175 1743673 18824 -597876 818428 2642149 3234136 2608125 1615668 1003835
37392 1003835 1397689 2877892 4386288 4670022 3865401 3075591 2598514 1983333 1639170
37383 1639170 2524352 4026372 4171992 2604623 1361409 1678771 2021918 793625 -819112
37374 -819112 -738472 588428 935385 -340736 -1912261 -2901965 -3348927 -2545101 434640
37365 434640 4132151 5204782 2632489 -606862 -1354188 11309 1151437 1413871 1882501
37356 1882501 2826703 3318573 3112213 2980179 3092307 2727935 1923798 1934225 3443674
37347 3443674 5388939 6148158 5128357 2831577 233201 -1496625 -1572252 -488751 344283
37338 344283 288866 26558 72579 -145547 -996051 -1557785 -962150 43342 163282 -485890
37328 -485890 -873776 -928281 -1279090 -1508909 -578562 941492 1055164 -732984 -2543314
37319 -2543314 -2962878 -2922926 -3572702 -4031761 -2960412 -1065006 -78391 -49130 373095
37310 373095 1396557 1839096 1387003 1207821 1923763 2522712 1855950 81150 -1799795
37301 -1799795 -2831930 -2306836 -227233 2074227 2884691 2086343 1184067 1108784 1216404
37292 1216404 848566 457207 433057 185905 -554643 -710322 571990 2205052 2421231
37283 2421231 1161247 -160655 -834723 -1325819 -1735041 -1364201 -156676 765948 731632
37274 731632 734593 2057210 4126535 4815300 3084865 532774 -387384 634527 1507350
37265 1507350 688705 -707539 -663001 750773 1614638 1051052 131002 -256229 -580742
37256 -580742 -1059576 -723621 663478 1328067 -215925 -2732440 -3923003 -3670406 -3647383
37247 -3647383 -4187757 -3729946 -1522508 1056726 2457277 2746893 2818981 3030927 3310227
37238 3310227 3664477 3934102 3725090 3069841 2594035 2709851 3117486 3200215 2443331 697125
37228 697125 -1209537 -1478174 834165 4086159 5449791 4131150 1907367 409526
37220 409526 -494501 -1234690 -1284950 -345879 674864 975220 967804 1053326 541017 -975085
37210 -975085 -2331302 -2326094 -1573252 -1321630 -1312275 -518196 673960 937559 322367 154071
37200 154071 634631 455281 -868703 -2030514 -1888302 -898478 65689 975472 1986677
37191 1986677 2753917 3214971 3920758 4737615 4413325 2548238 918475 1399783 3280479
37182 3280479 4151051 3061212 1259150 -42489 -972531 -1772485 -1820547 -713094 741489
37173 741489 1557543 1923124 2604098 3443446 3401128 2001751 6207 -1435988 -1823941
37164 -1823941 -1480465 -1108331 -1198259 -1566545 -1535479 -851098 -210965 -434194 -1315689 -1925005
37154 -1925005 -1929335 -1828202 -1778486 -1099655 559442 2254792 2628749 1408044 -485031
37145 -485031 -1960795 -2403125 -1683553 -215885 1133694 1705218 1561026 1140353 797662
37136 797662 962304 2044179 3528977 3893028 2411729 501668 98835 1124170 1885525
37127 1885525 1666153 1298252 1205183 697813 -363996 -954855 -643367 -363178 -574337
37118 -574337 -277073 1036945 2063390 1754980 1232005 1875235 2800873 2311864 883692
37109 883692 365230 790769 503402 -657000 -857512 602595 2023901 1985554 1246020
37100 1246020 947538 744841 -30754 -818836 -729820 136008 1301106 2638176 3496077
37091 3496077 2528645 -261265 -2619343 -2765044 -1887789 -2172098 -3365905 -3445542 -2060703
37082 -2060703 -916512 -725100 -125741 1704773 3320115 2993664 1166588 -183587 129723
37073 129723 1610893 2964824 3263190 2604044 1930967 1900822 2056640 1721136 1317449
37064 1317449 1625202 1957776 791479 -1459301 -2187832 -136206 2456832 2758124 1149593
37055 1149593 333670 1421024 2898903 3268925 2757696 2079456 1180071 -21156 -790556
37046 -790556 -337050 1176941 2844014 3711871 3140593 1285056 -531221 -853327 98801
37037 98801 597602 -184731 -1070658 -875079 -195717 34217 576865 2586064 4951308
37028 4951308 5243778 3394267 2082226 2708562 3278856 1810644 -175176 80324 2100108
37019 2100108 2835414 1487494 662324 2041181 3692996 3289573 1777479 1615876 2787087
37010 2787087 3045396 1475438 -578762 -1921772 -2520361 -1978276 570458 4247851 6242678
37001 6242678 5089186 2523740 859341 87577 -961914 -2109611 -2380637 -1948435 -1451187
36992 -1451187 -200371 2610511 5342662 5116006 1824660 -1385464 -2244227 -1774160 -1747446
36983 -1747446 -1988969 -1668449 -1351277 -1826399 -2241698 -1450329 -257798 -193079 -670910
36974 -670910 280069 2546153 3577413 2115555 193721 257435 1837846 2549969 1459599
36965 1459599 -60305 -484940 164918 904097 1163405 1235125 1707734 2649259 3305706
36956 3305706 2810303 1367945 401850 1125517 3141500 4807422 4842485 3280402 1119386
36947 1119386 -459676 -687521 325565 1574562 2069590 1864812 1695037 1530729 359098
36938 359098 -1982803 -3547811 -2133984 1696658 4863703 5609006 5869561 8677211 13990130
36929 13990130 18594266 19870764 18085989 14841463 11050542 7312743 4773285 4098451
36921 4098451 4297413 3899713 2913278 2461778 2852007 3242672 3035282 2349115 1193353
36912 1193353 -510386 -1939401 -1749387 77381 1847216 2182446 1557334 1284384 1786853
36903 1786853 2470397 2650034 2048040 884919 -135210 -447219 -457322 -1095061 -2368634
36894 -2368634 -3197238 -2860640 -1605122 383308 3227870 6049684 6985973 5604998 3952351
36885 3952351 3855135 4383552 3562487 1539948 153893 80874 492401 1152585 2628110
36876 2628110 4346124 4656051 3388537 2433967 2965356 3745712 3161649 1504445 135308
36867 135308 -425071 -412220 205618 1435412 2564105 2825307 2366036 1806168 1368144
36858 1368144 1135007 1492521 2441573 3036588 2432420 1083155 83515 -254693 -349353
36849 -349353 -328759 -13963 369433 392235 214183 412749 1123202 1945169 2479701 2431149
36839 2431149 1611651 498597 237164 1236717 2312038 2215718 1432345 1198515 1330556
36830 1330556 738525 -139392 517509 2891479 4604077 3829742 1783540 814762 1190893
36821 1190893 1259697 118906 -1334485 -1815662 -1030688 281958 976593 398775 -794625
36812 -794625 -1195951 -577262 -428817 -1670892 -2826653 -1988082 89994 795399 -588386
36803 -588386 -1967704 -1633823 -393569 292019 438466 546125 74687 -1369967 -2374499
36794 -2374499 -1125469 1967774 4690253 5826320 6060704 6234127 6232077 5733914 4738801
36785 4738801 3197443 1339237 362851 1335919 3259905 3861819 2691171 1685245 2028202
36776 2028202 2394726 1484140 437912 987777 2613693 3536677 3530401 3657861 3910350
36767 3910350 3292785 1912241 841180 43681 -1392488 -2914916 -2719966 -754348 746408
36758 746408 489908 -225681 -91754 79465 -804148 -1989460 -2272147 -2029946 -2121465 -2023587
36748 -2023587 -900142 522592 1040398 1077220 1786340 2755250 2621496 1489718 698209
36739 698209 481248 -92263 -1026368 -1360183 -1195706 -1524925 -1839299 -371532 2564780
36730 2564780 3895959 1762825 -1766639 -3436051 -2627531 -922795 602006 1716119
36722 1716119 1788399 367994 -1400061 -1809138 -957253 -516393 -1151043 -1689193 -1119514
36713 -1119514 -50894 358221 -95333 -858677 -1607704 -2346414 -2891493 -2885105 -2314912 -1633405
36703 -1633405 -1162955 -543683 835914 2697342 3664195 2803057 1024290 64817 287416
36694 287416 647627 765014 1401872 2455223 2345084 550861 -944024 -434444 676189
36685 676189 -31406 -2062275 -2726616 -1424332 -451652 -1127445 -1760184 -630605 1172710
36676 1172710 1535291 416928 -565018 -657781 -383291 1875 850443 2037515 2773838
36667 2773838 2591243 1686860 361256 -1110841 -2140603 -2129832 -1170076 92656 1210655
36658 1210655 2065992 2474743 2310522 1920986 1778688 1733265 1212150 207469 -514449
36649 -514449 -355243 375403 813470 360354 -880360 -2188000 -2727707 -2260013 -1381912
36640 -1381912 -831618 -599496 -33862 1152143 2289005 2324182 888787 -1277444 -2959055
36631 -2959055 -3553658 -3507221 -3592660 -3908943 -3882556 -3146466 -1981704 -927609 -472119 -1063542
36621 -1063542 -2633528 -3949117 -3393913 -910614 1650070 2702434 2570682 2225842 1456842
36612 1456842 -359662 -2389052 -2933338 -1800177 -577933 -391861 -728387 -744249 -410303
36603 -410303 101847 939097 1862851 2094875 1499930 924509 735109 127507 -1268179
36594 -1268179 -2202162 -1399186 486401 1783268 2059690 2132637 2284101 1999098 1408689
36585 1408689 1460842 2279903 2614075 1539992 -184644 -1117780 -829646 12748 790944
36576 790944 1558263 2691420 4254986 5609954 5678767 4045183 1832753 820170 1384667
36567 1384667 1993115 1237171 -265741 -793047 74039 985716 804758 70143 12636
36558 12636 820903 1631670 1889056 1821233 1509433 415908 -1546525 -3074077 -2584591
36549 -2584591 -281186 1739980 1773727 278114 -1026548 -1215883 -695691 -135855 303952
36540 303952 783457 1493947 2534485 3496198 3311483 1331748 -1376550 -2701485 -1802260
36531 -1802260 -17823 935110 872034 629760 459882 5 -571161 -619700 -397972 -1127875
36521 -1127875 -3205732 -5206950 -5481793 -4200475 -2895279 -2236664 -1349094 461167 2340668
36512 2340668 2970625 2349085 1541853 977643 120301 -1070749 -1580705 -897821 -131881
36503 -131881 -475503 -1158075 -375945 1724652 2496568 34192 -3963581 -5715145 -3546985
36494 -3546985 336562 2416891 1523659 -448563 -1048192 196857 1866618 2622726 2370098
36485 2370098 1606630 594873 -360656 -657934 -309611 -529937 -2225947 -4158239 -4019669
36476 -4019669 -1568776 697122 613753 -1117626 -2324716 -2185857 -1469573 -796840 -161514
36467 -161514 146380 -366948 -1249835 -1289746 -218400 738874 472277 -633351 -1424779
36458 -1424779 -1421934 -899636 24269 1569077 3474193 4597380 3904774 1945068 824251
36449 824251 2070288 4637225 5892258 4819480 3231952 3156333 4095175 4119230 2876719
36440 2876719 1807954 1595500 1240821 57781 -1041313 -1016846 -192503 574019 1151499
36431 1151499 1678897 1803962 1377968 1127336 1581692 1961201 1205010 -386793 -1622966
36422 -1622966 -2157333 -2643296 -3341369 -3628761 -2927273 -1360200 417397 1402767 651245
36413 651245 -1589409 -3512198 -3624171 -2723859 -2746202 -3824105 -4113338 -2788273 -1471995
36404 -1471995 -1828979 -3179863 -3736712 -3164925 -2514078 -2262494 -1936327 -1467462 -1497004
36395 -1497004 -2090642 -2297862 -1493329 -376821 -64468 -643431 -1141558 -699820 610992
36386 610992 2000384 2651232 2239885 1055283 -264686 -1218148 -1812485 -2466157 -3399233
36377 -3399233 -4098008 -3701508 -2199002 -890455 -1005120 -1976246 -1971034 -372296 1236275
36368 1236275 1204099 41754 -544604 -210606 -110931 -603923 -466943 979615 2312164
36359 2312164 1710587 -507903 -2259367 -2316398 -1462346 -993815 -1073623 -1000079 -494922 -144290
36349 -144290 -652128 -1913237 -2893529 -2549136 -985783 524091 962356 724865 880809
36340 880809 1534648 1701201 840055 -336229 -918682 -927924 -886960 -912167 -887619 -1046069
36330 -1046069 -1601723 -2117391 -2025306 -1574793 -1447190 -1558037 -1161634 -189221 482993 334977
36320 334977 -180194 -695952 -1582289 -2838393 -3276354 -1897490 455291 1968063 2138751
36311 2138751 2080783 2609135 3193318 3090759 2501476 2088154 2099792 2460576 3047066 3354449
36301 3354449 2577530 736339 -805414 -741850 600526 1843392 2358191 2572749 2725744
36292 2725744 2493240 2017151 2127205 2968758 3382855 2489081 1141611 735654 1004041
36283 1004041 290032 -1925678 -4005556 -4185123 -2684179 -1042057 -45997 704815 1548758
36274 1548758 2215571 2629600 3254995 4214505 4830208 4604177 4040561 3805298 3571579
36265 3571579 2571106 972946 -338055 -1290309 -2693710 -4428564 -4883524 -3179947
36257 -3179947 -962299 -536743 -1678989 -1908689 -44543 2117405 2322074 679451 -1067852
36248 -1067852 -1998685 -2321138 -1931263 -428711 1394847 1712819 -40036 -2099837 -2298956
36239 -2298956 -315810 2529455 4900957 6150116 6110441 5123877 3955503 3010730 1973701
36230 1973701 719691 -86831 -98584 -232835 -1294040 -2213492 -1260552 1126787 2502490
36221 2502490 1791785 786732 1399215 2941319 3445097 2549527 1483984 831324 -16750
36212 -16750 -1317669 -2411196 -2911121 -3211934 -3422935 -2880068 -1323711 230474 537872
36203 537872 -298805 -830521 242954 2742542 5029878 5418322 3886912 2269348 2290645
36194 2290645 3599177 4377185 3675842 2173138 654785 -944635 -2516816 -3115824 -2325628
36185 -2325628 -1326301 -1356786 -1751230 -855470 1462097 3643732 4687099 5057036 5163321
36176 5163321 4542119 3248973 2583429 3239327 3843766 2805225 878672 195324 1033842
36167 1033842 1417441 216099 -1158335 -1056135 -108895 -77986 -1139434 -1882875 -1578843
36158 -1578843 -864317 -160800 1077354 3057044 4790404 5291836 4844265 4356194 4044443
36149 4044443 3472278 2487082 1403674 421945 -582748 -1704008 -2714817 -3079576 -2286421
36140 -2286421 -557511 820508 604964 -790993 -1665262 -1341241 -1022055 -1643719 -2118177
36131 -2118177 -1041330 770547 1209881 3867 -875548 -66945 1516611 2282859 1805867
36122 1805867 522955 -1124688 -2518914 -2911048 -2440448 -2251098 -2892570 -3440274 -2899547
36113 -2899547 -1622604 -541457 183267 850702 1283101 1179348 873662 873134 1136751 1546180
36103 1546180 2384892 3472145 3657928 2370543 922565 825816 1370147 573705 -1704980
36094 -1704980 -3424044 -3250050 -2013656 -867852 231145 1391911 1743343 746162 -592587
36085 -592587 -1093789 -1156008 -1844668 -2858976 -2806119 -1299452 437726 1120848 632401
36076 632401 -328548 -955961 -587783 929047 2824958 3900337 3646521 2508022 1107786
36067 1107786 -157056 -767181 -222463 1084463 1865659 1372716 295012 -355722 -687559
36058 -687559 -1393649 -2175578 -1913781 -552173 393240 -136235 -1154041 -1069940 -69485
36049 -69485 271642 -432206 -697317 467137 1882640 1919327 950305 712507 1605475 2102920
36039 2102920 1058110 -679805 -1583859 -1480318 -1416545 -1986687 -2662619 -2713876 -2109742
36030 -2109742 -1348064 -816038 -560385 -493844 -594449 -865838 -1175798 -1251699 -946509 -490362
36020 -490362 -354200 -819408 -1714758 -2525110 -2702485 -2021750 -834625 99188 253906
36011 253906 -186011 -598036 -550279 -16801 796045 1521386 1699178 1134625 81774 -1198335
36001 -1198335 -2732268 -4205629 -4499079 -2826001 -241598 1112249 570663 -295283 -3230
35992 -3230 818541 630304 -665072 -1810954 -2201109 -2448590 -2933021 -3009061 -2074552 -551114
35982 -551114 693785 1302142 1416545 1286077 1282395 1759143 2426657 2389445 1385702 515382
35972 515382 968687 2310971 2895805 1928933 245556 -1071649 -1865050 -2261783 -1855632
35963 -1855632 -477698 808070 673194 -587929 -1240223 -406300 823110 1070964 569317
35954 569317 552576 1339385 2009082 1814293 1011975 202314 -402580 -810036 -972445 -1062309
35944 -1062309 -1580164 -2706300 -3720393 -3515456 -1791515 467648 1853417 1834306 1107104
35935 1107104 682073 865627 1322904 1824716 2390347 2766017 2453605 1494788 653652
35926 653652 503014 825177 1179674 1453681 1527549 1130724 491076 329658 656046 510086
35916 510086 -378732 -833126 -217383 92918 -1116158 -2375309 -1414540 1073410 2115814
35907 2115814 855111 -360753 278706 1810492 2899902 3965891 5490851 6370030
35899 6370030 5673849 4357040 3553137 2748566 1346157 440043 1035612 1852368 1059246
35890 1059246 -813346 -1762655 -1209265 7040 1562874 3372261 4213622 3025498 997899
35881 997899 61123 -78905 -916378 -1879753 -1130258 668429 771288 -1089626 -1964038
35872 -1964038 -456284 1003280 159765 -1693314 -2226295 -1485562 -721290 78112 1243938
35863 1243938 1731283 653711 -744406 -731330 344872 998581 1053900 1277864 1564032
35854 1564032 1411910 1404805 2341306 3573709 3933277 3596153 3360799 2909779 1616099
35845 1616099 261379 -44276 29705 -913883 -2398385 -2667780 -1471839 -121070 857565
35836 857565 1870604 2405650 1559201 395402 1127562 3549577 4826677 3538581 1573926
35827 1573926 1142349 2116798 3310768 4248599 4533630 3470877 1561980 526910 657260
35818 657260 86195 -2031627 -3743387 -3364481 -2232506 -2303164 -2871650 -2203403 -939281
35809 -939281 -1012841 -2069650 -1887019 -26788 1686086 2318402 2768446 3212622 2307516
35800 2307516 -76901 -1598919 -345886 2566500 4626979 4964195 4509695 4119019 3858356
35791 3858356 3627690 3383986 2973913 2447559 2225644 2387237 2192007 930445 -1030000
35782 -1030000 -2559565 -2878504 -1965747 -230382 1669336 2870171 2735530 1382748 -376125
35773 -376125 -1625842 -1915978 -1488757 -1050006 -1151134 -1747678 -2428554 -2833406 -2568907
35764 -2568907 -1133603 1360328 3575894 3980523 2677954 1441618 1624300 2724142
35756 2724142 3366955 2993868 2049180 1102452 487636 485842 1157392 1971041 2020237 776204
35746 776204 -1348602 -3105376 -3290515 -1940050 -505183 -272532 -755274 -458163 840120
35737 840120 1722339 1318647 556048 513163 771187 530042 318973 1070024 2125787 1919846
35727 1919846 525153 -218279 496717 1067017 -248277 -2763655 -4124158 -3098336 -753229
35718 -753229 910155 847466 -361723 -1218346 -673090 939730 2357939 2798292 2601173
35709 2601173 2378311 2034940 1089514 -346847 -1507206 -1903691 -1863068 -1932113 -2064798
35700 -2064798 -1779606 -1083694 -776667 -1466672 -2550642 -2818822 -2125404 -1671324 -2181074
35691 -2181074 -2572629 -1353186 1100234 2787692 2590029 1444144 802856 996958 1633465
35682 1633465 2601102 3735120 4065763 2499594 -720417 -3917686 -5481783 -5126058 -3717990
35673 -3717990 -2282699 -1248515 -393671 609120 1597516 1971250 1389053 247886 -632139
35664 -632139 -692895 -30483 702693 854967 475548 268858 483105 249173 -1146020 -2632068
35654 -2632068 -2347157 -473631 464021 -997773 -2955121 -2669284 -432511 922896 39838
35645 39838 -1331413 -1052291 622309 1769974 1316297 22207 -516015 651155 2912576
35636 2912576 4375191 3564983 1104506 -819442 -829172 419615 1506529 1845081 1589177
35627 1589177 859012 -131814 -761731 -685571 -530342 -1153490 -2434195 -3537358 -4193523
35618 -4193523 -4851785 -5506901 -5282261 -3638205 -1368603 265507 1097169 2021296 3400580
35609 3400580 4311258 3867130 2677536 2062959 2024221 1199399 -778142 -2126810 -1192966
35600 -1192966 978486 1858914 906344 115180 827950 1758401 1245620 139239 763068
35591 763068 3435975 5674464 5236235 2818268 988346 1069916 2036820 2451711 2503304
35582 2503304 3356888 4936730 5570459 4220201 2023909 751026 536448 366890 211852
35573 211852 959900 2238914 2159874 -36117 -2547196 -3259880 -2355553 -1595478 -1852959
35564 -1852959 -2508431 -2753125 -2422563 -1808716 -1403926 -1535711 -1772068 -1270204 -180427
35555 -180427 202232 -607478 -1244464 -454799 937816 1386423 1039580 1151504 1694388
35546 1694388 1396631 -42702 -1487860 -2084602 -1887411 -866376 985252 2462965 1897116
35537 1897116 -485800 -2548937 -3000023 -2539000 -1852515 -393992 1945516 3778736 4156072
35528 4156072 4112324 4828571 5402758 4035333 726971 -2612656 -4304269 -4080402 -2679799
35519 -2679799 -1288695 -860265 -1088640 -688621 517119 831495 -812194 -2726684 -2623456
35510 -2623456 -1071490 -634148 -1847973 -2462557 -1100566 644029 897324 390586 939976
35501 939976 2252492 2283521 482156 -1179468 -857954 839681 2006130 2030929 1982912
35492 1982912 2724224 3742500 4065541 3450689 2179699 407882 -1526489 -2670071 -2316990
35483 -2316990 -1132465 -490043 -738070 -1051395 -990402 -1110216 -1781748 -2451622 -2448380 -1616404
35473 -1616404 77787 2444593 4275414 4011895 1803063 -446094 -1710244 -2934355
35465 -2934355 -4614013 -5220735 -3627376 -1353031 -302502 276162 2111729 4355003
35457 4355003 4639663 3148251 2517974 3615508 4450873 3856904 3252133 3616129 3471788
35448 3471788 1556032 -726018 -1403799 -785224 -350386 -212776 449638 1477236 1976305
35439 1976305 1756338 1191574 467098 55759 802334 2327024 2711379 1233898 -79789
35430 -79789 564749 1792259 1425440 315081 781983 2159523 1450772 -1542877 -3308177
35421 -3308177 -1719392 1117810 2513934 2827704 3528582 4043954 2997973 1011022 -212430
35412 -212430 -657594 -1621488 -3152040 -3958279 -3607238 -2912615 -2205501 -1008006 400297
35403 400297 751794 -382517 -1818170 -2352219 -2148161 -2057793 -2395294 -2834138 -2877837 -2143078
35393 -2143078 -802578 79067 -601022 -2510776 -3935328 -3591968 -1817942 172437 1442419
35384 1442419 1546011 531268 -757052 -1142830 -448453 293711 435859 688525 1769366
35375 1769366 2886806 2662050 1157965 -71624 170854 1675161 3470877 4700915
35367 4700915 4964159 4609037 4616637 5408399 5910558 4743663 2308274 645799 1051643
35358 1051643 2773394 4251772 4643971 3898535 2490154 1530967 1965807 3019826 2629139
35349 2629139 254367 -1923771 -1739436 117111 1399606 1526987 1746583 2580040 3050576
35340 3050576 2574375 1944949 1978382 2442064 2770003 2826115 2649491 2340849 2282749 2500489
35330 2500489 1987262 33810 -1944570 -1776848 75305 669028 -1186354 -3149809 -3036530
35321 -3036530 -1940632 -1753320 -1705680 -63057 2247297 2801589 1689709 1182310 1632591
35312 1632591 1008405 -1104694 -2365769 -1648607 -1025724 -2028438 -2737696 -1051294 1384542
35303 1384542 1504101 -319245 -926245 687405 2190290 1852749 854813 884928 1777944
35294 1777944 2658056 3507329 4260478 3901814 2027288 225798 300350 1730963 2360791
35285 2360791 1259748 -422436 -1298564 -1159518 -439077 579453 1559884 1858082 1016947
35276 1016947 -710844 -2491746 -3389273 -2875665 -1300439 222278 804912 569988 110807
35267 110807 -446174 -1175805 -1525778 -795112 577981 1267728 787135 -62472 -686633
35258 -686633 -1397543 -2117069 -1804443 -249813 775200 -326885 -2459209 -3150652 -1967960
35249 -1967960 -802344 -822477 -1095076 -711543 -398749 -922911 -1350502 -375983 1439435
35240 1439435 2202202 1136830 -648750 -1679924 -1416745 -134806 1544639 2844078
35232 2844078 3193464 2588601 1316852 -432762 -2229626 -3071133 -2242489 -463372 615519
35223 615519 228387 -789442 -1262450 -1088888 -1095097 -1832514 -2850065 -3129069 -2164719 -536888
35213 -536888 791147 1638652 2538569 3490317 3721383 3144621 2937767 3658313 3816679
35204 3816679 1930792 -639237 -948608 1416972 3551934 3131476 1166637 -135154
35196 -135154 -438221 -654626 -686102 175376 1262657 963234 -880188 -2590638 -2842266
35187 -2842266 -1911167 -604551 707107 1624271 1554141 653175 -25642 37474 94007 -513417
35177 -513417 -1089944 -613086 542318 979137 243481 -547246 -259329 742352 1037034
35168 1037034 -159489 -2044633 -2966398 -2055332 -97490 1308775 1422180 906302 678634
35159 678634 742205 585275 304982 557030 1422146 2101721 2032171 1689495 1827541 2368339
35149 2368339 2624449 2351472 1945321 1686458 1433260 1149316 1134430 1492526 1840262 1797553
35139 1797553 1350354 530509 -687148 -1786448 -1641140 241087 2744550 4111423 3675519
35130 3675519 2073145 172730 -1291311 -1363363 521672 3330106 4979748 4597520 3352421
35121 3352421 2638346 2441577 2116263 1727152 1685892 1872357 2133201 2935195 4391830
35112 4391830 5301302 4550931 3096606 3006606 4557742 5781362 5159865 3374345 1879458
35103 1879458 1031581 385721 -189247 -600163 -1050743 -1695008 -2288578 -2771910 -3587098
35094 -3587098 -4764633 -5302281 -4245348 -2001211 105775 1275856 1671630 1780122 1889882
35085 1889882 1901049 1298837 -197309 -1706827 -1804587 -572104 135860 -577091 -935346
35076 -935346 922507 3710338 4505929 2993990 1748093 2149085 2589794 1597461 322642
35067 322642 338621 876132 288490 -983062 -1095051 153365 1015595 453131 -607531
35058 -607531 -836865 -2929 1223914 1878661 1155209 -635792 -1689934 -533205 1862524
35049 1862524 3122341 2546158 1598641 1307257 1069881 519157 559906 1529782 2129506
35040 2129506 1538736 1004497 1713662 2535089 1855121 479638 356082 1161688 845769
35031 845769 -569183 -580322 1742261 3928762 3676689 2066676 1432566 1742428 1316595
35022 1316595 105672 -162798 1124268 2590953 3158172 3337877 3642051 3370222 2062029
35013 2062029 979115 1801724 4359010 6753097 7489623 6588988 4837658 3001164 1857186
35004 1857186 1964524 2899084 3391142 2751089 1658747 1011182 501940 -851748 -2984735
34995 -2984735 -4476492 -4152317 -2376622 -522899 360006 169472 -443220 -616652 -72027
$$ [...]
##END NTUPLES=NMR SPECTRUM
##END=
