##TITLE=31Pdec_LR-684A-1
 , 24 sc
 22.7.2019
##JCAMPDX= 6.0         $$ Bruker NMR JCAMP-DX V2.0
##DATA TYPE= NMR SPECTRUM
##DATA CLASS= NTUPLES
##ORIGIN= UXNMR, Bruker Analytische Messtechnik GmbH
##OWNER= root
$$ XWIN-NMR		Version 3.5
$$ Mon Jul 22 15:06:21 2019 Russian Standard Time (UT+4h)  she@DPX200
##.OBSERVE FREQUENCY= 81.013821
##.OBSERVE NUCLEUS= ^31P
##.ACQUISITION MODE= SIMULTANEOUS
##.ACQUISITION SCHEME= undefined
##.AVERAGES= 24
##.DIGITISER RES= 16
##SPECTROMETER/DATA SYSTEM= spect
##.PULSE SEQUENCE= zgpg30
##.SOLVENT NAME= Tol
##.SHIFT REFERENCE= (INTERNAL, Tol, 0, 248.564)
##AUDIT TRAIL= $$ (NUMBER, WHEN, WHO, WHERE, WHAT)
$$ ##TITLE= Audit trail, XWIN-NMR		Version 3.5
$$ ##JCAMPDX= 5.01
$$ ##ORIGIN= Bruker BioSpin GmbH
$$ ##OWNER= she
$$ F:/spectra/data/she/nmr/P31/1/pdata/1/auditp.txt
$$ ##AUDIT TRAIL=  $$ (NUMBER, WHEN, WHO, WHERE, WHAT)
(   1,<2019-07-22 15:04:17.28 +0400>,<she>,<DPX200>,
      <created by zg, POWCHK disabled, PULCHK disabled
       configuration hash MD5:
       00 E9 B6 7A A2 85 ED C7 34 08 36 98 17 FE 4E 26
       data hash MD5: 32K
       68 89 03 DC 73 BA EE D4 1F A4 77 FE E7 BC B2 14>)
(   2,<2019-07-22 15:04:20.62 +0400>,<she>,<DPX200>,
      <Start of raw data processing
       efp BC_mod = 2 LB = 1 FT_mod = 6 PKNL = 1 PHC0 = -2771.128 PHC1 = -239.2011 SI = 64K 
       data hash MD5: 64K
       61 94 01 CE 7C C8 95 5A 1A A6 FA 09 3C 82 92 6B>)
(   3,<2019-07-22 15:05:40.70 +0400>,<she>,<DPX200>,
      <pk PHC0 = 49.14933 PHC1 = 337.8003 
       data hash MD5: 64K
       BF 2E 64 29 47 4A 80 F5 19 21 E4 D3 D5 67 53 F8>)
(   4,<2019-07-22 15:05:43.23 +0400>,<she>,<DPX200>,
      <abs ABSG = 5 
       data hash MD5: 64K
       3B 96 75 02 C2 EE C0 BE 6F 4B 83 58 EA 7D 35 6C>)
$$ ##END=
$$ 
$$ hash MD5
$$ 05 74 A0 F8 50 22 AA D4 DD D2 87 AC 2F CE 9B BF
##$RELAX= 
##$RELAX= 
##$RELAX= 
##$RELAX= 
##$RELAX= 
##$RELAX= 
##$RELAX= 
##$RELAX= 
$$ Bruker specific parameters
$$ --------------------------
##$DU= <F:/spectra>
##$EXPNO= 1
##$NAME= <P31>
##$PROCNO= 1
##$TYPE= <nmr>
##$USER= <she>
##$AMP= (0..31)
100 100 100 100 100 100 100 100 100 100 100 100 100 100 100 100 100 100 
100 100 100 100 100 100 100 100 100 100 100 100 100 100 
##$AQSEQ= 0
##$AQ_mod= 1
##$AUNM= <au_zg>
##$AUTOPOS= <>
##$BF1= 81.014009
##$BF2= 200.13
##$BF3= 200.13
##$BF4= 200.13
##$BF5= 200.13
##$BF6= 200.13
##$BF7= 200.13
##$BF8= 200.13
##$BYTORDA= 1
##$CFDGTYP= 0
##$CFRGTYP= 5
##$CHEMSTR= <none>
##$CNST= (0..31)
1 1 145 1 1 1 1 1 1 1 1 1 1 1 1 1 1 1 1 1 1 1 1 1 1 1 1 1 1 1 1 1 
##$CPDPRG= <waltz16>
##$CPDPRG1= <>
##$CPDPRG2= <waltz16>
##$CPDPRG3= <>
##$CPDPRG4= <mlev>
##$CPDPRG5= <mlev>
##$CPDPRG6= <mlev>
##$CPDPRG7= <mlev>
##$CPDPRG8= <mlev>
##$CPDPRGB= <>
##$CPDPRGT= <>
##$D= (0..31)
0 1 0 0 0 0 0 0 0 0 0 0.03 2e-05 3e-06 0 0 0 0 0 0 0 0 0 0 0 0 0 0 0 0 
0 0 
##$DATE= 1563793456
##$DBL= (0..7)
120 120 120 11 120 120 24 19 
##$DBP= (0..7)
150 150 150 150 150 150 150 150 
##$DBP07= 0
##$DBPNAM0= <>
##$DBPNAM1= <>
##$DBPNAM2= <>
$$ [...]
##$SUBNAM3= <"">
##$SUBNAM4= <"">
##$SUBNAM5= <"">
##$SUBNAM6= <"">
##$SUBNAM7= <"">
##$SUBNAM8= <"">
##$SUBNAM9= <"">
##$SW= 501.771253377433
##$SWIBOX= (0..15)
0 1 3 0 0 0 0 0 0 0 0 0 0 0 0 0 
##$SW_h= 40650.406504065
##$TD= 32768
##$TD0= 1
##$TE= 0
##$TE2= 300
##$TE3= 300
##$TEG= 300
##$TL= (0..7)
0 120 53 12 22 120 120 120 
##$TP= (0..7)
150 150 150 150 150 150 150 150 
##$TP07= 0
##$TPNAME0= <>
##$TPNAME1= <>
##$TPNAME2= <>
##$TPNAME3= <>
##$TPNAME4= <>
##$TPNAME5= <>
##$TPNAME6= <>
##$TPNAME7= <>
##$TPOAL= (0..7)
0.5 0.5 0.5 0.5 0.5 0.5 0.5 0.5 
##$TPOFFS= (0..7)
0 0 0 0 0 0 0 0 
##$TUNHIN= 0
##$TUNHOUT= 0
##$TUNXOUT= 0
##$USERA1= <user>
##$USERA2= <user>
##$USERA3= <user>
##$USERA4= <user>
##$USERA5= <user>
##$V9= 5
##$VALIST= <valist>
##$VCLIST= <CCCCCCCCCCCCCCC>
##$VD= 0
##$VDLIST= <DDDDDDDDDDDDDDD>
##$VPLIST= <PPPPPPPPPPPPPPP>
##$VTLIST= <TTTTTTTTTTTTTTT>
##$WBST= 1024
##$WBSW= 4
##$XGAIN= (0..3)
0 0 0 0 
##$XL= 0
##$YL= 0
##$YMAX_a= 35073
##$YMIN_a= -40995
##$ZGOPTNS= <>
##$ZL1= 120
##$ZL2= 120
##$ZL3= 120
##$ZL4= 120
##$ABSF1= 248.5645
##$ABSF2= -253.2056
##$ABSG= 5
##$ABSL= 3
##$ALPHA= 0
##$AQORDER= 0
##$ASSFAC= 0
##$ASSFACI= 0
##$ASSFACX= 0
##$ASSWID= 0
##$AUNMP= <proc_1d>
##$AZFE= 0.1
##$AZFW= 0.5
##$BCFW= 0
##$BC_mod= 2
##$BYTORDP= 0
##$COROFFS= 0
##$CY= -3
##$DATMOD= 1
##$DC= 0
##$DFILT= <>
##$DTYPP= 0
##$F1P= 0
##$F2P= 0
##$FCOR= 1
##$FTSIZE= 65536
##$FT_mod= 6
##$GAMMA= 0
##$GB= 0
##$INTBC= 1
##$INTSCL= 5.30512e-09
##$ISEN= 30
##$LB= 1
##$LEV0= 0
##$LPBIN= 0
##$MAXI= 10000
##$MC2= 0
##$MEAN= 0
##$ME_mod= 0
##$MI= 50
##$NCOEF= 0
##$NC_proc= -4
##$NLEV= 6
##$NOISF1= 182.463
##$NOISF2= 159.3651
##$NSP= 0
##$NTH_PI= 0
##$NZP= 0
##$OFFSET= 248.5645
##$PC= 4
##$PHC0= -2721.979
##$PHC1= 98.5992
##$PH_mod= 1
##$PKNL= yes
##$PPARMOD= 0
##$PSCAL= 0
##$PSIGN= 0
##$REVERSE= no
##$SF= 81.0140089999434
##$SI= 65536
##$SIGF1= 159.3651
##$SIGF2= -187.1042
##$SINO= 113.3802
##$SIOLD= 16384
##$SREGLST= <1H.CDCl3>
##$SSB= 0
##$STSI= 65536
##$STSR= 0
##$SW_p= 40650.406504065
##$SYMM= 0
##$S_DEV= 0
##$TDeff= 32768
##$TDoff= 0
##$TI= <>
##$TILT= no
##$TM1= 0
##$TM2= 0
##$TOPLEV= 0
##$USERP1= <user>
##$USERP2= <user>
##$USERP3= <user>
##$USERP4= <user>
##$USERP5= <user>
##$WDW= 1
##$XDIM= 65536
##$YMAX_p= 397453164
##$YMIN_p= -209977013
$$ End of Bruker specific parameters
$$ ---------------------------------
##NTUPLES= NMR SPECTRUM
##VAR_NAME=  FREQUENCY,     SPECTRUM/REAL,   SPECTRUM/IMAG
##SYMBOL=    X,             R,               I
##VAR_TYPE=  INDEPENDENT,   DEPENDENT,       DEPENDENT
##VAR_FORM=  AFFN,          ASDF,            ASDF
##VAR_DIM=   65536,         65536,           65536
##UNITS=     HZ,            ARBITRARY UNITS, ARBITRARY UNITS
##FACTOR=    0.620285442955139, 1,           1
##FIRST=     20137.2065510618, 0,            0
##LAST=      -20513.1999530032, 0,           0
##MIN=       -20513.1999530032, -209977013,  0
##MAX=       20137.2065510618, 397453164,    0
$$ Real data points
##PAGE= N=1
##DATA TABLE= (X++(R..R)), XYDATA
$$ [...]
$$ plain form
40137 -209538 -303850 -338904 -52458 471776 809423 651174 153603 -243030 -336378 -410670
40127 -410670 -869338 -1645143 -2127562 -1777203 -755466 151146 250281 -415116 -1122915 -1191592
40117 -1191592 -683523 -329584 -677193 -1423140 -1775117 -1402185 -758204 -433963 -475714 -502491
40107 -502491 -292440 -14312 84398 38603 120564 443663 714895 555303 78524 -124428
40097 -124428 245617 719872 674660 192667 -123727 -51870 73603 65183 178422 543028
40087 543028 819270 702513 375671 168589 93538 15224 6940 218001 556385 757574
40077 757574 657406 259129 -298224 -725794 -761411 -491208 -271164 -212773 -12997 547383
40067 547383 1196495 1459260 1163709 517085 -136845 -529436 -629316 -670761 -842434 -970715
$$ packed form
40137b09538r4312l5054K86446N24234L37647j58249m97571l96633r3348p4292
40127d10670m58668p75805m82419L50359J021737R06612R9135o65397p07799o8677
40117a191592N08069L53939l47609p45947l51977L72932O43981L24241m1751k6777
40107e02491K10051K78128R8710m5795Q1961L23099K71232j59592m76779k02952
40097a24428L70045M74255m5212m81993l16394P1857J25473q420J13239L64606
40087E43028K76242j16757l26842k07082p5051p8314q284K11061L38384K01189
40077G57574j00168l98277n57353m27570l5617K70203K20044N8391J99776N60380
40067E47383O49112K62765k95551o46624o53930l92591r9880m1445j71673j28281
$$ plain form
40057 -970715 -780297 -410589 -288576 -495970 -684214 -625044 -389136 4293 558120 916442
40047 916442 689930 241929 376804 1063200 1342154 846697 458865 865734 1378828 1043990
40037 1043990 197823 -97170 293020 509533 71696 -590152 -891412 -656807 -17953
40028 -17953 634000 747725 246999 -157699 114215 597559 477808 -128031 -421409 -196068
40018 -196068 68461 234391 611559 1015347 745045 -253658 -1073655 -1020384 -413726 46642
40008 46642 86594 -191705 -550234 -601885 -135403 411681 417745 76632 175924 774335 1024048
39997 1024048 599356 305970 725508 1189951 888341 232819 171026 649538 773332 247554
39987 247554 -299056 -381365 -180391 99639 608963 1312482 1699981 1436731 905117 705125
$$ packed form
40057i70715J90418L69708J22013k07394j88244N9170K35908L93429N53827L58322
40047I16442k26512m48001J34875O86396K78954m95457l87832M06869N13094l34838
40037A043990q46167k94993L90190K16513m37837o61848l01260K34605O38854
40028a7953O51953J13725n00726m04698K71914M83344j19751o05839k93378K25341
40018a96068K64529J65930L77168M03788k70302r98703q19997N3271O06658M60368
40008D6642L9952k78299l58529n1651M66482N47084O064l41113R9292N98411K49713
39997A024048m24692k93386M19538M64443l01610o55522o1793M78512J23794n25778
39987B47554n46610q2309K00974K80030N09324P03519L87499k63250n31614j99992
$$ plain form
39977 705125 859009 876660 483973 -53812 -323664 -194995 208686 717012 1116314 1121394
39967 1121394 620502 -71596 -454702 -390411 -209371 -243891 -501154 -839855 -1129645 -1111289
39957 -1111289 -515176 399966 817771 282847 -645094 -1086269 -914121 -647374 -539989
39948 -539989 -399382 -177786 -94036 -164709 -195925 -264069 -631048 -1140668 -1299787 -1053105
39938 -1053105 -865284 -890701 -712268 -160094 246631 62197 -413171 -667312 -746867 -1012907
39928 -1012907 -1460522 -1785633 -1920456 -2028621 -2077708 -1851002 -1380726 -1018617 -996223 -1142688
39918 -1142688 -1139142 -924018 -734643 -781338 -1004941 -1240445 -1492924 -1794867 -1842385 -1221927
39908 -1221927 -171196 377260 -98534 -972610 -1312354 -1044487 -678280 -288374 375974
$$ packed form
39977G05125J53884J7651l92687n37785k69852J28669M03681N08326L99302N080
39967A121394n00892o92098l83106O4291J81040l4520k57263l38701k89790J8356
39957a111289N96113R15142M17805n34924r27941m41175J72148K66747J07385
39948e39989J40607K21596Q3750p0673l1216o8144l66979n09620j59119K46682
39938a053105J87821k5417J78433N52174M06725j84434m75368k54141p9555k66040
39928a012907m47615l25111j34823j08165m9087K26706M70276L62109K2394j46465
39918a142688L546K15124J89375m6695k23603k35504k52479l01943m7518O20458
39908a221927J050731N48456m75794q74076l39744K67867L66207L89906O64348
$$ plain form
39899 375974 1008695 955871 313448 -113870 -63874 -111742 -524813 -780851 -579126 -410924
39889 -410924 -630747 -791527 -478889 -51686 78848 192434 555954 628368 -153946 -1245044
39879 -1245044 -1553108 -915823 -210725 -103217 -394281 -588546 -497894 -223108 22527 42224
39869 42224 -98372 -62392 252168 436454 157256 -249458 -227041 167070 366683 117094
39859 117094 -266661 -395223 -168506 285306 677632 640167 79184 -588717 -816733 -486271
39849 -486271 85150 530128 645793 449076 225098 280052 478315 364621 -67593 -202795
39839 -202795 282959 844420 861873 531411 388113 368730 41171 -534232 -910432 -1048543
39829 -1048543 -1283613 -1564833 -1427811 -777540 -102880 196379 216512 195748 172790 104174
$$ packed form
39899C75974O32721n2824o42423m27318M9996m7868m13071k56038K01725J68202
39889d10924k19823j60780L12638M27203J30534J13586L63520P2414p82314j091098
39879a245044l08064O37285P05098J07508k91064j94265R0652K74786K45635J9697
39869D2224j40596L5980L14560J84286k79198m06714K2417L94111J99613k49589
39859A17094l83755j28562K26717M53812L92326l7465n60983o67901k28016L30462
39849d86271N71421M44978J15665j96717k23978N4954J98263j13694m32214j35202
39839b02795M85754N61461J7453l30462j43298j9383l27559n75403l76200j38111
39829a048543k35070k81220J37022O50271O74660K99259K0133k0764k2958o8616
$$ plain form
39819 104174 19533 -2126 149901 505574 773474 528199 -104500 -386334 685 369167
39809 369167 84983 -297928 173695 1274650 1843737 1512488 1132680 1321901 1573153
39800 1573153 1206485 425824 -70604 -10729 346889 660364 738147 591564 423738 342716
39790 342716 125857 -379237 -761856 -494585 224393 702947 752828 727326 622988 69673
39780 69673 -658248 -644857 268346 1034103 886359 404061 433950 773393 770979 580058
39770 580058 832487 1466288 1829072 1712507 1401958 871684 -145454 -1302030 -1758732
39761 -1758732 -1340787 -793731 -628578 -442428 199362 831802 665761 -213731 -841227
39752 -841227 -540455 348461 1003761 1047557 737530 446579 269994 175381 255480 598169
$$ packed form
39819A04174q4641k1659J52027L55673K67900k45275o32699k81834L87019L68482
39809C69167k84184l82911M71623J100955N69087l31249l79808J89221K51252
39800A573153l66668p80661m96428N9875L57618L13475P7783j46583j67826q1022
39790C42716k16859n05094l82619K67271P18978M78554M9881k5502j04338n53315
39780F9673p27921J3391R13203P65757j47744m82298K9889L39443k414j90921
39770E80058K52429O33801L62784j16565l10549n30274j017138j156576m56702
39761a758732M17945N47056J65153J86150O41790O32440j66041q79492o27496
39752h41227L00772Q88916O55300M3796l10027k90951j76585r4613Q0099L42689
$$ plain form
39742 598169 1018869 1184544 1000599 651330 258952 -227288 -754089 -1075103 -1059170 -816792
39732 -816792 -403485 268498 1028701 1338601 938367 321270 152042 425732 658102 734020
39722 734020 987284 1443289 1591726 1128475 453260 136262 240985 473263 688386 898633
39712 898633 1021007 998179 987665 1044015 804680 -3279 -854383 -856870 19197 793131
39702 793131 802100 521773 621712 856394 626519 161558 185444 601027 552959 -109049
39692 -109049 -468931 10478 650487 722060 561406 735144 833404 128458 -992801 -1359162
39682 -1359162 -669952 175643 464315 466208 635065 841207 793735 611367 542438 527589
39672 527589 386389 128610 -160431 -451020 -622389 -504949 -195648 16415 122928 357245
$$ packed form
39742E98169M20700J65675j83945l49269l92378m86240n26801l21014J5933K42378
39732h16792M13307O71983P60203L09900m00234o17097j69228K73690K32370P5918
39722G34020K53264M56005J48437m63251o75215l16998J04723K32278K15123K10247
39712H98633J22374k2828j0514N6350k39335q07959q51104k487Q76067P73934
39702G93131Q969k80327R9939K34682k29875m64961K3886M15583m8068o62008
39692a09049l59882M79409O40009P1573j60654J73738R8260p04946j121259l66361
39682a359162O89210Q45595K88672J893J68857K06142m7472j82368o8929j4849
39672E27589j41200k57779k89041k90589j71369J17440L09301K12063J06513K34317
$$ plain form
39662 357245 578168 260858 -611590 -1200356 -832710 9182 259547 -370381 -1112495 -1174116
39652 -1174116 -612277 -76394 38464 -15528 243751 845234 1261745 1059873 450922 -27254
39642 -27254 -178679 -141365 121072 793241 1665741 2154076 2002484 1537915 1123000 821693
39632 821693 696671 860873 1028994 625274 -322747 -952198 -643396 157718 645453 716571
39622 716571 799603 1024642 1180153 1261713 1485220 1852889 2131833 2152243 1824952 1114666
39612 1114666 337374 148860 778253 1565082 1746577 1419855 1197949 1219109 1146658 936784
39602 936784 892941 1029425 1037056 860201 711099 565152 273626 115602 498577 1066087
39592 1066087 902494 -146996 -1083390 -1017342 -229720 375869 345652 -153525 -731758 -945040
$$ packed form
39662C57245K20923l17310q72448n88766L67646Q41892K50365o29928p42114o1621
39652a174116N61839N35883J14858n3992K59279O01483M16511k01872o08951m78176
39642b7254j51425L7314K62437O72169Q72500M88335j51592m64569m14915l01307
39632H21693j25022J64202J68121m03720r48021o29451L08802Q01114M87735P1118
39622G16571Q3032K25039J55511Q1560K23507L67669K78944K0410l27291p10286
39612A114666p77292j88514O29393P86829J81495l26722k21906K1160p2451k09874
39602I36784m3843J36484P631j76855j49102j45947k91526j58024L82975N67510
39592A066087j63593j049490r36394O6048P87622O05589l0217m99177n78233k13282
$$ plain form
39582 -945040 -495261 336142 807498 611765 286518 413605 848068 1143717 1288068 1476683
39572 1476683 1531276 1178360 680525 548939 733540 705384 311574 -44038 -124011 -192775
39562 -192775 -471922 -746353 -742004 -526511 -314966 -181707 -161123 -345890 -666252 -810420
39552 -810420 -579488 -131674 291015 649116 922752 898420 449300 -112055 -278060 85541
39542 85541 639303 991755 1005250 734424 326488 19659 12137 232013 377676 270648
39532 270648 67454 49163 267839 464302 329677 -137802 -529346 -378592 293561 897604
39522 897604 897285 429477 103130 243490 602072 827224 915336 1046655 1192487 1093534
39512 1093534 560458 -297711 -1072637 -1280460 -771665 17497 415094 207795 -196361
$$ packed form
39582i45040M49779Q31403M71356j95733l25247J27087M34463K95649J44351J88615
39572A476683N4593l52916m97835j31586J84601k8156l93810l55612p9973o8764
39562a92775k79147k74431M349K15493K11545J33259K0584j84767l20362j44168
39552h10420K30932M47814M22689L58101K73636k4332m49120n61355j66005L63601
39542H5541N53762L52452J3495k70826m07936l06829p522K19876J45663j07028
39532B70648k03194j8291K18676J96463j34625m67479l91544J50754O72153O04043
39522H97604l19m67808l26347J40360L58582K25152Q8112J31319J45832r8953
39512A093534n33076q58169p74926k07823N08795P89162L97597k07299m04156
$$ plain form
39503 -196361 -362049 -306802 -227981 -57085 384429 942790 1194674 944541 428523 25530
39493 25530 -71787 64678 198353 138902 -55168 -171387 -194506 -362735 -751205 -1047832
39483 -1047832 -955598 -594958 -276724 -115500 -125069 -407414 -901705 -1232451 -1218875 -1235439
39473 -1235439 -1560798 -1693476 -1020773 36856 407067 -103685 -557936 -369358 -129789
39464 -129789 -498172 -1062210 -1005588 -381117 41904 -65248 -274760 -159227 196883 471394
39454 471394 494797 328556 214023 418547 924428 1340762 1299647 829851 201084 -396184
39444 -396184 -824289 -898231 -596945 -208566 -13463 24586 59923 101628 186767 514194
39434 514194 1054545 1299557 842413 25836 -441640 -381543 -192050 -111608 21815 266072
$$ packed form
39503a96361j65688N5247P8821J70896M41514N58361K51884k50133n16018m02993
39493B5530r7317J36465J33675n9451j94070j16219k3119j68229l88470k96627
39483a047832R2234L60640L18234J61224r569k82345m94291l30746J3576j6564
39473a235439l25359j32678O72703J057629L70211n10752m54251J88578K39569
39464a29789l68383n64038N6622O24471M23021j07152k09512J15533L56110K74511
39454D71394K3403j66241j14533K04524N05881M16334m1115m69796o28767n97268
39444c96184m28105p3942L01286L88379J95103L8049L5337M1705Q5139L27427
39434E14194N40351K45012m57144q16577m67476O0097J89493Q0442J33423K44257
$$ plain form
39424 266072 371808 227880 64024 35995 14538 -7681 288232 1015548 1661388 1621974
39414 1621974 1018636 575163 698678 1059497 1187021 1142401 1328685 1809496 2150934 1956206
39404 1956206 1297969 541125 -32826 -295755 -200152 134219 407586 452103 452451 634460
39394 634460 862970 819464 466447 33146 -358151 -717464 -938188 -899451 -735831 -609678
39384 -609678 -331565 305812 934910 976612 558652 362278 511690 434430 -2595 -146272
39374 -146272 266495 526199 157152 -178408 182715 627760 184570 -808024 -1124730 -521996
39364 -521996 -14238 -240775 -630939 -488323 -34490 86790 -224596 -502681 -364909 94561
39354 94561 416043 225857 -285763 -479670 -76899 433771 539536 442750 494213 342423
$$ packed form
39424B66072J05736j43928j63856k8029k1457k2219K95913P27316O45840l9414
39414A621974o03338m43473J23515L60819J27524m4620J86284M80811L41438j94728
39404A956206o58237p56844n73951k62929R5603L34371K73367M4517L48J82009
39394F34460K28510m3506l53017m33301l91297l59313k20724L8737J63620J26153
39384f09678K78113O37377O29098M1702m17960j96374J49412p7260m37025j43677
39374a46272M12767K59704l69047l35560L61123M45045m43190r92594l16706O02734
39364e21996N07758k26537l90164J42616M53833J21280l11386k78085J37772M59470
39354I4561L21482j90186n11620j93907M02771N10670J05765r6786N1463j51790
$$ plain form
39344 342423 -469253 -1338363 -1161710 -109817 329354 -534028 -1519679 -1297886 -262900
39335 -262900 268672 102091 223943 980252 1404364 759387 -159353 -46094 1027809
39326 1027809 1663549 1091985 170620 -32836 157503 -214405 -851875 -423282 1214101
39317 1214101 2387374 1873974 647701 379218 1101747 1575275 1318923 907873 596269
39308 596269 64977 -505773 -447390 151033 375510 -122143 -735649 -1082048 -1448032 -1823880
39298 -1823880 -1666592 -991837 -553410 -515122 -144920 644911 762571 -259237 -1174374
39289 -1174374 -811653 100631 143299 -596987 -925982 -587392 -459333 -890113 -1169675 -787562
39279 -787562 -163978 123464 64761 -66835 -145235 -141524 -32817 145185 372659 655926
$$ packed form
39344C42423q11676q69110J76653J051893M39171q63382r85651K21793J034986
39335b62900N31572j66581J21852P56309M24112o44977r18740J13259J073903
39326A027809O35740n71564r21365k03456J90339l71908o37470M28593J637383
39317A214101J173273n13400j226273k68483P22529M73528k56352m11050l11604
39308E96269n31292n70750N8383N98423K24477m97653o13506l46399l65984l75848
39298a823880J57288O74755M38427L8288L70202P89831J17660j021808r15137
39289a174374L62721R12284M2668p40286l28995L38590J28059m30780k79562L82113
39279g87562O23584K87442n8703j31596p8400L711J08707J78002K27474K83267
$$ plain form
39269 655926 795911 504436 18947 80322 851067 1425421 1038824 223863 139 387530
39259 387530 601869 363576 71338 -80234 -215402 -187525 189918 468747 93785 -506368
39249 -506368 -410917 235572 319600 -417470 -848267 -187406 820688 1069891 581307 115222
39239 115222 -24728 -45371 1436 195277 305171 -19430 -703898 -1281156 -1379832 -965919
39229 -965919 -287670 244789 352679 196573 149929 241597 206423 99120 287576 679270
39219 679270 594550 -242085 -1153541 -1401860 -1150642 -1038392 -1202637 -1298424 -1197282 -1073374
39209 -1073374 -939250 -636311 -249594 -84111 -206196 -349999 -309423 -161044 -69671 -58519
39199 -58519 -403 230034 550400 656633 422455 255758 652370 1346853 1465924 784072
$$ packed form
39269F55926J39985k91475m85489O1375P70745N74354l86597q14961k23724L87391
39259C87530K14339k38293k92238j51572j35168K7877L77443K78829l74962o00153
39249e06368R5451O46489Q4028p37070m30797O60861J008094K49203m88584m66085
39239A15222j39950k0643M6807J93841J09894l24601o84468n77258r8676M13913
39229i65919O78249N32459J07890j56106m6644R1668l5174j07303J88456L91694
39219F79270q4720q36635r11456k48319K51218J12250j64245r5787J01142J23908
39209a073374J34124L02939L86717J65483j22085j43803M0576J48379R1373J1152
39199e8519N8116K30437L20366J06233k34178j66697L96612O94483J19071o81852
$$ plain form
39189 784072 228909 644793 1571498 1940108 1618271 1414172 1656426 1678617 936347 -108473
39179 -108473 -634021 -484086 -99226 245546 671722 1290019 1909975 2159247 1766667 845629
39169 845629 591 -75852 662685 1455065 1554822 1065119 666724 666517 750028 675195 686204
39158 686204 967700 1111261 621378 -216040 -517095 67164 854996 993039 465446 -55558
39148 -55558 -118503 106266 207641 -27540 -507612 -866880 -640732 282056 1384542 1984728
39138 1984728 1949720 1637472 1215552 548652 -175058 -338692 240206 875425 943731 814817
39128 814817 1187057 1796119 1659635 640822 -132642 187060 919801 803045 -255482
39119 -255482 -1141710 -1111225 -623838 -447269 -594505 -565134 -218383 112941 216102 234112
$$ packed form
39189G84072n55163M15884R26705L68610l21837k04099K42254K2191p42270j044820
39179a08473n25548J49935L84860L44772M26176O18297O19956K49272l92580r21038
39169H45629q45038p6443P38537P92380R9757m89703l98395k07Q3511p4833J1009
39158F86204K81496J43561m89883q37418l01055N84259P87832J38043n27593n21004
39148e5558o2945K24769J01375k35181m80072l59268K26148R22788J102486O00186
39138A984728l5008l12248m21920o66900p23710j63634N78898O35219O8306j28914
39128H14817L72240O09062j36484j018813p73464L19702P32741j16756j058527
39119b55482q86228L0485M87387J76569j47236K9371L46751L31324J03161J8010
$$ plain form
39109 234112 295815 283983 91743 -137809 -173011 45404 401719 740121 902398 735886
39099 735886 216143 -415770 -722635 -398888 377156 977934 901388 335981 -74524 -86420
39089 -86420 -130622 -539362 -929441 -791353 -329127 -93445 -28708 336213 837722 730852
39079 730852 -52725 -619855 -440666 -65504 -12412 149417 847788 1460288 1218944 556182
39069 556182 435137 763561 682855 189713 157228 732890 1037902 713003 492923 782757
39059 782757 870243 245027 -364549 -152205 433089 503786 215594 355508 886743 1015171
39049 1015171 529830 44708 -106627 -283827 -680631 -864368 -499985 51263 212449
39040 212449 -92767 -455927 -459970 -11618 559318 693610 180829 -449558 -458402 155016
$$ packed form
39109B34112O1703j1832j92240k29552l5202K18415L56315L38402J62277j66512
39099G35886n19743o31913l06865L23747P76044O00778p6546n65407m10505j1896
39089h6420m4202m08740l90079J38088M62226K35682O4737L64921N01509j06870
39079G30852p83577n67130J79189L75162N3092J61829O98371O12500k41344o62762
39069E56182j21045L28424q0706m93142l2485N75662L05012l24899k20080K89834
39059G82757Q7486o25216o09576K12344N85294P0697k88192J39914N31235J28428
39049A015171m85341m85122j51335j77200l96804j83737L64383N51248J61186
39040B12449l05216l63160m043M48352N70936J34292n12781o30387q844O13418
$$ plain form
39030 155016 624180 426054 -84471 -252062 3712 183812 -89510 -621501 -859679 -444733
39020 -444733 426944 1173829 1417881 1352354 1416984 1706330 1893352 1667172 1023379 181137
39010 181137 -543813 -852052 -737465 -600617 -764111 -936119 -575020 213082 658373 360212
39000 360212 -175980 -312561 -106463 48612 183731 579292 1059571 1102549 654273 279011
38990 279011 365140 633395 645650 447295 427467 754968 1210516 1476685 1415084 1121474
38980 1121474 822137 668241 600006 497294 415156 465314 515066 361999 259329 775694
38970 775694 1849929 2472714 1847052 548935 -134596 120491 426673 170568 -106061
38961 -106061 266815 885585 820117 19705 -575473 -294672 491426 973628 839068 437512
$$ packed form
39030A55016M69164j98126n10525j67591K55774J80100k73322n31991k38178M14946
39020d44733Q71677P46885K44052o5527O4630K89346J87022k26180o43793q42242
39010A81137p24950l08239J14587J36848j63494j72008L61099P88102M45291k98161
39000C60212n36192j36581K06098J55075J35119L95561M80279M2978m48276l75262
38990B79011Q6129K68255J2255j98355j9828L27501M55548K66169o1601k93610
38980A121474k99337j53896o8235j02712q2138N0158M9752j53067j02670N16365
38970G75694J074235O22785o25662j298117o83531K55087L06182k56105k76629
38961a06061L72876O18770o5468q00412n95178K80801P86098M82202j34560m01556
$$ plain form
38951 437512 316132 740989 1482756 1995755 1983212 1791449 1995051 2559310 2745222 2039152
38941 2039152 921061 385969 758765 1294877 1085929 151939 -639788 -693156 -335232
38932 -335232 -145239 -21932 543299 1426927 1839472 1514403 1236480 1736456 2608519 2925624
38922 2925624 2543168 2116812 2051488 2117668 2037079 1844639 1681497 1721648 2199828 2984468
38912 2984468 3307670 2612990 1553966 1326899 1991964 2359484 1743448 902776 812000
38903 812000 1317463 1623583 1494601 1295816 1230795 1157009 962214 688494 426423 322096
38893 322096 462875 639807 575026 431810 579493 810204 512889 -225453 -566255 -255873
38883 -255873 -13587 -112699 277465 1529887 2503183 2250700 1816588 2783490 4635270
$$ packed form
38951D37512j21380M24857P41767N12999j2543j91763K03602N64259J85912p06070
38941B039152j118091n35092L72796N36112k08948r33990p91727n3368L57924
38932c35232J89993J23307N65231Q83628M12545l25069k77923M99976Q72063L17105
38922B925624l82456m26356o5324O6180q0589j92440j63142M0151M78180P84640
38912B984468L23202o94680j059024k27067O65065L67520o16036q40672r0776
38903H12000N05463L06120j28982j98785o5021p3786j94795k73720k62071j04327
38893C22096J40779J76932o4781j43216J47683K30711k97315p38342l40802L10382
38883b55873K42286r9112L90164J252422R73296k52483m34112R66902J851780
$$ plain form
38874 4635270 5279732 4017701 2317408 1490961 1187641 639997 -23244 -435248 -839560
38865 -839560 -1449490 -1773974 -1382030 -749329 -627929 -1006927 -1302285 -1224677 -940272 -663858
38855 -663858 -531866 -636495 -844693 -818896 -479909 -198431 -306333 -647583 -761580 -313735
38845 -313735 635955 1497091 1430986 259751 -1049271 -1421970 -1034030 -845931 -979500
38836 -979500 -690645 -9707 -35970 -1108458 -1988242 -1660177 -804733 -505600 -540723 -160403
38826 -160403 295576 -31244 -868838 -1162225 -796169 -621197 -884541 -956475 -648363 -508531
38816 -508531 -607521 -269150 604692 1062939 501442 -392390 -680383 -393451 -107493 58041
38806 58041 374461 869607 1295992 1434199 1104231 260626 -656150 -943505 -518620 -78400
$$ packed form
38874D635270O44462j262031j700293q26447l03320n47644o63241m12004m04312
38865h39560o09930l24484L91944O32701J21400l78998k95358P7608K84405K76414
38855f63858J31992j04629k08198K5797L38987K81478j07902l41250j13997M47845
38845c13735R49690Q61136o6105j171235j309022l72699L87940J88099j33569
38836i79500K88855O80938k6263j072488q79784L28065Q55444K99133l5123L80320
38826a60403M55979l26820q37594k93387L66056J74972k63344p1934L08112J39832
38816e08531r8990L38371Q73842M58247n61497q93832k87993K86932K85958J65534
38806E8041L16420M95146M26385J38207l29968q43605r16776k87355M24885M40220
$$ plain form
38796 -78400 -73207 -103737 260448 690745 692642 443828 387492 444872 341872 332020 794409
38785 794409 1369970 1346008 794392 483314 630890 584213 -68393 -828217 -1061658 -815598
38775 -815598 -458921 -38305 521371 941976 836735 271255 -312965 -642669 -787876 -892162
38765 -892162 -1001698 -1115306 -1198848 -1177592 -1024347 -772806 -394517 138373 588082 561437
38755 561437 103002 -143278 270700 882121 858976 134731 -508306 -505651 -151744 -13604
38745 -13604 -154214 -242580 -134582 11061 62444 56225 33348 -48379 -188303 -230715 39898
38734 39898 613777 1043836 728427 -337510 -1250773 -1079958 -58398 624901 387110
38725 387110 17582 474324 1432197 1697874 827657 -378789 -995429 -950873 -748008 -725651
$$ packed form
38796g8400N193l0530L64185M30297J897k48814n6336N7380j03000r852M62389
38785G94409N75561k3962n51616l11078J47576m6677o52606p59824k33441K46060
38775h15598L56677M20616N59676M20605j05241n65480n84220l29704j45207j04286
38765h92162j09536j13608q3542K1256J53245K51541L78289N32890M49709k6645
38755E61437m58435k46280M13978O11421k3145p24245o43037K655L53907J38140
38745a3604j40610q8366J07998J45643N1383o219k2877q1727j39924m2412K70613
38734C9898N73879M30059l15409j065937r13263J70815J021560O83299k37791
38725C87110l69528M56742R57873K65677q70217j206446o16640M4556K02865K2357
$$ plain form
38715 -725651 -861775 -975481 -885140 -566215 -271441 -289332 -525333 -568566 -230388 234028
38705 234028 468177 295712 -334439 -1299325 -2122644 -2250103 -1669845 -928680 -414185 -265
38695 -265 467989 802669 826589 664624 404951 -88020 -691781 -832113 -239995 487894
38685 487894 614042 242510 46754 299862 761402 1284719 1852798 2121621 1640496 594598
38675 594598 -253152 -446182 -173345 260855 716742 929362 593525 -82816 -500780 -540876
38665 -540876 -699313 -1110108 -1127228 -346107 559364 653815 2247 -535882 -535202 -381013
38655 -381013 -503645 -833210 -1083844 -1119865 -917563 -500717 -38849 225774 237796 154707
38645 154707 106514 107906 197876 457911 848772 1180638 1292017 1183195 994808 921722
$$ packed form
38715g25651j36124j13706R0341L18925K94774j7891k36001m3233L38178M64416
38705B34028K34149j72465o30151r64886q23319j27459N80258P41165N14495M13920
38695b65M68254L34680K3920j61965k59673m92971o03761j40332N92118P27889
38685D87894J26148l71532j95756K53108M61540N23317N68079K68823m81125j045898
38675E94598q47750j93030K72837M34200M55887K12620l35837o76341m17964m0096
38665e40876j58437m10795j7120P81121R05471R4451o51568n38129O80J54189
38655c81013j22632l29565k50634l6021K02302M16846M61868K64623J2022q3089
38645A54707m8193J392Q9970K60035L90861L31866J11379j08822j88387p3086
$$ plain form
38635 921722 1070411 1304580 1319808 976476 466597 61234 -176275 -322969 -406392 -419380
38625 -419380 -374287 -231324 35761 217322 26364 -352817 -287913 386237 877777 383212
38615 383212 -755894 -1433846 -1152344 -404577 193338 472622 419265 34632 -353641 -278476
38605 -278476 171227 428385 382276 561613 1155248 1621031 1666714 1822693 2441069 2881157
38595 2881157 2510399 1905246 2067918 2847453 3210190 2891754 2669517 2953639 3201002
38586 3201002 3015571 2861734 3210419 3738027 3896213 3680473 3341349 2870158 2288346
38577 2288346 1983668 2212572 2619056 2739052 2653386 2656946 2607369 2147380 1342525 578880
38567 578880 7819 -431634 -635746 -496452 -289734 -385234 -663234 -704378 -458774 -228491
$$ packed form
38635I21722J48689K34169J5228l43332n09879m05363k37509j46694q3423j2988
38625d19380M5093J42963K67085J81561j90958l79181O4904O74150M91540m94565
38615C83212j139106o77952K81502P47767N97915K79284n3357l84633l88273P5165
38605b78476M49703K57158m6109J79337N93635M65783M5683J55979O18376M40088
38595B881157l70758o05153J62672P79535L62737l18436k22237K84122K47363
38586C201002j85431j53837L48685N27608J58186k15740l39124m71191n81812
38577B288346l04678K28904M06484J19996q5666L560m9577m59989q04855p63645
38567E78880n71061m39453k04112J39294K06718r5500k78000m1144K45604K30283
$$ plain form
38557 -228491 -84501 152045 409248 441791 415259 768897 1361914 1394175 473388 -743754
38547 -743754 -1317987 -1047351 -400459 215549 731129 1164199 1451453 1494649 1231008 747864
38537 747864 365035 397365 769343 1078370 1074850 834937 479936 85287 -117626 105733
38527 105733 547902 727559 601963 563728 587623 108058 -876128 -1350269 -629955 451220
38517 451220 588962 -150175 -545278 -130861 203859 -270789 -1001999 -1065349 -492831 -40508
38507 -40508 -36818 -108678 85827 388924 469392 296270 169820 391554 938659 1447021
38497 1447021 1568644 1337946 1073563 944050 820665 579693 333291 279425 484337 852686
38487 852686 1140346 1013248 368649 -367185 -587137 -247929 78065 33310 -64620 130814
$$ packed form
38557b28491J43990K36546K57203L2543k6532L53638N93017L2261r20787j217142
38547g43754n74233K70636O46892O16008N15580M33070K87254M3196k63641m83144
38537G47864l82829L2330L71978L09027l520k39913l55001l94649k02913K23359
38527A05733M42169J79657j25596l8235K3895m79565r84186m74141P20314J081175
38517D51220J37742p39137l95103M14417L34720m74648p31210o3350N72518M52323
38507d0508L690p1860J94505L03097Q0468j73122j26450K21734N47105N08362
38497A447021J21623k30698k64383j29513j23385k40972k46402n3866K04912L68349
38487H52686K87660j27098o44599p35834k19952L39208L25994m4755r7930J95434
$$ plain form
38477 130814 327818 59422 -483927 -681240 -426790 -236875 -371430 -454093 -178000 144212
38467 144212 96775 -159954 -152282 197887 538477 632266 561064 449787 327279 246879 254026
38456 254026 239653 76773 -143518 -283262 -472519 -881070 -1234282 -1044261 -397102 10345
38446 10345 -177498 -497019 -452547 -264702 -338334 -419396 19450 746339 878965 110293
38436 110293 -805185 -1022054 -569209 -38502 307104 689843 1224022 1562297 1262380 377981
38426 377981 -460163 -624449 -112147 521926 806252 708356 389614 12127 -91431 436273
38416 436273 1338003 1749013 1315827 818162 1053117 1589678 1484464 855853 678786 1164011
38406 1164011 1499271 1278115 1014390 974905 673031 -19012 -366925 8718 435074 393386
$$ packed form
38477A30814J97004k68396n43349j97313K54450J89915j34555q2663K76093L22212
38467A44212m7437k56729P672L50169L40590R3789p1202j11277j22508q0400P147
38456B54026j4373j62880k20291j39744j89257m08551l53212J90021O47159M07447
38446A0345j87843l19521M4472J87845p3632q1062M38846P26889J32626p68672
38436A10293r15478k16869M52845N30707L45606L82739N34179L38275k99917q84399
38426C77981q38144j64286N12302O34073K84326r7896l18742l77487j03558N27704
38416D36273R01730M11010m33186m97665K34955N36561j05214o28611j77067M85225
38406A164011L35260k21156k63725l9485l01874o92043l47913L75643M26356m1688
$$ plain form
38396 393386 422587 1008132 1540554 1365378 1008600 1246059 1685548 1468532 766416 327153
38386 327153 79955 -441804 -739033 39884 1319987 1544187 483908 -433029 -365346
38377 -365346 -109658 -419574 -724255 -312408 381510 581780 381455 300831 359798 383110
38367 383110 606192 1206762 1742990 1763113 1537149 1557137 1738556 1717957 1535635 1435484
38357 1435484 1355351 1166267 1070471 1260245 1539093 1731291 2026765 2433391 2409533 1678628
38347 1678628 941583 1026571 1669650 1934514 1636288 1538532 2163565 3126204 3763335 3886688
38337 3886688 3768981 3747972 3934624 4099784 3902896 3391646 3054792 3167161 3409408 3435130
38327 3435130 3409782 3553418 3562134 3071297 2380494 2071399 2129975 2115655 2026554 2261222
$$ packed form
38396C93386K9201N85545N32422j75176l56778K37459M39489k17016p02116m39263
38386C27153k47198n21759k97229P78917J280103K24200j060279r16937O7683
38377c65346K55688l09916l04681M11847O93918K00270k00325q0624N8967K3312
38367C83110K23082O00570N36228K0123k25964J9988J81419k0599j82322j00151
38357A435484q0133j89084r5796J89774K78848J92198K95474M06626k3858p30905
38347A678628p37045Q4988O43079K64864k98226r7756O25033R62639O37131J23353
38337C886688j17707k1009J86652J65160j96888n11250l36854J12369K42247K5722
38327C435130k5348J43636Q716m90837o90803l09095N8576j4320q9101K34668
$$ plain form
38317 2261222 2779819 3061103 2977621 2997385 3307241 3384777 2789177 1885298 1368712 1376150
38307 1376150 1460068 1297979 1080535 1164493 1538731 1779545 1556991 1068586 797790 892089
38297 892089 1052698 1057392 1032063 1092105 1117855 1082421 1186656 1430476 1516732 1475343 1821108
38286 1821108 2643613 3133561 2663837 1838845 1692611 2237315 2660466 2647927 2546330 2393901
38276 2393901 1860600 1195776 1171217 1812771 2144236 1618274 985616 1198716 2088828 2735922
38266 2735922 2724861 2448470 2372943 2470684 2368039 1856276 1251017 1158416 1706258 2223613
38256 2223613 2085576 1650408 1742656 2344481 2602687 2202261 1866421 2188168 2752846 2892335
38246 2892335 2679368 2641820 2957105 3411093 3774157 3821370 3375527 2708010 2491134 2979550
$$ packed form
38317B261222N18597K81284q3482J9764L09856P7536n95600r03879n16586P438
38307A376150Q3918j62089k17444Q3958L74238K40814k22554m88405k70796R4299
38297H92089J60609M694k5329O0042K5750l5434J04235K43820Q6256m1389L45765
38286A821108Q22505M89948m69724q24992j46234N44704M23151j2539j01597j52429
38276B393901n33301o64824k4559O41554L31465n25962o32658K13100Q90112O47094
38266B735922j1061k76391p5527R7741j02645n11763o05259r2601N47842N17355
38256B223613j38037m35168R2248O01825K58206m00426l35840L21747N64678J39489
38246B892335k12967l7548L15285M53988L63064M7213m45843o67517k16876M88416
$$ plain form
38236 2979550 3655303 4032688 4292074 4651142 4678542 3937792 2935880 2642047 3187878
38227 3187878 3725767 3569291 2904474 2328149 2175258 2410423 2806705 3095256 3162461 3157288
38217 3157288 3256054 3363947 3212832 2701190 2014259 1490812 1424261 1805152 2199116 2150138
38207 2150138 1783148 1652519 1891078 2004936 1756657 1674706 2202800 2829284 2722230 1949600
38197 1949600 1380432 1471597 1783036 1734539 1319687 942090 903886 1170911 1432842 1382984
38187 1382984 1069613 842074 827146 752413 509912 488845 948040 1455017 1496999 1318060
38177 1318060 1492499 1913467 1963691 1580663 1340968 1431775 1344357 826034 425469 707093
38167 707093 1444529 1995661 2115362 2042572 2033384 2095082 2040569 1665598 994826 341882
$$ packed form
38236B979550O75753L77385K59386L59068K7400p40750j001912k93833N45831
38227C187878N37889j56476o64817n76325j52891K35165L96282K88551O7205n173
38217C157288R8766J07893j51115n11642o86931n23447o6551L80891L93964m8978
38207B150138l66990j30629K38559J13858k48279q1951N28094O26484j07054p72630
38197A949600n69168R1165L11439m8497m14852l77597l8204K67025K61931m9858
38187A382984l13371k27539j4928p4733k42501k1067M59195N06977M1982j78939
38177A318060J74439M20968N0224l83028k39695R0807q7418n18323m00565K81624
38167G07093P37436N51132J19701p2790r188O1698n4513l74971o70772o52944
$$ plain form
38157 341882 -48082 -268304 -384468 -90240 740690 1440189 1285452 743264 1001887 2144034
38147 2144034 2858898 2361974 1512199 1333997 1442544 945087 131863 37461 737143 1327274
38137 1327274 1455647 1662044 2117153 2185778 1586274 997103 1009717 1256250 1125702 722918
38127 722918 544965 691334 955371 1314093 1778747 2052882 1863936 1431768 1157416 1037297
38117 1037297 805560 464197 249320 248969 458403 990164 1752946 2146047 1671552 742385
38107 742385 258666 411907 571073 409989 401408 907316 1440564 1310116 588893 1813
38097 1813 112016 903481 1862321 2232767 1597245 504297 78087 645087 1258160 1065784
38087 1065784 569320 757061 1448404 1519156 645525 -220185 -278755 135969 350264 338445
$$ packed form
38157C41882l89964k20222j16164K94228Q30930O99499j54737n42188K58623J142147
38147B144034P14864m96924q49775j78202J08547m97457q13224r4402O99682N90131
38137A327274J28373K06397M55109O8625n99504n89171J2614K46533j30548m02784
38127G22918j77953J46369K64037L58722M64654K74135j88946m32168k74352j20119
38117A037297k31737l41363k14877l51K09434N31761P62782L93101m74495r29167
38107G42385m83719J53241J59166j61084q581N05908N33248j30448p21223n87080
38097A813J10203P91465R58840L70446o35522j092948m26210N67000O13073j92376
38087A065784m96464J87741O91343P0752q73631q65710n8570M14724K14295j1819
$$ plain form
38077 338445 437574 663809 822121 900028 945519 892355 815911 987621 1396918 1644768
38067 1644768 1583745 1545232 1602126 1249565 349973 -254142 152657 931797 884770 -28271
38057 -28271 -730532 -639321 -211286 147209 630081 1198201 1221836 524871 -27791 309306
38047 309306 1012801 1046374 332043 -303351 -364429 -83938 264936 632961 739115 172589
38037 172589 -769169 -1040798 -125547 1123443 1456764 740238 -70483 -286981 -170522
38028 -170522 -204769 -330743 -250129 -46290 -20719 -125565 -41910 240139 377343 252800
38018 252800 170557 340586 573659 699564 895116 1272056 1490819 1254043 968846 1353785
38008 1353785 2383894 3132746 2814155 1613013 344497 -340655 -221007 606754 1680987
$$ packed form
38077C38445R9129K26235J58312P7907M5491n3164p6444J71710M09297K47850
38067A644768o1023l8513N6894l52561q99592o04115M06799P79140m7027r13041
38057b8271p02261R1211M28035L58495M82872N68120K3635o96965n52662L37097
38047C09306P03495L3573p14331o35394o1078K80491L48874L68025J06154n66526
38037A72589r41758k71629R15251J248990L33321p16526q10721k16498J16459
38028a70522l4247j25974Q0614K03839K5571j04846Q3655K82049J37204j24543
38018B52800q2243J70029K33073J25905J95552L76940K18763k36776k85197L84939
38008A353785J030109P48852l18591j201142j268516o85152J19648Q27761J074233
$$ plain form
37999 1680987 2218275 1694274 476132 -415203 -322831 412232 937824 868319 594060 656627
37989 656627 1052879 1323563 1215487 978155 927842 978500 853782 620657 658623 1053924
37979 1053924 1356491 1143965 600543 244377 200745 124055 -107560 -46547 645447 1451526
37969 1451526 1477577 688856 78582 302823 685380 185607 -970918 -1448429 -602859
37960 -602859 691792 1308818 1220192 1070987 1022799 757601 282699 -49206 -201537 -425169
37950 -425169 -584359 -202138 700008 1423164 1470257 1105525 816082 685273 580358 561246
37940 561246 766884 1144847 1530644 1778763 1694069 1156945 467797 190442 438220 694901
37930 694901 594100 456967 696496 1075546 1035106 509774 -60387 -376259 -503834 -554587
$$ packed form
37999A680987N37288n24001j218142q91335R2372P35063N25592o9505k74259O2567
37989F56627L96252K70684j08076k37332n0313N0658j24718k33125L7966L95301
37979A053924L02567k12526n43422l56166m3632p6690k31615O1013O91994Q06079
37969A451526K6051p88721o10274K24241L82557m99773j156525m77511Q45570
37960f02859J294651O17026q8626j49205m8188k65198m74902l31905j52331k23632
37950d25169j59190L82221R02146P23156M7093l64732k89443j30809j04915j9112
37940E61246K05638L77963L85797K48119q4694n37124o89148k77355K47778K56681
37930F94901j00801j37133K39529L79050m0440n25332n70161l15872j27575n0753
$$ plain form
37920 -554587 -526622 -404280 -142037 303138 682099 507774 -212824 -659006 -181730 692125
37910 692125 966093 671544 750030 1451708 1900385 1570449 1170479 1416623 1795732 1456876
37900 1456876 729740 678616 1406086 1888009 1549696 1023072 1043534 1415852 1539759 1341604
37890 1341604 1129486 935380 577725 184816 166325 689089 1460583 1977651 1851035 1098002
37880 1098002 303652 205041 840015 1416524 1367821 1154746 1476417 2030361 1881286 997799
37870 997799 489864 1017741 1782570 1671357 815353 291407 603453 1212652 1494673 1466982
37860 1466982 1427408 1419511 1342376 1269011 1372310 1663727 1961438 2045880 1810545 1372215
37850 1372215 1034462 1002175 1144414 1190650 1105907 1048174 1003888 795627 522869 648337
$$ packed form
37920e54587K7965J22342K62243M45175L78961j74325p20598m46182M77276Q73855
37910F92125K73968k94549P8486P01678M48677l29936l99970K46144L79109l38856
37900A456876p27136n1124P27470M81923l38313n26624K0462L72318J23907j98155
37890A341604k12118j94106l57655l92909j8491N22764P71494N17068j26616p53033
37880A098002p94350r8611O34974N76509m8703k13075L21671N53944j49075q83487
37870I97799n07935N27877P64829j11213q56004n23946L12046O09199K82021k7691
37860A466982l9574p897p7135p3365J03299K91417K97711Q4442k35335m38330
37850A372215l37753l2287J42239M6236q4743n7733m4286k08261k72758J25468
$$ plain form
37840 648337 1409880 2350171 2696096 2155050 1186467 543609 653515 1349977 2056439 2259810
37830 2259810 1939528 1564701 1625613 2157042 2710601 2760083 2167151 1331572 855989 957458
37820 957458 1245282 1210592 864508 667658 866525 1214265 1405221 1436041 1384378 1196768
37810 1196768 962199 1045506 1554759 1953993 1697872 1067005 802309 999710 1046606 735927
37800 735927 678389 1242150 1771442 1486488 693868 361972 747083 1221186 1394708 1608474
37790 1608474 2165143 2798967 3207469 3499192 3756815 3714538 3297586 2968606 3040309 3132484
37780 3132484 2900577 2807309 3368395 4003483 3657144 2484174 1845279 2412266 3290160
37771 3290160 3479659 3296800 3626663 4455457 5008878 4952338 4610646 4206194 3694480 3312270
$$ packed form
37840F48337P61543R40291L45925n41046r68583o42858J09906O96462P06462K03371
37830B259810l20282l74827O0912N31429N53559M9482n92932q35579m75583J01469
37820I57458K87824l4690l46084j96850J98867L47740J90956L0820n1663j87610
37810A196768k34569Q3307N09253L99234k56121o30867k64696J97401M6896l10679
37800G35927n7538N63761N29292k84954p92620l31896L85111M74103J73522K13766
37790A608474N56669O33824M08502K91723K57623m2277m16952l28980P1703R2175
37780C132484k31907r3268N61086O35088l46339j172970o38895N66987Q77894
37771C290160J89499j82859L29863Q28794N53421n6540l41692m04452n11714l82210
$$ plain form
37761 3312270 3522345 4278682 4956369 5183754 5224838 5366687 5458791 5337612 5242862 5433314
37751 5433314 5722799 5802038 5790367 6044368 6544741 6907830 6998616 7100521 7331759 7270872
37741 7270872 6493981 5309893 4582971 4783050 5477562 5864725 5599587 4971048 4472788
37732 4472788 4399091 4718518 5125608 5295905 5241059 5269452 5450391 5399384 4892359 4362014
37722 4362014 4276082 4296644 3781660 3017067 3048845 4088165 4982574 4765143 3974124 3753225
37712 3753225 4214137 4504027 4175469 3673439 3540720 3810527 4215350 4481621 4382347 3909834
37702 3909834 3411069 3231652 3286133 3271043 3154136 3108160 3114870 3008187 2787636 2560704
37692 2560704 2332314 2153714 2245249 2630173 2914018 2787023 2435159 2098731 1671667 1210839
$$ packed form
37761C312270K10075P56337O77687K27385M1084J41849R2104j21179r4750J90452
37751E433314K89485P9239j1671K54001N00373L63089R0786J01905K31238o0887
37741G270872p76891j184088p26922K00079O94512L87163k65138o28539m98260
37732D472788p3697L19427M07090J70297n4846K8393J80939n1007n07025n30345
37722D362014q5932K0562n14984p64593L1778J039320Q94409k17431p91019k20899
37712C753225M60912K89890l28558n02030j32719K69807M04823K66271r9274m72513
37702C909834m98765j79417N4481j5090j16907m5976O710j06683k20551k26932
37692B560704k28390j78600R1535L84924K83845j26995l51864l36428m27064m60828
$$ plain form
37682 1210839 1287898 2126604 2878433 2619186 1689490 1115234 1038473 805706 385980 449216
37672 449216 989885 1111524 474157 -112525 88684 839625 1564068 2006347 1967293 1300059
37662 1300059 497276 381349 894956 1130154 825319 718285 1029970 888000 -61887
37653 -61887 -741431 -283463 534193 613696 316658 638637 1373569 1501043 935944 543175
37643 543175 654875 794782 746834 785413 904219 821126 697776 912659 1189108 897365
37633 897365 184076 -145101 136491 497237 713679 1111336 1622850 1636207 1077871 715492
37623 715492 984257 1334591 1206666 920228 1048867 1488401 1721894 1606307 1375588 1146540
37613 1146540 875739 622553 490052 423359 327929 277645 398056 629900 773847 737836
$$ packed form
37682A210839P7059Q38706P51829k59247r29696n74256p6761k32767m19726O3236
37672D49216N40669J21639o37367n86682K01209P50941P24443M42279l9054o67234
37662A300059q02783j15927N13607K35198l04835j07034L11685j41970r49887
37653f1887o79544M57968Q17656P9503k97038L21979P34932J27474n65099l92769
37643E43175J11700J39907m7948L8579J18806q3093j23350K14883K76449k91743
37633H97365p13289l29177K81592L60746K16442L97657N11514J3357n58336l62379
37623G15492K68765L50334j27925k86438J28639M39534K33493j15587k30719k29048
37613A146540k70801k53186j32501o6693r5430n0284J20411K31844J43947l6011
$$ plain form
37603 737836 657689 765180 1102235 1364580 1178805 591380 54016 -187965 -378342 -717076
37593 -717076 -919665 -665083 -165305 138920 202409 275855 424837 573775 771765 970496
37583 970496 832835 263296 -194539 -78599 198661 -26300 -539780 -576084 -115498 46412
37573 46412 -428400 -910012 -733592 43674 975397 1688381 1870677 1402461 673049 268626
37563 268626 255394 239642 95139 57256 159325 237077 446301 1049358 1712817 1818288
37553 1818288 1500715 1534022 2115125 2655527 2883963 3165548 3521764 3398648 2767844 2395335
37543 2395335 2537002 2431514 1700940 1185742 1570282 2140236 1888335 1077298 663723
37534 663723 796368 945687 1002671 1153530 1085930 485859 56125 826403 2497508 3625201
$$ packed form
37603G37836q0147J07491L37055K62345j85775n87425n37364k41981j90377l38734
37593g17076k02589K54582M99778L04225O3489P3446J48982J48938J97990J98731
37583I70496j37661n69539m57835J15940K77260k24961n13480l6304M60586J61910
37573D6412m74812m81612J76420P77266R31723P12984J82296m68216p29412m04423
37563B68626j3232j5752j44503l7883J02069P7752K09224O03057O63459J05471
37553A818288l17573L3307N81103N40402K28436K81585L56216j23116o30804l72509
37543B395335J41667j05488p30574n15198L84540N69954k51901q11037m13575
37534F63723J32645J49319N6984J50859o7600o00071m29734P70278J671105J127693
$$ plain form
37524 3625201 3560950 3124756 3115881 3235166 2973890 2646179 2810567 3260816 3349555 3005505
37514 3005505 2747057 2799451 2807527 2510684 2231001 2440251 3088983 3634653 3649952 3172352
37504 3172352 2477448 1786897 1309008 1287190 1733084 2265679 2505650 2515971 2552808 2539519
37494 2539519 2236387 1862011 1979942 2628908 3068855 2665866 1687131 967282 1030985 1704131
37484 1704131 2348247 2379915 1815510 1330209 1480818 1957074 2072244 1888171 2130472 2906289
37474 2906289 3359591 2962937 2362929 2377064 2791705 2833673 2372832 1954658 1924589 2149847
37464 2149847 2432143 2669426 2736146 2610345 2474856 2399890 2186047 1816242 1709470 2145022
37454 2145022 2762282 3026254 2890164 2647565 2469322 2429823 2611438 2851133 2822666 2677046
$$ packed form
37524C625201o4251m36194q875J19285k61276l27711J64388M50249Q8739l44050
37514C005505k58448N2394Q076k96843k79683K09250O48732N45670J5299m77600
37504C172352o94904o90551m77889k1818M45894N32595K39971J0321L6837j3289
37494B539519l03132l74376J17931O48966M39947m02989r78735p19849O3703O73146
37484A704131O44116L1668n64405m85301J50609M76256J15170j84073K42301P75817
37474B906289M53302l96654o00008J4135M14641M1968m60841m18174l0069K25258
37464B149847K82296K37283O6720j25801j35489p4966k13843l69805j06772M35552
37454B145022O17260K63972j36090k42599j78243l9499J81615K39695k8467j45620
$$ plain form
37444 2677046 3015158 3838343 4252330 3777539 3165216 3143568 3166994 2466453 1646105 1898331
37434 1898331 3023870 3664002 3405799 3239999 3765448 4291763 4153313 3751410 3700980
37425 3700980 3863537 3841746 3692084 3561614 3251297 2714202 2455553 2878526 3650902 4211049
37415 4211049 4523641 4862061 5173723 5162224 4822980 4493293 4435483 4598731 4725045 4599195
37405 4599195 4300398 4167782 4323961 4394448 4065728 3722062 3944211 4481073 4471737 3778448
37395 3778448 3298758 3667772 4405313 4780945 4833577 4959973 5066833 4826518 4399631 4206066
37385 4206066 4191168 3969981 3599768 3587140 4080713 4586358 4660083 4506148 4638502 5145800
37375 5145800 5562016 5489494 5170241 5223722 5797381 6278060 6114680 5677384 5811445 6604277
$$ packed form
37444B677046L38112Q23185M13987m74791o12323k1648K3426p00541q20348K52226
37434A898331J125539O40132k58203j65800N25449N26315j38450m01903n0430
37425C700980J62557k1791j49662j30470l10317n37095k58649M22973P72376N60147
37415D211049L12592L38420L11662j1499l39244l29687n7810J63248J26314j25850
37405D599195k98797j32616J56179P0487l28720l43666K22149N36862r336o93289
37395C778448m79690L69014P37541L75632N2632J26396J06860k40315m26887j93565
37385D206066j4898k21187l70213j2628M93573N05645P3725j53935J32354N07298
37375E145800M16216p2522l19253N3481N73659M80679j63380m37296J34061P92832
$$ plain form
37365 6604277 7178772 6869237 6072774 5632782 5815861 6286594 6744926 7100832 7191836 6823227
37355 6823227 6128337 5553154 5377744 5440206 5418637 5260602 5213952 5441947 5732344 5746412
37345 5746412 5543745 5608531 6222082 7061672 7634463 7830489 7748465 7323193 6633810 6305017
37335 6305017 6911988 8062116 8760165 8702256 8493292 8509945 8390164 7946402 7748425 8239645
37325 8239645 8914994 9046193 8797176 8946706 9745340 10653095 11114595 11120235 11031592 11191711
37315 11191711 11696588 12363698 12977045 13564678 14183069 14493323 14092178 13361028 13293441
37306 13293441 14149873 14984234 15011276 14746141 15065842 15756977 15957929 15670804 15761168 16523433
37296 16523433 17257392 17433938 17423604 17786473 18551964 19537052 20769959 22199798 23452476
$$ packed form
37365F604277N74495l09535p96463m39992J83079M70733M58332L55906R1004l68609
37355F823227o94890n75183j75410O2462k1569j58035m6650K27995K90397J4068
37345E746412k02667O4786O13551Q39590N72791J96026q2024m25272o89383l28793
37335F305017O06971J150128O98049n7909k08964J6653j19781m43762j97977M91220
37325H239645O75349J31199k49017J49530P98634R07755M61500N640q8643J60119
37315A1191711N04877O67110O13347N87633O18391L10254m01145p31150o7587
37306A3293441Q56432Q34361K7042k65135L19701O91135K00952k87125R0364P62265
37296A6523433P33959J76546j0334L62869P65491R85088J232907J429839J252678
$$ plain form
37287 23452476 24284193 24961450 25860114 26949140 27960304 28842996 29764596 30796832 31828283
37278 31828283 32737638 33572219 34622140 36253614 38456297 40633410 42194823 43378859
37270 43378859 45088310 47795000 51002431 53999343 56782997 59933526 63819516 68237821
37262 68237821 72721485 77017988 81406554 86649282 93358756 101235423 109254414 116892859
37254 116892859 124848387 134148400 144869969 156338752 168427470 181888807 197234207
37247 197234207 213971787 231365462 249438834 268685005 289079419 309905953 330335323
37240 330335323 349585145 366623187 380377771 390318617 396245158 397453164 392918833
37233 392918833 382687515 368351254 351571150 332772420 312036914 290594439 270182774
$$ packed form
37287B3452476Q31717O77257Q98664J089026J011164Q82692R21600J032236J031451
37278C1828283R09355Q34581J049921J631474K202683K177113J561413J184036
37270D3378859J709451K706690L207431K996912K783654L150529L885990M418305
37262F8237821M483664M296503M388566N242728O709474P876667Q018991P638445
37254A16892859P955528R300013J0721569J1468783J2088718J3461337J5345400
37247A97234207J6737580J7393675J8073372J9246171K0394414K0826534K0429370
37240C30335323J9249822J7038042J3754584R940846N926541J208006m534331
37233C92918833j0231318j4336261j6780104j8798730k0735506k1442475k0411665
$$ plain form
37226 270182774 251125825 232375303 213674159 196389361 181594905 168462562 155530590
37219 155530590 142800075 131463894 122005758 113720369 105978146 98872322 92495346 86529281
37211 86529281 80843495 75726823 71204568 66818307 62448652 58682502 55863839 53351102
37203 53351102 50332889 46980377 44145977 42172198 40626917 39056452 37350306 35401039
37195 35401039 33077076 30691364 28930016 28032057 27443305 26551858 25399983 24356157
37187 24356157 23430638 22365150 21211934 20334265 19836701 19411679 18846092 18327275 18062975
37178 18062975 17861830 17350056 16500101 15732894 15495483 15823428 16283125 16295252 15601473
37169 15601473 14502373 13584229 13153662 13007627 12791594 12443211 12168042 12096053 12137745
$$ packed form
37226B70182774j9056949j8750522j8701144j7284798j4794456j3132343j2931972
37219A55530590j2730515j1336181r458136q285389p742223p105824o376976n966065
37211H6529281n685786n116672m522255m386261m369655l766150k818663k512737
37203E3351102l018213l352512k834400j973779j545281j570465j706146j949267
37195C5401039k323963k385712j761348q97959n88752q91447j151875j043826
37187B4356157r25519j065488j153216q77669m97564m25022n65587n18817k64300
37178A8062975k01145n11774q49955p67207k37411L27945M59697J2127o93779
37169A5601473j099100r18144m30567j46035k16033l48383k75169p1989M1692
$$ plain form
37160 12137745 12138367 12004782 11665964 11070140 10333089 9823114 9921551 10564157 11089114 10796890
37150 10796890 9777807 8929079 8893406 9223357 9025227 8255800 7746902 7900641 8085956
37141 8085956 7650557 6878053 6426677 6343391 6256072 6134143 6164966 6180963 5957943 5867511
37131 5867511 6412675 7196148 7207419 6219857 5103477 4591590 4524909 4559353 4812600 5384828
37121 5384828 5915377 6100262 6111305 6089047 5795146 5220588 4920807 5160040 5295253 4726747
37111 4726747 3985897 4039559 4821217 5356125 5241162 5103609 5475739 6004673 6068813 5592108
37101 5592108 4941946 4481641 4505025 5172747 6142815 6593673 6044652 4998374 4389691
37092 4389691 4471355 4630665 4350324 3930519 3960689 4345912 4366454 3741035 3104065 3103965
$$ packed form
37160A2137745O22j33585l38818n95824p37051n09975R8437O42606N24957k92224
37150A0796890j019083q48728l5673L29951j98130p69427n08898J53739J85315
37141H085956m35399p72504m51376q3286q7319j21929L0823J5997k23020r0432
37131E867511N45164P83473J1271r87562j116380n11887o6681L4444K53247N72228
37121E384828N30549J84885J1043k2258k93901n74558k99781K39233J35213n68506
37111D726747p40850N3662P81658N34908j14963j37553L72130N28934O4140m76705
37101E592108o50162m60305K3384O67722R70068M50858n49021j046278o08683
37092D389691Q1664J59310k80341m19805L0170L85223K0542o25419o36970j00
$$ plain form
37082 3103965 3446187 3368247 2825316 2533013 2840289 3241699 3205835 2896485 2767319 2926513
37072 2926513 3227264 3559190 3735134 3518184 3092043 3062770 3627524 4190457 4199675 3883507
37062 3883507 3702853 3607631 3419473 3415073 3780528 3944946 3352306 2577092 2671501 3534449
37052 3534449 3967117 3415913 2652832 2483971 2724920 2867700 2946401 3193017 3444926 3443102
37042 3443102 3263957 2991294 2410400 1529185 996695 1406782 2406970 3044940 2904946
37033 2904946 2450249 2284385 2481284 2701962 2681391 2482201 2375328 2515730 2745116 2800309
37023 2800309 2678465 2579633 2487360 2146121 1588512 1308181 1601749 2028173 1946142 1450728
37013 1450728 1307654 1910105 2725507 3003565 2740543 2580516 2842216 3057864 2678958
$$ packed form
37082C103965L42222p7940n42931k92303L07276M01410l5864l09350j29166J59194
37072B926513L00751L31926J75944k16950m26141k9273N64754N62933R218l16168
37062C883507j80654r5222j88158m400L65455J64418n92640p75214R4409Q62948
37052C534449M32668n51204p63081j68861K40949J42780P8701K46616K51909j824
37042C443102j79145k72663n80894q81215n32490M10087J000188O37970j39994
37033B904946m54697j65864J96899K20678k0571j99190j06873J40402K29386N5193
37023B800309j21844r8832r2273l41239n57609k80331K93568M26424q2031m95414
37013A450728j43074O02451Q15402K78058k63022j60027K61700K15648l78906
$$ plain form
37004 2678958 1952097 1679531 2134823 2660306 2553584 1996200 1718413 1942320 2139035
36995 2139035 1863201 1406098 1409153 2057419 2879961 3280189 3120167 2773498 2665266 2824158
36985 2824158 2933943 2753343 2329382 1843947 1511310 1627623 2321480 3097027 3077941 2067156
36975 2067156 997792 864164 1477515 1805259 1343277 563363 91262 55571 295572
36966 295572 659261 969982 1143094 1415177 2019122 2603944 2526559 1846421 1440919 1847737
36956 1847737 2499304 2486565 1698204 797636 352807 402617 713886 1068396 1321631 1454633
36946 1454633 1596005 1848982 2105360 2123372 1777866 1204802 735791 672774 1051303 1631504
36936 1631504 2143417 2453702 2495371 2276481 2053270 2172300 2534972 2578876 2094161 1651968
$$ packed form
37004B678958p26861k72566M55292N25483j06722n57384k77787K23907J96715
36995B139035k75834m57103L055O48266Q22542M00228j60022l46669j08232J58892
36985B824158J09785j80600m23961m85435l32637J16313O93857P75547j9086j010785
36975B067156j069364j33628O13351L27744m61982p79914m72101l5691K40001
36966B95572L63689L10721J73112K72083O03945N84822p7385o80138m05502M06818
36956A847737O51567j2739p88361r00568m44829M9810L11269L54510K53235J33002
36946A454633J41372K52977K56378J8012l45506n73064m69011o3017L78529N80201
36936A631504N11913L10285M1669k18890k23211J19030L62672M3904m84715m42193
$$ plain form
36926 1651968 1777112 2102627 1954003 1440168 1231019 1466431 1682723 1720103 1879975 2178581
36916 2178581 2246612 2022664 1768768 1380423 563782 -233232 -79051 1014190 1935632
36907 1935632 2093043 2137709 2590321 2844538 2303683 1555272 1457605 1761318 1619289 957610
36897 957610 401799 209811 142623 119173 225891 298870 160297 31779 146887 286924
36887 286924 250694 335053 724415 929928 592663 305185 726441 1369855 1327667 808251
36877 808251 743610 1077700 776698 -358432 -1166231 -795807 141777 594825 417926 165727
36867 165727 177246 400091 713563 998770 1121009 1060530 888970 640372 455313 640782
36857 640782 1164535 1390837 939923 502792 973942 1996355 2368781 1839320 1398001
$$ packed form
36926A651968J25144L25515j48624n13835k09149K35412K16292L7380J59872K98606
36916B178581O8031k23948k53896l88345q16641p97014J54181J093241R21442
36907A935632J57411M4666M52612K54217n40855p48411r7667L03713j42029o61679
36897I57610n55811j91988o7188k3450J06718P2979j38573j28518J15108J40037
36887B86924l6230Q4359L89362K05513l37265k87478M21256O43414m2188n19416
36877H08251o4641L34090l01002j135130q07799L70424R37584M53048j76899k52199
36867A65727J1519K22845L13472K85207J22239o0479j71560k48598j85059J85469
36857F40782N23753K26302m50914m37131M71150J022413L72426n29461m41319
$$ plain form
36848 1398001 1656955 2056419 1998184 1711988 1548423 1374785 1174570 1336367 1811170 1881275
36838 1881275 1355098 1080227 1581890 2102568 1829881 1232883 1200487 1580142 1660451 1521538
36828 1521538 1733350 2121958 2049912 1704282 1903757 2656174 3041151 2650572 2121707 2023930
36818 2023930 2162022 2302041 2723074 3570366 4297338 4258715 3495384 2604460 2108429 2110428
36808 2110428 2277217 2106393 1524766 1144103 1496941 2189148 2441890 2335569 2668462
36799 2668462 3550434 4121175 3946680 3699514 3925179 4059799 3437123 2516928 2193198
36790 2193198 2423675 2530558 2489197 2848403 3510524 3688017 3220924 2951998 3422036 3999891
36780 3999891 3824824 3014401 2354756 2187707 2194662 2078677 1915877 1859085 1915684 2093387
$$ packed form
36848A398001K58954L99464n8235k86196j63565j73638k00215J61797M74803P0105
36838A881275n26177k74871N01663N20678k72687n96998l2396L79655Q0309j38913
36828A521538K11812L88608p2046l45630J99475P52417L84977l90579n28865r7777
36818B023930J38092J40019M21033Q47292P26972l8623p63331q90924m96031J999
36808B110428J66789j70824n81627l80663L52838O92207K52742j06321L32893
36799B668462Q81972N70741j74495k47166K25665J34620o22676r20195l23730
36790B193198K30477J06883m1361L59206O62121J77493m67093k68926M70038N77855
36780C999891j75067q10423o59645j67049O955j15985j62800n6792N6599J77703
$$ plain form
36770 2093387 2491707 3146359 3903264 4475010 4585864 4178969 3600292 3430502 3914242
36761 3914242 4632259 4976003 4905108 4950240 5431307 6006335 6190086 6034775 5939842 5936064
36751 5936064 5649003 5070730 4874316 5597482 6852927 7853008 8514453 9395285 10548579
36742 10548579 11219881 11000690 10573102 10752581 11389845 11977423 12854022 14767864 17424641
36733 17424641 19644795 21171523 23213485 26690647 30929459 34853162 38649478 43251933
36725 43251933 48652108 53781133 57867630 60918596 62854039 63109597 61360544 57980429
36717 57980429 53560586 48521899 43342540 38566346 34333558 30377278 26668134 23579078
36709 23579078 21249414 19322648 17528636 15976485 14623911 13078577 11330441 10098130
$$ packed form
36770B093387L98320O54652P56905N71746J10854m06895n78677j69790M83740
36761C914242P18017L43744p0895M5132M81067N75028J83751j55311r4933l778
36751E936064k87061n78273j96414P23166J255445J000081O61445Q80832J153294
36742A0548579O71302k19191m27588J79479O37264N87578Q76599J913842K656777
36733A7424641K220154J526728K041962L477162M238812L923703L796316M602455
36725D3251933N400175N129025M086497L050966J935443K55558j749053l380115
36717E7980429m419843n038687n179359m776194m232788l956280l709144l089056
36709B3579078k329664j926766j794012j552151j352574j545334j748136j232311
$$ plain form
36701 10098130 9879087 10075367 9678333 8554970 7453449 6881795 6571889 6070076 5373109
36692 5373109 4827359 4662222 4747939 4729721 4404945 3979832 3819090 3937738 3980929 3733515
36682 3733515 3331369 2926117 2555779 2429638 2806430 3391920 3454026 2858136 2362676 2451360
36672 2451360 2550839 2038262 1367584 1325195 1660305 1479358 738588 282876 454943 693918
36662 693918 624796 572809 741845 777790 539782 541170 1142068 1898346 2200806 2108673 2099893
36651 2099893 2337256 2567560 2495998 1985952 1121583 256988 -230676 -319588 -208141 132929
36641 132929 806932 1432357 1390996 774280 425132 784713 1323263 1427922 1226055 1115637
36631 1115637 1059950 855799 645001 650916 746674 698885 522817 290066 -19775 -215759
$$ packed form
36701A0098130k19043J96280l97034j123363j101521n71654l09906n01813o96967
36692E373109n45750j65137Q5717j8218l24776m25113j60742J18648M3191k47414
36682C733515m02146m05252l70338j26141L76792N85490O2106n95890m95460Q8684
36672B451360R9479n12577o70678m2389L35110j80947p40770m55712J72067K38975
36662F93918o9122n1987J69036L5945k38008J388O00898P56278L02460r2133q780
36651B099893K37363K30304p1562n10046q64369q64595m87664q8912J11447L41070
36641A32929O74003O25425m1361o16716l49148L59581N38550J04659k01867j10418
36631A115637n5687k04151k10798N915R5758m7789j76068k32751l09841j95984
$$ plain form
36621 -215759 31319 509279 489123 -173326 -669265 -483026 -209206 -417734 -551165 32709
36611 32709 656067 267763 -667643 -708056 257557 766425 98954 -605606 -170929 856853
36601 856853 1133138 404079 -411239 -573346 -209775 125636 61364 -291409 -402703 65092
36591 65092 632911 489590 -261674 -525837 272287 1307121 1517988 1011967 610213 524460
36581 524460 324967 -89298 -357389 -392039 -477378 -630748 -559167 -305559 -271029 -450244
36571 -450244 -271585 533462 1403670 1618171 1144952 522331 158938 50184 43196 117077
36561 117077 375243 815805 1135546 923127 210053 -358002 -215869 375084 657034 376538
36551 376538 2914 -47489 112768 251167 374567 459915 314002 -3117 -60463 298825
$$ packed form
36621b15759K47078M77960k0156o62449m95939J86239K73820k08528j33431N83874
36611C2709O23358l88304r35406m0413R65613N08868o67471p04560M34677J027782
36601H56853K76285p29059q15318j62107L63571L35411o4272l52773j11294M67795
36591F5092N67819j43321p51264k64163P98124J034834K10867n06021m01754q5753
36581E24460j99493m14265k68091l4650q5339j53370P1581K53608L4530j79215
36571d50244J78659Q05047Q70208K14501m73219o22621l63393j08754o988P3881
36561A17077K58166M40562L19741k12419p13074n68055J42133N90953K81950k80496
36551C76538l73624n0403J60257J38399J23400Q5348j45913l17119n7346L59288
$$ plain form
36541 298825 629590 602196 595599 1022537 1448353 1116720 194119 -281995 223460 1087684
36531 1087684 1451736 1235509 938481 878545 995063 1120801 1111388 874053 516906 325339
36521 325339 394541 436092 140686 -389118 -737033 -619356 -130045 362971 505905 257579
36511 257579 -82312 -263348 -402528 -658523 -748456 -287374 416881 563121 44061 -257362
36501 -257362 237878 886289 824959 328719 333493 952459 1386031 1187850 720806 329771
36491 329771 -50356 -308601 -75049 448037 410618 -434037 -1132979 -815620 28964 297364
36481 297364 -146126 -467418 -222882 133511 140880 -22486 -26807 33981 -97409 -342690
36471 -342690 -397414 -203246 -52706 -226739 -659026 -1016370 -1094300 -1030212 -993729 -771996
$$ packed form
36541B98825L30765k7394o597M26938M25816l31633r22601m76114N05455Q64224
36531A087684L64052k16227k97028n9936J16518J25738r413k37335l57147j91567
36521C25339O9202M1551k95406n29804l47915J17677M89311M93016J42934k48326
36511B57579l39891j81036j39180k55995q9933M61082P04255J46240n19060l01423
36501b57362M95240O48411o1330m96240M774O18966M33572j98181m67044l91035
36491C29771l80127k58245K33552N23086l7419q44655o98942L17359Q44584K68400
36481B97364m43490l21292K44536L56393P369j63366m321O0788j31390k45281
36471c42690n4724J94168J50540j74033m32287l57344p7930O4088L6483K21733
$$ plain form
36461 -771996 -6124 1099906 1746209 1495025 884616 683909 862894 835796 485945 281399
36451 281399 429258 605650 627493 725044 919086 771849 134477 -420126 -400921 -175827
36441 -175827 -370616 -843285 -923523 -480784 -46623 108358 322180 804752 1168790 1010355
36431 1010355 503435 75841 -147692 -238413 -139415 135126 243672 -51713 -357787 -91105
36421 -91105 584528 832446 299546 -336862 -308006 176278 280642 -233594 -673278 -355523
36411 -355523 536290 1248222 1353357 1095086 940354 1053330 1263259 1370650 1328813 1171037
36401 1171037 925680 667964 538429 590291 678926 627769 459940 326688 253999 149441
36391 149441 35160 16943 -29374 -436941 -1218025 -1788111 -1518376 -501290 473137 725369
$$ packed form
36461g71996P65872J106030O46303k51184o10409k00707J78985k7098l49851k04546
36451B81399J47859J76392K1843R7551J94042j47237o37372n54603J9205K25094
36441a75827j94789m72669q0238M42739M34161J54981K13822M82572L64038j58435
36431A010355n06920m27594k23533r0721R8998K74541J08546k95385l06074K66682
36421i1105O75633K47918n32900o36408K8856M84284J04364n14236m39684L17755
36411c55523Q91813P11932J05135k58271j54732J12976K09929J07391m1837j57776
36401A171037k45357k57716j29535N1862Q8635n1157j67829j33252p2689j04558
36391A49441j14281j8217m6317m07567p81084n70086K69735J017086R74427K52232
$$ plain form
36381 725369 333293 -43663 97636 583437 825908 632106 550342 1130115 1994541 2171336
36371 2171336 1400205 496991 160966 90773 -197139 -317380 366158 1452850 1841487
36362 1841487 1289261 664144 516863 372552 -198103 -707497 -561008 -50797 185712
36353 185712 233204 658306 1453989 1959895 1788984 1229721 691513 271761 -15589 -32245
36343 -32245 233858 476741 363975 -66704 -425460 -359656 119493 696308 1110398 1365411
36333 1365411 1512139 1404488 947597 486068 531226 1045958 1414843 1265761 913799 793035
36323 793035 868578 894028 863221 866924 837858 781041 929675 1325774 1601112 1548745 1495886
36312 1495886 1641709 1501861 687582 -163667 -113639 610004 834595 181578 -374066 13707
$$ packed form
36381G25369l92076l76956J41299M85801K42471j93802q1764N79773Q64426J76795
36371B171336p71131r03214l36025p0193k87912j20241O83538J086692L88637
36362A841487n52226o25117j47281j44311n70655n09394J46489N10211K36509
36353A85712M7492M25102P95683N05906j70911n59263n38208m19752k87350j6656
36343c2245K66103K42883j12766m30679l58756O5804M79149N76815M14090K55013
36333A365411J46728j07651m56891m61529M5158N14732L68885j49082l51962j20764
36323G93035P5543K5450l0807L703k9066n6817J48634L96099K75338n2367n2859
36312A495886J45823j39848q14279q51249N0028P23643K24591o53017n55644L87773
$$ plain form
36302 13707 868699 1196423 846680 463200 478093 757398 1031296 1143831 958716 464039
36292 464039 -12098 -26124 467947 1038019 1260146 1139385 996779 1044794 1168720 1134905
36282 1134905 940033 823148 902019 980820 866743 704299 746077 907687 861819 544433
36272 544433 258585 243095 404956 521674 478961 302475 189819 459989 1150126 1703395
36262 1703395 1478338 625639 24730 231480 939257 1645058 2307174 2992116 3383906
36253 3383906 3214454 2870860 2944413 3303183 3238535 2561903 1960650 2071460 2689430 3180819
36243 3180819 3285873 3160811 2940808 2702901 2667121 2933872 3080869 2558805 1580189 1062433
36233 1062433 1419896 1946339 1867543 1538308 1859903 2743766 3066565 2289882 1272275
$$ packed form
36302A3707Q54992L27724l49743l83480J4893K79305K73898J12535j85115m94677
36292D64039m76137j4026M94071N70072K22127j20761j42606M8015J23926l3815
36282A134905j94872j16885P8871P8801j14077j62444M1778J61610m5868l17386
36272E44433k85848j5490J61861J16718m2713j76486j12656K70170O90137N53269
36262A703395k25057q52699o00909K06750P07777P05801O62116O84942L91790
36253C383906j69452l43594P3553L58770o4648o76632o01253J10810O17970M91389
36243C180819J05054j25062k20003k37907l5780K66751J46997n22064r78616n17756
36233A062433L57463N26443p8796l29235L21595Q83863L22799p76683j017607
$$ plain form
36224 1272275 1051052 1500705 1782222 1613584 1406546 1446609 1632411 1900228 2276985 2532407
36214 2532407 2323092 1718617 1149420 839263 691476 659933 760097 776521 491461 187943
36204 187943 352052 824494 853792 153730 -656880 -900053 -626093 -304413 -183240 -236561
36194 -236561 -359322 -353586 -64317 270764 188226 -290157 -540073 -168633 455769 767342
36184 767342 671507 377178 19235 -219237 -68739 341192 385232 -228559 -933336 -1077052
36174 -1077052 -816012 -682342 -635817 -239152 426437 733493 388027 -232803 -654972 -752976
36164 -752976 -609728 -366935 -251679 -394236 -609846 -646282 -555877 -515110 -442533 -173564
36154 -173564 174774 443109 796434 1310831 1443896 646624 -609713 -1240022 -1019528
$$ packed form
36224A272275k21223M49653K81517j68638k07038M0063J85802K67817L76757K55422
36214B532407k09315o04475n69197l10157j47787l1543J00164J6424k85060l03518
36204A87943J64109M72442K9298p00062q10610k43173K73960L21680J21173n3321
36194b36561j22761N736K89269L35081q2538m78383k49916L71440O24402L11573
36184G67342r5835k94329l57943k38472J50498M09931M4040o13791p04777j43716
36174a077052K61040J33670M6525L96665O65589L07056l45466o20830m22169r8004
36164g52976J43248K42793J15256j42557k15610l6436R0405M0767P2577K68969
36154a73564L48338K68335L53325N14397J33065p97272j256337o30309K20494
$$ plain form
36145 -1019528 -798161 -1079293 -1318118 -1035360 -710903 -884611 -1110128 -687966 40983
36136 40983 99101 -631803 -1229889 -1054288 -435722 79493 422521 664884 637316 297358
36126 297358 19515 102666 322851 348742 280284 349907 364311 -33751 -673700 -955797
36116 -955797 -659351 -192159 50575 150861 339346 584954 733319 753165 628190 289669
36106 289669 -112022 -174672 208822 545331 356952 -124977 -303039 -56829 255112 495367
36096 495367 836354 1142990 940828 221115 -317371 -174423 306234 591170 755810 1077154
36086 1077154 1247401 749091 -144507 -542890 -214834 35706 -423805 -1096038 -1111090 -510400
36076 -510400 -119808 -303406 -530792 -309623 47808 -44130 -538646 -865865 -779345 -603452
$$ packed form
36145a019528K21367k81132k38825K82758L24457j73708k25517M22162P28949
36136D0983N8118p30904n98086J75601O18566N15215L43028K42363k7568l39958
36126B97358k77843Q3151K20185K5891o8458O9623J4404l98062o39949k82097
36116i55797K96446M67192K42734J00286J88485K45608J48365J9846j24975l38521
36106B89669m01691o2650L83494L36509j88379m81929j78062K46210L11941K40255
36096D95367L40987L06636k02162p19713n38486J42948M80657K84936J64640L21344
36086A077154J70247m98310q93598l98383L28056K50540m59511o72233j5052O00690
36076e10400L90592j83598k27386K21169L57431r1938m94516l27219Q6520J75893
$$ plain form
36066 -603452 -631940 -730805 -681661 -556352 -538603 -639118 -779522 -917952 -935811 -696868
36056 -696868 -383848 -375884 -539412 -165721 901687 1604444 907373 -624065 -1398471 -847513
36046 -847513 57211 393803 350424 375410 306070 -15431 -94164 435527 975386 762893
36036 762893 81198 -204971 -40289 -178160 -854715 -1365236 -1151062 -581004 -317718 -417682
36026 -417682 -440113 -153126 215875 337377 169311 -32295 -32102 123692 254923 378956
36016 378956 641625 928472 922690 650346 533400 712385 795318 539486 235105 57459
36006 57459 -313387 -887741 -888363 102250 1122147 1007636 159786 -88485 367765 303642
35996 303642 -663791 -1294004 -673135 359451 598876 248465 248182 579805 434570 -291362
$$ packed form
36066f03452k8488r8865M9144J25309J7749j00515j40404j38430j7859K38943
36056f96868L13020P964j63528L73691J067408P02757o97071j531438p74406N50958
36046h47513R04724L36592m3379K4986o9340l21501p8733N29691N39859k12493
36036G62893o81695k86169J64682j37871o76555n10521K14174N70058K63286r9964
36026d17682k2431K86987L69001J21502j68066k01606J93J55794J31231J24033
36016C78956K62669K86847n782k72344j16946J78985Q2933k55832l04381j77646
36006E7459l70846n74354o22R90613J019897j14511q47850k48271M56250o4123
35996C03642r67433o30213O20869J032586K39425l50411k83L31623j45235p25932
$$ plain form
35986 -291362 -790321 -568000 36143 581096 973882 1092644 732393 180071 192484 1023027
35976 1023027 1943063 2137496 1724035 1437269 1534862 1540479 1063462 388392 36646 67894
35966 67894 139389 86127 55538 80730 -65747 -422480 -588186 -221660 416688 741732
35956 741732 543511 134199 -81881 107339 745748 1675833 2540005 3123209 3624133 4292799
35946 4292799 4953730 5308185 5595617 6431962 7959288 9607152 10724900 11024082 10456296
35937 10456296 9230422 7969495 7209292 6652508 5601663 4221247 3482705 3560823 3314872
35928 3314872 2033834 751828 805964 1759410 1997364 1077258 203963 343244 1077538
35919 1077538 1635897 1952944 2135991 1796165 720897 -358189 -510232 152972 697553
$$ packed form
35986b91362m98959K22321O04143N44953L92786J18762l60251n52322J2413Q30543
35976A023027R20036J94433m13461k86766R7593N617m77017o75070l51746L1248
35966F7894P1495n3262l0589K5192j46477l56733j65706L66526O38348L25044
35956G41732j98221m09312k16080J89220O38409R30085Q64172N83204N00924O68666
35946D292799O60931L54455K87432Q36345J527326J647864J117748K99182n67786
35937A0456296j225874j260927p60203n56784j050845j380416p38542P8118k45951
35928C314872j281038j282006N4136R53446K37954r20106q73295J39281P34294
35919A077538N58359L17047J83047l39826j075268j079086j52043O63204N44581
$$ plain form
35910 697553 671145 492493 563568 685463 566548 382561 499939 954210 1489786 1896291
35900 1896291 2061875 1897808 1474844 1078200 872309 663369 271639 -30480 171560
35891 171560 786387 1312943 1568974 1852922 2308726 2633336 2605314 2425392 2269125 1968674
35881 1968674 1472220 1151238 1215148 1242781 804129 183221 -50866 162982 565353 1113265
35871 1113265 1621701 1355030 -14370 -1336750 -1072886 561490 1748982 1522869 786349
35862 786349 511173 306329 -413666 -1052457 -786817 -72136 36627 -459559 -725973 -618808
35852 -618808 -751856 -1147239 -1035938 -203127 487148 294622 -415795 -781782 -469336 248695
35842 248695 967733 1360140 1253362 816898 483240 511469 780048 1033554 1092001 819374
$$ packed form
35910F97553k6408j78652P1075J21895j18915j83987J17378M54271N35576M06505
35900A896291J65584j64067m22964l96644k05891k08940l91730l02119K02040
35891A71560O14827N26556K56031K83948M55804L24610k8022j79922j56267l00451
35881A968674m96454l20982O3910K7633m38652o20908k34087K13848M02371N47912
35871A113265N08436k66671j369400j322380K63864J634376J187492k26113p36520
35862G86349k75176k04844p19995o38791K65640P14681J08763m96186k66414J07165
35852f18808j33048l95383J11301Q32811O90275j92526p10417l65987L12446P18031
35842B48695P19038L92407j06778m36464l33658K8229K68579K53506N8447k72627
$$ plain form
35832 819374 215491 -377395 -457626 99491 859125 1256871 1095657 641740 381824 634883
35822 634883 1237038 1659520 1558359 1094982 627256 328810 266092 503504 837691 772248
35812 772248 149818 -494363 -632418 -472826 -500073 -641139 -519696 -234878 -138561 -59671
35802 -59671 400428 921878 773985 106364 -101261 369602 498562 -318810 -1096909 -589616
35792 -589616 843419 1667120 1208490 391395 402438 1273576 1991110 1660644 400213
35783 400213 -776210 -920551 -56123 924344 1232571 838697 170342 -432366 -769075
35774 -769075 -667097 -168699 361110 596967 595659 595153 653300 670075 584884 387103 127400
35763 127400 44869 408542 1062584 1435211 1223203 767284 512672 451359 424880 608607
$$ packed form
35832H19374o03883n92886q0231N57117P59634L97746j61214m53917k59916K53059
35822F34883O02155M22482j01161m63377m67726k98446o2718K37412L34187o5443
35812G72248o22430o44181j38055J59592k7247j41066J21443K84818R6317P8890
35802e9671M60099N21450j47893o67621k07625M70863J28960q17372p78099N07293
35792e89616J433035Q23701m58630q17095J1043Q71138P17534l30466j260431
35783D00213j176423j44341Q64428R80467L08227l93874o68355o02708l36709
35774g69075J01978M98398N29809K35857j308n06N8147J6775q5191j97781k59703
35763A27400q2531L63673O54042L72627k12008m55919k54612o1313k6479J83727
$$ plain form
35753 608607 1205627 1886866 2063324 1642308 1070184 676672 415761 244239 281346 464805
35743 464805 449484 88288 -231079 11177 804056 1522288 1532096 829054 35082 -259942
35733 -259942 -91701 53837 -69874 -232692 -228021 -251860 -534763 -872911 -886314 -604241
35723 -604241 -423570 -511855 -577664 -288847 311689 865439 1023561 715902 238409 34911
35713 34911 243365 528411 531805 366934 398052 620219 639836 325704 87028 282575
35703 282575 651875 672184 329667 133857 326722 467152 53911 -696498 -1083718 -855649
35693 -855649 -463779 -308951 -229875 -42351 -107421 -786729 -1607734 -1681182 -918727 -144846
35683 -144846 101948 173699 480750 771071 681188 399796 230933 877 -469931 -726560
$$ packed form
35753F08607N97020O81239J76458m21016n72124l93512k60911j71522L7107J83459
35743D64805j5321l61196l19367K42256P92879P18232R808p03042p93972k95024
35733b59942J68241J45538j23711j62818M671k3839k82903l38148j3403K82073
35723f04241J80671q8285o5809K88817O00536N53750J58122l07659m77493k03498
35713C4911K08454K85046L394j64871L1118K22167J9617l14132k38676J95547
35703B82575L69300K0309l42517j95810J92865J40430m13241p50409l87220K28069
35693h55649L91870J54828P9076J87524o5070o79308q21005p3448P62455P73881
35683a44846K46794P1751L07051K90321q9883k81392j68863k30056m70808k56629
$$ plain form
35673 -726560 -246316 617538 1008994 753468 442452 392809 276806 -121402 -492929 -581560
35663 -581560 -607342 -848746 -1234578 -1551844 -1667131 -1410876 -683090 177590 585875 444185
35653 444185 247161 307871 377296 209854 -54220 -324491 -778711 -1291979 -1264064 -514592
35643 -514592 201047 162413 -307598 -458298 -294240 -369041 -727882 -924844 -923069 -1077588
35633 -1077588 -1253541 -890288 -87025 278131 -164477 -665449 -461202 203198 651029
35624 651029 747525 703878 438669 -157374 -665589 -577237 -122543 -228 -339920 -544368
35614 -544368 -207879 332052 471584 -27048 -956584 -1869738 -2307196 -2139315 -1725232 -1476554
35604 -1476554 -1336024 -1023036 -661930 -658140 -971926 -1086225 -799502 -491063 -428265 -389101
$$ packed form
35673g26560M80244Q63854L91456k55526l11016m9643j16003l98208l71527q8631
35663e81560k5782k41404l85832l17266j15287K56255P27786Q60680M08285j41690
35653D44185j97024O0710O9425j67442k64074k70271m54220n13268K7915P49472
35643e14592P15639l8634m70011j50700J64058p4801l58841j96962J775j54519
35633a077588j75953L63253Q03263L65156m42608n00972K04247O64400M47831
35624F51029R6496m3647k65209n96043n08215Q8352M54694J22315l39692k04448
35614e44368L36489N39931J39532m98632r29536r13154m37458J67881M14083K48678
35604a476554J40530L12988L61106L790l13786j14299K86723L08439O2798L9164
$$ plain form
35594 -389101 -233224 -247514 -527899 -593291 -165735 151283 -336966 -1279459 -1697788 -1378712
35584 -1378712 -1044410 -1111809 -1104869 -585206 27975 68154 -372683 -586391 -225358 313355
35574 313355 480001 241520 67571 376936 1075919 1661547 1786831 1626696 1569051 1670646
35564 1670646 1673034 1494306 1358095 1380245 1385142 1282081 1281449 1501106 1670823 1559183 1445191
35553 1445191 1732212 2212927 2216123 1562616 927245 1005332 1644766 2150057 2243010 2271658
35543 2271658 2476347 2549220 2191022 1726467 1688711 1949947 1834608 1175156 674174 888396
35533 888396 1343169 1211921 590496 408808 1083874 1926712 2116629 1716739 1335045 1190942
35523 1190942 1061706 973436 1314302 2083992 2503637 1829889 444678 -344001 201765
$$ packed form
35594c89101J55877j4290k80385o5392M27556L17018m88249r42493m18329L19076
35584a378712L34302o7399O940N19663O13181M0179m40837k13708L61033N38713
35574C13355J66646k38481j73949L09365O98983N85628J25284j60135n7645J01595
35564A670646K388j78728j36211K2150M897j03061o32K19657J69717j11640j13992
35553A445191K87021M80715L196o53507o35371P8087O39434N05291R2953K8648
35543B271658K04689P2873l58198m64555l7756K61236j15339o59452n00982K14222
35533H88396M54773j31248o21425j81688O75066Q42838J89917l99890l81694j44103
35523A190942j29236q8270L40866P69690M19645o73748j385211p88679N45766
$$ plain form
35514 201765 1280433 1479518 527378 -419439 -324597 485367 986269 842444 519572 339363
35504 339363 180690 68554 313951 895120 1305567 1255888 1012969 808863 452565 -137955
35494 -137955 -530591 -371363 -11809 -64508 -598004 -1219188 -1699442 -2013129 -1949173 -1291713
35484 -1291713 -395556 -14660 -353291 -692554 -260742 742946 1315597 827115 -216689
35475 -216689 -738286 -313945 408364 579325 143868 -310780 -472235 -592193 -890330 -1189237
35465 -1189237 -1293366 -1270896 -1124156 -612355 255229 899140 770413 91450 -368622 -164285
35455 -164285 449497 913342 900296 512905 98274 -151788 -371157 -625207 -526806 271253
35445 271253 1246356 1353905 420187 -493313 -495467 26563 223123 57665 42613 203942
$$ packed form
35514B01765J078668J99085r52140r46817R4842Q09964N00902j43825l22872j80209
35504C39363j58673j12136K45397N81169M10447m9679k42919k04106l56298n90520
35494a37955l92636J59228L59554n2699n33496o21184m80254l13687O3956O57460
35484a291713Q96157L80896l38631l39263M31812J003688N72651m88482j043804
35475b16689n21597M24341P22309J70961m35457m54648j61455j19958k98137k98907
35465a189237j04129K2470J46740N11801Q67584O43911j28727o78963m60072K04337
35455a64285O13782M63845j3046l87391m14631k50062k19369k54050R8401P98059
35445B71253R75103J07549r33718r13500k154N22030J96560j65458j5052J61329
$$ plain form
35435 203942 165596 -17466 48380 307085 328094 93465 -25310 -36497 -327250 -847932
35425 -847932 -1020047 -611147 -90678 48050 -200956 -616040 -978086 -958671 -361881 374226
35415 374226 473561 -193653 -918504 -1099609 -867760 -600681 -369701 -137059 -21556 -62233
35405 -62233 -95693 -107845 -328613 -751876 -950357 -626846 -18325 469350 700440 686536
35395 686536 392903 -67669 -351732 -280959 -123513 -267150 -752402 -1238641 -1291976 -707048
35385 -707048 244034 918391 909999 487717 186649 166257 332075 776389 1486207 1860347
35375 1860347 1323476 353921 41054 550132 901173 449003 -307845 -689060 -737586 -759222
35365 -759222 -734713 -628028 -592613 -511296 -66323 424330 147492 -808834 -1223004 -516368
$$ packed form
35435B03942l8346j83062O5846K58705K1009k34629j18775j1187k90753n20682
35425h47932j72115M08900N20469J38728k49006m15084l62046J9415N96790P36107
35415C74226R9335o67214p24851j81105K31849K67079K30980K32642J15503m0677
35405f2233l3460j2152k20768m23263j98481L23511O08521M87675K31090j3904
35395F86536k93633m60572k84063P0773J57446j43637m85252m86239n3335N84928
35385g07048R51082O74357q392m22282l01068k0392J65818M44314P09818L74140
35375A860347n36871r69555l12867N09078L51041m52170p56848l81215m8526k1636
35365g59222K4509J06685L5415Q1317M44973M90653k76838r56326m14170P06636
$$ plain form
35355 -516368 292678 227573 -101961 327089 1144007 1247262 618551 116487 -84290 -461581
35345 -461581 -841986 -551564 193378 403639 -74224 -327599 57521 429358 371694 370558
35335 370558 697755 732771 75262 -554442 -295387 607449 1264301 1384814 1376007 1494841
35325 1494841 1523354 1195098 539819 -155696 -538498 -469303 -221088 -213327 -496700 -739460
35315 -739460 -726572 -554189 -325697 -34324 210183 228090 110317 146025 359301 480902
35305 480902 409306 329833 366811 480127 657688 824852 696958 198797 -157105 80548
35295 80548 472430 277864 -268053 -209070 585877 1170343 1012503 669270 598767 385943
35285 385943 -251962 -685008 -372753 177187 281394 183247 389123 560502 111019 -543864
$$ packed form
35355e16368Q09046o5105l29534M29050Q16918J03255o28711n02064k00777l77291
35345d61581l80405K90422P44942K10261m77863k53375L85120L71837n7664j136
35335C70558L27197L5016o57509o29704K59055R02836O56852J20513q807J18834
35325A494841K8513l28256o55279o95515l82802O9195K48215P761k83373k42760
35315g39460J2888J72383K28492K91373K44507J7907j17773L5708K13276J21601
35305D80902p1596p9473L6978J13316J77561J67164j27894m98161l55902K37653
35295H0548L91882j94566n45917N8983P94947N84466j57840l43233p0503k12824
35285C85943o37905m33046L12255N49940J04207r8147K05876J71379m49483o54883
$$ plain form
35275 -543864 -432810 470402 1184376 1111400 623936 239770 4142 -180897 -264314 -259970
35265 -259970 -292727 -342886 -305610 -268003 -358243 -421926 -242853 45559 170241 167267 198878
35254 198878 138463 -179592 -502733 -459214 -116893 234872 576107 897683 848888 350950
35244 350950 150012 836340 1637768 1310357 79881 -568038 -108911 361786 40139
35235 40139 -382735 -113260 374200 319229 56261 306630 789268 690090 72709 -283756
35225 -283756 -187035 -139341 -297596 -307231 -127324 -105913 -205839 -13276 412706 529114 252987
35214 252987 89098 169550 43754 -320504 -258886 404109 770529 160381 -706899 -653296
35204 -653296 290741 1019897 912994 425612 171065 167928 147533 23959 -179369 -485432
$$ packed form
35275e43864J11054R03212P13974p2976m87464l84166k35628j85039q3417M344
35265b59970l2757n0159L7276L7607r0240o3683J79073K88412J24682k974L1611
35254A98878o0415l18055l23141M3519L42321L51765L41235L21576m8795m97938
35244C50950k00938O86328Q01428l27411j230476o47919M59127M70697l21647
35235D0139m22874K69475M87460n4971k62968K50369M82638r9178o17381l56465
35225b83756R6721M7694j58255r635J79907K1411r9926J92563M25982J16408k76127
35214B52987j63889Q0452j25796l64258O1618O62995L66420o10148q67280N3603
35204f53296R44037P29156j06903m87382k54547l137k0395j23574k03328l06063
$$ plain form
35194 -485432 -833030 -1025108 -932596 -606631 -195648 98744 94172 -131929 -235703 -106713
35184 -106713 -143070 -638381 -1145967 -1021718 -446300 -214302 -513516 -682965 -359258 -71722
35174 -71722 -300022 -639230 -475881 24696 234303 820 -338768 -609907 -861322 -969800
35164 -969800 -778921 -519602 -540360 -695542 -536484 -65925 235209 148533 -19224 29347
35154 29347 246316 506552 770799 882288 611052 40344 -415990 -487683 -276395 3825
35144 3825 220653 282715 229825 316693 661231 905977 642986 58564 -336903 -492045
35134 -492045 -723579 -945489 -735193 -192411 78694 -15804 76219 415597 237177 -751673
35124 -751673 -1612729 -1420317 -561394 -13317 91155 299528 665641 693206 284347 -109887
$$ packed form
35194d85432l47598j92078R2512L25965M10983K94392m572k26101j03774J28990
35184a06713l6357m95311n07586J24249N75418K31998k99214j69449L23707K87536
35174g1722k28300l39208J63349N00577K09607k33483l39588k71139k51415j08478
35164i69800J90879K59319k0758j55182J59058M70559L01134q6676j67757M8571
35154B9347K16969K60236K64247J11489k71236n70708m56334p1693K11288K80220
35144C825K16828O2062n2890Q6868L44538K44746k62991n84422l95467j55142
35134d92045k31534k21910K10296N42782K71105r4498R2023L39378j78420r88850
35124g51673q61056J92412Q58923N48077J04472K08373L66113K7565m08859l94234
$$ plain form
35114 -109887 -271590 -434212 -678383 -725467 -433572 -21544 288492 490052 628771 710979
35104 710979 736671 607779 172137 -420825 -704771 -531575 -350673 -482053 -559365 -198109
35094 -198109 270602 399590 490291 1014622 1547784 1296389 518176 320348 977637 1499499
35084 1499499 1121198 287712 -201270 -201248 26461 340569 555368 380652 -48728 -150587
35074 -150587 215123 421065 48528 -410725 -332327 101642 328035 341346 572950 1083366
35064 1083366 1453162 1383918 991220 560030 282610 160094 19856 -229869 -358691 -137701
35054 -137701 130222 -85422 -662945 -902840 -641020 -519329 -818880 -885182 -309310 133894
35044 133894 -416531 -1490294 -1943889 -1606146 -1220196 -1005949 -428868 567298 1191468
$$ packed form
35114a09887j61703j62622k44171m7084K91895M12028L10036K01560J38719Q2208
35104G10979K5692j28892m35642n92962k83946J73196J80902j31380p7312L61256
35094a98109M68711J28988R0701N24331N33162k51395p78213j97828O57289N21862
35084A499499l78301q33486m88982K2K27709L14108K14799j74716m29380j01859
35074a50587L65710K05942l72537m59253P8398M33969K26393J3311K31604N10416
35064A083366L69796o9244l92698m31190k77420j22516j40238k49725j28822K20990
35054a37701K67923k15644n77523k39895K61820J21691k99551o6302N75872M43204
35044A33894n50425j073763m53595L37743L85950K14247N77081R96166O24170
$$ plain form
35035 1191468 974946 438035 196896 125501 -145219 -496619 -615710 -592584 -700244 -846077
35025 -846077 -718720 -329686 5859 161402 314224 555175 675709 451397 -17618 -358418
35015 -358418 -274119 196321 726142 975321 855954 590678 508398 707848 909109 752971
35005 752971 285591 -54029 -65131 -137727 -661167 -1310494 -1410505 -924717 -530223 -669902
34995 -669902 -1086808 -1393633 -1493578 -1268765 -550714 272357 336157 -516217 -1291707 -1191291
34985 -1191291 -756211 -912056 -1449858 -1431884 -743732 -181747 -125922 -163548 -82993 -252433
34975 -252433 -776483 -1123748 -921099 -448129 -63868 241738 481489 479547 312119 339570
34965 339570 535272 407279 -107782 -340663 92631 586532 395693 -315786 -848240 -971202
$$ packed form
35035A191468k16522n36911k41139p1395k70720l51400j19091K3126j07660j45833
35025h46077J27357L89034L35545J55543J52822K40951J20534k24312m69015l40800
35015c58418Q4299M70440N29821K49179j19367k65276q2280J99450K01261j56138
35005G52971m67380l39620j1102p2596n23440o49327j00011M85788L94494j39679
34995f69902m16906l06825r9945K24813P18051Q23071O3800q52374p75490J00416
34985a191291M35080j55845n37802J7974O88152N61985N5825l7626Q0555j69440
34975b52433n24050l47265K02649M72970L84261L05606K39751j942j67428K7451
34965C39570J95702j27993n15061k32881M33294M93901j90839p11479n32454j22962
$$ plain form
34955 -971202 -941958 -839145 -535774 -185430 -123781 -290749 -243586 186583 618682 593454
34945 593454 84103 -514401 -746133 -448175 123634 535172 601749 506845 483353 544168
34935 544168 569652 449345 69022 -600014 -1297323 -1604983 -1403802 -975726 -582181 -235907
34925 -235907 18123 -29472 -399226 -762579 -868943 -855774 -924779 -1004288 -960278 -850472
34915 -850472 -729635 -487651 -117434 151575 225463 336933 617239 818663 736858 545692
34905 545692 410898 172536 -229853 -447337 -279159 -114068 -298398 -495095 -304403 -114991
34895 -114991 -535823 -1250679 -1352336 -750145 -317563 -520294 -793778 -590133 -238892 -284390
34885 -284390 -580426 -589482 -165577 450427 1071780 1517837 1410722 564722 -524664 -1045554
$$ packed form
34955i71202K9244J02813L03371L50344O1649j66968M7163M30169M32099k5228
34945E93454n09351n98504k31732K97958N71809M11538O6577r4904k3492O0815
34935E44168K5484j20307l80323o69036o97309l07660K01181M28076L93545L46274
34925b35907K54030m7595l69754l63353j06364J3169o9005p9509M4010J09806
34915h50472J20837K41984L70217K69009P3888J11470K80306K01424q1805j91166
34905E45692j34794k38362m02389k17484J68178J65091j84330j96697J90692J89412
34895a14991m20832p14856j01657O02191M32582k02731k73484K03645L51241m5498
34885b84390k96036r056M23905O16004O21353M46057j07115q46000j089386n20890
$$ plain form
34875 -1045554 -735004 -65342 392686 463786 248142 -89523 -254903 128438 1091161 2046615
34865 2046615 2253729 1598504 690234 108648 -172722 -419259 -504750 -111524 544198 760829
34855 760829 281247 -320637 -456170 -281828 -271119 -419458 -371785 -94837 86984 -1274
34845 -1274 -270773 -621680 -891916 -727953 3660 805669 1064085 865800 758947 806095
34835 806095 540973 -109237 -556725 -393931 91461 456527 612521 574371 260222 -157311
34825 -157311 -196233 302251 895771 1168863 1199281 1125659 761082 34642 -617447 -731684
34815 -731684 -344103 289279 1038437 1569717 1233133 -80391 -1388383 -1660878 -1153891
34806 -1153891 -963261 -1443634 -1893853 -1776119 -1376650 -1060759 -668986 -58535 373049
$$ packed form
34875a045554L10550O69662M58028P1100k15644l37665j65380L83341R62723R55454
34865B046615K07114o55225r08270n81586k81370k46537q5491L93226O55722K16631
34855G60829m79582o01884j35533J74342J0709j48339M7673K76948J81821q8258
34845a274k69499l50907k70236J63963P31613Q02009K58416j98285j06853M7148
34835H06095k65122o50210m47488J62794M85392L65066J55994l8150l14149m17533
34825a57311l8922M98484N93520K73092L0418p3622l64577p26440o52089j14237
34815g31684L87581O33382P49158N31280l36584j313524j307992k72495N06987
34806a153891J90630m80373m50219J17734L99469L15891L91773O10451M31584
$$ plain form
34797 373049 233583 -173701 -216593 210944 631979 671791 413484 103110 -145605 -281471
34787 -281471 -233205 -56829 4395 -191330 -396022 -192009 434405 924217 722366 -70431
34777 -70431 -809654 -1006495 -705287 -245415 21853 -217144 -1024858 -1855173 -1827471 -720741
34767 -720741 581899 1031596 592857 75499 -27192 9341 -150474 -309923 -125863 262465
34757 262465 343854 -115421 -772183 -1088428 -904239 -549038 -378555 -331719 -132422 156622
34747 156622 167868 -85796 -48939 493812 829292 238474 -763928 -931642 -59946 595513
34737 595513 27269 -1125086 -1500655 -846708 -134085 -25574 -81523 283734 738854 485779
34727 485779 -512013 -1343602 -1255393 -511564 66392 120172 -11327 84230 434139 848720
$$ packed form
34797C73049j39466m07284m2892M27537M21035L9812k58307l10374k48715j35866
34787b81471M8266J76376O1224j95725k04692K04013O26414M89812k01851p92797
34777g0431p39223j96841L01208M59872K67268k38997q07714q30315K7702J106730
34767g20741J302640M49697m38739n17358j02691L6533j59815j59449J84060L88328
34757B62465Q1389m59275o56762l16245J84189L55201J70483M6836J99297K89044
34747A56622J1246k53664L6857N42751L35480n90818j002402j67714Q71696O55459
34737E95513n68244j152355l75569O53947P12623J08511n5949L65257M55120k53075
34727D85779r97792q31589Q8209P43829N77956N3780j31499R5557L49909M14581
$$ plain form
34717 848720 1160855 1185709 809758 315297 250125 680723 937063 522744 -57991 8219
34707 8219 534969 519628 -284712 -832616 -263480 770500 965008 162214 -543159 -435022
34697 -435022 -75440 -268124 -784014 -733089 80892 847235 841527 277665 -180148 -302426
34687 -302426 -260912 -30830 545856 1146873 1096284 345133 -247359 -30967 487743 361774
34677 361774 -446084 -1079691 -1018944 -598102 -238786 157114 773682 1364891 1554803 1333461
34667 1333461 933406 473810 27404 -196045 -74678 151121 127965 -162882 -447235 -576009
34657 -576009 -665041 -838682 -1036412 -1112626 -1015597 -825924 -643017 -446443 -140601 184294
34647 184294 175244 -344652 -930212 -893460 -225601 251951 -99155 -891996 -1221261 -788022
$$ packed form
34717H48720L12135K4854l75951m94461o5172M30598K56340m14319n80735O6210
34707H219N26750j5341q04340n47904N69136J033980J94508q02794p05373J08137
34697d35022L59582j92684n15890N0925Q13981P66343n708n63862m57813j22278
34687c02426M1514K30082N76686O01017n0589p51151n92492K16392N18710j25969
34677C61774q07858o33607O0747M20842L59316L95900O16568N91209J89912k21342
34667A333461m00055m59596m46406k23449J21367K25799k3156k90847k84353j28774
34657e76009q9032j73641j97730p6214R7029J89673J82907J96574L05842L24895
34647A84294r050n19896n85560L6752O67859M77552l51106p92841l29265M33239
$$ plain form
34637 -788022 -127312 182677 129992 36918 49857 43529 -101528 -280439 -245593 92099 462179
34626 462179 443074 -58289 -632679 -779296 -424883 61053 298925 231532 59564 -38676
34616 -38676 -80538 -189376 -372011 -481855 -454167 -434549 -526240 -572247 -443581 -380332 -638103
34605 -638103 -877765 -469284 470176 925948 222191 -1052833 -1808599 -1788408 -1622075 -1775355
34595 -1775355 -2028213 -1962210 -1469767 -717859 9363 368932 198390 -228846 -468567 -460300
34585 -460300 -516132 -721967 -718253 -239923 424384 746647 557346 134809 -158972 -136352
34575 -136352 199255 644863 835881 561738 138172 218243 990643 1726059 1507911 422037
34565 422037 -456194 -474120 -277548 -780646 -1716907 -2034596 -1559957 -1285890 -1832018 -2570172
$$ packed form
34637g88022O60710L09989n2685r3074J2939o328j45057j78911L4846L37692L70080
34626D62179j9105n01363n74390j46617L54413M85936K37872o7393j71968r8240
34616c8676m1862j08838j82635j09844K7688J9618r1691m6007J28666O3249k57771
34605f38103k39662M08481R39460M55772p03757j275024p55766K0191J66333j53280
34595a775355k52858O6003M92443P51908P27222L59569j70542m27236k39721Q267
34585d60300n5832k05835L714M78330O64307L22263j89301m22537k93781K2620
34575a36352L35607M45608J91018k74143m23566Q0071P72400P35416k18148j085874
34565D22037q78231j7926J96572n03098r36261l17689M74639K74067n46128p38154
$$ plain form
34555 -2570172 -2721598 -2467399 -2326723 -2168097 -1661768 -1171181 -1293448 -1871626 -2337288
34546 -2337288 -2720241 -3362194 -3858321 -3390480 -2139559 -1288066 -1395627 -1758786 -1707608
34537 -1707608 -1559719 -1763872 -1961036 -1612422 -954302 -603226 -622948 -650965 -656010 -923132
34527 -923132 -1415849 -1687635 -1434003 -827313 -336110 -345190 -783962 -1062265 -690258 -28960
34517 -28960 48047 -611501 -1143517 -913066 -399981 -329378 -528682 -368195 98372 251924
34507 251924 -55310 -359795 -409742 -441969 -642449 -925648 -1247055 -1588448 -1670240 -1250687
34497 -1250687 -674997 -503752 -596270 -265247 544352 977611 470428 -435657 -912782 -935036
34487 -935036 -1008817 -1207460 -1108361 -574857 -58676 -33045 -443490 -830554 -829560 -482696 -150698
$$ packed form
34555b570172j51426K54199J40676J58626N06329M90587j22267n78178m65662
34546b337288l82953o41953m96127M67841J250921Q51493j07561l63159N1178
34537a707608J47889k04153j97164L48614O58120L51076j9722k8017n045k67122
34527i23132m92717k71786K53632O06690M91203r080m38772k78303L72007O61298
34517b8960P7007o59548n32016K30451N13085P0603j99304J60487M66567J53552
34507B51924l07234l04485m9947l2227k00480k83199l21407l41393q1792M19553
34497a250687N75690J71245r2518L31023Q09599M33259n07183r06085m77125k2254
34487i35036p3781j98643R9099N33504N16181K5631m10445l87064R94L46864L31998
$$ plain form
34476 -150698 -157748 -492955 -848754 -924105 -653993 -208633 128847 138391 -142120 -410975
34466 -410975 -394294 -110109 221369 412078 361717 76861 -205351 -154708 155192 172379
34456 172379 -367028 -898783 -741356 -88767 319643 335294 451231 755509 695713 91068
34446 91068 -442365 -461147 -368201 -631315 -964859 -877056 -516146 -337407 -331112 -220606 -100209
34435 -100209 -225053 -415582 -312220 -34494 26515 -103432 -123686 -113842 -356435 -620711
34425 -620711 -383010 234431 516098 258852 60519 268084 376972 -118693 -875997 -1186201
34415 -1186201 -897604 -437177 -235831 -464211 -998525 -1331262 -890263 182934 925971
34406 925971 639712 -229876 -726032 -600369 -388135 -478702 -685824 -709605 -531850 -279000
$$ packed form
34476a50698p050l35207l55799p5351K70112M45360L37480R544k80511k68855
34466d10975J6681K84185L31478J90709n0361k84856k82212N0643L09900J7187
34456A72379n39407n31755J57427O52589M08410J5651J15937L04278n9796o04645
34446I1068n33433j8782R2946k63114l33544Q7803L60910J78739O295J10506J20397
34435a00209j24844j90529J03362K77726O1009j29947k0254R844k42593k64276
34425f20711K37701O17441K81667k57246j98333K07565J08888m95665p57304l10204
34415a186201K88597M60427K01346k28380n34314l32737M40999J073197P43037
34406I25971k86259q69588m96156J25663K12234r0567k07122k3781J77755K52850
$$ plain form
34396 -279000 -46132 68310 -5220 -221687 -529591 -956558 -1389082 -1459094 -957188 -202761
34386 -202761 324675 561876 720050 779225 594987 348541 336367 400600 184815 -66951
34376 -66951 304807 1233848 1716324 1112891 38744 -522241 -461051 -327892 -304068 -106237
34366 -106237 257021 327357 -124641 -738586 -1007148 -786642 -320348 17652 26030 -73480
34356 -73480 192332 874319 1294153 813957 -222964 -831917 -660150 -370433 -618069 -1199236
34346 -1199236 -1541426 -1584334 -1676525 -1834692 -1660860 -1032809 -441005 -412393 -805216 -929090
34336 -929090 -366213 487856 818422 298042 -541767 -928766 -713304 -417654 -476798 -728116
34326 -728116 -785329 -651451 -643962 -797930 -729098 -248313 177359 -80208 -928228 -1542401
$$ packed form
34396b79000K32868J14442p3530k16467l07904m26967m32524p0012N01906P54427
34386b02761N27436K37201J58174N9175j84238k46446j2174O4233k15785k51766
34376f6951L71758R29041M82476o03433j074147n60985O1190J33159K3824J97831
34366a06237L63258P0336m51998o13945k68562K20506M66294L38000Q378r9510
34356g3480K65812O81987M19834m80196j036921o08953J71767K89717k47636n81167
34346a199236l42190m2908r2191j58167J73832O28051N91804K8612l92823j23874
34336i29090N62877Q54069L30566n20380q39809l86999K15462K95650n9144k51318
34326g28116n7213J33878P489j53968O8832M80785M25672k57567q48020o14173
$$ [...]
##END NTUPLES=NMR SPECTRUM
##END=
