##TITLE=31Pdec_LR-684-C1M
 CDcl3, 24 sc
 26.7.2019
##JCAMPDX= 6.0         $$ Bruker NMR JCAMP-DX V2.0
##DATA TYPE= NMR SPECTRUM
##DATA CLASS= NTUPLES
##ORIGIN= UXNMR, Bruker Analytische Messtechnik GmbH
##OWNER= root
$$ XWIN-NMR		Version 3.5
$$ Fri Jul 26 15:33:19 2019 Russian Standard Time (UT+4h)  she@DPX200
##.OBSERVE FREQUENCY= 81.013821
##.OBSERVE NUCLEUS= ^31P
##.ACQUISITION MODE= SIMULTANEOUS
##.ACQUISITION SCHEME= undefined
##.AVERAGES= 24
##.DIGITISER RES= 17
##SPECTROMETER/DATA SYSTEM= spect
##.PULSE SEQUENCE= zgpg30
##.SOLVENT NAME= CDCl3
##.SHIFT REFERENCE= (INTERNAL, CDCl3, 0, 182.463)
##AUDIT TRAIL= $$ (NUMBER, WHEN, WHO, WHERE, WHAT)
$$ ##TITLE= Audit trail, XWIN-NMR		Version 3.5
$$ ##JCAMPDX= 5.01
$$ ##ORIGIN= Bruker BioSpin GmbH
$$ ##OWNER= she
$$ F:/spectra/data/she/nmr/P31/1/pdata/1/auditp.txt
$$ ##AUDIT TRAIL=  $$ (NUMBER, WHEN, WHO, WHERE, WHAT)
(   1,<2019-07-26 15:32:35.95 +0400>,<she>,<DPX200>,
      <created by zg, POWCHK disabled, PULCHK disabled
       configuration hash MD5:
       00 E9 B6 7A A2 85 ED C7 34 08 36 98 17 FE 4E 26
       data hash MD5: 32K
       34 3E 47 6B 92 5C F5 B8 DB 87 CD 9B 5F 0D CB 08>)
(   2,<2019-07-26 15:32:38.26 +0400>,<she>,<DPX200>,
      <Start of raw data processing
       efp BC_mod = 2 LB = 1 FT_mod = 6 PKNL = 1 PHC0 = -403.6025 PHC1 = 130.4 SI = 64K 
       data hash MD5: 64K
       E0 1A 44 F9 EC 46 71 6D 36 4F 48 AA 0F 81 C2 40>)
(   3,<2019-07-26 15:32:50.64 +0400>,<she>,<DPX200>,
      <pk PHC0 = 0.3179333 PHC1 = 0 
       data hash MD5: 64K
       C4 7A E9 31 90 10 0C EE 62 94 C0 03 C4 1F 3B E6>)
(   4,<2019-07-26 15:32:53.43 +0400>,<she>,<DPX200>,
      <abs ABSG = 5 
       data hash MD5: 64K
       3B 6C 3F A5 8A 61 EA E9 3A 6F 47 84 FC 0A 79 E2>)
$$ ##END=
$$ 
$$ hash MD5
$$ AC BE 7D 99 93 80 C7 17 5D 45 5E CB 2E 95 AB 9B
##$RELAX= 
##$RELAX= 
##$RELAX= 
##$RELAX= 
##$RELAX= 
##$RELAX= 
##$RELAX= 
##$RELAX= 
$$ Bruker specific parameters
$$ --------------------------
##$DU= <F:/spectra>
##$EXPNO= 1
##$NAME= <P31>
##$PROCNO= 1
##$TYPE= <nmr>
##$USER= <she>
##$AMP= (0..31)
100 100 100 100 100 100 100 100 100 100 100 100 100 100 100 100 100 100 
100 100 100 100 100 100 100 100 100 100 100 100 100 100 
##$AQSEQ= 0
##$AQ_mod= 1
##$AUNM= <au_zg>
##$AUTOPOS= <>
##$BF1= 81.014009
##$BF2= 200.13
##$BF3= 200.13
##$BF4= 200.13
##$BF5= 200.13
##$BF6= 200.13
##$BF7= 200.13
##$BF8= 200.13
##$BYTORDA= 1
##$CFDGTYP= 0
##$CFRGTYP= 5
##$CHEMSTR= <none>
##$CNST= (0..31)
1 1 145 1 1 1 1 1 1 1 1 1 1 1 1 1 1 1 1 1 1 1 1 1 1 1 1 1 1 1 1 1 
##$CPDPRG= <waltz16>
##$CPDPRG1= <>
##$CPDPRG2= <waltz16>
##$CPDPRG3= <>
##$CPDPRG4= <mlev>
##$CPDPRG5= <mlev>
##$CPDPRG6= <mlev>
##$CPDPRG7= <mlev>
##$CPDPRG8= <mlev>
##$CPDPRGB= <>
##$CPDPRGT= <>
##$D= (0..31)
0 1 0 0 0 0 0 0 0 0 0 0.03 2e-05 3e-06 0 0 0 0 0 0 0 0 0 0 0 0 0 0 0 0 
0 0 
##$DATE= 1564140755
##$DBL= (0..7)
120 120 120 11 120 120 24 19 
##$DBP= (0..7)
150 150 150 150 150 150 150 150 
##$DBP07= 0
##$DBPNAM0= <>
##$DBPNAM1= <>
##$DBPNAM2= <>
$$ [...]
##$SUBNAM3= <"">
##$SUBNAM4= <"">
##$SUBNAM5= <"">
##$SUBNAM6= <"">
##$SUBNAM7= <"">
##$SUBNAM8= <"">
##$SUBNAM9= <"">
##$SW= 369.568048894756
##$SWIBOX= (0..15)
0 1 3 0 0 0 0 0 0 0 0 0 0 0 0 0 
##$SW_h= 29940.119760479
##$TD= 32768
##$TD0= 1
##$TE= 0
##$TE2= 300
##$TE3= 300
##$TEG= 300
##$TL= (0..7)
0 120 53 12 22 120 120 120 
##$TP= (0..7)
150 150 150 150 150 150 150 150 
##$TP07= 0
##$TPNAME0= <>
##$TPNAME1= <>
##$TPNAME2= <>
##$TPNAME3= <>
##$TPNAME4= <>
##$TPNAME5= <>
##$TPNAME6= <>
##$TPNAME7= <>
##$TPOAL= (0..7)
0.5 0.5 0.5 0.5 0.5 0.5 0.5 0.5 
##$TPOFFS= (0..7)
0 0 0 0 0 0 0 0 
##$TUNHIN= 0
##$TUNHOUT= 0
##$TUNXOUT= 0
##$USERA1= <user>
##$USERA2= <user>
##$USERA3= <user>
##$USERA4= <user>
##$USERA5= <user>
##$V9= 5
##$VALIST= <valist>
##$VCLIST= <CCCCCCCCCCCCCCC>
##$VD= 0
##$VDLIST= <DDDDDDDDDDDDDDD>
##$VPLIST= <PPPPPPPPPPPPPPP>
##$VTLIST= <TTTTTTTTTTTTTTT>
##$WBST= 1024
##$WBSW= 4
##$XGAIN= (0..3)
0 0 0 0 
##$XL= 0
##$YL= 0
##$YMAX_a= 19208
##$YMIN_a= -25379
##$ZGOPTNS= <>
##$ZL1= 120
##$ZL2= 120
##$ZL3= 120
##$ZL4= 120
##$ABSF1= 182.463
##$ABSF2= -187.1042
##$ABSG= 5
##$ABSL= 3
##$ALPHA= 0
##$AQORDER= 0
##$ASSFAC= 0
##$ASSFACI= 0
##$ASSFACX= 0
##$ASSWID= 0
##$AUNMP= <proc_1d>
##$AZFE= 0.1
##$AZFW= 0.5
##$BCFW= 0
##$BC_mod= 2
##$BYTORDP= 0
##$COROFFS= 0
##$CY= -3
##$DATMOD= 1
##$DC= 0
##$DFILT= <>
##$DTYPP= 0
##$F1P= 0
##$F2P= 0
##$FCOR= 1
##$FTSIZE= 65536
##$FT_mod= 6
##$GAMMA= 0
##$GB= 0
##$INTBC= 1
##$INTSCL= 5.30512e-09
##$ISEN= 30
##$LB= 1
##$LEV0= 0
##$LPBIN= 0
##$MAXI= 10000
##$MC2= 0
##$MEAN= 0
##$ME_mod= 0
##$MI= 50
##$NCOEF= 0
##$NC_proc= -6
##$NLEV= 6
##$NOISF1= 182.463
##$NOISF2= 159.3651
##$NSP= 0
##$NTH_PI= 0
##$NZP= 0
##$OFFSET= 182.463
##$PC= 4
##$PHC0= -403.2846
##$PHC1= 130.4
##$PH_mod= 1
##$PKNL= yes
##$PPARMOD= 0
##$PSCAL= 0
##$PSIGN= 0
##$REVERSE= no
##$SF= 81.0140089999434
##$SI= 65536
##$SIGF1= 159.3651
##$SIGF2= -187.1042
##$SINO= 113.3802
##$SIOLD= 16384
##$SREGLST= <1H.CDCl3>
##$SSB= 0
##$STSI= 65536
##$STSR= 0
##$SW_p= 29940.119760479
##$SYMM= 0
##$S_DEV= 0
##$TDeff= 32768
##$TDoff= 0
##$TI= <>
##$TILT= no
##$TM1= 0
##$TM2= 0
##$TOPLEV= 0
##$USERP1= <user>
##$USERP2= <user>
##$USERP3= <user>
##$USERP4= <user>
##$USERP5= <user>
##$WDW= 1
##$XDIM= 65536
##$YMAX_p= 320803683
##$YMIN_p= -9066043
$$ End of Bruker specific parameters
$$ ---------------------------------
##NTUPLES= NMR SPECTRUM
##VAR_NAME=  FREQUENCY,     SPECTRUM/REAL,   SPECTRUM/IMAG
##SYMBOL=    X,             R,               I
##VAR_TYPE=  INDEPENDENT,   DEPENDENT,       DEPENDENT
##VAR_FORM=  AFFN,          ASDF,            ASDF
##VAR_DIM=   65536,         65536,           65536
##UNITS=     HZ,            ARBITRARY UNITS, ARBITRARY UNITS
##FACTOR=    0.456856943014862, 1,           1
##FIRST=     14782.0589164792, 0,            0
##LAST=      -15158.0608439998, 0,           0
##MIN=       -15158.0608439998, -9066043,    0
##MAX=       14782.0589164792, 320803683,    0
$$ Real data points
##PAGE= N=1
##DATA TABLE= (X++(R..R)), XYDATA
$$ [...]
$$ plain form
45583 -613970 -1470910 -2160044 -1983239 -480069 1281669 1418885 -270216 -1795216 -1648020
45574 -1648020 -696015 -505704 -1072589 -1420496 -1351479 -1214968 -789122 192014 1045295 1023738
45564 1023738 629503 723307 884931 103676 -1317421 -2085822 -1973432 -2043102 -2756076 -3233239
45554 -3233239 -2700036 -1559799 -664020 -325180 -306670 -168130 447846 1324900 1626227
45545 1626227 964328 199904 358832 1087917 1195420 493484 -43647 85567 294031
45536 294031 116629 -1305 515772 1534480 2394654 2409408 1276183 -359812 -1034710
45527 -1034710 -70483 1235985 1163720 44408 -284989 522167 681215 -831434 -2527135
45518 -2527135 -2651428 -1730466 -1388889 -1627194 -1018481 748487 2190490 2107013 1057467
$$ packed form
45583f13970q56940o89134J76805J503170J761738J37216j689101j525000J47196
45574a648020R52005J90311n66885l47907O9017J36511M25846R81136Q53281k1557
45564A023738l94235R3804J61624p81255j421097p68401J12390o9670p12974m77163
45554c233239N33203J140237Q95779L38840J8510J38540O15976Q77054L01327
45545A626227o61899p64424J58928P29085J07503p01936n37131J29214K08464
45536B94031j77402j17934N17077J018708Q60174J4754j133225j635995o74898
45527a034710R64227J306468p2265j119312l29397Q07156J59048j512649j695701
45518b527135j24293R20962L41577k38305O08713J766968J442003q3477j049546
$$ plain form
45509 1057467 269785 -10597 -400424 -1090405 -1375780 -477912 1509311 3560900 4455954
45500 4455954 3592757 1353439 -1091417 -2460751 -2268613 -1252530 -627912 -718868 -685384
45491 -685384 60512 660685 -170034 -2059424 -2915993 -1425424 1092071 2135571 1103002
45482 1103002 -8059 701686 2441945 2797490 1130886 -417468 90352 1668593 2024576
45473 2024576 1058085 756723 1688911 1869031 -80966 -2676481 -3846144 -3763831 -3711820
45464 -3711820 -3610726 -2810982 -2226526 -3198279 -4811354 -4908867 -3607982 -3168832 -4134554
45455 -4134554 -4365290 -2769131 -1383740 -2251633 -4306420 -5126049 -4204049 -2687061 -1123716
45446 -1123716 619414 2000537 2160234 1268312 152007 -1003342 -2360547 -3351869 -3241817
$$ packed form
45509A057467p87682k80382l89827o89981k85375Q97868J987223K051589Q95054
45500D455954q63197k239318k444856j369334J92138J016083O24618r0956L3484
45491f85384P45896O00173q30719j889390q56569J490569K517495J043500j032569
45482A103002j111061P09745J740259L55545j666604j548354N07820J578241L55983
45473B024576r66491l01362R32188J80120j949997k595515j169663Q2313N2011
45464c711820J01094P99744N84456r71753j613075r7513J300885M39150r65722
45455d134554k30736J596159J385391q67893k054787q19629R22000J516988J563345
45446a123716J743130J381123J59697q91922j116305j155349j357205r91322J10052
$$ plain form
45437 -3241817 -2462498 -2141172 -2496534 -2816561 -2794764 -2737692 -2606676 -2066320 -1541976 -2071404
45427 -2071404 -3737249 -5066091 -4473337 -1978016 728248 1795822 886183 -576030
45419 -576030 -1042490 -607720 -468339 -747785 -191758 1500058 2564121 1535659 -526928
45410 -526928 -1624586 -1584001 -1544493 -1532776 -608170 940733 1664143 1282421 978452 1088102
45400 1088102 466073 -1244300 -2562678 -2337436 -1427928 -1160496 -1381358 -1161352 -373471
45391 -373471 547985 1502245 2272438 2039871 552443 -925864 -1104240 -556263 -769021
45382 -769021 -1664880 -1604788 17848 1590500 1271667 -768012 -2774668 -3498666 -3145936
45373 -3145936 -2479302 -1667784 -331885 1477742 2791518 2572106 977074 -680495 -1354249
$$ packed form
45437c241817P79319L21326l55362l20027K1797N7072J31016N40356N24344n29428
45427b071404j665845j328842N92754K495321K706264J067574r09639j462213
45419e76030m66460M34770J39381k79446N56027J691816J064063j028462k062587
45410e26928j097658M0585L9508J1717R24606J548903P23410l81722l03969J09650
45400A088102o22029j710373j318378K25242R09508K67432k20862K20006P87881
45391c73471R21456R54260P70193k32567j487428j478307j78376N47977k12758
45382g69021q95859O0092J622636J572652l18833k039679k006656p23998L52730
45373c145936O66634Q11518J335899J809627J313776k19412j595032j657569o73754
$$ plain form
45364 -1354249 -1152693 -552717 600187 2549554 4442349 4720633 2966883 658751 -370425
45355 -370425 165259 1032971 1083181 314481 -522608 -801599 -335962 706254 1785841
45346 1785841 2100764 1207124 -390464 -1619411 -1942165 -1793135 -1811093 -2043517 -2198300
45337 -2198300 -2279681 -2450265 -2458380 -1800489 -515717 624945 860165 124411 -967988
45328 -967988 -1503036 -737071 1283861 3447287 4348022 3549506 1822092 104809 -1342330
45319 -1342330 -2623093 -3534466 -3607230 -2670284 -1170701 16757 177594 -578367 -1322369
45310 -1322369 -1312653 -805386 -333199 493369 2372582 4453975 4571305 2158355 -338163
45301 -338163 -345099 1384625 1921595 346278 -1269966 -1340274 -1038443 -1904936 -2959980
$$ packed form
45364a354249K01556N99976J152904J949367J892795K78284j753750k308132j029176
45355c70425N35684Q67712N0210p68700q37089k78991M65637J042216J079587
45346A785841L14923q93640j597588j228947l22754J49030j7958k32424j54783
45337b198300q1381j70584q115O57891J284772J140662K35220p35754j092399
45328i67988n35048P65965K020932K163426R00735p98516j727414j717283j447139
45319a342330j280763r11373p2764R36946J499583J187458J60837p55961p44002
45310a322369R716N07267M72187Q26568J879213K081393J17330k412950k496518
45301c38163o936J729724N36970j575317j616244p0308L01831q66493j055044
$$ plain form
45292 -2959980 -2177404 82309 1314769 457916 -802787 -790841 -60554 138906 109891
45283 109891 922311 2262988 2651798 1488632 -448092 -2351218 -3889376 -4392290 -3034437
45274 -3034437 -336755 1694318 1653931 182253 -1252604 -2196336 -3047011 -3660186 -3146232
45265 -3146232 -1146836 1218839 2035665 473395 -1929432 -2488968 -560406 1207277
45257 1207277 124517 -2572994 -3074141 -401828 2060750 1494568 -433772 -555477 1029555
45248 1029555 1929456 1774141 2256700 3364866 3024930 1006552 -783 1465567 3034561
45239 3034561 1906585 -1024902 -2541710 -1421798 612817 1636482 1355850 372159
45231 372159 -750205 -1328845 -616235 1356259 3420108 4172403 3197886 1341673 -165696
$$ packed form
45292b959980P82576K259713J232460q56853j260703J1946P30287J99460k9015
45283A09891Q12420J340677L88810j163166j936724j903126j538158n02914J357853
45274c034437K697682K031073m0387j471678j434857r43732q50675o13175N13954
45265c146232J999396K365675Q16826j562270k402827n59536J928562J767683
45257A207277j082760k697511n01147K672313K462578n66182j928340j21705J585032
45248A029555Q99901j55315M82559J108166l39936k018378j007335J466350J568994
45239C034561j127976k931487j516808J119912K034615J023665k80632r83691
45231C72159j122364n78640P12610J972494K063849P52295r74517j856213j507369
$$ plain form
45222 -165696 -795397 -863429 -735696 -426190 -160770 -532074 -1453234 -1780293 -989582 -442413
45212 -442413 -1567122 -3413280 -3805619 -2598600 -1722016 -1967465 -2000556 -1069143 -405565
45203 -405565 -943266 -1690181 -1620673 -1353086 -1576062 -1545325 -716158 -283563 -1320906 -2696994
45193 -2696994 -2656631 -1378402 -231457 427526 924004 809706 -275551 -1141350 -464976
45184 -464976 990659 1510046 1128659 1239850 2122194 2902744 3402420 3849260 3297847
45175 3297847 769257 -2302082 -3292892 -2079150 -1013700 -1101865 -890549 325464 966060
45166 966060 -40268 -1285881 -1120863 -21686 594622 338614 -565108 -2135415 -3828067
45157 -3828067 -4214490 -2725287 -667507 461146 607922 400803 102554 135469 1132105
$$ packed form
45222a65696o29701o8032J27733L09506K65420l71304r21160l27059P90711N47169
45212d42413j124709j846158l92339J207019Q76584k45449l3091R31413O63578
45203d05565n37701p46915O9508K67587k22976L0737Q29167M32595j037343j376088
45193b696994M0363J278229J146945O58983M96478j14298j085257q65799O76374
45184d64976J455635N19387l81387J11191Q82344P80550M99676M46840n51413
45175C297847k528590l071339r90810J213742J065450q8165K11316J216013O40596
45166I66060j006328j245613J65018J099177O16308k56008r03722j570307j692652
45157c828067l86423J489203K057780J128653J46776k07119k98249L2915R96636
$$ plain form
45148 1132105 2437278 2097464 -394112 -2762149 -2764750 -1077909 96055 99484 -133569
45139 -133569 -93585 3629 270149 850827 1016342 13242 -1518883 -2232343 -1785108 -743495
45129 -743495 654794 2320540 3353993 2719480 816456 -723670 -771129 500924 2141051
45120 2141051 2937223 1989158 -229639 -1865949 -1714631 -731042 -559291 -1214404 -1394463
45111 -1394463 -525983 756391 1735735 2027270 1286528 -336890 -1843097 -2495598 -2717286
45102 -2717286 -2887867 -2210285 -197848 1689333 1748773 661560 394361 1036915 993298
45093 993298 17708 -450751 -116870 -433258 -1783161 -2498465 -1703223 -962454 -1765496
45084 -1765496 -3174970 -3478067 -2749184 -2219343 -2129394 -1677503 -467872 1126405 2584807
$$ packed form
45148A132105J305173l39814k491576k368037k601J686841J173964L429k33053
45139a33569L9984R7214K66520N80678J65515j003100j532125p13460M47235J041613
45129g43495J398289J665746J033453o34513j903024j540126m7459J272053J640127
45120B141051P96172r48065k218797j636310J51318R83589J71751o55113j80059
45111a394463Q68480J282374R79344K91535p40742j623418j506207o52501k21688
45102b717286j70581O77582K012437J887181N9440j087213k67199O42554m3617
45093I93298r75590m68459L33881l16388j349903p15304P95242P40769q03042
45084a765496j409474l03097P28883N29841Q9949M51891J209631J594277J458402
$$ plain form
45075 2584807 3497814 3758457 3889268 4335067 4250751 2404211 -294960 -1034330 1118813
45066 1118813 3586424 3988635 3630291 5026091 7378999 7463329 4546251 1425910 179849
45057 179849 -323071 -1550331 -2438734 -1399650 428071 404457 -1636354 -3006718 -2154401
45048 -2154401 -987115 -2028950 -4721436 -6335369 -5876676 -4988922 -4800573 -4050010 -1537994
45039 -1537994 1239497 1780902 21193 -1838354 -2496830 -2564384 -2514204 -1783402 -412553
45030 -412553 374742 136035 167707 1487078 3177077 3740730 2944443 1423029 -333376
45021 -333376 -1682441 -1813203 -1047915 -868695 -1643782 -1869137 -878377 -414114 -1654102
45012 -1654102 -2563163 -848602 1834103 1808438 -1111192 -3344188 -2859433 -1522104 -1430025
$$ packed form
45075B584807R13007K60643J30811M45799q4316j846540k699171p39370K153143
45066A118813K467611M02211l58344J395800K352908Q4330k917078l120341j246061
45057A79849n02920j227260q88403J039084J827721k3614k040811j370364Q52317
45048b154401J167286j041835k692486j613933M58693Q87754J88349P50563K512016
45039a537994K777491N41405j759709j859547o58476o7554N0180P30802J370849
45030d12553P87295k38707L1672J319371J689999N63653p96287j521414j756405
45021c33376j349065j30762P65288J79220p75087k25355R90760M64263j239988
45012a654102r09061J714561K682705k5665k919630k232996M84755J337329R2079
$$ plain form
45003 -1430025 -1990198 -2009627 -2050956 -2860548 -3476600 -2892934 -2100787 -2497137 -3396661 -3119626
44993 -3119626 -1811058 -1214287 -1914783 -2541965 -1838147 -237854 867982 626697 -616292
44984 -616292 -1612238 -1301847 -32482 714169 222920 -550492 -638703 -687839 -1737459 -3105893
44974 -3105893 -3098797 -1647854 -622689 -1195197 -2278829 -2251406 -1203620 -629836 -1449010
44965 -1449010 -3075599 -4216533 -4093720 -2998601 -1916159 -1489539 -1290177 -419726 1060404
44956 1060404 1772740 525605 -2043111 -3842404 -3495397 -1812439 -779663 -1207751 -1904986
44947 -1904986 -1410034 32806 910690 491682 -565104 -1584862 -2575598 -3139965 -2112720
44938 -2112720 602494 2886929 2584722 289743 -1486106 -1552139 -892043 -504795 -238708
$$ packed form
45003a430025n60173j9429m1329q09592o16052N83666P92147l96350q99524K77035
44993c119626J308568N96771p00496o27182P03818J600293J105836k41285j242989
44984f16292r95946L10391J269365P46651m91249p73412q8211m9136j049620j368434
44974c105893P096J450943J025165n72508j083632K7423J047786N73784q19174
44965a449010j626589j140934J22813J095119J082442M26620J99362Q70451J480130
44956A060404P12336j247135k568716j799293L47007J682958J032776m28088o97235
44947a904986M94952J442840Q77884m19008j056786j019758r90736n64367J027245
44938b112720K715214K284435l02207k294979j775849o6033O60096L87248K66087
$$ plain form
44929 -238708 -32523 -449725 -1245321 -1083745 274344 1014946 -183373 -1976430 -2348081
44920 -2348081 -1690049 -1917101 -3165676 -3634379 -2735346 -2200876 -3367843 -5144325 -5688192
44911 -5688192 -4757601 -3304120 -1840999 -472033 229043 -281954 -1435009 -2040095 -1750537
44902 -1750537 -1222947 -994777 -980141 -941751 -733977 -183634 615510 1036869 590600 -333343
44892 -333343 -1034145 -1505486 -2091091 -2501707 -2216208 -1636430 -1657790 -2182161 -2352066 -2222698
44882 -2222698 -2599199 -2993708 -1704309 1217261 3020124 1768710 -785463 -1690741 -835779
44873 -835779 -261202 -396127 262279 1877671 2527328 1392696 223685 500241 1273978
44864 1273978 1266886 1211480 2258362 3541464 3465268 2470526 2329308 3191405 3508054 2774057
$$ packed form
44929b38708K06185m17202p95596J61576J358089P40602j198319j793057l71651
44920b348081O58032k27052j248575m68703Q99033N34470j166967j776482n43867
44911e688192R30591J453481J463121J368966P01076n10997j153055o05086K89558
44902a750537N27590K28170J4636L8390K07774N50343P99144M21359m46269r23943
44892c33343p00802m71341n85605m10616K85499N79778k1360n24371j69905J29368
44882b222698l76501l94509J289399K921570J802863j251414k554173r05278Q54962
44873h35779N74577j34925O58406J615392O49657j134632j169011K76556P73737
44864A273978p092n5406J046882J283102p6196r94742j41218Q62097L16649p33997
$$ plain form
44854 2774057 2188305 2279471 1926886 518143 -671669 -385003 628546 751269 -283339
44845 -283339 -1482782 -2204638 -2454058 -2001119 -446419 1820768 3635597 4169195 3504503
44836 3504503 2221526 997515 475570 836850 1465641 1578254 1183234 933068 1123845
44827 1123845 1439522 1636264 1797854 1833577 1391766 458299 -532695 -1323429 -1947709 -2115824
44817 -2115824 -1320077 113779 994969 908122 1005891 2229453 3493346 2975678 873198
44808 873198 -649455 -411962 367323 204311 -465216 -337285 469575 605549 -349901
44799 -349901 -1268319 -1153197 -368414 159367 125587 -222769 -706374 -1241430 -1657268 -1937030
44789 -1937030 -2352052 -3001785 -3492735 -3399424 -2793762 -2037079 -1328071 -731526 -325119 -11129
$$ packed form
44854B774057n85752R1166l52585j408743j189812K86666J013549J22723j034608
44845b83339j199443p21856k49420M52939J554700K267187J814829N33598o64692
44836C504503j282977j224011n21945L61280O28791J12613l95020k50166J90777
44827A123845L15677J96742J61590L5723m41811r33467r90994p90734o24280j68115
44817b115824P95747J433856Q81190q6847R7769J223562J263893n17668k102480
44808H73198j522653K37493P79285j63012o69527J27931Q06860J35974r55450
44799c49901r18418J15122P84783N27781l3780l48356m83605n35056m15838k79762
44789a937030m15022o49733m90950R3311O05662P56683P09008N96545M06407L13990
$$ plain form
44779 -11129 428825 724534 82871 -1584724 -2820492 -1946090 796327 3279743 3843305
44770 3843305 2904057 2018811 2062120 2727297 3255289 3147822 2454782 1683713 1207923 731733
44760 731733 -167046 -986572 -689489 565188 1171887 310212 -620550 14227 1512909
44751 1512909 1862987 897630 508669 1565601 2627729 2522394 2350535 3450144 4711027
44742 4711027 3852913 824509 -1938099 -2657090 -2024123 -1576565 -1686230 -1786242 -1528349
44733 -1528349 -984457 -413960 -370650 -1306951 -2545828 -2503213 -697090 1275247 1783737
44724 1783737 1493304 2266067 4077091 4735443 3059187 731001 -47608 416327 109804
44715 109804 -1432690 -2421403 -1572353 -5059 470925 -195261 -813142 -1198134 -2289716
$$ packed form
44779a1129M39954K95709o41663j667595j235768Q74402K742417K483416N63562
44770C843305r39248q85246M3309O65177N27992j07467o93040p71069m75790m76190
44760G31733q98779q19526K97083J254677O06699q61675r30762O34777J498682
44751A512909L50078r65357l88961J056932J062128j05335j71859J099609J260883
44742D711027q58114l028404k762608p18991O32967M47558j09665j00012K57893
44733a528349N43892N70497M3310r36301j238877M2615J806123J972337N08490
44724A783737k90433P72763J811024O58352j676256k328186p78609M63935l06523
44715A09804j542494r88713Q49050J567294M75984o66186o17881l84992j091582
$$ plain form
44706 -2289716 -4043600 -4831883 -3656654 -1766305 -1028752 -1482324 -1667258 -887943 169658
44697 169658 920049 1584242 2135687 1818332 403963 -1002652 -1256539 -669112 -402297
44688 -402297 -788295 -1069050 -593666 467876 1533127 2088788 1771779 576424 -870326
44679 -870326 -1686158 -1594475 -1143196 -905210 -686334 176097 1674182 2589313 1621518 -766466
44669 -766466 -2267362 -1164593 1584008 3609265 4098187 4164262 4389952 3869664 2314292
44660 2314292 1210219 1593095 2283109 2004881 1803019 3153802 4762895 3955223 900729
44651 900729 -1326435 -1151457 -274526 -348596 -526294 360980 1458614 1470058 840081 560187
44641 560187 246552 -699715 -1235143 -63488 1904302 2538213 1527377 538280 522804
$$ packed form
44706b289716j753884p88283J175229J890349P37553m53572j84934P79315J057601
44697A69658P50391O64193N51445l17355j414369j406615k53887N87427K66815
44688d02297l85998k80755M75384J061542J065251N55661l17009j195355j446750
44679h70326q15832R1683M51279K37986K18876Q62431J498085R15131r67795k387984
44669g66466j500896J102769K748601K025257M88922O6075K25690n20288j555372
44660B314292j104073L82876O90014k78228k01862J350783J609093q07672l054494
44651I00729k227164J74978Q76931p4070j77698Q87274J097634J1444o29977k79894
44641E60187l13635r46267n35428J171655J967790O33911j010836r89097j5476
$$ plain form
44632 522804 650076 32351 -979684 -1513668 -1175641 -279569 186966 -766596 -2647858
44623 -2647858 -3437009 -2232731 -993450 -1942736 -4146632 -4917409 -3998601 -3574159 -4155729
44614 -4155729 -3619755 -1214589 521298 -397877 -2097816 -1625301 714130 2201255 1767157
44605 1767157 856576 794942 1416464 2146288 2665603 2501467 1457738 508617 954010
44596 954010 2558024 3569957 2668193 132261 -2643619 -4020999 -3109838 -1016054 -453546
44587 -453546 -2656368 -5198742 -4639018 -1056277 2034094 2362206 1342897 1243005 2025714
44578 2025714 2260526 1580428 719752 67432 -504377 -1005406 -1500352 -2274898 -3084763
44569 -3084763 -3129772 -2566194 -2857734 -4435498 -5235087 -3283479 138330 1942200 1383527
$$ packed form
44632E22804J27272o17725j012035n33984L38027Q96072M66535r53562j881262
44623b647858p89151J204278J239281r49286k203896p70777R18808M24442n81570
44614d155729N35974K405166J735887r19175j699939M72515K339431J487125m34098
44605A767157r10581o1634O21522P29824N19315j64136j043729r49121M45393
44596I54010J604014J011933r01764k535932k775880j377380R11161K093784N62508
44587d53546k202822k542374N59724L582741L090371L28112j019309r9892P82709
44578B025714K34812o80098q60676o52320n71809n01029m94946p74546q09865
44569c084763m5009N63578k91540j577764p99589J951608L421809J803870n58673
$$ plain form
44560 1383527 571917 853711 1062625 85027 -1004680 -751987 299550 655720 295420
44551 295420 430663 1425856 2486061 3139708 3582515 3571578 2396838 320785 -1103150
44542 -1103150 -772318 642239 1688723 1904429 1977099 2423323 2745785 2116390 703271
44533 703271 -83842 854745 2560366 2692872 523162 -1640214 -1207908 1064633 1849312
44524 1849312 -346405 -3319926 -4293017 -3176866 -1629406 -356174 1027672 2407282
44516 2407282 3238359 3775495 4575983 4994496 3839011 1580802 244536 670691 1340634
44507 1340634 580226 -1263056 -2605445 -2657036 -1904036 -1235287 -1203256 -1623221 -1531900 -146841
44497 -146841 1927149 3253251 3465970 3490159 3554602 2470927 -233184 -2831316 -3381041
$$ packed form
44560A383527q11610K81794K08914r77598j089707K52693J051537L56170l60300
44551B95420J35243R95193J060205O53647M42807j0937j174740k076053j423935
44542a103150L30832J414557J046484K15706P2670M46224L22462o29395j413119
44533G03271p87113R38587J705621J32506k169710k163376M32306K272541P84679
44524A849312k195717k973521r73091J116151J547460J273232J383846J379610
44516B407282Q31077N37136Q00488M18513j155485k258209j336266M26155O69943
44507A340634p60408j843282j342389n1591P53000O68749L2031m19965R1321J385059
44497a46841K073990J326102K12719K4189O4443j083675k704111k598132n49725
$$ plain form
44488 -3381041 -2266635 -1402448 -1571099 -1894671 -1461861 -205863 1432948 2535882 1910462
44479 1910462 -387020 -2209751 -1569962 546693 1320315 -4195 -1224552 -541196 1042137
44470 1042137 1529410 645691 -353156 -509511 266482 1638513 2822442 2735530 1180031
44461 1180031 -453441 -480695 1251019 3337446 4292511 3577215 1585552 -724462 -2305843
44452 -2305843 -2599826 -1705216 -23944 1887757 3167746 3104494 2081793 1427418 1860468
44443 1860468 2591326 2406529 1182490 -152925 -797642 -766179 -647807 -998159 -1825476
44434 -1825476 -2593220 -2879516 -2783072 -2321118 -1046205 818145 1547753 -140860 -2602615
44425 -2602615 -2806775 -637342 670429 -775186 -2880495 -3167606 -2553709 -3102730 -4025730
$$ packed form
44488c381041J114406Q64187j68651l23572M32810J255998J638811J102934o25420
44479A910462k297482j822731O39789K116655P73622j324510j220357O83356J583333
44470A042137M87273q83719r98847j56355P75993J372031J183929q6912j555499
44461A180031j633472k7254J731714K086427R55065p15296j991663k310014j581381
44452b305843k93983Q94610J681272J911701J279989o3252j022701o54375M33050
44443A860468P30858j84797j224039j335415o44717L1463J18372l50352q27317
44434a825476p67744k86296R6444M61954J274913J864350P29608j688613k461755
44425b602615k04160K169433J307771j445615k105309k87111O13897n49021r23000
$$ plain form
44416 -4025730 -3144689 -1200259 -1120966 -3147903 -4163762 -2538375 -492472 -371890 -1324979
44407 -1324979 -1473847 -1146151 -1714616 -2707547 -2411940 -662889 984151 1628341 1908277
44398 1908277 2454049 2755461 1888745 -331529 -3027924 -4706643 -4329749 -2459126 -992386
44389 -992386 -1225545 -2530444 -3434740 -3502244 -3469811 -3928928 -4634987 -4982945 -4657231 -3943919
44379 -3943919 -3614116 -4083645 -4551780 -3761777 -1944488 -940913 -1672201 -2606078 -1916085
44370 -1916085 -272817 26038 -1737886 -3860536 -4448712 -3187067 -949976 1045378
44362 1045378 1646808 613154 -725377 -771041 208625 412364 -832375 -2049038 -1734419
44353 -1734419 -287736 853239 951974 86827 -1511185 -3250468 -3934468 -2722672 -152267
$$ packed form
44416d025730Q81041J944430P9293k026937j015859J625387K045903J20582r53089
44407a324979j48868L27696n68465r92931K95607J749051J647040O44190K79936
44398A908277N45772L01412q66716k220274k696395j678719L76894J870623J466740
44389i92386k33159j304899r04296o7504L2433m59117p06059l47958L25714P13312
44379c943919L29803m69529m68135P90003J817289J003575p31288r33877O89993
44370a916085J643268K98855j763924k122650n88176J261645K237091J995354
44362A045378O01430j033654j338531m5664R79666K03739j244739j216663L14619
44353a734419J446683J140975R8735q65147j598012j739283o84000J211796K570405
$$ plain form
44344 -152267 2348205 3706505 3682000 2669114 1492737 878411 665886 40701 -1124915
44335 -1124915 -1879020 -1595743 -951613 -832971 -1063786 -1039453 -875897 -949761 -951016 -502553
44325 -502553 -182041 -692228 -1394937 -1002791 435143 1566773 1745602 1684177 1953513
44316 1953513 2143849 1873927 1443284 1031961 355162 -391918 -346788 636414 1438194 1232333
44306 1232333 649624 575330 674245 89951 -1081725 -2042216 -2510701 -2727037 -2632344 -1985972
44296 -1985972 -1037840 -277623 244163 686386 901001 828428 902984 1293639 1345510 698908
44286 698908 263613 880296 1688033 1335704 276554 13192 340921 -448400 -2354885
44277 -2354885 -2998932 -1104511 1374884 1942767 695104 -708287 -1666907 -2429899 -2508957
$$ packed form
44344a52267K500472J358300k4505j012886j176377o14326k12525o25185j165616
44335a124915p54105K83277O44130J18642k30815K4333J63556p3864j255M48463
44325e02553L20512n10187p02709L92146J437934J131630J78829o1425K69336
44316A953513J90336k69922m30643m11323o76799p47080M5130R83202Q01780k05861
44306A232333n82709p4294R8915n84294j171676r60491m68485k16336R4693O46372
44296a985972R48132P60217N21786M42223K14615p2573P4556L90655N1871o46602
44286F98908m35295O16683Q07737l52329j059150k63362L27729p89321j906485
44277b354885o44047J894421K479395N67883j247663j403391r58620p62992p9058
$$ plain form
44268 -2508957 -1415281 -250003 -431665 -1203854 -529666 1591861 2882867 2243189 1348421
44259 1348421 1889432 3000631 2780833 1140530 -356471 -811155 -757938 -864658 -1042402
44250 -1042402 -959031 -641032 -337078 -188991 -113052 228465 1200925 2618114 3537148 3058176
44240 3058176 1363633 -332211 -922277 -291855 904801 1973959 2431024 1833940 62434
44231 62434 -1979223 -2613326 -1155940 849928 1178855 -293928 -1512490 -1174351 -303104
44222 -303104 -196661 -417460 -184150 -280294 -1563353 -2651383 -1610791 540685 800739
44213 800739 -1220543 -2546207 -1403748 329381 631894 543174 1732170 3127142 2696194
44204 2696194 1118900 798651 1954146 2447795 1319596 1223 -196359 320820 700517
$$ packed form
44268b508957J093676J165278j81662p72189O74188K121527J291006o39678q94768
44259A348421N41011J111199k19798j640303j497001m54684N3217j06720j77744
44250a042402Q3371L17999L03954J48087P5939L41517R72460J417189R19034m78972
44240C058176j694543j695844n90066O30422J196656J069158M57065n97084j771506
44231F2434k041657o34103J457386K005868L28927j472783j218562L38139Q71247
44222c03104J06443k20799K33310r6144j283059j088030J040592K151476K60054
44213H00739k021282j325664J142459J733129L02513q8720J188996J394972m30948
44204B696194j577294l20249J155495M93649j128199j318373j97582N17179L79697
$$ plain form
44195 700517 668465 -114845 -2032944 -4334330 -5394221 -4634244 -3029134 -1534417 -297884
44186 -297884 504858 604070 667473 1825372 3749360 4696371 3899680 2432101 1305804
44177 1305804 357407 -527299 -952650 -1449970 -3295210 -5812891 -6024042 -2654277 1375043
44168 1375043 2497951 1044073 2739 519608 1238962 1404908 1767843 2327533 1765619
44159 1765619 -201503 -1955618 -2297414 -1968912 -1994019 -1987784 -1184613 2030 621156
44150 621156 656688 785794 1079832 891599 -53290 -1132262 -1513517 -1039167 -259566 361694
44140 361694 1053024 2182910 3189323 2865124 1097937 -582608 -995066 -948538 -1688156
44131 -1688156 -2500926 -1634136 666719 1991201 982025 -982240 -1904011 -1400504 -51450
$$ packed form
44195G00517l2052p83310j918099k301386j059891P59977J605110J494717J236533
44186b97884Q02742R9212O3403J157899J923988R47011p96691j467579j126297
44177A305804r48397q84706m25351m97320j845240k517681k11151L369765M029320
44168A375043J122908j453878j041334N16869P19354J65946L62935N59690n61914
44159A765619j967122j754115l41796L28502k5107O235Q03171J186643O19126
44150F21156L5532J29106K94038j88233r44889j078972l81255M74350P79601O21260
44140C61694O91330J129886J006413l24199j767187j680545m12458M6528p39618
44131a688156q12770Q66790K300855J324482j009176j964265r21771N03507J349054
$$ plain form
44122 -51450 1960938 4365773 6017430 5854768 4141338 2011618 393599 -175679 303865
44113 303865 718871 -335252 -2286184 -2548422 -18794 2821100 3073163 1505409 1242187
44104 1242187 3119862 4897905 4982789 4321515 4043158 3621308 2470929 1406056 1179255
44095 1179255 1146752 752717 918613 2400761 3957980 3900661 2615168 1790899 1808923
44086 1808923 1779655 1699657 2417020 3449981 3085431 1254256 270286 1621074 3695136
44077 3695136 4066370 2704708 1349537 736032 284679 -25519 546261 1795806 2396537
44068 2396537 1807368 927482 428560 -112039 -765922 -457880 1223968 2634967 2030302
44059 2030302 191294 -566809 290111 942730 156800 -922003 -717332 386561 861453
$$ packed form
44122e1450K012388K404835J651657j62662j713430k129720j618019n69278M79544
44113C03865M15006j054123j950932k62238K529628K839894K52063j567754k63222
44104A242187J877675J778043Q4884o61274k78357m21850j150379j064873k26801
44095A179255l2503l94035J65896J482148J557219n7319j285493q24269J8024
44086A808923k9268p9998P17363J032961l64550j831175r83970J350788K074062
44077C695136L71234j361662j355171o13505m51353l10198N71780J249545O00731
44068B396537n89169q79886m98922n40599o53883L08042J681848J410999o04665
44059B030302j839008p58103Q56920O52619p85930j078803K04671J103893M74892
$$ plain form
44050 861453 487013 575238 1835076 3217071 3302381 2097691 867403 521743 762112
44041 762112 841550 665163 730326 1135128 1230361 576624 -158873 129357 1498925 2768120
44031 2768120 2943249 2257279 1539537 1165740 1102020 1444280 2187732 2745633 2502254 1822381
44021 1822381 1754941 2590723 3454770 3666724 3775574 4578134 5632164 5730788 4804038 4288467
44011 4288467 5090197 5987675 5018377 2155769 -477168 -1250829 -872385 -984640 -1755492
44002 -1755492 -1906763 -817481 519652 804014 -128802 -1402170 -1969105 -1207673 614684
43993 614684 2190117 2241083 1134363 667203 1768077 3262328 3636086 3154487 3140242
43984 3140242 3774942 3965052 3192877 2183101 1603584 1251772 819393 469124 268357
$$ packed form
44050H61453l74440Q8225J259838J381995Q5310j204690j230288l45660K40369
44041G62112P9438j76387O5163M04802R5233o53737p35497K88230J369568J269195
44031B768120J75129o85970p17742l73797o3720L42260P43452N57901k43379o79873
44021A822381o7440Q35782Q64047K11954J08850Q02560J054030R8624r26750n15571
44011D288467Q01730Q97478r69298k862608k632937p73661L78444j12255p70852
44002a755492j51271J089282J337133K84362r32816j273368n66935P61432J822357
43993F14684J575433N0966j106720m67160J100874J494251L73758m81599j4245
43984C140242O34700J90110p72175j009776n79517l51812m32379l50269k00767
$$ plain form
43975 268357 -106705 -702917 -1050610 -940692 -764891 -807982 -927185 -1163076 -1789383 -2439401
43965 -2439401 -2192686 -1021341 -82542 82939 459911 1687759 2478241 1401243 -552534
43956 -552534 -964770 695131 2381343 2174249 260485 -1925763 -3151794 -2707117 -670144
43947 -670144 1616911 2510347 2025896 1729562 2224897 2153176 572497 -1038326 -592383
43938 -592383 1584375 3051299 2308905 324491 -952157 -616437 705106 1673532 1486193
43929 1486193 710273 627974 1434462 1784209 811172 -275012 150411 1500304 1679570
43920 1679570 365605 -149362 1971181 5441973 7131837 5360495 1355176 -2053109
43912 -2053109 -2771489 -972585 1326323 2405343 2451698 2628654 3076704 2967288 2294971
$$ packed form
43975B68357l75062n96212l47693J09918J75801m3091j19203k35891o26307o50018
43965b439401K46715J171345R38799J65481L76972J227848P90482j076998j953777
43956e52534m12236J659901J686212k07094j913764k186248j226031M44677K036973
43947f70144K287055Q93436m84451k96334M95335p1721j580679j610823M45943
43938e92383K176758J466924p42394j984414j276648L35720J321543R68426j87339
43929A486193p75920q2299Q06488L49747r73037j086184M25423J349893J79266
43920A679570j313965n14967K120543L470792J689864j771342m005319l408285
43912b053109p18380J798904K298908J079020M6355J76956M48050j09416o72317
$$ plain form
43903 2294971 2093591 2609335 2768075 2044850 1428781 1683012 1952076 1162368 -272798
43894 -272798 -1228582 -1364525 -783403 738356 2903816 4257321 3836197 2654471 2109413
43885 2109413 1808412 693390 -510099 -118460 1572970 2324920 956631 -1605022 -4245415
43876 -4245415 -6502320 -7320307 -5387584 -1555235 1173853 1202676 189002 289571 1260485
43867 1260485 1586543 1004317 447431 561099 1456523 2881890 3664054 2319568 -647240
43858 -647240 -2501524 -1636615 339200 1327885 1767375 2906843 3802034 2812653 971909
43849 971909 760013 1977441 1967846 29630 -1469154 -957739 269619 861647 1559081
43840 1559081 3030218 3889324 2792102 841606 16122 404298 722722 611396 758336
$$ packed form
43903B294971k01380N15744J58740p23225o16069K54231K69064p89708j435166
43894b72798r55784j35943N81122J521759K165460J353505m21124j181726n45058
43885B109413l01001j115022j203489L91639J691430P51950j368289k561653k640393
43876d245415k256905q17987J932723L832349K729088K8823j013674J00569R70914
43867A260485L26058n82226n56886J13668Q95424J425367P82164j344486k966808
43858f47240j854284Q64909J975815R88685M39490J139468Q95191r89381j840744
43849I71909k11896J217428r595j938216j498784N11415J227358N92028O97434
43840A559081J471137Q59106j097222j950496q25484L88176L18424j11326J46940
$$ plain form
43831 758336 1403572 2127604 2600435 2459599 1196628 -703179 -1386264 207312 2481483
43822 2481483 2961156 1507941 354191 1168306 3358819 5175490 5411934 4134441 2607966
43813 2607966 2234752 2817305 2499346 365273 -1845977 -2088769 -1187571 -1634401 -3659078
43804 -3659078 -4876369 -4035700 -2703367 -2391103 -2228717 -901125 833419 1302843 475117
43795 475117 -367391 -800713 -1452269 -2378553 -2813062 -2550482 -2270949 -2247040 -1795777 -445077
43785 -445077 1096082 1645990 924398 -76877 -40289 1321865 2792047 2791192 1139679
43776 1139679 -749751 -1641860 -1742962 -1708628 -1304661 -163676 776001 177445 -1399016
43767 -1399016 -1781487 -283495 1045069 315134 -1307501 -1149835 1169876 3205377 2972216
$$ packed form
43831G58336O45236P24032M72831j40836j262971j899807o83085J593576K274171
43822B481483M79673j453215j153750Q14115K190513J816671K36444j277493j526475
43813B607966l73214N82553l17959k134073k211250k42792R01198m46830k024677
43804c659078j217291Q40669J332333L12264J62386J327592J734544M69424q27726
43795D75117q42508m33322o51556r26284m34509K62580K79533K3909M51263J350700
43785d45077J541159N49908p21592j001275L6588J362154J470182q55j651513
43776A139679j889430q92109j01102L4334M03967J140985R39677n98556j576461
43767a399016l82471J497992J328564p29935j622635J57666K319711K035501k33161
$$ plain form
43758 2972216 1242384 56958 195121 949093 1505205 1492955 670671 -802887 -1887401
43749 -1887401 -1481010 91718 1246591 1076246 346178 170948 523938 762220 917008
43740 917008 1404373 1824517 1318523 212007 28886 1310114 2500696 1928441 114444
43731 114444 -1023055 -776700 -114514 349634 1326661 3292175 5270778 6120363 6086880
43722 6086880 5966638 5465392 3827836 1774760 1169671 2448752 3800236 3549423 2177589
43713 2177589 1136795 743921 416313 191943 597293 1382951 1794087 1983251 2761065
43704 2761065 3860533 3937202 2746335 1901480 2636757 3959086 4038066 2552315 610214
43695 610214 -870743 -1514686 -907467 869349 2451793 2458881 1530310 1614714 3045694
$$ packed form
43758B972216j729832j185426J38163P53972N56112j2250q22284j473558j084514
43749a887401M06391J572728J154873j70345p30068j75230L52990K38282J54788
43740I17008M87365M20144n05994j106516j83121J281228J190582n72255j813997
43731A14444j137499K46355O62186M64148R77027J965514J978603Q49585l3483
43722F086880j20242n01246j637556k053076o05089J279081J351484k50813j371834
43713B177589j040794l92874l27608k24370M05350P85658M11136J89164P77814
43704B761065J099468P6669j190867q44855P35277J322329P8980j485751j942101
43695F10214j480957o43943O07219J776816J582444P088r28571Q4404J430980
$$ plain form
43686 3045694 3946553 3153856 2115084 2662712 4136596 4383959 3029843 1993347 2710773
43677 2710773 4405171 5571535 5851617 5637024 4874115 3409683 1946530 1435287 1650349
43668 1650349 1446888 497626 -267891 -213297 76784 -26060 -67001 574137 1398530 1485192
43658 1485192 940002 498283 126181 -587538 -911452 408117 2798187 4005892 3324847
43649 3324847 2842148 4231815 6000655 5722352 3711103 2301627 2330305 2764797 3406747
43640 3406747 5180512 7398555 7537859 4907645 2189934 1738598 2350622 1690012 227712
43631 227712 246766 1913988 3097386 2916030 2841249 3782855 4427103 3511415 1875337
43622 1875337 920533 500825 -128809 -402983 688020 2397254 2795638 1609407 774371
$$ packed form
43686C045694R00859p92697j038772N47628J473884K47363j354116j036496P17426
43677B710773J694398J166364K80082k14593p62909j464432j463153n11243K15062
43668A650349k03461r49262p65517N4594K90081j02844m0941O41138Q24393Q6662
43658A485192n45190m41719l72102p13719l23914J319569K390070J207705o81045
43649C324847m82699J389667J768840k78303k011249j409476K8678M34492O41950
43640C406747J773765K218043J39304k630214k717711m51336O12024o60610j462300
43631B27712J9054J667222J183398j81356p4781R41606O44248r15688j636078
43622A875337r54804m19708o29634k74174J091003J709234L98384j186231q35036
$$ plain form
43613 774371 1620723 2942769 2834215 1414082 441382 665455 906586 -44091 -1658141
43604 -1658141 -2368379 -1450707 378287 1943466 2647391 2633185 2403592 2382930 2593100
43595 2593100 2681816 2414326 2100826 2327464 3274631 4532424 5619536 6422755 6978692
43586 6978692 7041825 6213155 4609957 3185076 3006405 4074624 5162060 5183078 4512547
43577 4512547 4391935 5098763 5494812 4690707 3391056 2955563 3680653 4782032 5685888
43568 5685888 6416646 6823659 6365841 4923829 3256763 2417448 2963511 4602040 6214691
43559 6214691 6520160 5332892 3960271 3732206 4455629 5083309 5441484 6119585 6931598
43550 6931598 6967403 6267287 5929571 6188487 5907848 4615263 3551755 3779599 4576237
$$ packed form
43613G74371Q46352J322046j08554j420133r72700K24073K41131r50677j614050
43604a658141p10238R17672J828994J565179P03925j4206k29593k0662K10170
43595B593100Q8716k67490l13500K26638R47167J257793J087112Q03219N55937
43586F978692O3133q28670j603198j424881j78671J068219J087436K1018o70531
43577D512547j20612P06828L96049q04105j299651m35493P25090J101379R03856
43568E685888P30758M07013m57818j442012j667066q39315N46063J638529J612651
43559F214691L05469j187268j372621k28065P23423O27680L58175O78101Q12013
43550F931598L5805p00116l37716K58916k80639j292585j063508K27844P96638
$$ plain form
43541 4576237 4813424 4747041 5136659 5548168 4980952 3591476 2488710 2229724 2598898
43532 2598898 3378955 4249087 4417479 3472728 2173990 1401622 897656 96897 -513642
43523 -513642 -132217 942484 1979660 3138664 4572548 5060204 3531953 1356163 834837
43514 834837 1764995 2015019 1436392 2241902 4865312 6496125 5237638 3128469 3022642
43505 3022642 4536045 5388310 5194109 5374089 6212236 6517666 5950492 5542878 5852952
43496 5852952 6376060 6926107 7974899 9295701 9714484 8805432 7820782 8308430 10362340
43487 10362340 12635877 13800801 13920421 14553727 17191848 21314584 24644213 25939256
43479 25939256 26772684 29530389 34325556 39309897 43680090 48605678 54794075 60643006
$$ packed form
43541D576237K37187o6383L89618M11509n67216j389476j102766k58986L69174
43532B598898P80057Q70132J68392r44751j298738p72368n03966q00759o10539
43523e13642L81425J074701J037176J159004J433884M87656j528251k175790n21326
43514H34837R30158K50024n78627Q05510K623410J630813j258487k109169j05827
43505C022642J513403Q52265j94201J79980Q38147L05430n67174m07614L10074
43496E852952N23108N50047J048792J320802M18783r09052r84650M87648K053910
43487A0362340K273537J164924J19620O33306K638121M122736L329629J295043
43479B5939256Q33428K757705M795167M984341M370193M925588O188397N848931
$$ plain form
43471 60643006 63721770 63251174 60330359 56300203 51676406 46422472 40569512 34477165
43463 34477165 28791553 24187493 20942307 18626998 16282354 13200328 9831019 7698196
43455 7698196 7818180 9198073 9645205 8272019 6360977 5379940 5182613 4963068 4986172
43446 4986172 6083733 7979926 9486816 10227396 10987549 12339367 13921250 15144357
43438 15144357 15737101 15540475 14537635 13102142 11613270 10072126 8735462 8513690
43430 8513690 9639640 10506894 9315879 6599262 4513464 3766415 3107926 2026378 1810493
43421 1810493 3095402 4271998 3692371 2075911 1263660 1548606 1689647 989570 50805
43412 50805 -307697 30871 495645 281881 -800377 -1649169 -838869 1325581 2745675
$$ packed form
43471F0643006L078764m70596k920815m030156m623797n253934n852960o092347
43463C4477165n685612m604060l245186k315309k344644l082026l369309k132823
43455G698196J19984J379893M47132j373186j911042r81037j97327k19545K3104
43446D986172J097561J896193J506890P40580P60153J351818J581883J223107
43438A5144357N92744j96626j002840j435493j488872j541144j336664k21772
43430H513690J125950Q67254j191015k716617k085798p47049o58489j081548k15885
43421A810493J284909J176596n79627j616460q12251K84946J41041p00077r38765
43412E0805l58502L38568M64774k13764j082258q48792Q10300K164450J420094
$$ plain form
43403 2745675 2159169 759048 402426 1373636 2927919 4771567 6548096 6932601 5054983
43394 5054983 2258522 756956 929159 1502843 1945476 2869021 4309910 5498597 6330985
43385 6330985 7202427 7316211 5278859 1889485 232447 1946881 5043219 6505062
43377 6505062 5632961 3783116 2304761 2044050 3507656 5916699 7125733 6074872
43369 6074872 4455775 4369868 5288517 5278959 4453685 4726182 6257987 6763259 5006063
43360 5006063 2673125 1629513 1321816 455733 -415988 41702 1383717 2013164 1850917
43351 1850917 2308594 3708213 4744395 4798915 4881862 5629960 6118603 5600276 4838202
43342 4838202 4531785 3928973 2572966 2071954 3996611 6828602 7464926 5639538 4349487
$$ packed form
43403B745675n86506j400121l56622R71210J554283J843648J776529L84505j877618
43394E054983k796461j501566J72203N73684M42633R23545J440889J188687Q32388
43385F330985Q71442J13784k037352l389374j657038J714434L096338J461843
43377F505062q72101j849845j478355k60711J463606K409043J209034j050861
43369F074872j619097q5907R18649r558q25274K72497J531805N05272j757196
43360E006063k332938j043612l07697q66083q71721M57690J342015O29447j62247
43351A850917M57677J399619J036182N4520Q2947P48098M88643n18327p62074
43342D838202l06417o02812j356007n01012J924657K831991O36324j825388j290051
$$ plain form
43333 4349487 5393523 6946462 6741135 5447199 5004404 5222253 4418823 2675145 2001016
43324 2001016 3183855 4591390 4743921 4390995 4999364 6322619 6735939 5550767 3918806
43315 3918806 3338754 3924608 4499998 4160570 3269918 2684716 2429004 1898929 1299320
43306 1299320 1732185 3329964 4441455 3743904 2284556 2015213 2878884 3022925 1720218
43297 1720218 280054 -207109 -281558 -601751 -573606 467205 1817382 2246482 1568030
43288 1568030 535649 -153342 -22563 1269681 3347855 5029174 5542218 5332257 5177080
43279 5177080 5261465 5612806 6397793 7036664 6196603 3740229 1558749 1149880 1445921
43270 1445921 670185 -622212 -403855 1481906 3068546 3286482 3052810 3068998 2681089
$$ packed form
43333D349487J044036J552939k05327j293936m42795K17849q03430j743678o74129
43324B001016J182839J407535J52531l52926O08369J323255M13320j185172j631961
43315C918806n80052N85854N75390l39428q90652n85202k55712n30075n99609
43306A299320M32865J597779J111491o97551j459348k69343Q63671J44041j302707
43297A720218j440164m87163p4449l20193K8145J040811J350177M29100o78452
43288A568030j032381o88991J30779J292244K078174J681319N13044k09961j55177
43279E177080Q4385L51341P84987O38871q40061k456374k181480m08869K96041
43270A445921p75736j292397K18357J885761J586640K17936k33672J6188l87909
$$ plain form
43261 2681089 1631848 1008941 1412633 1748067 965012 -278226 -753434 -285450 828296
43252 828296 2820564 5555040 7578644 7542383 6024842 4684599 4094127 3666116 3289356
43243 3289356 3584913 4524931 5040792 4349036 2907698 1785686 1534047 1772665 1624752
43234 1624752 666876 -433134 -632504 55493 653954 989789 2131238 4283053 5585903
43225 5585903 4432677 1992888 741493 1170023 1829318 2167424 3124955 4813624 5762414
43216 5762414 5078148 3572404 2108950 596160 -603238 -152219 2079494 3891991
43208 3891991 3416374 1781999 1486968 2889594 3969532 3167422 984708 -1047522 -1722074
43199 -1722074 -599031 1753798 3957342 5119260 5771804 6740592 7559649 7172783 5891105
$$ packed form
43261B681089j049241o22907M03692L35434p83055j243238m75208M67984J113746
43252H28296J992268K734476K023604l6261j517541j340243n90472m28011l76760
43243C289356K95557R40018N15861o91756j441338j122012k51639K38618j47913
43234A624752r57876j100010j99370O87997N98461L35835J141449K151815J302850
43225E585903j153226k439789j251395M28530O59295L38106R57531J688669R48790
43216E762414o84266j505744j463454j512790j199398M51019K231713J812497
43208C891991m75617j634375k95031J402626J079938q02110k182714k032230o74552
43199a722074J123043K352829K203544J161918O52544R68788Q19057l86866j281678
$$ plain form
43190 5891105 5257173 5908185 6885466 7338164 7693184 8638554 9976466 11153690 12224306
43181 12224306 13703392 16030536 19660109 25030528 31642387 37395408 39641490 37294547
43173 37294547 31841578 26131505 22042229 19292279 16561754 13488049 10986364 9659996
43165 9659996 8839892 7658841 6216394 4992876 3953216 3123569 3182944 4280896 5044629
43156 5044629 4230003 2728156 2241991 2506259 1894615 568811 602694 2585367 4472336
43147 4472336 4634132 3816477 2999597 1583090 -732830 -2314436 -1836546 -574709 -436088
43138 -436088 -1097496 -1214787 -1117098 -1809698 -2368676 -1154210 961017 1523346 535312
43129 535312 542961 2288904 3303032 1929275 83036 335821 2290875 3685119 3605154
$$ packed form
43190E891105o33932O51012R77281M52698L55020R45370J337912J177224J070616
43181A2224306J479086K327144L629573N370419O611859N753021K246082k346943
43173C7294547n452969n710073m089276k749950k730525l073705k501685j326368
43165I659996q20104j181051j442447j223518j039660q29647N9375J097952P63733
43156E044629q14626j501847m86165K64268o11644j325804L3883J982673J886969
43147D472336J61796q17655q16880j416507k315920j581606M77890J261837J38621
43138d36088o61408j17291R7689o92600n58978J214466K115227N62329r88034
43129E35312P649J745943J014128j373757j846239K52785J955054J394244p9965
$$ plain form
43120 3605154 2807528 1913297 1004246 363609 199546 98832 -171704 67929 1287296
43111 1287296 2548747 2614574 1784212 1505830 2462239 3987133 5084231 5212925 4440275
43102 4440275 3581530 3717349 4787323 5251275 4051735 2249458 1577980 1986272 2018182
43093 2018182 1246327 715738 931593 979885 119026 -1000135 -1350992 -888898 -290308
43084 -290308 40376 209247 489691 992743 1346896 840656 -458050 -981170 744527
43075 744527 3622930 4523859 2084140 -1177137 -1746994 586544 2733350 2395177 698532
43066 698532 274198 1842356 3709284 4209823 3546183 2965208 2939082 2873304 2307704 1611054
43056 1611054 1372818 1741474 2606115 3808371 4760667 4491620 2812609 1076480 932659
$$ packed form
43120C605154p97626q94231r09051o40637j64063j00714k70536K39633J219367
43111A287296J261451O5827q30362k78382R56409J524894J097098J28694p72650
43102D440275q58745J35819J069974M63952j199540j802277o71478M08292L1910
43093B018182p71855n30589K15855M8292q60859j119161l50857M62094N98590
43084b90308L30684J68871K80444N03052L54153n06240j298706n23120J725697
43075G44527K878403R00929k439719l261277n69857K333538K146806l38173j696645
43066F98532m24334J568158J866928N00539o63640n80975k6126o5778n65600o96650
43056A611054k38236L68656Q64641J202256R52296k69047j679011j736129j43821
$$ plain form
43047 932659 2402100 3932379 4377460 4154234 4226322 4657221 4676895 3846602 2679377
43038 2679377 2088212 2400075 3029316 3220979 3001823 2996062 3282599 3149802 2366022 1861886
43028 1861886 2312180 2728135 1673642 -454376 -1700355 -1085849 457178 1874148 3308690
43019 3308690 5072570 6531259 6905793 6394717 5715918 5129844 4536927 3953174 3337810
43010 3337810 2560094 2024012 2573273 4157465 5354398 4988612 3609177 2645063 2740162
43001 2740162 3659429 5080478 6494362 6962296 6127623 5111464 5350952 6809019 8255745
42992 8255745 8947682 8988854 8393155 7046254 5535385 4860165 5205579 5897052 6519284
42983 6519284 7142074 7560448 7393213 6915375 6710384 6522291 5636917 4427335 4178192
$$ packed form
43047I32659J469441J530279M45081k23226P2088M30899J9674q30293j167225
43038B679377n91165L11863O29241J91663k19156n761K86537j32797p83780n04136
43028A861886M50294M15955j054493k128018j245979O14506J543027J416970J434542
43019C308690J763880J458689L74534n11076o78799n86074n92917n83753o15364
43010C337810p77716n36082N49261J584192J196933l65786j379435r64114R5099
43001B740162R19267J421049J413884M67934q34673j016159K39488J458067J446726
42992H255745O91937M1172n95699j346901j510869o75220L45414O91473O22232
42983F519284O22790M18374j67235m77838k04991j88093q85374j209582k49143
$$ plain form
42974 4178192 5137682 6084661 6199875 6001130 5904869 5301840 3906424 2749495 2778308
42965 2778308 3483607 3966078 4425549 5420436 6439493 6522140 5836305 5457564 5880876
42956 5880876 6732329 7569383 7960061 7218750 5300369 3731323 4324223 6823605 8929251
42947 8929251 8937872 7486002 6405407 6655293 7766861 8719909 8917734 8571973 8389012
42938 8389012 8819597 9679225 10553721 11219353 11502488 11326833 11263051 12251400 14140475
42929 14140475 15373456 15085485 14638138 15754348 17901539 19224944 19552540 20394362 21990376
42920 21990376 22584562 21181604 19007556 17403635 16168476 15057452 15038382 16527509
42912 16527509 17941348 17794357 17046056 17483244 18706055 18766861 17273600 15837119 15603399
$$ packed form
42974D178192R59490R46979J15214j98745r6261o03029j395416j156929K8813
42965B778308P05299M82471M59471R94887J019057Q2647o85835l78741M23312
42956E880876Q51453Q37054L90678p41311j918381j569046N92900K499382K105646
42947H929251Q621j451870j080595K49886J111568R53048J97825l45761j82961
42938H389012M30585Q59628Q74496O65632K83135j75655o3782R88349J889075
42929A4140475J232981k87971m47347J116210K147191J323405L27596Q41822J596014
42920B1990376N94186j402958k174048j603921j235159j111024j9070J489127
42912A6527509J413839j46991p48301M37188J222811O0806j493261j436481k33720
$$ plain form
42903 15603399 16177249 16982587 17948649 18723292 18881624 19177633 20995375 24204914 27122478
42894 27122478 29049473 31266781 34857365 39083985 42833741 46330355 50389923 55133051
42886 55133051 60492706 66967461 74810339 83481192 93045853 105091639 120874957 139449119
42878 139449119 159226323 180712803 205809769 234513112 263900212 290255024 310397578
42871 310397578 320803683 317774844 300237534 271788521 238902334 207080616 178629817
42864 178629817 153165549 129611624 108141090 90465704 77833595 68991435 61258604
42857 61258604 53695397 47717130 44023710 40638921 35370124 28956661 24002202 21455386
42849 21455386 19936700 18206932 16396438 14661832 12476191 9902159 8114388 7816615
$$ packed form
42903A5603399N73850Q05338R66062P74643J58332K96009J817742L209539K917564
42894B7122478J926995K217308L590584M226620L749756L496614M059568M743128
42886E5133051N359655O474755P842878Q670853R564661J2045786J5783318J8574162
42878A39449119J9777204K1486480K5096966K8703343K9387100K6354812K0142554
42871C10397578J0406105l028839j7537310k8449013l2886187l1821718k8450799
42864A78629817k5464268k3553925k1470534j7675386j2632109q842160p732831
42857F1258604p563207n978267l693420l384789n268797o413463m954459k546816
42849B1455386j518686j729768j810494j734606k185641k574032j787771k97773
$$ plain form
42841 7816615 8188411 8108299 7467093 6677201 5971220 5857554 6973103 8489116 8081023
42832 8081023 5045597 2242630 2835953 5824979 7261410 5735042 3896557 3925097 4374301
42823 4374301 3241259 1770070 2520800 4954574 5899871 4235552 2484851 3221930 6012514
42814 6012514 8749092 10198004 10082132 8180796 4950139 2227801 1792940 3417686
42806 3417686 5306179 6136551 5797969 4627533 3160158 2446009 3270263 4817545 5271114
42797 5271114 4187939 3227668 3837245 5167451 5367676 4327299 3688506 4141164 4272215
42788 4272215 2913849 1390797 1906996 4192139 5554974 4572668 2990352 2975816 3994031
42779 3994031 4020456 2828416 2036564 2337749 2897521 3554281 5207315 7316607 7427232
$$ packed form
42841G816615L71796q0112o41206p89892p05981j13666J115549J516013m08093
42832H081023l035426k802967N93323K989026J436431j526368j838485K8540M49204
42823D374301j133042j471189P50730K433774R45297j664319j750701P37079K790584
42814F012514K736578J448912j15872j901336l230657k722338m34861J624746
42806C417686J888493Q30372l38582j170436j467375p14149Q24254J547282M53569
42797E271114j083175r60271O09577J330206K00225j040377o38793M52658J31051
42788D272215j358366j523052N16199K285143J362835r82306j582316j4536J018215
42779C994031K6425j192040p91852L01185N59772O56760J653034K109292J10625
$$ plain form
42770 7427232 4650634 1666404 1440726 3509491 5439308 6436734 7098888 6887360 4928735
42761 4928735 2803695 3259723 5871863 7090971 5365992 3174812 2710966 2639579 1262454
42752 1262454 237297 2175553 6170697 8800985 8787193 7803192 7030519 5767684 3743882
42743 3743882 2245383 2097674 2479955 2644285 3163345 4461365 5479171 4981256 3316062
42734 3316062 1882207 1461871 1848280 2546549 3108184 3176057 2784365 2346727 2081427
42725 2081427 1907343 2075784 3148348 4923548 6146104 5976608 5250685 5558092 7327717
42716 7327717 9411309 10401027 9870111 8419505 6980629 6216495 6408398 7629555 9632539
42707 9632539 11441683 11687868 10063754 8081261 7461896 7977166 7994500 7093786 6682858
$$ packed form
42770G427232k776598k984230k25678K068765J929817R97426O62154k11528j958625
42761D928735k125040M56028K612140J219108j724979k191180m63846p1387j377125
42752A262454j025157J938256L995144K630288j3792r84001p72673j262835k023802
42743C743882j498499j47709L82281J64330N19060J298020J017806m97915j665194
42734C316062j433855m20336L86409O98269N61635O7873l91692m37638k65300
42725B081427j74084J68441J072564J775200J222556j69496p25923L07407J769625
42716G327717K083592R89718n30916j450606j438876p64134J91903J221157K002984
42707I632539J809144K46185j624114j982493o19365N15270J7334r00714m10928
$$ plain form
42698 6682858 7610685 8711043 8697627 8223112 8659437 9686853 9738292 8571059 7823836
42689 7823836 8749557 10598825 11783369 11830988 11540615 11587726 11610299 10837956 9428963
42680 9428963 8769478 10003673 12405132 13951098 13723477 12926481 13047878 13868563 14126261
42671 14126261 13489430 12845498 13006602 14079814 15780355 17384334 17721169 16387666 14780138
42662 14780138 14636770 15573195 15481794 13639233 11908201 12119698 13560246 14170383 13360173
42653 13360173 12369088 12248671 12727369 13134570 13472813 14134915 14988879 15166600 13851111
42644 13851111 11317983 9112159 8835170 10556301 12671307 13521411 12898493 11785563
42636 11785563 11021531 10695090 10691798 11247389 12638214 14506416 15917385 16377470 16628205
$$ packed form
42698F682858R27827J100358j3416m74515M36325J027416N1439j167233p47223
42689G823836R25721J849268J184544M7619k90373M7111K2573p72343j408993
42680I428963o59485J234195K401459J545966k27621p96996J21397Q20685K57698
42671A4126261o36831o43932J61104J073212J700541J603979L36835j333503j607528
42662A4780138j43368R36425r1401j842561j731032K11497J440548O10137q10210
42653A3360173r91085j20417M78698M07201L38243O62102Q53964J77721j315489
42644A3851111k533128k205824k76989J721131K115006Q50104o22918j112930
42636A1785563p64032l26441l292N55591J390825J868202J410969M60085K50735
$$ plain form
42627 16628205 17927848 20429662 22864348 24220497 25106398 26688588 28757442 29930444
42619 29930444 29693354 29116183 29257005 29785680 29645027 28379694 26364834 24257355 22567064
42610 22567064 21295001 19791848 17512173 15013842 13526048 13419670 13894626 14235446
42602 14235446 14327685 13796177 12044608 9720847 8692436 9590601 10644873 10102312 8591238
42593 8591238 7705393 7408044 6597773 5357285 4603074 4012173 2490081 623151 433174
42584 433174 2273499 4018679 4136507 3786764 4780895 6868844 8295063 8094113 6730831
42575 6730831 5171860 4251075 4351165 4919511 4843254 3930450 3382602 4205399 5872604
42566 5872604 7172932 7543720 6861203 4919028 2211787 420789 777271 2377726 3369856
$$ packed form
42627A6628205J299643K501814K434686J356149Q85901J582190K068854J173002
42619B9930444k37090n77171J40822N28675j40653j265333k014860k107479j690291
42610B2567064j272063j503153k279675k498331j487794j06378M74956L40820
42602A4235446R2239n31508j751569k323761j028411Q98165J054272n42561j511074
42593H591238q85845k97349q10271j240488p54211n90901j522092j866930j89977
42584D33174J840325J745180J17828l49743R94131K087949J426219k00950j363282
42575F730831j558971r20785J00090N68346p6257r12804n47848Q22797J667205
42566E872604J300328L70788o82517j942175k707241j790998L56482J600455R92130
$$ plain form
42557 3369856 3465899 3954454 5386509 6708185 6950544 6508847 6192836 5976907 5381316
42548 5381316 4433369 3520311 2625426 1367872 -218878 -1356870 -1108793 774796 3571561
42539 3571561 6082947 7405343 7302345 6118852 4668323 4034215 4820799 6340824 7056025
42530 7056025 6206507 4649069 3771143 3970911 4563127 4809921 4667695 4762613 5731663
42521 5731663 7144483 7224769 4702350 1087416 -412974 1017438 2444282 1260471
42513 1260471 -999525 -1044024 1194824 2775081 2536049 2540386 4125055 5498085 4841618
42504 4841618 3475662 3805963 5610220 6557873 5623837 4000137 3000449 2838425 3399208
42495 3399208 4593367 5644840 5311752 3423493 1524221 1467741 3511795 5902123 6390060
$$ packed form
42557C369856R6043M88555J432055J321676K42359m41697l16011k15929n95591
42548E381316r47947r13058q94885j257554j586750j137992K48077J883589K796765
42539C571561K511386J322396j02998j183493j450529o34108P86584J520025P15201
42530G056025q49518j557438q77926J99768N92216K46794j42226R4918R69050
42521E731663J412820Q0286k522419l614934j500390J430412J426844j183811
42513A260471k259996m4499K238848J580257k39032M337J584669J373030o56467
42504D841618j365956L30301J804257R47653r34036j623700r99688j62024N60783
42495C399208J194159J051473l33088j888259j899272n6480K044054K390328M87937
$$ plain form
42486 6390060 4476738 2127692 1648487 2868746 3468138 2288205 836960 756596 1422875
42477 1422875 1450453 1131027 1457976 1840058 1120470 238924 1279094 3916303 5461645
42468 5461645 4929830 4470270 5720847 7155193 6670680 4872824 3846275 4060422 4494422
42459 4494422 4814664 5367668 5634180 4717869 3124218 2221118 2056513 1552488 900964
42450 900964 1703879 4099041 5632669 4233722 1061418 -941743 -526690 1149290 2753751
42441 2753751 4225157 5877924 7326712 7979633 7989309 8012332 8175156 7818885 6408295
42432 6408295 4396235 2923230 2691516 3312637 3819748 3694644 3260473 3081236 3118634
42423 3118634 2693863 1455849 245455 482414 2406473 4429876 4892607 4124565 3806415
$$ packed form
42486F390060j913322k349046m79205J220259N99392j179933j451245q0364O66279
42477A422875K7578l19426L26949L82082p19588q81546J040170K637209J545342
42468E461645n31815m59560J250577J434346m84513j797856j026549K14147M34000
42459D494422L20242N53004K66512r16311j593651r03100j64605n04025o51524
42450I00964Q02915K395162J533628j398947l172304k003161M15053J675980J604461
42441B753751J471406J652767J448788O52921R676K3023J62824l56271j410590
42432F408295k012060j473005k31714O21121N07111j25104m34171j79237L7398
42423C118634m24771j238014j210394K36959J924059K023403M62731p68042l18150
$$ plain form
42414 3806415 4386501 4487437 3404332 2780024 4444670 7414577 8771148 7461945 5596479
42405 5596479 5452614 6550137 6709447 5229107 3781376 4153789 5959998 7056584 6033057
42396 6033057 3864027 2766298 3534085 4667287 4502421 3443274 3127361 3897814 4529849
42387 4529849 4476804 4763338 5996418 6970658 6445029 5218795 4947082 5553793 5485689
42378 5485689 4346305 3581503 4222881 5436796 6002480 6019121 6175594 6176606 5049553
42369 5049553 2694672 206768 -1220058 -1034998 732432 3369742 5379533 5500537
42361 5500537 4166095 3143738 3295445 3505594 2518930 1031570 715099 1501993 1427464
42352 1427464 -401506 -2153974 -1695509 361042 1533362 920218 92108 477972 1559972
$$ packed form
42414C806415N80086J00936j083105o24308J664646K969907J356571j309203j865466
42405E596479j43865J097523J59310j480340j447731L72413J806209J096586j023527
42396F033057k169030j097729P67787J133202j64866j059147l15913P70453O32035
42387D529849n3045K86534J233080R74240n25629j226234k71713O06711o8104
42378E485689j139384p64802O41378J213915N65684J6641J56473J012j127053
42369E049553k354881k487904j426826J85060J767430K637310K009791J21004
42361E500537j334442j022357J51707K10149r86664j487360l16471P86894p4529
42352A427464j828970j752468M58465K056551J172320o13144q28110L85864J082000
$$ plain form
42343 1559972 2228675 2351694 2025846 736295 -1284545 -2042597 -52531 3010193 4034075
42334 4034075 2700984 1776576 2854632 4195881 3891969 2958466 3369504 4601540 4524104
42325 4524104 2969662 1974093 2514447 3247299 2944932 2222672 2036413 2138937 2096295
42316 2096295 2430030 3436791 3956876 2836507 987237 490481 1905259 3803305 4884876
42307 4884876 5209599 5132448 4329449 2576224 712820 78975 1207580 3349677 5010256
42298 5010256 4907670 2965491 612132 -370825 414132 1743398 2393434 2441034 2650566
42289 2650566 3163879 3403123 3003881 2265252 1659178 1212299 451061 -1051401 -2948060
42280 -2948060 -4043411 -3349708 -1230053 999302 2617712 3937404 5049900 5173267
$$ packed form
42343A559972O68703J23019l25848j289551k020840p58052J990066L062724J023882
42334D034075j333091r24408J078056J341249l03912r33503M11038J232036p7436
42325D524104j554442r95569N40354P32852l02367p22260j86259J02524m2642
42316B096295L33735J006761N20085j120369j849270m96756J414778J898046J081571
42307D884876L24723p7151q02999j753225j863404o33845J128605K142097J660579
42298E010256j02586j942179k353359r82957P84957J329266O50036M7600K09532
42289B650566N13313K39244l99242p38629o06074m46879p61238j502462j896659
42280b948060j095351O93703K119655K229355J618410J319692J112496J23367
$$ plain form
42272 5173267 3966810 2659332 2771089 4082310 4901713 4179609 2391905 455376 -1137630
42263 -1137630 -1972784 -1599259 -254634 1034443 1553703 1580301 1641681 1664505 1245922 315326
42253 315326 -816078 -1715357 -1986575 -1626980 -1292207 -1589576 -2049656 -1629290 -396595
42244 -396595 335717 -31942 -466633 -76697 382780 -86256 -831131 -549608 473215
42235 473215 774393 43931 -648779 -922047 -1583690 -2682250 -2797912 -1180544 738255
42226 738255 1089573 -46006 -1021209 -754578 461283 1814166 2780952 3376522 4194835
42217 4194835 5809136 7639535 8047946 6268217 3649519 2160500 2209756 2858166 3576311
42208 3576311 4504804 5260808 4958065 3670345 2698593 2919943 3728631 4034558 3571523
$$ packed form
42272E173267j206457j307478J11757J311221Q19403p22104j787704j936529j593006
42263a137630q35154L73525J344625J289077N19260K6598O1380K2824m18583r30596
42253C15326j131404q99279k71218L59595L34773k97369m60080M20366J232695
42244c96595P32312l67659m34691L89936M59477m69036p44875K81523J022823
42235D73215L01178p30462o92710k73268o61643j098560j15662J617368J918799
42226G38255L51318j135579r75203K66631J215861J352883R66786N95570Q18313
42217D194835J614301J830399M08411j779729k618698j489019M9256O48410P18145
42208C576311R28493P56004l02743j287720r71752K21350Q08688L05927m63035
$$ plain form
42199 3571523 2795917 2138471 1790770 1707719 1467687 645839 -359636 -453798 782140
42190 782140 2355744 2991572 2612659 2218225 2557829 3374084 3843231 3483215 2669137
42181 2669137 2259400 2544942 2805112 2395824 1950224 2526841 3659829 3627898 2084786
42172 2084786 942243 1635672 2827033 2346008 505975 -368472 637529 2004298 2342896
42163 2342896 2186016 2583919 3413478 4024701 4455458 4957642 5096261 4379776 3329359
42154 3329359 2980253 3525560 4131533 3919028 2680590 998085 115438 1140447 3646276
42145 3646276 5523231 5117756 3265668 2272831 2998277 3987926 3685917 2502258 2091653
42136 2091653 3177851 4782604 5460085 4821718 3757709 3335211 3638593 3849311 3431153
$$ packed form
42199C571523p75606o57446l47701q3051k40032q21848j005475r4162J235938
42190G82140J573604O35828l78913l94434L39604Q16255M69147l60016q14078
42181B669137m09737K85542K60170m09288m45600N76617J132988l1931j543112
42172B084786j142543O93429J191361m81025j840033q74447J006001J366769L38598
42163B342896j56880L97903Q29559O11223M30757N02184J38619p16485j050417
42154C329359l49106N45307O05973k12505j238438j682505q82647J025009K505829
42145C646276J876955m05475j852088r92837P25446R89649l02009j183659m10605
42136B091653J086198J604753O77481o38367j064009m22498L03382K10718m18158
$$ plain form
42127 3431153 2803927 2556146 2478602 2032465 1476279 1653805 2669925 3671448 4124777
42118 4124777 4387197 4643697 4306539 3251238 2757903 4003973 6041909 6631688 5159152
42109 5159152 3483628 3466097 4757086 5774552 5948066 5845819 5553825 4341047 2207093
42100 2207093 648787 1126390 3266862 5259581 5800316 5101472 4176049 3779128 4126712
42091 4126712 5055669 6060412 6384732 5459694 3431058 1279696 249610 757963 1738546
42082 1738546 1583854 184115 -513930 1174343 4146517 5503798 4119596 1880167
42074 1880167 922342 1113673 1328918 1859870 3741892 6333766 7610513 6974595 5987800
42065 5987800 5869596 5965409 5509467 5297895 6220094 7228241 6465740 4029233 2085758
$$ packed form
42127C431153o27226k47781p7544m46137n56186J77526J016120J001523M53329
42118D124777K62420K56500l37158j055301m93335J246070K037936N89779j472536
42109E159152j675524j7531J290989J017466J73514j02247k91994j212778k133954
42100B207093j558306M77603K140472J992719N40735o98844r25423l96921L47584
42091D126712R28957J004743L24320r25038k028636k151362j030086N08353R80583
42082A738546j54692j399739o98045J688273K972174J357281j384202k239429
42074A880167r57825J91331K15245N30952J882022K591874J276747o35918r86795
42065E987800j18204R5813m55942k11572R22199J008147p62501k436507j943475
$$ plain form
42056 2085758 2166907 3517257 4360683 3878102 2611656 1613255 1530314 2066337 2158599 1091897
42046 1091897 -532608 -1409322 -1043886 -16248 1206336 2764615 4435626 5202159 4558937
42037 4558937 3522654 3370467 3794735 3393294 1886765 697347 991541 2116834 2635515
42028 2635515 2248724 1900273 2352003 3498461 4935491 6303773 6955922 6209899 4433600
42019 4433600 3191877 3612230 4983668 5654824 5052300 4078538 3678727 3881144 4331250
42010 4331250 4856527 5088165 4299562 2343353 374634 -62451 1348256 3349577 4291080
42001 4291080 3435284 1370015 -504035 -1096740 -616067 -278537 -744197 -1172055 -346306
41992 -346306 1529953 2899677 2729416 1641732 981697 1360363 2455177 3708960 4666324
$$ packed form
42056B085758Q1149J350350Q43426m82581j266446r98401q2941N36023R2262j066702
42046A091897j624505q76714L65436J027638J222584J558279J671011P66533o43222
42037D558937j036283j52187M24268m01441j506529j189418K94194J125293N18681
42028B635515l86791l48451M51730J146458J437030J368282O52149p46023j776299
42019D433600j241723M20353J371438O71156o02524r73762l99811K02417M50106
42010D331250N25277K31638p88603j956209j968719m37085J410707K001321R41503
42001D291080q55796k065269j874050n92705M80673L37530m65660m27858Q25749
41992c46306J876259J369724j70261j087684o60035L78666J094814J253783R57364
$$ plain form
41983 4666324 4908348 4308872 3420654 3144314 3839463 5081878 6432045 7977940 9694054
41974 9694054 10691057 9969865 7961362 6377981 6104201 6144196 5433641 4762870 5535792
41965 5535792 7195313 7719905 6740821 6180050 7076234 7706247 6270430 3909264 3148208
41956 3148208 4271826 5280692 5026383 4345469 4048322 3723951 3024362 2537605 2707571
41947 2707571 3102448 3325680 3565311 3790512 3570315 3193878 3732823 5300152 6399325
41938 6399325 5808421 4100293 2532495 1499917 959116 1275748 2512499 3744645 4211589
41929 4211589 4390311 4887973 5177205 4672898 4138622 4467745 4817266 3802603 2171378
41920 2171378 2291752 4811148 7573035 8325977 7118480 5519205 4648833 4462392 4020282
$$ packed form
41983D666324K42024n99476q88218k76340O95149J242415J350167J545895J716114
41974I694054R97003p21192k008503j583381k73780L9995p10555o70771P72922
41965E535792J659521N24592r79084n60771Q96184O30013j435817k361166p61056
41956C148208J123618J008866k54309o80914k97147l24371o99589m86757J69966
41947B707571L94877K23232K39631K25201k20197l76437N38945J567329J099173
41938F399325n90904j708128j567798j032578n40801L16632J236751J232146M66944
41929D211589J78722M97662K89232n04307n34276L29123L49521j014663j631225
41920B171378J20374K519396K761887P52942j207497j599275q70372j86441m42110
$$ plain form
41911 4020282 2213102 -817670 -2989856 -2325589 239213 1687078 852329 -310352
41903 -310352 6611 1037958 1521430 2093016 3588155 4594520 3300032 875731 204278
41894 204278 1450660 1771816 -80571 -1699560 -863133 1016458 1321827 347017 453769
41885 453769 1969849 2578530 894682 -1637251 -3084056 -3396678 -3441332 -3194031 -2269876
41876 -2269876 -1232860 -905453 -938454 -428420 445049 824468 988126 2126704 4093384
41867 4093384 5010082 3829212 1931432 1199915 1607309 1857766 1512166 1097772 690380
41858 690380 -110535 -962315 -919479 95666 1102800 1466148 1416575 1087742 260295 -629334
41848 -629334 -491836 803029 1924655 1940579 1682240 2333318 3498892 3805900 2895460
$$ packed form
41911D020282j807180l030772k172186O64267K564802J447865q34749j162681
41903c10352L16963J031347M83472N71586J495139J006365j294488k424301o71453
41894B04278J246382L21156j852387j618989Q36427J879591L05369r74810J06752
41885D53769J516080O08681j683848k531933j446805l12622m4654K47301R24155
41876b269876J037016L27407l3001N10034Q73469L79419J63658J138578J966680
41867D093384R16698j180870j897780p31517M07394K50457l45600m14394m07392
41858F90380q00915q51780M2836J015145J007134L63348m9573l28833q27447q89629
41848f29334J37498J294865J121626J5924k58339O51078J165574L07008r10440
$$ plain form
41839 2895460 1675277 865836 397764 205508 596402 1629087 2887772 4072565 5148349
41830 5148349 5720075 5013222 2984612 980966 639166 2154608 4040944 4679903 3806508
41821 3806508 2292135 796747 -766075 -2337879 -3057734 -2228978 -545199 643771
41813 643771 1234565 2393795 4392639 5713175 5173860 3837173 3456922 3734839 2825838
41804 2825838 492972 -1029217 -14123 2274205 3243016 2388679 1746173 2974749 5113041
41795 5113041 5792260 4158581 1893283 1281538 2725786 4479276 4651028 3114965 1443518
41786 1443518 1266148 2760674 4535734 4997914 4043206 3209003 3755514 4949537 5087707
41777 5087707 3983320 3128930 3215172 3109660 2105806 1561022 2851362 5005584 6197901
$$ packed form
41839B895460j220183q09441m68072j92256L90894J032685J258685J184793J075784
41830E148349N71726p06853k028610k003646l41800J515442J886336O38959q73395
41821C806508j514373j495388j562822j571804p19855Q28756J683779J188970
41813F43771N90794J159230J998844J320536n39315j336687l80251K77917r09001
41804B825838k332866j522189J015094K288328R68811q54337o42506J228576K138292
41795E113041O79219j633679k265298o11745J444248J753490J71752j536063j671447
41786A443518j77370J494526J775060M62180r54708q34203N46511J194023J38170
41777E087707j104387q54390Q6242j05512j003854n44784J290340K154222J192317
$$ plain form
41768 6197901 6554897 7279611 7736588 6159345 3247953 2133176 3929007 5982826 5885106
41759 5885106 4745897 4607055 4826946 3655005 1932368 2237969 4804174 6963192 6805250
41750 6805250 5191760 3846115 3450235 4098952 5762889 7544456 8004270 7019491 6064574
41741 6064574 6011858 5951557 4902504 3397316 2498167 2392643 2861695 4007490 5492287
41732 5492287 6100570 5216372 3892526 3385361 3544083 3803959 4680364 6638531 8308812
41723 8308812 7802951 5489183 3545908 2859781 2371601 1651496 1847630 3229363 3902521
41714 3902521 2527954 845026 1641102 4950888 7968182 8454313 6824813 4963231
41706 4963231 4269460 5030768 6621059 7914089 8137584 7576680 7071512 6940436 6902341
$$ packed form
41768F197901L56996P24714M56977j577243k911392j114777J795831K053819r7720
41759E885106j139209j38842K19891j171941j722637L05601K566205K159018j57942
41750F805250j613490j345645l95880O48717J663937J781567M59814r84779r54917
41741F064574n2716o0301j049053j505188q99149j05524M69052J145795J484797
41732E492287O08283q84198j323846n07165J58722K59876Q76405J958167J670281
41723H308812n05861k313768j943275o86127m88180p20105J96134J381733O73158
41714C902521j374567j682928P96076L309786L017294M86131j629500j861582
41706D963231o93771P61308J590291J293030K23495n60904n05168j31076l8095
$$ plain form
41697 6902341 6771473 6457665 5528701 3804391 2356561 2721144 4764244 6431294 6240684
41688 6240684 5115906 4969494 6236901 7781081 8719657 9220492 9590154 9608082 9060840
41679 9060840 8307122 7969858 8326432 9090278 9584805 9226753 8136117 7143205 6890223
41670 6890223 7161470 7481180 7963703 8864203 9626721 9429165 8659321 8647689 9554074 9706859
41660 9706859 7836004 5004817 3276823 3156862 3536305 3670331 3798910 3958890 3714999
41651 3714999 3395328 4191677 6338640 8322115 8755677 8120382 7693135 7606750 7201705
41642 7201705 6697079 7026933 8127376 8788718 8451961 7955593 8095301 8523119 8650345
41633 8650345 8671622 8884372 8728352 7526843 5914322 5581206 7364312 10005651 11095073
$$ packed form
41697F902341j30868l13808r28964j724310j447830L64583K043100J667050j90610
41688F240684j124778j46412J267407J544180R38576N00835L69662J7928n47242
41679I060840p53718l37264L56574P63846M94527l58052j090636r92912k52982
41670F890223K71247L19710M82523R00500P62518j97556p69844j1632R06385J52785
41660I706859j870855k831187j727994j19961L79443J34026J28579J59980k43891
41651C714999l19671P96349K146963J983475M33562o35295m27247q6385m05045
41642G201705n04626L29854J100443O61342l36757m96368J39708M27818J27226
41633H650345K1277K12750j56020j201509j612521l33116J783106K641339J089422
$$ plain form
41624 11095073 9374832 6190312 4325774 4953672 6172602 5493381 3384223 2745382
41616 2745382 4697628 6897038 7026611 5977210 5752640 5881670 4534961 2359473 2192422
41607 2192422 4767414 7411714 7772237 6467991 5003047 3346060 1202430 -172680
41599 -172680 524407 2410544 3464140 3039552 1868976 487940 -679333 -505793 1631918
41590 1631918 4265279 5288219 4745326 4420941 4916157 5116675 4594428 4424429 5101368
41581 5101368 5555298 5060124 4510484 4859631 5638042 5973320 5915623 5868114 5801302 5816926
41571 5816926 6252124 6377024 4514998 800842 -1638913 -179492 3562551 5586841
41563 5586841 4629514 3218707 3615264 5010231 5537137 5136505 5051865 5692001 6475751
$$ packed form
41624A1095073j720241l184520j864538O27898J218930o79221k109158o38841
41616B745382J952246K199410J29573j049401k24570J29030j346709k175488j67051
41607B192422K574992K644300L60523j304246j464944j656987k143630j375110
41599a72680O97087J886137J053596m24588j170576j381036j167273J73540K137711
41590A631918K633361J022940n42893l24385M95216K00518n22247j69999O76939
41581E101368M53930m95174n49640L49147P78411L35278n7697m7509o6812J5624
41571E816926M35198J24900j862026l714156k439755J459421L742043K024290
41563E586841r57327j410807L96557J394967N26906m00632q4640O40136P83750
$$ plain form
41554 6475751 7195532 8155277 9075072 9012630 7645303 5875255 4762996 4298222 3663512
41545 3663512 2542051 1704155 2104422 3602161 4900794 4847447 3626903 2573497 2911629
41536 2911629 4678724 6644755 7246870 5964421 3959461 3007754 3581698 4451534 4514269
41527 4514269 4354410 5191652 6744027 7341841 6289248 4989857 5150825 6659084 7988030
41518 7988030 8210376 7758005 7354948 7042439 6507893 5854796 5644078 6303525 7711957
41509 7711957 9311524 10476899 10778116 10078635 8648928 7275085 6942425 7941144 9248239
41500 9248239 9266101 7463618 4985686 3337497 2791657 2549839 2157591 1952934 2051702
41491 2051702 1792881 782678 -84150 529258 2671777 4934817 6078054 6241080 6408097
$$ packed form
41554F475751P19781R59745R19795o2442j367327j770048j112259m64774o34710
41545C663512j121461q37896M00267J497739J298633n3347j220544j053406L38132
41536B911629J767095J966031O02115j282449k004960r51707N73944Q69836O2735
41527D514269j59859Q37242J552375N97814j052593j299391J60968J508259J328946
41518G988030K22346m52371m03057l12509n34546o53097k10718O59447J408432
41509G711957J599567J165375L01217o99481j429707j373843l32660R98719J307095
41500I248239J7862j802483k477932j648189n45840k41818l92248k04657R8768
41491B051702k58821j010203q66828O13408K142519K263040J143237J63026J67017
$$ plain form
41482 6408097 7218965 8533276 9682242 9871449 8769000 7015269 5803547 5724866 6421411
41473 6421411 7470248 8820152 9942064 9519535 6983935 3777614 1976140 1960771 2505310
41464 2505310 2829774 3252860 3899332 4220482 4070048 3911944 3574310 2218565 206853
41455 206853 -430254 1519075 4552476 6197448 5838166 4729333 4032117 4095610 4985363
41446 4985363 6271848 6701948 5542887 4080733 4368317 6460359 8222681 8051730 6524863
41437 6524863 5064524 4202467 3709466 3413759 3169833 2688327 2034464 1847005 2561072
41428 2561072 3712602 4355590 3989575 2990858 2357023 2907185 4337712 5234858 4529549
41419 4529549 2775177 1468732 1389548 2211587 3295594 3980856 3581228 2290141 1717285
$$ packed form
41482F408097Q10868J314311J148966J89207j102449j753731j211722p8681O96545
41473F421411J048837J349904J121912m22529k535600l206321j801474j5369N44539
41464B505310L24464M23086O46472L21150j50434j58104l37634j355745k011712
41455B06853o37107J949329L033401J644972l59282j108833o97216O3493Q89753
41446D985363J286485M30100j159061j462154K87584K092042J762322j70951j526867
41437F524863j460339q62057m93001k95707k43926m81506o53863j87459P14067
41428B561072J151530O42988l66015r98717o33835N50162J430527Q97146p05309
41419D529549j754372j306445p9184Q22039J084007O85262l99628j291087n72856
$$ plain form
41410 1717285 3077491 5067320 5258827 3627638 2702372 3762918 5044710 4743550 3746018
41401 3746018 3767803 4451184 4314951 3488953 3439407 4562723 5883242 6731589 7058987
41392 7058987 6533681 5111787 4171860 5124483 6951987 7154432 5382829 4086601 4960429
41383 4960429 6736637 7475788 7214266 6971662 6672757 5797795 5071244 5626522 6950719
41374 6950719 7370432 6452712 5392634 4978499 4693165 4173014 4111512 4981205 5994025
41365 5994025 6267449 6201859 6681820 7510989 7792477 7553684 7756311 8650134 9314055 9172070
41355 9172070 8833384 8793243 8354250 6874367 5328101 5273219 6511505 7127845 6031122
41346 6031122 4294955 3577817 4212807 5419947 6547691 7350263 7611643 7291912 6831401
$$ packed form
41410A717285J360206J989829J91507j631189r25266J060546J281792l01160r97532
41401C746018K1785O83381j36233q25998m9546J123316J320519Q48347L27398
41392G058987n25306j421894r39927R52623J827504K02445j771603j296228Q73828
41383D960429J776208P39151k61522k42604k98905q74962p26551N55278J324197
41374F950719M19713r17720j060078m14135k85334n20151o1502Q69693J012820
41365E994025K73424o5590M79961Q29169K81488k38793K02627Q93823O63921j41985
41355I172070l38686m0141m38993j479883j546266n4882J238286O16340j096723
41346F031122j736167p17138O34990J207140J127744Q02572K61380l19731m60511
$$ plain form
41337 6831401 6786607 7275633 7951276 8188346 7290695 5223615 3297934 3176224 4783780
41328 4783780 6248923 6518724 6750694 7999024 8821572 7064420 3380674 843378 968617
41319 968617 2055627 2006897 1069285 812575 1717431 3017373 4144491 5097960 5692227
41310 5692227 5506296 4715411 4348900 5379232 7562428 9259368 8750299 6115570 3522188
41301 3522188 3001977 4150957 4858032 4155787 3191054 3197966 3840448 4267204 4688623 5792657
41291 5792657 7188626 7546838 6201036 3926918 2175420 1907037 2951850 4178740
41283 4178740 4545425 4150223 3801155 3500032 2281982 9720 -1708723 -1326860 626734
41274 626734 2338552 2945536 2939355 2885418 3017223 3784412 5354235 6531988 5635838 2875423
$$ packed form
41337F831401m4794M89026O75643K37070q97651k067080j925681j21710J607556
41328D783780J465143K69801K31970J248330Q22548j757152l683746k537296J25239
41319I68617J087010m8730r37612k56710R04856J299942J127118R53469N94267
41310E692227j85931p90885l66511J030332K183196J696940n09069k634729k593382
41301C522188n20211J148980P07075p02245r64733O912O42482M26756M21419J104034
41291E792657J395969L58212j345802k274118j751498k68383J044813J226890
41283D178740L66685l95202l49068l01123j218050k272262j718443L81863J953594
41274F26734J711818O06984o181n3937J31805P67189J569823J177753q96150k760415
$$ plain form
41264 2875423 616794 625242 2035552 2798315 2288405 1572852 1694805 2694698 4045755
41255 4045755 5108460 5206763 4148179 2867144 2791446 4150664 5480333 5389937 4441529
41246 4441529 4432837 5781076 6586203 5000408 1935417 270130 1306786 3161217 3294075
41237 3294075 1722018 645449 1376695 2972485 4011145 4409598 4751965 4738541 3470671
41228 3470671 1118093 -688889 -483792 1500702 3726783 4944984 5051178 4614969 4119202
41219 4119202 3798133 3774293 3956275 3993282 3737223 3644595 4249421 5261118 5775092 5534588
41209 5534588 5339554 5832795 6501977 6458799 5652166 4544647 3081949 1068537 -631620
41200 -631620 -568089 1321282 3342638 4190972 4411579 4936738 5202402 4043674 1900072
$$ packed form
41264B875423k258629Q448J410310P62763n09910p15553J21953R99893J351057
41255D045755J062705R8303j058584j281035p5698J359218J329669r0396r48408
41246D441529q692J348239Q05127j585795l064991j665287J036656J854431J32858
41237C294075j572057j076569P31246J595790J038660L98453L42367j3424j267870
41228C470671k352578j806982K05097J984494K226081J218201J06194m36209m95767
41219D119202l21069k3840J81982L7007k56059r2628O04826J011697N13974k40504
41209E534588j95034M93241O69182m3178q06633j107519j462698k013412j700157
41200f31620O3531J889371K021356Q48334K20607N25159K65664j158728k143602
$$ plain form
41191 1900072 541917 539258 505931 -592085 -1712032 -1345889 107147 971739 868512
41182 868512 1112071 2396781 3595630 3614088 3232608 3889262 5334762 5912481 4976497
41173 4976497 3643896 2964183 2664176 2213022 1875403 1816845 1203482 -582442 -2489454
41164 -2489454 -2889159 -1771326 -511632 336653 1457361 2855757 3311024 2534134 2294520
41155 2294520 4045410 6524458 7323595 6194459 5049874 4921947 4814735 3926129 3187343
41146 3187343 3592338 4342462 3956520 2384642 708941 -649666 -1949621 -2626183 -1456283
41137 -1456283 1335991 3491590 3116727 911284 -804057 -762624 344631 1312223 1879401
41128 1879401 2589749 3700469 4572531 4218690 2504902 603052 -176932 87227 249140
$$ packed form
41191A900072j358155k659l3327j098016j119947L66143J453036Q64592j03227
41182H68512K43559J284710J198849J8458l81480O56654J445500N77719r35984
41173D976497j332601o79713l00007m51154l37619n8558o13363j785924j907012
41164b489454l99705J117833J259694Q48285J120708J398396M55267p76890k39614
41155B294520J750890K479048P99137j129136j144585j27927j07212q88606p38786
41146C187343M04995P50124l85942j571878j675701j358607j299955o76562J169900
41137a456283K792274K155599l74863k205443j715341M1433J107255R67592N67178
41128A879401P10348J110720Q72062l53841j713788j901850p79984K64159J61913
$$ plain form
41119 249140 8132 527145 2586706 5030847 6014671 5230510 3855738 2686560 1505365
41110 1505365 204110 -635617 -529498 348958 1507792 2328185 2050821 565075 -811953
41101 -811953 -509442 1155744 2205181 1711181 1035055 1748518 3450656 4445872 3714615
41092 3714615 1542401 -903727 -2022325 -919742 1113242 1483824 -362789 -1836759
41084 -1836759 -774811 1318672 1570745 151434 -165834 1571422 3280463 3426103 3184767
41075 3184767 3931159 4765121 4175987 2630597 1704347 1571780 1093345 -77150 -1037929
41066 -1037929 -1161410 -762451 -205570 516105 1124983 1009884 251841 -67654 881149
41057 881149 2589043 3854540 4164001 3906052 3450706 2701388 1677014 924669 951817
$$ packed form
41119B49140k41008N19013K059561K444141R83824p84161j374772j169178j181195
41110A505365j301255q39727J06119Q78456J158834Q20393k77364j485746j377028
41101h11953L02511J665186J049437m94000o76126P13463J702138R95216p31257
41092C714615k172214k446128j118598J102583K032984L70582j846613j473970
41084a836759J061948K093483K52073j419311l17268J737256J709041J45640k41336
41075C184767P46392Q33962n89134j545390r26250j32567m78435j170495r60779
41066a037929j23481L98959N56881P21675O08878j15099p58043l19495R48803
41057H81149J707894J265497L09461k57949m55346p49318j024374p52345K7148
$$ plain form
41048 951817 1644747 2679261 4046638 5467569 5726948 3800377 696556 -1118209 -576788
41039 -576788 920915 1836704 2381502 3027927 2776369 794121 -1344851 -1374471 246644
41030 246644 1056305 567037 843447 2644260 3753341 2447944 269367 -487540 -216646
41021 -216646 -798267 -2210810 -2635412 -1393163 281304 1306823 1900439 2545144 3199055
41012 3199055 3752743 4202393 4207585 3382387 2127434 1368081 1404490 1733116 1980649 2271815
41002 2271815 2658709 2904934 2956862 3101611 3578889 4373029 5276925 5870415 5734252 5028359
40992 5028359 4444233 4211567 3731068 2683519 1777427 1685010 2005970 2234174 2976506
40983 2976506 4885565 6861046 6869729 4632148 2209609 1596948 2652712 3716073 3586636
$$ packed form
41048I51817O92930J034514J367377J420931K59379j926571l103821j814765N41421
41039e76788J497703R15789N44798O46425k51558j982248k138972k9620J621115
41030B46644Q09661m89268K76410J800813J109081j305397k178577p56907K70894
41021b16646n81621j412543m24602J242249J674467J025519N93616O44705O53911
41012C199055N53688M49650N192q25198j254953p59353L6409L28626K47533K91166
41002B271815L86894K46225N1928J44749M77278P94140R03896N93490j36163p05893
40992E028359n84126k32666m80499j047549r06092r2417L20960K28204P42332
40983B976506J909059J975481Q683k237581k422539o12661J055764J063361j29437
$$ plain form
40974 3586636 2629677 2276212 3381004 4903983 4818404 2756019 783367 651979 1368653
40965 1368653 950067 -367524 -683158 280294 729059 -194232 -1125006 -833553 2732
40956 2732 274056 152178 362398 967442 1761554 2824739 3917074 4294398 3767693 2984818
40946 2984818 2215553 1074659 -40530 266410 2256544 4038978 3787580 1909473 47774
40937 47774 -921179 -861616 389104 2404006 3757515 3577060 2706660 2195456 1686085
40928 1686085 655193 77569 1035483 2541929 2780434 1984227 1964249 2979242 3271197
40919 3271197 1969342 416875 -26252 247100 396766 783712 2190390 4230740 5513550
40910 5513550 5061809 3157878 1177478 689367 2071791 3885221 4270374 3011669 1503391
$$ packed form
40974C586636r56959l53465J104792J522979q5579k062385j972652j31388P16674
40965A368653m18586j317591l15634R63452M48765r23291r30774K91453Q36285
40956B732K71324j21878K10220O05044P94112J063185J092335L77324n26705p82875
40946B984818p69265j140894j115189L06940J990134J782434k51398j878107j861699
40937D7774r68953N9563J250720K014902J353509j80455q70400n11204n09371
40928A686085j030892n77624R57914J506446K38505p96207j9978J014993K91955
40919C271197j301855j552467m43127K73352J49666L86946J406678K040350J282810
40910E513550m51741j903931j980400m88111J382424J813430L85153j258705j508278
$$ plain form
40901 1503391 803538 765091 1091424 1923453 2962004 3243349 2500438 1801604 2119389
40892 2119389 3063710 3700291 3823399 3684065 3236519 2513724 2063444 2039394 1438747 -613066
40882 -613066 -3146257 -4135020 -2998557 -1178420 -10906 825243 2129677 3427902 3489511
40873 3489511 2234658 1013583 860217 1388311 1778858 1969732 2145521 1803398 476883
40864 476883 -952957 -989801 383751 1667431 2160654 2822617 4167231 4916480 4015676
40855 4015676 2619681 2381500 2798281 2259363 1067978 1133752 2754481 3969527 3497691
40846 3497691 2282715 1536788 1182913 994961 1372097 1982419 1489343 -120839 -710481
40837 -710481 979225 3100565 3323313 2241391 2004427 2693430 2566827 1308342 398654
$$ packed form
40901A503391o99853l8447L26333Q32029J038551K81345p42911o98834L17785
40892B119389R44321O36581J23108j39334m47546p22795m50280k4050o00647k051813
40882f13066k533191r88763J136463J820137J167514Q36149J304434J298225O1609
40873C489511j254853j221075j53366N28094L90547J90874J75789l42123j326515
40864D76883j429840l6844J373552J283680M93223O61963J344614P49249r00804
40855D015676j395995k38181M16781n38918j191385O5774J620729J215046m71836
40846C497691j214976p45927l53875j87952L77136O10322m93076j610182n89642
40837g10481J689706K121340K22748j081922k36964O89003j26603j258485r09688
$$ plain form
40828 398654 310710 -73174 -803714 -120742 2581296 5112310 5245207 3600979 2305279
40819 2305279 2004010 1900723 1951795 3146852 5656476 8161317 9298615 8821382 7231578
40810 7231578 5267616 3960136 4103629 5067506 4983065 2963405 580762 122751 1630792
40801 1630792 2830329 2130258 434124 -642322 -1095135 -1783972 -2232513 -1055604 1444083
40792 1444083 2974695 2188976 386483 -604428 -820285 -1198436 -1471925 -721283 695240
40783 695240 1525745 1627830 1941175 2609473 2837379 2739741 3592253 5707679 7544993
40774 7544993 7651396 6298668 4533492 2790260 1232821 351266 209394 -85449 -1195243
40765 -1195243 -2454934 -2798485 -2212885 -1515750 -1256581 -1556431 -2414716 -3379152 -3483778
$$ packed form
40828C98654q7944l83884p30540O82972K702038K531014J32897j644228j295700
40819B305279l01269j03287N1072J195057K509624K504841J137298m77233j589804
40810G231578j963962j307480J43493R63877q4441k019660k382643m58011J508041
40801A630792J199537p00071j696134j076446m52813o88837m48541J176909K499687
40792A444083J530612p85719j802493r90911k15857l78151k73489P50642J416523
40783F95240Q30505J02085L13345O68298K27906r7638Q52512K115426J837314
40774G544993J06403j352728j765176j743232j557439q81555j41872k94843j109794
40765a195243j259691l43551N85600O97135K59169k99850q58285r64436j04626
$$ plain form
40756 -3483778 -2346011 -845586 22316 397579 875322 1234861 861017 -14051 -473221
40747 -473221 -12447 1278360 3109950 4754354 5112777 4062790 3018959 2956690 2730137
40738 2730137 959947 -1192516 -1289990 619499 1855560 988415 -421057 -629102 -35442
40729 -35442 388199 955543 2021589 2495760 1345100 -491168 -1234794 -438233 1265840
40720 1265840 3481892 5614685 6236125 4762501 2972665 2900467 3817763 3415712 1599078
40711 1599078 730386 1933061 3456987 3407409 2151741 1097457 707780 774617 1355564
40702 1355564 2384521 3301470 3813722 4060108 3571224 1520356 -1228445 -2036762 147225
40693 147225 2804445 3037206 1648202 1852901 4455134 6695554 6187708 3880507 2183852
$$ packed form
40756c483778J137767J500425Q67902L75263M77743L59539l73844q75068m59170
40747d73221M60774J290807J831590J644404L58423j049987j043831o2269k26553
40738B730137j770190k152463r7474J909489J236061q67145j409472k08045N93660
40729c5442M23641N67344J066046M74171j150660j836268p43626P96561J704073
40720A265840K216052K132793O21440j473624j789836p2198R17296m02051j816634
40711A599078q68692J202675J523926m9578j255668j054284l89677O6837N80947
40702A355564J028957R16949N12252K46386m88884k050868k748801q08317K183987
40693A47225K657220K32761j389004K04699K602233K240420n07846k307201j696655
$$ plain form
40684 2183852 1731484 1326817 249705 -743412 -622737 607556 2013736 2723283 2609093
40675 2609093 2148486 1811850 1703811 1726924 1826051 1962572 2082255 2229908 2445242 2481920
40665 2481920 2036178 1385405 1273106 1898239 2563934 2623845 2135393 1254199 -93884
40656 -93884 -1291983 -859036 1588121 3962781 3832987 1619192 134424 929908 2630093
40647 2630093 3231700 2596579 1929033 1895525 2212966 2495664 2712649 3054021 3746413 4736507
40637 4736507 5414089 5093006 3899959 2714695 2150274 2064694 2006424 1547441 397511
40628 397511 -937583 -841233 1825690 5750939 8142898 8012530 7110299 7067622 7130787
40619 7130787 5784513 3389225 1802885 2004684 3271548 4361585 4633481 4294926 4165333
$$ packed form
40684B183852m52368m04667j077112r93117J20675J230293J406180P09547j14190
40675B609093m60607l36636j08039K3113R9127J36521J19683J47653K15334L6678
40665B481920m45742o50773j12299O25133O65695N9911m88452q81194j348083
40656i3884j198099M32947K447157K374660j29794k213795j484768P95484J700185
40647B630093O01607o35121o67546l3508L17441K82698K16985L41372O92392R90094
40637D736507O77582l21083j193047j185264n64421q5580n8270m58983j149930
40628C97511j335094R6350K666923L925249K391959j30368r02231m2677O3165
40619G130787j346274k395288j586340K01799J266864J090037K71896l38555j29593
$$ plain form
40610 4165333 4821167 5627474 5318517 3863200 2682010 2471710 2165973 1006487 217083
40601 217083 1148025 2904335 3574824 3045978 2814536 3559435 4699954 5972243 7574342
40592 7574342 8890594 8898108 7908842 7252048 7172856 6721906 5806125 5509090 6032731 6131284
40582 6131284 5192956 4271816 4364673 5096117 5734250 6070987 5676714 3846656 1139096
40573 1139096 -493391 -79044 1158703 1834192 2213939 2946322 3467701 3092424 2480178
40564 2480178 2492373 2576431 1851807 976294 1291951 2690382 3890766 4379793 4534080
40555 4534080 4204906 2859448 1072248 303153 937038 1765731 1675601 853129 132231
40546 132231 20221 496785 1032835 823225 -296468 -1353633 -1424029 -957134 -940654 -1158937
$$ packed form
40610D165333O55834Q06307l08957j455317j181190k10300l05737j159486p89404
40601B17083R30942J756310O70489n28846k31442P44899J140519J272289J602099
40592G574342J316252P514r89266o56794p9192m50950r15781k97035N23641R8553
40582F131284r38328r21140R2857P31444O38133L36737l94273j830058k707560
40573A139096j632487M14347J237747O75489L79747P32383N21379l75277o12246
40564B480178J2195Q4058p24624q75513L15657J398431J200384M89027J54287
40555D534080l29174j345458j787200p69095O33885Q28693r0130q22472p20898
40546A32231j12010M76564N36050k09610j119693j057165p0396M66895J6480k18283
$$ plain form
40536 -1158937 -613607 495876 749793 -281983 -1212782 -753414 675820 1810595 2032766
40527 2032766 1414696 204639 -1001648 -1279550 -348831 835663 1025154 4586 -1258360
40518 -1258360 -1502032 -194833 1796175 2557759 911043 -1972240 -3499737 -2489361
40510 -2489361 -339290 896039 714101 -21411 -548266 -656556 -288203 370582 637066
40501 637066 -29104 -1150318 -1579848 -820952 366059 804983 213199 -437557 7845
40492 7845 1418222 2341034 1792232 640865 463340 1313163 1704670 872868 -136146
40483 -136146 -92848 728794 1210912 987769 620267 682109 1309855 2242473 2813970 2387216
40473 2387216 1240469 463269 553901 841063 801853 1036581 2124044 3402124 3965110
$$ packed form
40536a158937N45330J109483K53917j031776r30799M59368J429234J134775K22171
40527B032766o18070j210057j206287k77902R30719J184494J89491j020568j262946
40518a258360k43672J307199J991008P61584j646716k883283j527497J010376
40510b489361K150071J235329j81938p35512n26855j08290L68353O58785K66484
40501F37066o66170j121214m29530P58896J187011M38924n91784o50756M45402
40492G845J410377R22812n48802j151367j77525Q49823L91507q31802j009014
40483a36146M3298Q21642M82118k23143l67502O1842O27746R32618N71497m26754
40473B387216j146747p77200R0632K87162l9210K34728J087463J278080N62986
$$ plain form
40464 3965110 4093728 4392234 4172349 2357972 -259780 -1484760 -681003 411252 414504
40455 414504 268935 1403200 3253097 4077093 3535608 2903469 2892330 2752406 1894290
40446 1894290 1184059 1816208 3562952 4987944 5116660 4162833 2761852 1333825 361327
40437 361327 462268 1642426 2986445 3638022 3652486 3321914 2262828 175992 -1841978
40428 -1841978 -2051370 -287962 1712505 2507158 2371383 2197891 2251544 2643118 3691754
40419 3691754 4837000 4509635 2462405 1071561 2533074 5566399 6945242 5866313
40411 5866313 4523416 4330203 4106844 2847546 1954601 3077263 5283884 6225020 5250027
40402 5250027 3722502 2796146 2461810 2556902 3221724 4241020 5124610 6025203 7511842
$$ packed form
40464C965110J28618K98506k19885j814377k617752j224980Q03757J092255L252
40455D14504j45569J134265J849897Q23996n41485o32139j1139j39924q58116
40446A894290p10231O32149J746744J424992J28716r53827j400981j428027r72498
40437C61327J00941J180158J344019O51577J4464l30572j059086k086836k017970
40428a841978k09392J763408K000467P94653j35775j73492N3653L91574J048636
40419C691754J145246l27365k047230j390844J461513L033325J378843j078929
40411E866313j342897j93213k23359j259298q92945J122662K206621R41136r74993
40402E250027j527525r26356l34336R5092O64822J019296Q83590R00593J486639
$$ plain form
40393 7511842 9144175 9279403 6896867 3045400 -24986 -863423 255906 1921661
40385 1921661 2753956 2390889 1748519 2098445 3590752 4984603 5258614 5169338 6428400
40376 6428400 9229978 11462270 11038282 8461958 6120318 5258669 4917208 4134458 3726815
40367 3726815 4746890 6218865 6074166 4030213 1929921 1145436 1185636 1204777 1312552
40358 1312552 1672353 1712343 1195768 865970 988549 469446 -1278064 -2743702 -2269300
40349 -2269300 -721530 -279559 -1044127 -989659 669296 2160822 1767621 44767 -1303399
40340 -1303399 -1379027 -277201 1352278 2285171 1598965 209766 75118 1175667 1125681
40331 1125681 -1033999 -2679022 -1224548 1771989 2772255 1475835 812191 1965217
$$ packed form
40393G511842J632333J35228k382536l851467l070386q38437J119329J665755
40385A921661Q32295l63067o42370L49926J492307J393851K74011q9276J259062
40376F428400K801578K232292m23988k576324k341640q61649l41461p82750m07643
40367C726815J020075J471975j44699k043953k100292p84485M0200J9141J07775
40358A312552L59801L9990n16575l29798J22579n19103j747510j465638M74402
40349b269300J547770M41971p64568N4468J658955J491526l93201j722854j348166
40340a303399p5628J101826J629479R32893o86206j389199j34648J100549m9986
40331A125681k159680j645023J454474K996537J000266j296420o63644J153026
$$ plain form
40323 1965217 2683974 1339652 -306851 -28040 1452396 1992687 1379391 974568 1072813
40314 1072813 839382 383322 753629 1891431 2495811 2211765 2231667 3159997 3799220
40305 3799220 2918070 1062726 -360073 -942289 -1221076 -1394361 -1152967 -527056 17158
40296 17158 286876 495750 748104 1022369 1618670 2888487 4346411 4774466 3710102
40287 3710102 2351278 2262969 3298828 3603905 2002003 -300423 -1117482 -17154 1344108
40278 1344108 1636738 1417167 1686318 2004864 1255604 -302266 -1143787 -578415 502038
40269 502038 1111673 1240445 1161557 830486 467807 707782 1559909 2115945 1876151 1469641
40259 1469641 1460073 1445088 1097894 1029854 1612717 1965676 1353455 677468 1099448 1917269
$$ packed form
40323A965217P18757j344322j646503K78811J480436N40291o13296m04823R8245
40314A072813k33431m56060L70307J137802O04380k84046J9902R28330O39223
40305C799220q81150j855344j422799n82216k78787j73285K41394O25911N44214
40296A7158K69718K08874K52354K74265N96301J269817J457924M28055j064364
40287C710102j358824q8309J035859L05077j601902k302426q17059J100328J361262
40278A344108K92630k19571K69151L18546p49260j557870q41521N65372J080453
40269E02038O09635J28772p8888l31071l62679K39975Q52127N56036k39794m06510
40259A469641r568j4985l47194o8040N82863L52959o12221o75987M21980Q17821
$$ plain form
40249 1917269 1534944 159590 -270902 1139044 3157395 4279616 4210567 3300033 1957445
40240 1957445 968037 1043883 1665959 1591631 783916 497374 1154515 1650505 1269478 766105
40230 766105 873649 1212235 1415115 1823354 2224827 1523841 -274859 -1410180 -1002610
40221 -1002610 -690202 -1995562 -3633926 -3479128 -1926574 -979717 -894806 -221982 1284046
40212 1284046 2293181 2377359 2513400 2895797 2430186 854267 -579261 -1049203 -1045866
40203 -1045866 -891944 -196737 716885 690324 -317687 -925354 -616883 -467357 -863702
40194 -863702 -615527 582703 1020932 -104018 -719488 1038220 3440710 3384338 928694
40185 928694 -971560 -755919 222208 408486 -31595 -354744 -339170 310326 2040868
$$ packed form
40249A917269l82325j375354m30492J409946K018351J122221o9049r10534j342588
40240A957445r89408P5846O22076p4328q07715k86542O57141M95990l81027n03373
40230G66105J07544L38586K02880M08239M01473p00986j798700j135321M07570
40221a002610L12408j305360j638364J54798J552554R46857Q4911O72824J506028
40212A284046J009135Q4178J36041L82397m65611j575919j433528m69942L337
40203a045866J53922O95207R13622k6561j008011o07667L08471J49526l96345
40194h63702K48175J198230M38229j124950o15470J757708K402490n6372k455644
40185I28694j900254K15641R78127J86278m40081l23149J5574O49496J730542
$$ plain form
40176 2040868 4340313 5871404 6189942 6093503 5924542 4993506 3305495 2372758 3235971
40167 3235971 4766909 5165948 4448709 4168499 4940901 5481341 4416549 2258734 885734
$$ packed form
40176B040868K299445J531091L18538r6439j68961r31036j688011r32737Q63213
40167C235971J530938L99039p17239k80210P72402N40440j064792k157815j373000
$$ [...]
##END NTUPLES=NMR SPECTRUM
##END=
