##TITLE=31Pdec_LR-683B-CS2ME
 CD3OD, 24 sc
 3.3.2020
##JCAMPDX= 6.0         $$ Bruker NMR JCAMP-DX V2.0
##DATA TYPE= NMR SPECTRUM
##DATA CLASS= NTUPLES
##ORIGIN= UXNMR, Bruker Analytische Messtechnik GmbH
##OWNER= root
$$ XWIN-NMR		Version 3.5
$$ Tue Mar  3 16:44:53 2020 Russian Standard Time (UT+4h)  she@DPX200
##.OBSERVE FREQUENCY= 81.013821
##.OBSERVE NUCLEUS= ^31P
##.ACQUISITION MODE= SIMULTANEOUS
##.ACQUISITION SCHEME= undefined
##.AVERAGES= 24
##.DIGITISER RES= 17
##SPECTROMETER/DATA SYSTEM= spect
##.PULSE SEQUENCE= zgpg30
##.SOLVENT NAME= CDCl3
##.SHIFT REFERENCE= (INTERNAL, CDCl3, 0, 182.463)
##AUDIT TRAIL= $$ (NUMBER, WHEN, WHO, WHERE, WHAT)
$$ ##TITLE= Audit trail, XWIN-NMR		Version 3.5
$$ ##JCAMPDX= 5.01
$$ ##ORIGIN= Bruker BioSpin GmbH
$$ ##OWNER= she
$$ F:/spectra/data/she/nmr/P31/1/pdata/1/auditp.txt
$$ ##AUDIT TRAIL=  $$ (NUMBER, WHEN, WHO, WHERE, WHAT)
(   1,<2020-03-03 16:43:58.32 +0400>,<she>,<DPX200>,
      <created by zg, POWCHK disabled, PULCHK disabled
       configuration hash MD5:
       00 E9 B6 7A A2 85 ED C7 34 08 36 98 17 FE 4E 26
       data hash MD5: 32K
       01 18 B7 BF 97 C9 89 83 0A E5 12 41 DC 1B 64 76>)
(   2,<2020-03-03 16:44:00.78 +0400>,<she>,<DPX200>,
      <Start of raw data processing
       efp BC_mod = 2 LB = 1 FT_mod = 6 PKNL = 1 PHC0 = -1341.893 PHC1 = 126.4017 SI = 64K 
       data hash MD5: 64K
       AF 46 5A B3 7F E0 91 E1 0A 70 09 F5 3D 7C 31 FF>)
(   3,<2020-03-03 16:44:17.98 +0400>,<she>,<DPX200>,
      <pk PHC0 = 5.882132 PHC1 = 0 
       data hash MD5: 64K
       6B C3 F2 F2 87 FE 08 03 01 0B 65 92 FE 5D 3C 13>)
(   4,<2020-03-03 16:44:20.35 +0400>,<she>,<DPX200>,
      <abs ABSG = 5 
       data hash MD5: 64K
       A7 5B 5B 35 CB D1 3C 14 FA 49 45 14 68 CE 7A C0>)
$$ ##END=
$$ 
$$ hash MD5
$$ 09 84 81 E0 9F 4A B7 01 29 52 18 C2 24 65 50 EF
##$RELAX= 
##$RELAX= 
##$RELAX= 
##$RELAX= 
##$RELAX= 
##$RELAX= 
##$RELAX= 
##$RELAX= 
$$ Bruker specific parameters
$$ --------------------------
##$DU= <F:/spectra>
##$EXPNO= 1
##$NAME= <P31>
##$PROCNO= 1
##$TYPE= <nmr>
##$USER= <she>
##$AMP= (0..31)
100 100 100 100 100 100 100 100 100 100 100 100 100 100 100 100 100 100 
100 100 100 100 100 100 100 100 100 100 100 100 100 100 
##$AQSEQ= 0
##$AQ_mod= 1
##$AUNM= <au_zg>
##$AUTOPOS= <>
##$BF1= 81.014009
##$BF2= 200.13
##$BF3= 200.13
##$BF4= 200.13
##$BF5= 200.13
##$BF6= 200.13
##$BF7= 200.13
##$BF8= 200.13
##$BYTORDA= 1
##$CFDGTYP= 0
##$CFRGTYP= 5
##$CHEMSTR= <none>
##$CNST= (0..31)
1 1 145 1 1 1 1 1 1 1 1 1 1 1 1 1 1 1 1 1 1 1 1 1 1 1 1 1 1 1 1 1 
##$CPDPRG= <waltz16>
##$CPDPRG1= <>
##$CPDPRG2= <waltz16>
##$CPDPRG3= <>
##$CPDPRG4= <mlev>
##$CPDPRG5= <mlev>
##$CPDPRG6= <mlev>
##$CPDPRG7= <mlev>
##$CPDPRG8= <mlev>
##$CPDPRGB= <>
##$CPDPRGT= <>
##$D= (0..31)
0 1 0 0 0 0 0 0 0 0 0 0.03 2e-05 3e-06 0 0 0 0 0 0 0 0 0 0 0 0 0 0 0 0 
0 0 
##$DATE= 1583239437
##$DBL= (0..7)
120 120 120 11 120 120 24 19 
##$DBP= (0..7)
150 150 150 150 150 150 150 150 
##$DBP07= 0
##$DBPNAM0= <>
##$DBPNAM1= <>
##$DBPNAM2= <>
$$ [...]
##$SUBNAM3= <"">
##$SUBNAM4= <"">
##$SUBNAM5= <"">
##$SUBNAM6= <"">
##$SUBNAM7= <"">
##$SUBNAM8= <"">
##$SUBNAM9= <"">
##$SW= 369.568048894756
##$SWIBOX= (0..15)
0 1 3 0 0 0 0 0 0 0 0 0 0 0 0 0 
##$SW_h= 29940.119760479
##$TD= 32768
##$TD0= 1
##$TE= 0
##$TE2= 300
##$TE3= 300
##$TEG= 300
##$TL= (0..7)
0 120 53 12 22 120 120 120 
##$TP= (0..7)
150 150 150 150 150 150 150 150 
##$TP07= 0
##$TPNAME0= <>
##$TPNAME1= <>
##$TPNAME2= <>
##$TPNAME3= <>
##$TPNAME4= <>
##$TPNAME5= <>
##$TPNAME6= <>
##$TPNAME7= <>
##$TPOAL= (0..7)
0.5 0.5 0.5 0.5 0.5 0.5 0.5 0.5 
##$TPOFFS= (0..7)
0 0 0 0 0 0 0 0 
##$TUNHIN= 0
##$TUNHOUT= 0
##$TUNXOUT= 0
##$USERA1= <user>
##$USERA2= <user>
##$USERA3= <user>
##$USERA4= <user>
##$USERA5= <user>
##$V9= 5
##$VALIST= <valist>
##$VCLIST= <CCCCCCCCCCCCCCC>
##$VD= 0
##$VDLIST= <DDDDDDDDDDDDDDD>
##$VPLIST= <PPPPPPPPPPPPPPP>
##$VTLIST= <TTTTTTTTTTTTTTT>
##$WBST= 1024
##$WBSW= 4
##$XGAIN= (0..3)
0 0 0 0 
##$XL= 0
##$YL= 0
##$YMAX_a= 7627
##$YMIN_a= -16166
##$ZGOPTNS= <>
##$ZL1= 120
##$ZL2= 120
##$ZL3= 120
##$ZL4= 120
##$ABSF1= 182.463
##$ABSF2= -187.1042
##$ABSG= 5
##$ABSL= 3
##$ALPHA= 0
##$AQORDER= 0
##$ASSFAC= 0
##$ASSFACI= 0
##$ASSFACX= 0
##$ASSWID= 0
##$AUNMP= <proc_1d>
##$AZFE= 0.1
##$AZFW= 0.5
##$BCFW= 0
##$BC_mod= 2
##$BYTORDP= 0
##$COROFFS= 0
##$CY= -3
##$DATMOD= 1
##$DC= 0
##$DFILT= <>
##$DTYPP= 0
##$F1P= 0
##$F2P= 0
##$FCOR= 1
##$FTSIZE= 65536
##$FT_mod= 6
##$GAMMA= 0
##$GB= 0
##$INTBC= 1
##$INTSCL= 5.30512e-09
##$ISEN= 30
##$LB= 1
##$LEV0= 0
##$LPBIN= 0
##$MAXI= 10000
##$MC2= 0
##$MEAN= 0
##$ME_mod= 0
##$MI= 50
##$NCOEF= 0
##$NC_proc= -7
##$NLEV= 6
##$NOISF1= 182.463
##$NOISF2= 159.3651
##$NSP= 0
##$NTH_PI= 0
##$NZP= 0
##$OFFSET= 182.463
##$PC= 4
##$PHC0= -1336.011
##$PHC1= 126.4017
##$PH_mod= 1
##$PKNL= yes
##$PPARMOD= 0
##$PSCAL= 0
##$PSIGN= 0
##$REVERSE= no
##$SF= 81.0140089999434
##$SI= 65536
##$SIGF1= 159.3651
##$SIGF2= -187.1042
##$SINO= 113.3802
##$SIOLD= 16384
##$SREGLST= <1H.CDCl3>
##$SSB= 0
##$STSI= 65536
##$STSR= 0
##$SW_p= 29940.119760479
##$SYMM= 0
##$S_DEV= 0
##$TDeff= 32768
##$TDoff= 0
##$TI= <>
##$TILT= no
##$TM1= 0
##$TM2= 0
##$TOPLEV= 0
##$USERP1= <user>
##$USERP2= <user>
##$USERP3= <user>
##$USERP4= <user>
##$USERP5= <user>
##$WDW= 1
##$XDIM= 65536
##$YMAX_p= 512718525
##$YMIN_p= -19391927
$$ End of Bruker specific parameters
$$ ---------------------------------
##NTUPLES= NMR SPECTRUM
##VAR_NAME=  FREQUENCY,     SPECTRUM/REAL,   SPECTRUM/IMAG
##SYMBOL=    X,             R,               I
##VAR_TYPE=  INDEPENDENT,   DEPENDENT,       DEPENDENT
##VAR_FORM=  AFFN,          ASDF,            ASDF
##VAR_DIM=   65536,         65536,           65536
##UNITS=     HZ,            ARBITRARY UNITS, ARBITRARY UNITS
##FACTOR=    0.456856943014862, 1,           1
##FIRST=     14782.0589164792, 0,            0
##LAST=      -15158.0608439998, 0,           0
##MIN=       -15158.0608439998, -19391927,   0
##MAX=       14782.0589164792, 512718525,    0
$$ Real data points
##PAGE= N=1
##DATA TABLE= (X++(R..R)), XYDATA
$$ [...]
47009 -2176977 -3461900 -2006452 -718165 -1455217 -2743430 -2698611 -2177748 -3256821 -5582017
47000 -5582017 -6531563 -5210976 -4002516 -4811713 -5665466 -3444991 891459 2717239 -314627
46991 -314627 -5340654 -8280034 -8399530 -7369807 -5917011 -3732560 -1438209 -210476
46983 -210476 36926 144380 -34242 -853864 -1010342 996430 3613363 3263595 -555345
46974 -555345 -3677271 -2282661 2224912 5040186 3563670 -414805 -3532832 -4332370
46966 -4332370 -3826301 -3509716 -3357781 -2107665 335985 1705273 -47388 -3360349 -4219433
46957 -4219433 -1096297 3234367 5712560 6806649 8605701 10667116 10244330 6373758
46949 6373758 1601835 -938666 -889778 -397099 -1163190 -2540607 -2642027 -962367 774366
46940 774366 787103 -426569 -974658 -383723 -47516 -835820 -1857745 -1977291 -1022456
46931 -1022456 921231 3696939 5998874 6046035 4136997 2456728 1430032 -1096418
46923 -1096418 -5447290 -7877415 -5507556 -1027808 1011581 691039 1402412 3301521
46915 3301521 2973236 -153277 -1864045 711907 4879674 6569053 5801085 5370643 6161674
46906 6161674 6524893 5276357 2978294 558497 -1674145 -3602536 -4835512 -4789637 -3152803
46897 -3152803 -681595 727912 -168414 -2120863 -2509142 -362720 2836230 5121933
46889 5121933 5458193 3661146 789095 -742328 361789 1941415 1023419 -1550746
46881 -1550746 -2386076 -1422299 -2447219 -6655564 -10039140 -9402823 -6940418 -5856904 -5232994
46872 -5232994 -3069166 -1095814 -1782078 -2938299 -630242 3758635 4840068 1464098
46864 1464098 -1644151 -1359137 -296076 -1558800 -3618883 -3305736 -880636 1032876
46856 1032876 1779714 2955339 5105384 6587437 5827113 3195069 290111 -1881009
46848 -1881009 -3591006 -5332089 -6477714 -5865290 -3907994 -2704041 -3039766 -2900458 -802292
46839 -802292 983171 -594143 -4089141 -4871252 -1948454 136265 -2405564 -7391127
46831 -7391127 -9708048 -7461261 -3064573 308852 1400839 853741 153061 308768 804472
46822 804472 246094 -1761239 -4171946 -5824517 -6055675 -4408269 -1507208 237727 -662113
46813 -662113 -1579736 1338328 6567511 7596216 1886795 -4515813 -4729251 -386448 1021460
46804 1021460 -3497081 -9165650 -10216332 -6018553 99443 4874364 6748974 5816777
46796 5816777 3585549 1737906 499296 -1010999 -2972502 -4579304 -5327134 -5251302 -4105794
46787 -4105794 -1758527 683877 1555649 495723 -1412411 -3043688 -3683804 -2833583 -1192317
46778 -1192317 -1121859 -3957885 -7137731 -6446603 -1459361 3543603 4775353 2910680 892384
46769 892384 -50420 -461094 -306107 1137462 3409737 4814208 4643414 4147163 4514225
46760 4514225 4770139 2996902 -380324 -2067240 230772 4491712 6751189 6241903
46752 6241903 5734419 6664626 7038046 5527313 4519077 6411041 9224899 9237030 6477744
46743 6477744 4073044 3003976 1301189 -1609291 -3398898 -2414984 68901 1871251
46735 1871251 1829208 -442417 -4056694 -6016221 -3857763 585414 3184262 3456648 4768249
46726 4768249 8094404 10130671 9251766 8685155 10917953 13123723 11843699 8714591
46718 8714591 7221024 6454559 2912215 -3079162 -7443094 -8184311 -6980527 -5359440
46710 -5359440 -3362884 -2076525 -3475610 -6866017 -8718556 -7144853 -4064463 -2165953
46702 -2165953 -1999214 -2665152 -3123782 -2214895 451562 3020289 2868266 115250 -2353450
46693 -2353450 -2822448 -2496440 -2695752 -2703595 -1635305 -482739 -787141 -2552043 -4646765
46684 -4646765 -6200167 -6610311 -5167268 -1732243 2609488 6047887 6999273 4966715
46676 4966715 1288476 -1448494 -1839126 -1012913 -580400 -403129 17760 -438802 -2466925
46667 -2466925 -3732108 -1849677 957482 458258 -2545566 -2730459 1338815 4605090
46659 4605090 3487231 1279648 2067434 3767014 1967030 -2520606 -5130826 -4572654
46651 -4572654 -3331558 -2383010 -476776 1672956 1353763 -1546406 -4171425 -5519651
46643 -5519651 -7406474 -9667301 -8934294 -4332549 -397837 -1172834 -4309907 -4623386 -1602694
46634 -1602694 497175 -632180 -2406184 -1845494 136008 852865 334903 1137317 4039065
46625 4039065 6331117 5358643 2155006 -64576 -94398 626980 1254267 2844072 5636845
46616 5636845 7437012 6429583 3886905 2102753 1012972 -872818 -3154832 -3662541
46608 -3662541 -1604766 1465788 3579760 3442534 323163 -4752072 -8198792 -7139350
46600 -7139350 -3569079 -2369968 -4676510 -6216301 -3345108 2073908 5410310 4539973
46592 4539973 721064 -3558907 -5639023 -3611766 1394460 5197197 5012089 2742858
46584 2742858 1751989 1817886 167207 -3333882 -5398492 -4059464 -1237860 477593 1238341
46575 1238341 2613872 4588337 5640809 4904314 2779224 36815 -2369170 -3173968
46567 -3173968 -2014992 -585083 -1024489 -3013087 -4025091 -2888406 -1261308 -540062
46559 -540062 623484 3471265 5407848 2644325 -3549516 -7092472 -4971668 -1423454
46551 -1423454 -1833317 -5430075 -7434794 -6273614 -4448403 -3282544 -1347489 1596399
46543 1596399 3241214 2488784 1209382 967239 1028111 902671 1711842 3358950 3487315
46534 3487315 1400356 37845 1411541 2821705 895991 -2726996 -3427004 -79911
46526 -79911 4012687 6002660 5991336 4890138 2926544 610320 -1315093 -3215637 -5794956
46517 -5794956 -7971639 -7694683 -4971287 -2004289 -245280 624007 808923 -121688 -1549376
46508 -1549376 -1911598 -1100137 -655667 -929615 -218695 2264055 4502356 4142010 1548659
46499 1548659 -782467 -951994 1038808 3823749 5778232 6231040 5957712 5938146 5844944
46490 5844944 4764465 3029960 1829593 1197853 165749 -1118091 -1419374 -829286 -1044421
46481 -1044421 -2628817 -3941316 -3513470 -1665744 872048 3875458 6294643 6210992 3447174
46472 3447174 381269 -1068648 -1398618 -1323725 -23299 2545355 3802660 1561362 -2567126
46463 -2567126 -5167507 -5202409 -3938928 -2051146 513771 2755864 3539409 3674124 4341573
46454 4341573 4134643 942951 -3416194 -4204979 -268052 3893023 4086534 1499239 -140597
46445 -140597 246474 1305208 2471469 3797408 3787799 852748 -3154147 -3918406 26698
46436 26698 5227501 7418504 5798642 2370958 -842032 -2373711 -970407 2959947
46428 2959947 6389341 6456292 3973219 2083666 1590130 143958 -3357951 -6285647 -5881511
46419 -5881511 -3337179 -2047265 -3068088 -4681753 -5718728 -6705635 -7647927 -7048843 -3943891
46410 -3943891 574511 4446906 6162888 5131895 2008991 -1150247 -2569276 -2820440
46402 -2820440 -3679179 -4872813 -4130937 -1088139 1199997 59722 -3259505 -5446402
46394 -5446402 -5175443 -3703333 -2500182 -1915051 -1623054 -1198432 -635523 -789305 -2358944
46385 -2358944 -4161412 -4070538 -2222933 -1103229 -1401776 -439572 3360259 7112978 7476404
46376 7476404 5805172 5677275 6796497 5618595 1649946 -1225706 -486590 1709143
46368 1709143 2332904 1436205 464752 -775837 -3170891 -5877759 -6972996 -5884848 -3922319
46359 -3922319 -2902925 -3855575 -6216435 -7830560 -6777209 -3620090 -752604 751582
46351 751582 2200081 4700893 7020911 6913688 3623189 -1477320 -5879189 -7472149
46343 -7472149 -6265593 -4570832 -4150594 -3621888 -769194 2943222 3288215 -604361 -4242907
46334 -4242907 -3510506 331765 3350176 4098816 3607149 2420689 736213 177193 2325437
46325 2325437 5875538 7707421 6674137 4540766 3545485 4545490 6839065 8268135
46317 8268135 6516176 2085734 -1138007 -253515 2996385 5128759 5866727 7115269
46309 7115269 8356297 7098070 3677739 1491578 1703935 1444596 -1470618 -5349277
46301 -5349277 -7686332 -8369148 -8022178 -5990135 -2215729 1106799 2002728 1153367 161262
46292 161262 -639509 -970525 330339 2763397 3170720 229416 -2272340 -243666 4273183
46283 4273183 5554627 2239118 -1304244 -1556316 395482 2269733 3670787 4413774
46275 4413774 3465923 1463591 1148512 3206093 4504528 2717565 -93873 -1177309
46267 -1177309 -1630339 -3781111 -6199885 -5569019 -2506378 -1107791 -2562765 -3375501 -1033240
46258 -1033240 2158927 2762549 988443 -363767 134249 1718388 3306580 4332890
46250 4332890 4473684 3958057 3571698 3459237 2800394 1424260 473174 489292 318149
46241 318149 -783533 -1540498 -916131 -399219 -1623396 -2909199 -1254732 2572778 4243777
46232 4243777 1818422 -1553430 -2312407 -1185011 -939314 -1448676 -131943 3195717 5061224
46223 5061224 2996770 -668672 -1594065 863537 2832727 1155792 -2443296 -3876907
46215 -3876907 -2222558 -451758 -699361 -1469046 -844443 -111906 -1638963 -4498140 -5330880
46206 -5330880 -3384251 -1608281 -2053081 -3069454 -2620550 -1872190 -2996867 -4840283 -3684075
46197 -3684075 1628171 7561604 9750110 7773321 5127585 4926680 6559123 6908018
46189 6908018 4335303 466490 -2277272 -3743129 -5388210 -7329815 -7979487 -6674386
46181 -6674386 -4759878 -3478820 -2494626 -1293711 -414920 -304059 -484620 -885274 -2304003
46172 -2304003 -4303078 -4528619 -1919596 1137052 2016741 1574056 1973410 2288757 -169623
46163 -169623 -4710036 -7410029 -6981902 -6656004 -8598698 -9861312 -6610801 -155605 4333802
46154 4333802 4137000 1365820 -563873 -476674 691193 1586892 1331340 -99519 -1766814
46145 -1766814 -2609072 -2531180 -2193454 -1997908 -2022455 -2575302 -3711895 -4361007 -3202220
46136 -3202220 -571662 1715518 2715402 3219537 3804153 3589006 2061512 726426 1174309
46127 1174309 2397124 2142038 564561 100525 1407658 2087978 650708 -793318 40916
46118 40916 1512139 369347 -2913850 -4453074 -2449502 941411 3745964 6751800
46110 6751800 10525672 13076270 12902245 11855885 12059131 11925552 8731911 3952227 2002003
46101 2002003 3634355 4624603 2343333 6094 1699240 5665097 6223382 1793273
46093 1793273 -2579245 -1900653 2143860 3677837 700957 -2320698 -745386 3921176
46085 3921176 6387139 4927892 3130110 4074138 6074079 5873623 3444181 1052391
46077 1052391 -665734 -2689838 -4599847 -4788842 -3765465 -4310399 -7421994 -10295489
46069 -10295489 -9572910 -5262963 -523245 1470821 -64478 -3196881 -4916938 -3979117
46061 -3979117 -2279139 -2522336 -4736103 -6389966 -5766614 -3564533 -1160293 816853
46053 816853 1800499 1098885 -756903 -1900015 -1129902 1011513 3340988 4790782 4052956
46044 4052956 500029 -4004225 -6199971 -5097754 -2730432 -721860 1514706 4149221
46036 4149221 5170344 3142016 -386371 -3310660 -5936144 -9134409 -11178865 -9430263
46028 -9430263 -4617957 -721266 -342211 -2063743 -2678810 -716291 2393542 3756106
46020 3756106 1726199 -2239649 -5004110 -5476810 -5768668 -7826548 -10377908 -10631910 -7935945
46011 -7935945 -4377765 -2657632 -4287061 -8418218 -11360356 -9269344 -3037473 1558485
46003 1558485 691398 -2791803 -4143494 -3629385 -4652057 -6881683 -6448375 -2696907 404341
45994 404341 553217 184411 1559381 2933238 2030408 -11330 -855937 -478592 184167
45985 184167 1778636 4858884 7440375 7228890 5267186 4652816 6190497 7671624 7134688
45976 7134688 4705749 1309010 -2444825 -5706414 -7199484 -6272610 -3631971 -891728
45968 -891728 424846 -77145 -1154967 -905483 1338840 4441607 6733943 7121632 5318768
45959 5318768 2507508 1580886 4475176 8767293 9447567 5209966 367138 -1177307
45951 -1177307 -980007 -2311501 -3978535 -2060270 3332476 7519751 7762246 6265398
45943 6265398 5513674 4291273 609650 -4054029 -6241868 -4944739 -2247778 -339604
45935 -339604 156656 -514328 -1570460 -1487583 583273 2868863 2181591 -2122313 -6708394
45926 -6708394 -7817976 -5268020 -1731030 1036382 3383784 5415636 5743079 3638437
45918 3638437 784366 -695603 -920704 -1327913 -1880959 -1166708 1051203 3333479 4563666
45909 4563666 4589018 3065101 -9722 -2561263 -2119941 57135 -305411 -4149107 -6609747
45900 -6609747 -3377146 3167774 7267283 7077224 5136647 3301818 1401201 189374
45892 189374 1281672 3776094 4677866 3337623 2039190 1554407 -77666 -3060852 -4013105
45883 -4013105 -891791 3445778 5244147 4758737 4338998 3989463 2236650 -174496 -1058950
45874 -1058950 -598774 -1078706 -2935728 -4080873 -3499250 -2783800 -3202260 -3443088 -1533848
45865 -1533848 2407502 6417796 8721559 8672259 6462470 2899961 -616334 -2505171
45857 -2505171 -1948336 81153 997834 -946834 -3922824 -3692640 1222526 6742551 7366625
45848 7366625 2468746 -3306374 -5461883 -3506687 374563 4134843 6570121 7009877
45840 7009877 5656348 3640471 2063820 1259991 981350 758459 280315 35477 1038472
45831 1038472 3081594 4170431 3095631 1588353 1897544 3012026 1976111 -1209157
45823 -1209157 -3006873 -1259656 2159124 4624655 5891448 6414235 5225339 1833453
45815 1833453 -1556367 -2156108 -56283 2099511 2048979 -595912 -4463705 -6935352 -6236229
45806 -6236229 -4240958 -5110499 -9588180 -13114855 -11752773 -7287542 -3546766 -548094
45798 -548094 3426738 6224930 3975331 -1601073 -3794393 -23450 4617415 4935202
45790 4935202 2372433 1365387 2587703 3376137 2575356 1349775 277103 -1198863
45782 -1198863 -2605697 -2198641 560490 3557598 3747235 367311 -3543573 -3685545 387204
45773 387204 3771981 1921713 -3155015 -5575668 -3959011 -2753277 -4359799 -4895924
45765 -4895924 -691404 5048353 6214571 2043871 -2598809 -3793822 -1895749 821561
45757 821561 2732787 3467891 4114225 6061405 8223406 7397930 3283673 304371 1449901
45748 1449901 3280466 1174262 -3116994 -4334860 -2246553 -1331079 -2676899 -2569977
45740 -2569977 163893 1503722 -1226653 -5347138 -7551962 -8054754 -7711647 -5475008
45732 -5475008 -1570738 658510 -837036 -3700403 -5080576 -5429847 -5801939 -4890184 -1972403
45723 -1972403 406953 279923 13094 2538568 6294576 7737617 6722538 5478209
45715 5478209 4249233 2187641 931506 2697681 5698738 5949723 3339394 1681434
45707 1681434 2643095 3672850 2568212 517545 -343751 456843 2256415 3891527 3513074
45698 3513074 337143 -3264023 -4050997 -2274246 -863242 -422882 1365109 4850593
45690 4850593 6761715 4877355 1105170 -1741355 -3255476 -3719349 -2065771 1868585
45682 1868585 5227928 5065177 2215614 15885 37732 1029416 1448904 1267401 1398139
45673 1398139 2467600 4110866 5082350 4505371 3060804 2034560 1268208 -522318 -3262496
45664 -3262496 -5059595 -4707422 -3091328 -1673343 -1176791 -1985958 -3794419 -4498091 -1986040
45655 -1986040 2083661 3063661 -544559 -4334736 -3599489 429184 2586819 637920
45647 637920 -2528201 -2936026 394549 5092117 7596955 6058686 2187291 -362319
45639 -362319 -28301 1533975 2808762 4461996 6633583 7024125 4327673 1279235 1035142
45630 1035142 2292472 1676053 -327893 -45152 3163563 5632311 4912742 2750428 1526704
45621 1526704 1226815 1343473 2548163 4586553 5240807 3491715 1527606 1585701 2745674
45612 2745674 2890712 2026635 1452494 1250694 997793 1610215 3807107 5632262 4373887
45603 4373887 743699 -1552992 -722581 1081842 1336965 502875 459810 1287185 1476343
45594 1476343 702348 614868 2525637 5296876 6196694 3678735 -1039039 -5165176 -6804503
45585 -6804503 -6099390 -4384939 -2966536 -2680558 -3608292 -4623486 -4037250 -1596762 702505
45576 702505 842690 -529234 -889498 672220 2099511 1102068 -1753817 -3611711 -2565664
45567 -2565664 433754 2758471 2553938 9316 -3171411 -5075878 -4558678 -1717299
45559 -1717299 1871062 3681925 2269710 -685444 -1537566 967333 3520185 2204239
45551 2204239 -2111728 -4860748 -4249601 -3460944 -5094943 -6684413 -4711987 -812902
45543 -812902 95481 -2782546 -4709947 -2139213 2672695 5296711 4559490 2431788 717850
45534 717850 -16116 209023 549692 -292334 -1856514 -1567150 1651873 5036141 5395408
45525 5395408 3339708 1645719 914666 -61308 -678415 1067306 4636478 6865377 6299805
45516 6299805 4521787 2601629 -510932 -4958382 -8462776 -9501636 -9411808 -9605902 -9073096
45507 -9073096 -6561975 -3153390 -635391 936532 2201400 2764305 2401336 2280672 3013249
45498 3013249 3160110 1694541 163007 149744 459257 -567203 -1851785 -1908393 -2609703
45489 -2609703 -6548527 -11579767 -12606386 -9071930 -6169415 -7280593 -9332943 -7992907
45481 -7992907 -4125094 -1899787 -2448416 -2712329 -122051 4067926 6437066 5067271
45473 5067271 1289161 -1698710 -2017391 -939656 -990527 -2537572 -3676388 -3549644 -3778635
45464 -3778635 -5660089 -7735543 -7681740 -5413233 -2756979 -958036 -48823 71341 -386524
45455 -386524 -496591 376290 1264299 977457 590789 2424094 6049222 7569146 4449661
45446 4449661 -520883 -2327036 -98588 2132864 1329011 -550464 -23167 2505181
45438 2505181 3537670 1982726 892296 3088903 7421110 10599789 10994449 9222263
45430 9222263 6481557 4008222 3141054 4136587 5460110 5700726 5585214 6583578 8069567
45421 8069567 7616158 4087681 -908014 -4668875 -5530747 -3666170 -819533 995072
45413 995072 1295323 1095354 626179 -1363400 -4813746 -6782912 -4970092 -1392352 235757
45404 235757 -144794 730558 4174696 7702318 8504243 5951407 709194 -5518153 -9199568
45395 -9199568 -7417543 -1989614 1895917 2034265 1152561 1701212 2249272 643841 -2507859
45386 -2507859 -5452213 -7570017 -8307895 -6747524 -4027077 -3123002 -4350037 -4503451 -2619208
45377 -2619208 -2497903 -6273783 -9583766 -7597782 -2446490 530098 1156818 3102389
45369 3102389 6004036 5534297 1171538 -2346277 -2344133 -1533990 -2510320 -3828570 -3492768
45360 -3492768 -2028564 -83902 2933494 5696439 4646542 -327853 -3736639 -1473041
45352 -1473041 3227274 4639812 2741420 2158798 4526114 6539775 5488047 2731836
45344 2731836 926164 791820 1609386 2541827 2440543 327005 -2734253 -3829759 -1700459
45335 -1700459 943056 160648 -4370403 -8490535 -7891503 -2591171 3415032 6424171
45327 6424171 6051215 4162649 2220273 613382 -323507 -121261 1098221 2751851 4494562
45318 4494562 5902210 6045533 4810046 4125996 5883186 8632023 8607732 4671346 176247
45309 176247 -1074197 1042283 3866578 5112126 3823273 99216 -4216825 -5936905
45301 -5936905 -3699761 40128 1937966 1829357 2008656 3244526 3862954 2724887 873455
45292 873455 -397476 -1438214 -3292807 -5834851 -7689210 -7704563 -6194223 -4752904 -4533292
45283 -4533292 -4615931 -3060350 -135198 980501 -1716606 -5521557 -6025640 -3194906 -1563280
45274 -1563280 -3807655 -6999252 -6888082 -3618257 -733368 126121 644420 2177941 3474488
45265 3474488 3000549 1540548 910665 1151503 644105 -1275961 -3234003 -3591658 -2344051
45256 -2344051 -816912 -73179 -59323 -11348 620573 1540554 1904339 1514351 1516204 3232305
45246 3232305 6256230 8462516 8166086 5672976 2662101 926952 1672467 4496045
45238 4496045 6589683 4882328 246381 -2280279 589087 5825973 7891317 5790051
45230 5790051 3270520 2888150 3647361 4466688 5670286 5945582 2264546 -4713903 -9084533
45221 -9084533 -6995172 -2360894 -1195390 -2840039 -1951823 2257656 4827443 3598127
45213 3598127 3026837 6901956 11944938 12464928 8289895 3971568 2053574 1440561 1562021
45204 1562021 3510330 6269052 5917364 846373 -4898660 -6069571 -2404001 2053938
45196 2053938 4489203 5228277 4744128 2338999 -1238582 -2997922 -1599572 140942
45188 140942 -973401 -3990540 -5913785 -6951743 -9812855 -13855459 -14218851 -8548203
45180 -8548203 -1251483 1644042 -314251 -2843003 -3431666 -3635695 -5074586 -6260340
45172 -6260340 -4620418 -81055 4517361 6060039 3823953 -104566 -2944689 -3805020
45164 -3805020 -3799041 -3809182 -3506606 -3017389 -3732746 -6110148 -8220223 -8299851 -7543402 -8314255
45154 -8314255 -10485039 -11648064 -10235080 -6431521 -1016334 4211702 5888546 2300351
45146 2300351 -3082510 -4713983 -1921752 663340 170679 -929773 180880 2003055
45138 2003055 1750564 -1556 -926014 -1007668 -1669522 -2429141 -1885370 -1105655 -2551310
45129 -2551310 -5792186 -7413673 -5528021 -1761387 1639671 4121558 5532438 4989682
45121 4989682 2423420 -445274 -2074858 -2918083 -4107238 -5339279 -5401908 -4286865 -3523134
45112 -3523134 -4343949 -6289710 -7905131 -8506051 -8902052 -10174534 -11915441 -12294028 -10150742
45103 -10150742 -6388987 -2747752 145586 2636604 4500490 4762142 3097221 503891
45095 503891 -1579250 -2265741 -1489266 4377 1030707 967028 203297 -895931 -2802349
45086 -2802349 -5572697 -7463231 -6455504 -3151997 -551998 -552541 -2015630 -2789976 -2331691
45077 -2331691 -1556255 -1179228 -1211381 -1543180 -2233176 -3405861 -5114028 -6941661 -7775297
45068 -7775297 -6668187 -3988132 -1017137 1436004 3123696 3501645 2383334 1338299
45060 1338299 2363902 4698956 5211820 3002343 1274570 2809662 5642691 5820610
45052 5820610 3114494 1034486 1634558 3212984 3536798 2906336 3093735 4830481 7129634
45043 7129634 8149829 6669131 3773490 2569847 4502909 6582748 4834486 304277
45035 304277 -1676435 1031609 4203660 3420583 40302 -1955837 -2321756 -3800428 -6634757
45026 -6634757 -8233766 -8042009 -8512132 -10443951 -11147042 -8887599 -6049210 -5613408 -6711622
45017 -6711622 -6090333 -2606750 1887836 5125032 5884576 3722352 -592527 -4512158
45009 -4512158 -5357993 -2856971 862034 3588987 4493501 3863129 2700398 2353575 3377002
45000 3377002 4872700 5806556 6406304 7099704 6865354 4518319 1349278 316825 2193429
44991 2193429 4439277 4674662 3552410 3129541 3906596 4900399 5588578 6202316 6558763
44982 6558763 5947736 4108561 1496163 -1211103 -3237209 -3808980 -2954908 -1858544 -1605503
44973 -1605503 -1853287 -1497952 -345694 730113 1104784 1032332 1008130 1202379 1516844
44964 1516844 1692534 1509972 1292528 1755857 2754302 2824176 962631 -1700259 -3295959
44955 -3295959 -3892580 -5160994 -7362881 -8468965 -6914188 -3763790 -1266742 -403602
44947 -403602 -709367 -1404426 -1703348 -1009488 74760 -175989 -2274249 -4022405 -2800723
44938 -2800723 1041436 4383644 4653503 1856916 -2183275 -5251938 -5873956 -4630149
44930 -4630149 -4063919 -5596761 -6885297 -4443820 1072913 4834620 3877383 611772
44922 611772 -1092588 -836254 -573669 -649842 193408 1937190 3191820 3541390 3583904
44913 3583904 3006191 1034056 -1432623 -2668042 -3075256 -4581302 -6789359 -6713655 -3361651
44904 -3361651 198089 912857 -440357 -1306248 -1180957 -1303437 -2026303 -2574454 -2449275
44895 -2449275 -1485282 425427 2383583 2808810 2168073 3318092 6970866 9029831 5654840
44886 5654840 -596565 -3498307 -1290884 1885004 2624571 2120825 2433629 2848349 1932330
44877 1932330 226884 -1260962 -2887668 -4614997 -4518173 -1324079 3062354 5573243
44869 5573243 5277522 3082489 -241045 -3783295 -5714643 -5023214 -3085347 -1630722
44861 -1630722 -299177 1761356 3212173 2121033 -515966 -1647749 -374217 1273156
44853 1273156 1719886 1432084 865612 -499222 -2264750 -2649425 -1156080 163701 -591491
44844 -591491 -2741650 -4529697 -5577046 -6328182 -6239525 -4394892 -1534756 110568 -827440
44835 -827440 -3558444 -6140011 -6986655 -5476782 -2084846 1573055 3377191 2231013
44827 2231013 -744307 -2936009 -2732183 -1230683 -828393 -2144241 -3448586 -3549862 -3721424
44818 -3721424 -5382846 -7116588 -6252105 -3114297 -1259249 -2837904 -5757082 -6636626
44810 -6636626 -5069858 -3416547 -3196531 -3270115 -1666249 1659926 4312851 3833694 674269
44801 674269 -1867926 -1513344 -22865 -719522 -3512081 -4894927 -3252659 -1249161 -1455214
44792 -1455214 -2343694 -1180788 1184436 1739519 433289 250172 2139793 3349951 1816780
44783 1816780 -731518 -1674525 -1150807 -793950 -581157 685812 2707092 3865141 3876928
44774 3876928 4183898 5357597 5842478 4116526 1011373 -1082088 -854807 797352 2117088
44765 2117088 2374978 2226529 2378510 2287676 636339 -2860661 -6696620 -8976275 -9078823
44756 -9078823 -7492526 -4729150 -1389610 1144025 1447755 -307851 -2454017 -3707054
44748 -3707054 -3957733 -3180068 -1076492 1659301 3324011 3454203 3591913 4492364 4236935
44739 4236935 1249379 -2186020 -2443486 -152086 163169 -3257522 -6463267 -5369009
44731 -5369009 -1554897 203060 -1509813 -3616389 -3265860 -938183 1236045 2084228
44723 2084228 1898655 1804289 2825693 4531462 5002642 3442270 2017046 3118030 5440336
44714 5440336 5437631 2625936 444038 1098194 2520752 1951805 -94461 -1483979 -1868416
44705 -1868416 -1964424 -1112582 1623576 4825661 5882846 4409899 2152888 -151461 -3259466
44696 -3259466 -6720212 -8361266 -7258287 -5090365 -3616728 -2681367 -1747646 -1541500 -2602371
44687 -2602371 -3502850 -2260453 992884 3953975 4354300 1520152 -3331844 -7278491
44679 -7278491 -7127279 -2255674 4296965 8774280 10273015 10151202 8782665 5209239
44671 5209239 65474 -3657944 -3910195 -1912479 -58891 841158 846890 -710774 -3780927
44662 -3780927 -5795728 -4219249 -521566 1388322 922024 1701027 5495065 8633472
44654 8633472 7052185 2415212 -240435 352815 576010 -2279184 -6563208 -9239632
44646 -9239632 -9311844 -7240025 -3635556 -28111 1345984 300423 -536876 620659 2087085
44637 2087085 1619245 151909 101423 1233990 1123925 -805368 -2525784 -2701754 -2173273
44628 -2173273 -1886676 -1831453 -2504271 -4798082 -7446646 -7198647 -3242185 719707 932089
44619 932089 -1640774 -3499167 -4103971 -5871486 -9029438 -10168106 -7195371 -2787601
44611 -2787601 -684528 -620178 211310 1839668 1230151 -2315685 -4901926 -3134701 911744
44602 911744 2540792 896782 -503452 673212 2769477 3606411 3664541 4031968 3671553
44593 3671553 1312828 -1439599 -1681852 703371 3021643 3590006 3241872 3031546 2856429
44584 2856429 2777376 3392144 4118737 3240459 668787 -1338301 -1387158 -854779 -1103423
44575 -1103423 -892678 1253691 3813732 4113923 2361467 990805 629401 -133400 -1048886
44566 -1048886 128609 3280179 4685979 2274526 -700916 -138491 2752905 3245092
44558 3245092 55197 -3236355 -3862370 -3244576 -3367653 -3035325 -286554 3444352 4512736
44549 4512736 1785116 -2195521 -4700844 -5562345 -6202519 -7458372 -8840274 -9064209 -7228102
44540 -7228102 -4184400 -2336693 -2966304 -4247205 -3405493 -488713 1829836 2078700 1519248
44531 1519248 1600954 2150274 2795857 3894843 4850932 3689275 -26599 -3609837 -4279538
44522 -4279538 -2209521 951666 4528754 7662004 7928987 4273597 -212987 -1930262
44514 -1930262 -2065961 -4280511 -7776005 -7602399 -2678828 1545714 919892 -1189844 799666
44505 799666 6202633 9316115 7688009 4687775 3821109 4329327 3570743 995976 -1821523
44496 -1821523 -3405644 -3239914 -1565766 421146 865501 -1133720 -4360429 -6534981
44488 -6534981 -6415013 -4572489 -2410461 -858772 21610 505786 572848 19013 -795160
44479 -795160 -736280 1035642 3754934 5238839 3758375 -238591 -4382937 -6385730 -5707566
44470 -5707566 -3352943 -611277 1415448 1553991 -752733 -4078925 -5641432 -4261557
44462 -4261557 -1752895 -368616 33728 946317 2525388 3860527 4976864 6248762
44454 6248762 6538326 4733813 2798247 3900654 7119934 7730683 4106426 639656
44446 639656 1452481 4485061 5006666 2423450 -102916 -991503 -1122293 -293032 2959087
44437 2959087 7619117 9833454 7452213 2565844 -1368980 -2991648 -2977637 -2385860 -1973300
44428 -1973300 -1993164 -2122789 -2177398 -2502800 -2895139 -2308592 -1014096 -1374281 -4214259
44419 -4214259 -6261301 -4531668 -1724104 -2827583 -7098943 -8675130 -5602935 -2509222
44411 -2509222 -2423217 -1825147 2476183 6647434 5295357 207307 -2243378 -701781 -65958
44402 -65958 -3409332 -7896390 -9618030 -8263973 -5648043 -2963180 -970532 -255684 4474
44393 4474 1313315 2980635 2316327 -1329446 -5116085 -6494235 -6101425 -5531975 -4731979
44384 -4731979 -3613347 -3941121 -6745443 -9223092 -7354914 -1334721 4339436 6442254
44376 6442254 6205358 6185261 6361784 5169987 2991156 2298807 4374755 7634205 9724177
44367 9724177 9979451 9053963 7330911 5020815 3079376 2300963 1620718 -861833 -4765857
44358 -4765857 -7189827 -6540545 -4825218 -4576105 -5039255 -3662076 -461332 1786223 1799257
44349 1799257 1717930 3817206 7107081 8547208 6731108 3295552 1035420 1176222 2387274
44340 2387274 2541871 1547400 1476320 3095717 3835424 1369693 -1991378 -1833063 1602781
44331 1602781 3158210 444173 -2255124 -406639 3861663 5094580 2456625 -113766
44323 -113766 -637761 -1235235 -3142771 -4009741 -1912243 1266412 2741910 2775192 3348313
44314 3348313 4528345 4637274 3315574 2217136 2583696 3558851 3249728 864596 -2272017
44305 -2272017 -3784069 -2812340 -1371029 -1950370 -3680109 -2749592 2423946 8349523 10487272
44296 10487272 8610261 5995122 4486034 3250947 2090173 2607364 4925780 5966264
44288 5966264 3190243 -1434984 -3561783 -2076604 -434711 -1969010 -5496201 -6762349
44280 -6762349 -3691540 971127 2601853 -328691 -4955098 -7548591 -7245111 -5608643
44272 -5608643 -3638967 -1025818 1736082 2592144 414328 -3023383 -4853858 -4174005
44264 -4174005 -2273882 -723154 -534477 -2281559 -5130666 -6231263 -3375389 1476705
44256 1476705 3580505 1144852 -2376910 -2955754 -929724 591350 569205 674832 1855487
44247 1855487 3002346 3186455 2932557 2761241 2351371 1675314 1203576 500043 -1453937
44238 -1453937 -3868812 -4213821 -1766265 1018238 2113550 2713790 4439899 5898822
44230 5898822 4829688 2148716 609199 304504 -991895 -3220477 -3494403 -892002
44222 -892002 1606686 1345327 -741038 -2666671 -4425712 -6351619 -6835877 -4442792 -931754
44213 -931754 416018 -1140791 -3363094 -4096560 -3190913 -1937154 -1872083 -3433300 -4885534
44204 -4885534 -3842244 -799769 779030 -592506 -1716421 714405 5069511 7429867
44196 7429867 7424337 7676309 8705107 8541883 6851771 5218326 3480927 151824 -3353629
44187 -3353629 -3661381 -1391429 -1113930 -3801116 -4644609 -1099518 2141746 311354 -3704488
44178 -3704488 -3872236 -40356 3001882 3343843 3182052 3334251 2147176 -111873 -885141
44169 -885141 -15654 -249738 -2101631 -2600101 -624286 644112 -1273229 -4227480 -5077180
44160 -5077180 -4403053 -4776444 -6367846 -7119631 -6119287 -4404439 -3084191 -2519481 -2866752
44151 -2866752 -3947801 -4906583 -4967861 -4108133 -2470436 -30958 2571970 3992577 3695957
44142 3695957 2514364 1203265 -197222 -998791 307595 3589693 5951954 4694182
44134 4694182 511324 -3491582 -5078340 -4130251 -1823890 2196 -413540 -3118280
44126 -3118280 -6009698 -7046464 -6212275 -4532054 -2421735 -225721 1034407 1224265
44118 1224265 2237599 5423334 8633780 8244443 3990893 -450270 -1983904 -1183932
44110 -1183932 -320620 -205144 -79934 658278 1884594 3275539 4431505 4729320 3774561
44101 3774561 2042274 715013 699817 1720148 2421168 1668855 -144375 -1442396 -1252242
44092 -1252242 -184500 553721 518937 90761 -184333 96827 903472 1375221 418558
44083 418558 -1807244 -3668248 -3779750 -2297134 -245682 1429884 1823329 455340 -1530771
44074 -1530771 -1867048 181413 2811434 4164592 4385348 4232605 3462141 2191704 2158664
44065 2158664 4470652 7296465 7889096 5892910 2758159 -683205 -3677264 -4184837
44057 -4184837 -1318757 1836992 1467405 -1299686 -1762826 1186845 3388795 1936583
44049 1936583 -668253 -956749 322356 282406 -1225036 -1905776 -1008369 -362180 -1713762
44040 -1713762 -4660540 -7058338 -6746473 -3540167 107944 1562898 1258516 1694416 3042392
44031 3042392 2590421 -307544 -1942130 603195 4576932 5132585 2185644 71135
44023 71135 872078 1656686 -904864 -5830574 -9089131 -8187550 -4420155 -1100358 -125762
44014 -125762 -359710 338980 1840398 1958072 244903 -589556 1490095 4567275 5506654
44005 5506654 4375824 3443599 2933678 1078314 -1818279 -2750745 -313065 2986026 3900356
43996 3900356 2018542 -840580 -3001525 -3585221 -2438511 -814196 -918073 -3298748
43988 -3298748 -5429642 -4342313 -457416 2471330 1632426 -1332571 -1932717 1878355
43980 1878355 6888325 8314820 5953834 4560544 7342677 11436058 11929065 8525606
43972 8525606 5186599 4122259 3660826 2166564 520738 -407830 -1653077 -3673017
43964 -3673017 -4390972 -1949458 2129813 4650671 4636233 3741026 3519354 3903997 3976836
43955 3976836 2997248 988386 -912849 -1327055 -489084 -190098 -1068294 -1362837 319504
43946 319504 2445249 2754276 2041898 3301922 7228665 10910877 11591217 9834679 7969189
43937 7969189 6850595 5627519 4021315 3230216 4184998 5888822 6478457 5840913 6073967
43928 6073967 8548178 11304238 10973691 7372025 4389134 5266429 8310292 8884349 5065266
43919 5065266 -308115 -3243989 -2881760 -1674712 -2176171 -4425902 -6424841 -6648058 -5522991
43910 -5522991 -4282860 -3159311 -1696400 -324473 29199 -51087 1129115 3214837 3246126
43901 3246126 -30372 -3157351 -1865516 2940230 5927426 4103111 218849 -1372539
43893 -1372539 -111204 922625 -728692 -4292330 -7058956 -7304670 -5805182 -4676618
43885 -4676618 -4790102 -4727683 -2691943 1088375 4616037 6303148 5956023 4110622 1689586
43876 1689586 102652 333984 1865103 3522523 5056596 6539423 6743898 4290976
43868 4290976 571590 -831579 1378754 4219073 4187474 1501109 -853605 -1101257 -104208
43859 -104208 529425 312620 -22679 516411 1968023 2894751 1724265 -1172510 -3750469
43850 -3750469 -4964315 -5858170 -7367699 -8530383 -8014717 -6257347 -4839187 -4582323 -5258127
43841 -5258127 -6311180 -7062863 -7230369 -7829657 -9998770 -12234142 -11107428 -6228620 -1979217
43832 -1979217 -1917347 -3767194 -3079935 134537 2309563 2403546 2487547 2751480 920058
43823 920058 -2654521 -4199269 -2525744 -1361882 -3238275 -5123600 -3399313 250583
43815 250583 1808422 1213181 1460631 3073247 3800136 3145760 3114129 4335308 5024745
43806 5024745 4373035 3934661 4840923 6151316 6728690 6513505 5318461 2636267 -582071
43797 -582071 -2141843 -1512991 -535283 -385208 -16422 1235401 1752524 115516 -2279053
43788 -2279053 -3111469 -2429622 -2030694 -2405734 -2367515 -1387602 -412513 -232607 -513129 -686378
43778 -686378 -567472 266927 2566091 6096382 8840928 8442134 4668386 33711 -2499415
43769 -2499415 -2393992 -1563665 -1430907 -1037401 976671 3531890 4130129 2533816 1318460
43760 1318460 2097331 3007525 1140956 -3719480 -8852528 -11128184 -9054751 -3630733
43752 -3630733 1779372 3696313 1950506 -169441 -209086 584601 204851 -265524 1443561
43743 1443561 4150947 4005643 229452 -3063505 -2104292 1761510 4216351 3375519 1292710
43734 1292710 780324 2230995 3628814 2998219 677373 -916179 -46512 2247201 3588044
43725 3588044 3247723 2340013 1383080 -374975 -2815171 -4069091 -2789975 100232 2842380
43716 2842380 4634539 5082700 3550633 634054 -1054008 416342 3408118 4325344
43708 4325344 1846261 -1916482 -4170277 -3851045 -1511505 1529086 3684121 4033465
43700 4033465 3066480 1699528 -122684 -2649051 -4658692 -4474231 -2649511 -1537446
43692 -1537446 -1683825 -899225 1958982 4482883 3896864 1096771 -814137 -962331 -1121577
43683 -1121577 -2206227 -3106219 -3224739 -3481302 -3959365 -3087618 -567768 1177089 445946
43674 445946 -811101 -43178 1467294 524575 -2206502 -2107827 2834489 8636668 10289257
43665 10289257 7627728 4006952 1136215 -1805484 -4801520 -5870434 -3875912 -493759
43657 -493759 1427302 496098 -2395098 -4951950 -5297916 -3848502 -2966440 -3681257 -3659399
43648 -3659399 -377181 4350148 5754630 2283694 -2436664 -4743674 -5202252 -5980758
43640 -5980758 -6615767 -5245563 -2503431 -999496 -1329509 -1409629 -32250 1282688 641788
43631 641788 -1853776 -4806217 -7037975 -7666511 -6130920 -3235445 -1172495 -1352229 -2658292
43622 -2658292 -2674629 -366300 2963675 5012466 4304069 1080153 -3014690 -6137255 -7393027
43613 -7393027 -6906804 -5151742 -2799083 -1047623 -1103981 -2893478 -4932651 -5962647 -6210086
43604 -6210086 -6564288 -7015355 -6603983 -4770010 -2199546 -272726 108056 -756299 -1596706
43595 -1596706 -1284584 64220 1198655 1119586 245398 31725 1481322 4069325 6058337
43586 6058337 5976016 4033809 1963137 1023652 291113 -2329249 -7164960 -11691398 -13068951
43577 -13068951 -11206843 -8432423 -6482465 -4990365 -3047215 -956157 387386 1011772
43569 1011772 1637190 2306966 2469170 2427840 3405807 5649424 7602582 7799200 6600135
43560 6600135 4957429 2432528 -1823056 -6590225 -9225800 -9082310 -8237944 -8063147 -7193656
43551 -7193656 -4403678 -1556341 -1364531 -3392183 -4950812 -5474779 -7030634 -10012488
43543 -10012488 -11266302 -8203775 -2867350 217010 -590291 -2622832 -2596715 -234456
43535 -234456 2026704 2007895 -5407 -1853210 -2102955 -1625221 -1978179 -2709833 -1791014
43526 -1791014 1039450 3263241 3078357 2235085 3487955 6362559 7848868 6866797 5395991
43517 5395991 4773754 3489502 -8810 -4388706 -7188197 -8029674 -7906219 -6330798 -2124091
43508 -2124091 2795100 3487910 -2268580 -10125329 -13405636 -10540710 -6038572 -4218325
43500 -4218325 -4614178 -4584190 -3963377 -4653731 -6762581 -8004225 -7078452 -5208916 -3593374
43491 -3593374 -1547445 1473197 3906943 4102330 3027948 2743823 2904661 1261922 -2398490
43482 -2398490 -5327167 -5526737 -4258295 -3691840 -3873221 -3612707 -3041739 -3332800 -4419731
43473 -4419731 -4734026 -3190250 -211184 3145897 5974532 7496161 7348516 6014624
43465 6014624 4195172 1957008 -551454 -1916707 -484206 3277556 6824263 8316115
43457 8316115 8088014 7041781 5218185 2832995 1145957 833985 575128 -1125140 -3369862
43448 -3369862 -3796137 -1778790 818850 2024761 1508570 -16536 -1714067 -2773942
43440 -2773942 -2948498 -3116096 -3996458 -4264030 -1777528 2763784 5478632 4025291 949764
43431 949764 288327 1931557 1879321 -1971096 -6644750 -7534676 -3484098 2544206 6790997
43422 6790997 7657517 6073280 4085232 3039337 2543325 1257498 -1052751 -2726439
43414 -2726439 -2066710 381324 2324098 2517568 2087030 2556777 3477460 3186698 1620866
43405 1620866 832242 2106110 3886695 3888934 2434751 1850754 2713449 2876158 1026746
43396 1026746 -828290 -162121 2159150 2985180 1347728 -470954 -423888 939875 2186162
43387 2186162 2992119 3372615 2821685 1777709 2291701 5177558 7775344 7136810 4713459
43378 4713459 4745694 7809628 9445649 6667201 2533727 1414574 2223933 437427 -4191477
43369 -4191477 -6599225 -3962034 -88911 80184 -2757572 -4152782 -2550850 -492440
43361 -492440 22211 -141733 117465 118114 -929108 -2215630 -2447411 -1538151 -647114 -1393579
43351 -1393579 -4756533 -9304349 -11077302 -7571175 -1743684 709116 -1583141 -4469483
43343 -4469483 -4950807 -5138646 -7268536 -8572205 -5223942 818483 3547690 908146
43335 908146 -3041092 -4210873 -3034614 -1958677 -1515648 -621636 1126344 2978624 3877883
43326 3877883 3141046 1282603 203480 1147602 2522205 1564553 -1647680 -3855294 -2839189
43317 -2839189 -141833 1156685 -221563 -3284462 -6059875 -6692209 -4771450 -2190042
43309 -2190042 -1235086 -1529756 -783375 1010916 691387 -3407421 -8202843 -9362789 -6623103
43300 -6623103 -3593780 -3158859 -4858019 -6304400 -5711351 -3242249 -777040 -28905 -532073
43291 -532073 -361100 920785 1560949 500659 -877068 -1122971 -1158502 -2682014 -5429062
43282 -5429062 -7729849 -8771924 -8666493 -7196467 -4206353 -596048 2503467 4870885
43274 4870885 6363446 6113284 4128865 2570324 3484035 5994267 7561090 7302888 6196197
43265 6196197 4792017 3081299 2284494 4198397 8206449 10882906 9497634 4913286
43257 4913286 568483 -694306 1180223 3599233 3734118 1406188 -886724 -1374384
43249 -1374384 -1367235 -3061045 -6104464 -8063778 -7649156 -5751533 -3674694 -2000935 -1025206
43240 -1025206 -825501 -875479 -573539 34332 599280 739493 -439501 -3475793 -6442733
43231 -6442733 -6052356 -2423269 -96054 -1877603 -4390803 -3094739 790931 2686837
43223 2686837 2028823 2138449 3733855 4043552 2353521 1004102 286838 -2118719 -5407304
43214 -5407304 -5110090 -591124 2333257 -512134 -5630626 -7513891 -6108674 -4609157
43206 -4609157 -3590284 -1996221 -1108688 -2726625 -5290056 -6128921 -5925256 -6852588 -7935393
43197 -7935393 -6625157 -3753767 -2449724 -2828740 -2073822 520472 2652927 3020655 2363764
43188 2363764 712697 -2339992 -4599298 -2890729 1565866 3633195 1359570 -1270074
43180 -1270074 -234894 3487243 6610894 7862564 7412284 5057619 1573209 -551071
43172 -551071 -296932 -60316 -2019717 -4488292 -4483572 -2300948 -713970 -730408 -944441
43163 -944441 -544483 -401120 -1247074 -2751169 -4273705 -4957296 -3586532 -132334 3132702
43154 3132702 4034333 3482386 3833028 4746417 3528336 -163828 -3058631 -2945118 -1901337
43145 -1901337 -2938907 -5570244 -7097286 -6813893 -6270293 -6133500 -5421629 -3694769 -1673808
43136 -1673808 278299 1959511 1730509 -1836402 -6059278 -5411150 1254373 7727421
43128 7727421 7699826 2794750 -229043 1230439 3395710 2844994 989747 720150 2335994
43119 2335994 4582413 6697782 7564584 5691141 2265863 1549088 5473131 10080482
43111 10080482 10417725 7130118 4689404 4405046 3295017 -255662 -3685678 -4065935
43103 -4065935 -1626805 1777176 5218692 8317281 10378401 11429891 12533179 13676205
43095 13676205 12828276 8713629 3459695 700902 1409270 3011537 2553491 -396800
43087 -396800 -4044023 -6461796 -6905526 -5789889 -4258933 -3696445 -4761199 -6413558 -6557263
43078 -6557263 -4422002 -1744467 -506021 -88629 1608651 4466227 5862720 4628051
43070 4628051 2901679 2894821 4041039 4863029 5381033 5703144 4527457 1616468 -323625
43061 -323625 718270 2413825 1661712 175483 2141891 7124412 10136095 8990272
43053 8990272 6747992 5823779 4492891 1347840 -1172910 -775582 607072 202267 -646081
43044 -646081 1428320 6213945 9748464 9127458 4964785 -350953 -4585063 -6244072
43036 -6244072 -5267678 -3179803 -1473260 -372697 29708 -1159605 -3846341 -5452192
43028 -5452192 -3334175 1647558 5612088 5624703 2200213 -1695906 -3205952 -1695173
43020 -1695173 772553 1452637 -207557 -2454535 -3924157 -4791505 -4974324 -3546081 -1009465
43011 -1009465 244347 -609735 -1205593 139305 1205177 -775787 -4455811 -6287378
43003 -6287378 -5821811 -5632904 -6598949 -6876107 -5783006 -5328032 -6769663 -8173035 -6791870
42994 -6791870 -2387540 2722502 5745156 5062897 1104641 -3750740 -6890943 -7414211
42986 -7414211 -6037061 -3696227 -1213913 361164 539486 212533 458812 949791 726432
42977 726432 -102227 -820011 -1509717 -2403544 -2602507 -1303952 316525 423822 -784447
42968 -784447 -1740306 -2391945 -4197059 -7406742 -10449390 -11906894 -11221337 -7943840 -2598966
42959 -2598966 2107049 3563003 2633470 2209319 2663048 1835363 -416791 -1291928 377487
42950 377487 2004005 1279888 -506803 -912704 356024 2241949 4102917 4965539 3292535
42941 3292535 -578102 -3759136 -4443945 -4260850 -5132904 -5925827 -4637871 -2186874 -1286817
42932 -1286817 -2548202 -4059467 -4125993 -2484995 329048 2938874 3401847 1502910 -123879
42923 -123879 883772 3356733 4580797 4467648 5020045 6184899 5390158 1848329 -1223966
42914 -1223966 -55785 5336040 11267608 14075504 13055838 10258134 7889306 6099901
42906 6099901 3675169 625669 -1329740 -1382805 -1037676 -1642567 -2152091 -1215857 -110724
42897 -110724 -1101079 -3570420 -4448826 -2571028 -256785 38392 -1142779 -1258023 1101266
42888 1101266 4397526 4933299 131695 -7869743 -12971949 -11325252 -5921811 -2761894
42880 -2761894 -3387393 -4353283 -3676798 -3607926 -5701029 -7085018 -4545330 174296 2385625
42871 2385625 493340 -2900169 -5194760 -6147786 -5975930 -3951108 -146611 3171852
42863 3171852 3561819 1297441 -951321 -1349471 -912677 -1804786 -4176928 -5762768 -4870219
42854 -4870219 -2650921 -1375587 -1268234 -634405 1140635 2569179 2359399 978134 -756489
42845 -756489 -2911627 -5219584 -6294111 -5590829 -4767431 -5245464 -5553717 -3397384 246914
42836 246914 1773329 -48198 -2208992 -1596254 1071329 2890448 2751692 1860086 1310226
42827 1310226 1124891 1282750 1776057 1635348 -231406 -2805464 -3368344 -1054442 1557623
42818 1557623 1651578 -359320 -2150189 -3106958 -4450392 -6261173 -6880254 -5650889 -4038372
42809 -4038372 -3161573 -2143767 -91573 1967914 2556222 1803480 625410 -872618 -2656587
42800 -2656587 -3728654 -3548755 -3180188 -3052216 -1095763 4136925 9691478 11094738 8659930
42791 8659930 7009605 7809428 7197533 2243997 -3936968 -6542887 -5589069 -4407868 -3721891
42782 -3721891 -1524926 1832089 2924272 661913 -1114525 1421371 6640280 9311684
42774 9311684 7069493 2935946 1184768 2225659 2760477 588539 -2342870 -2741534
42766 -2741534 -792617 -69712 -2496325 -5740291 -6808651 -6119271 -6012600 -6862540 -7240491
42757 -7240491 -6976216 -7220190 -7727944 -6860881 -4545455 -2628139 -1699174 -82608 3026052
42748 3026052 5729648 6053226 4426144 2170151 -537433 -3445891 -4720510 -2922190
42740 -2922190 417840 2221069 1317411 -1156940 -4066327 -6977520 -8861328 -8205026
42732 -8205026 -4957689 -1092322 1221594 1292676 -137638 -1698600 -2248623 -1811862 -1525316
42723 -1525316 -1918474 -1759379 255355 3108797 4241840 2704942 154519 -1488693
42715 -1488693 -2103667 -2689768 -3668478 -4468199 -4344845 -3358684 -2613882 -3044517 -3717806
42706 -3717806 -2523493 585149 2640693 1740448 486914 2508741 6570905 7860705
42698 7860705 5141061 2529644 3024650 4352112 3567720 2156856 3181181 5956245
42690 5956245 7341022 6696232 5866974 5267688 3627265 1137992 -613445 -1745591 -3834192
42681 -3834192 -6437030 -7040346 -4892126 -1985404 139739 1636745 2163763 910970
42673 910970 -497379 1121327 5378435 7787593 6238543 4208632 4930887 6146569
42665 6146569 4356697 1136792 584366 2470281 2880558 827520 -642625 -65077 255670
42656 255670 -1346413 -3175214 -3285123 -2127362 -639492 1394418 3495313 3754378 1873180
42647 1873180 605223 2067940 4522412 4967554 3427320 2568800 4184585 7808845
42639 7808845 11635354 13128159 10175943 3846578 -1075633 -711538 3266481 5727502
42631 5727502 4333551 1481332 282328 1016190 1911731 1404368 -930490 -4025017 -5499635
42622 -5499635 -3871589 -968453 -292062 -2373526 -3794993 -1985056 938619 915440 -2795285
42613 -2795285 -7133463 -9244558 -8784054 -6418903 -2438798 2164630 4962360 4188452
42605 4188452 1156789 -861688 -442886 332736 -1306447 -4990950 -7265775 -5577494
42597 -5577494 -1288090 1841883 1566203 -1152127 -3853732 -4920555 -4193812 -2330369
42589 -2330369 -191175 1475593 2191704 1698588 19895 -2110668 -3298934 -2747753 -1352327
42580 -1352327 -741346 -1276271 -1891517 -1881521 -1672522 -1571754 -1057694 26554 741636 426627
42570 426627 -157761 -84291 186930 -315012 -1329550 -1842253 -1885542 -2449723 -3681483 -4476600
42560 -4476600 -4056348 -2922073 -2016276 -1732988 -1841014 -1601158 17634 3273495 6610220
42551 6610220 7558318 5099375 751566 -2704032 -3218368 -672492 3008786 5172322
42543 5172322 4819240 3575515 3589668 5051363 6861490 8819525 11159614 12437324 10546758
42534 10546758 6300027 3432815 3869985 5078413 3586782 -517331 -4047687 -4296667
42526 -4296667 -952299 4038628 7295145 6406782 2981297 1535882 3778922 6109228
42518 6109228 4918545 2009462 1530782 3358416 3626163 1193448 -648702 543501
42510 543501 3025082 3958792 3012421 1670705 1211425 2205523 3913803 3785779 122717
42501 122717 -4334735 -4546941 215650 5142115 6486052 5795204 5595432 4758183 1548500
42492 1548500 -1829806 -2062361 -304670 -529001 -3046572 -3923662 -1047575 3030874 5227790
42483 5227790 5707983 6100477 6370000 5256018 2477532 -882124 -3409938 -3993325 -2267447
42474 -2267447 722155 2776874 2210569 -545239 -2953698 -2233100 2008896 6829452
42466 6829452 8666301 7330922 5899721 6115581 6005506 3537585 497911 252372 3074616
42457 3074616 6366079 8457983 9369488 8659301 5784198 2387448 1099935 1957804 2925073
42448 2925073 3841368 6310791 9363233 9388018 5866889 3238001 4600048 6860314 5269479
42439 5269479 344955 -3172695 -2809519 -500248 1084540 1431166 1442843 2033495 3599647
42430 3599647 5384540 5607142 3567853 1085433 402920 1364802 2354622 3327207 5753082
42421 5753082 9657797 12806509 13310632 11537834 8990591 6581434 4560660 3167063
42413 3167063 2717276 3389089 4929256 6232294 5713751 2930510 -535838 -2655821 -2961696
42404 -2961696 -2099728 -180657 2887489 5933796 7379649 7688996 9012357 11806112
42396 11806112 13699423 12841158 10743581 10153810 11180709 11498425 10020515 8370972
42388 8370972 8331409 9505232 10406440 10625445 10701696 10627913 9886296 8709547 7964249 7700884
42378 7700884 7047334 5813775 5013069 5330397 6212838 7032133 7957005 8990284 9501083
42369 9501083 9692381 11066249 14035652 16489852 16515732 15258705 14990433 15611922 15714036
42360 15714036 16030218 18465382 22055700 23606479 22783746 22822997 25067399 26592011 25259795
42351 25259795 23674316 25223290 28842536 31045700 31479072 33120440 37667272 43513214
42343 43513214 48149971 50629544 51891532 54022279 58569017 64536345 69265085 72448024
42335 72448024 77560142 87772654 102435986 119544635 139343607 162709874 188200018
42328 188200018 214470348 244225410 281662152 326490219 374119768 420898335 464399808
42321 464399808 498326929 512718525 502288340 471766211 430869289 386460582 341426654
42314 341426654 298176005 259604792 227133505 199990303 176514795 155479473 136843298
42307 136843298 121727630 110728285 102125098 93289352 84053760 76632263 71672968 66880086
42299 66880086 60742742 54999737 51296920 47656722 41302763 33834520 30248181 32516031
42291 32516031 36701691 37411833 33426915 27900781 24291328 23474644 24204214 24705816 23411126
42282 23411126 19512497 14104815 10178152 9831906 11393668 10990886 7522514 4216103
42274 4216103 4153678 6228709 7424253 7350702 7848269 9120728 9261919 7425042 4804009
42265 4804009 2483300 873378 1263668 5024403 10678680 14414596 14341123 11987777 9111489
42256 9111489 5693576 1880012 -945878 -2286302 -3144886 -3330129 -1021770 3361804
42248 3361804 5948091 4526249 2247052 3211878 6413260 7474437 5142634 2432358
42240 2432358 1608886 1487933 479099 -463989 425795 2546677 3288395 1423977 -1140765
42231 -1140765 -1770981 -719337 -937621 -3863990 -7088380 -7621348 -5815741 -3725798 -1180937
42222 -1180937 2922076 6272072 4768345 -754146 -4001423 -1343406 3520970 5369786
42214 5369786 4104667 2605705 1505874 -14794 -794775 854840 3768515 5439202
42206 5439202 5633215 5620861 5465243 5014840 5655337 7788705 8618776 6263456 4138040
42197 4138040 6707400 12118680 13925127 9809582 4041291 1173492 1643995 4017424
42189 4017424 7228469 9440056 8354669 4206659 -17181 -2005480 -1540124 1169010
42181 1169010 5489643 8920457 9058529 7077389 6011742 5987637 4957635 3568623 4451326
42172 4451326 6662793 6323355 3587464 3078144 5678445 6157940 2013370 -1408109 960577
42163 960577 5902714 7428675 6069244 6566331 9282399 10492088 9835608 11127222 15649597
42154 15649597 20030726 21672119 22007778 23404989 26409176 30900457 36664312 41855264
42146 41855264 43900210 43045055 42452618 43747178 44769708 42753866 37616318 31135398
42138 31135398 24916475 20295502 18389586 18806377 19500563 19000089 17789615 16760298
42130 16760298 15551685 13501929 11253353 10074837 9863247 8859718 5648649 1110571
42122 1110571 -1941824 -1313184 2436499 6724798 9564441 10596246 9806073 7093712
42114 7093712 3842294 2887698 5209175 8110790 8620863 7388406 6978492 7632693 7699230
42105 7699230 7413955 8564771 10252014 8878996 3632104 -1577266 -3659287 -4588199
42097 -4588199 -7249562 -9875689 -8694343 -4635574 -2696273 -4331234 -4918835 -708156
42089 -708156 5243739 7191449 4605538 2191921 2540552 2590206 -1249915 -7262740 -10191812
42080 -10191812 -7717308 -2815527 264830 436326 -411891 -545019 -51167 164822 -165705
42071 -165705 -725570 -1606111 -3379077 -5855887 -7545530 -7349568 -6391591 -6655198 -7708723
42062 -7708723 -6716140 -2595178 1792431 3233507 2264970 1568633 1742995 1383563 325300
42053 325300 -413667 -1484492 -4506323 -8309289 -9436828 -7140120 -4359604 -2742997
42045 -2742997 -587197 2639815 4077496 2646979 2317296 6075795 10033531 8696466
42037 8696466 3764993 1715231 3568528 3543953 -1203764 -5753274 -5178022 -2150991 -2549508
42028 -2549508 -6528437 -8636971 -5787022 -1068120 739277 -1452908 -5074819 -7309742
42020 -7309742 -7150162 -5097200 -2288994 -55251 542968 -526237 -2012163 -2469623 -1747946
42011 -1747946 -824415 -83401 1150889 2810494 3185490 1214348 -1300665 -1541175 746853
42002 746853 3274518 4434041 4490523 3665797 1436901 -1554474 -3052131 -1973399 -172344
41993 -172344 -75436 -1650148 -3031132 -3266380 -2940345 -2440145 -1077293 1670580 4802332
41984 4802332 6293237 5060638 2287520 395167 470235 1230132 1070882 445998 1072409
41975 1072409 3128550 4717476 4382654 2948084 2348044 3444732 5325223 6014369 3796511
41966 3796511 -1135874 -6066104 -7846485 -6092753 -3407062 -2048017 -1493722 -27280
41958 -27280 2334469 3757306 3045792 999862 -851179 -1999005 -2850745 -3314369 -2541697
41949 -2541697 -585866 592354 -834076 -3719032 -4874028 -3221586 -1070329 -281767
41941 -281767 591954 3350640 6272286 6136263 3102585 413715 -459202 -1180956 -2799998
41932 -2799998 -3790346 -2796983 -669667 1361182 3149424 4170517 3083581 266363
41924 266363 -1443417 -301316 1884581 2504853 1577852 722346 503074 759991 1924392
41915 1924392 3755167 4075711 1164680 -3419535 -6532766 -7228254 -6874673 -6395259 -5696372
41906 -5696372 -5222177 -5551397 -5555793 -3373800 475060 3087406 2862432 1391800 962715
41897 962715 1685932 1961882 723533 -1594055 -3711326 -4692941 -4874043 -5531845 -7090781
41888 -7090781 -8103261 -7013765 -4511871 -2768737 -2514237 -2401227 -1335845 217589
41880 217589 1610433 2917460 3655321 2322363 -1303082 -4614766 -4796403 -2517532 -1179734
41871 -1179734 -2403040 -4070458 -3590434 -1509016 -381504 -948063 -1351933 -202731 1373566
41862 1373566 1500157 49563 -1605270 -2350218 -1852890 -299218 1255490 1251190 -334109
41853 -334109 -1360439 -562217 37520 -1921140 -4804909 -4704037 -1142778 2332368 3504855
41844 3504855 3691150 3674980 1553512 -3189781 -7125244 -7369235 -5674928 -4835798 -3830679
41835 -3830679 -501417 3188828 3264742 43526 -2234808 -1776815 -916542 -1306048 -1759922
41826 -1759922 -1688295 -2538018 -4352613 -4597499 -2349094 -489222 -1519161 -3829780 -4451411
41817 -4451411 -3280648 -2150924 -1530295 -683876 160541 233531 -4165 374911 819360
41808 819360 15695 -1844348 -3190820 -3211451 -2408207 -1260094 237301 1669652 2055731
41799 2055731 941239 -967783 -2426597 -2695107 -2152693 -1953729 -2607056 -2924396 -1230360
41790 -1230360 2258566 5317713 6270611 5533797 4271205 2895488 1582556 898994 947251
41781 947251 993635 782239 1001792 1601233 1151295 -860997 -2570966 -2195693 -722100
41772 -722100 -283611 -833839 -525992 1138256 2639266 2829895 2191171 1592014 1266089
41763 1266089 1081451 576760 -1057291 -3601299 -4683795 -1865019 3884131 8387298
41755 8387298 8507668 5102147 1516408 309389 1660689 3726895 4144526 2221490
41747 2221490 -35095 18719 2522483 5117322 6020063 5651876 5069869 4446444 3682103
41738 3682103 3053919 2528266 1681944 906850 1348139 3013369 4425397 4923275 5654211
41729 5654211 7181928 7823103 5989169 2850663 853116 522459 493207 -80969 -917310
41720 -917310 -1790155 -2662214 -3211001 -3719647 -5444223 -8161097 -8557673 -3974708 2733164
41711 2733164 5383925 1963910 -3071051 -4744856 -2749551 489856 3610308 5899887
41703 5899887 5841378 3098363 316073 105467 1403488 1449742 172078 -413271 -308707
41694 -308707 -1512984 -3816282 -4121471 -1126607 2079468 1856942 -1266749 -3378553 -1782976
41685 -1782976 2358062 5562205 5619528 3780027 3008612 3691515 2522939 -2660096 -8501915
41676 -8501915 -9719109 -6441958 -4141578 -5775699 -8130443 -7638433 -5805955 -5806733 -6763199
41667 -6763199 -5296598 -1115391 2595107 3579519 2224512 -547077 -4171245 -7496536
41659 -7496536 -9544697 -11034270 -12829604 -13363244 -10328804 -4766362 -580647 320130
41651 320130 -238043 -197277 252404 490679 1076794 2165691 2434778 1112204 -496490
41642 -496490 -857645 -322509 -272123 -1250558 -2813215 -4132453 -4114298 -2224005 148220
41633 148220 629059 -1024183 -2331328 -1664287 -797335 -2337128 -5787929 -7977788 -6957307
41624 -6957307 -4015636 -1847891 -1695168 -2501410 -2549753 -1729100 -1694859 -3361332 -5174492
41615 -5174492 -5197460 -4040339 -3629628 -3667633 -2208048 161671 176932 -2939999 -5605562
41606 -5605562 -5082666 -3217388 -2290574 -534520 4087524 8145876 6191795 -634521
41598 -634521 -4792964 -2169363 2929047 4585962 2981377 2165809 3218424 3771576 3063062
41589 3063062 3230863 5057547 5823447 3179789 -877825 -2107232 672238 4369311
41581 4369311 5737772 4855492 3676774 2654390 594386 -2546027 -4627965 -3779070
41573 -3779070 -751965 1948804 2606029 1332122 -722717 -2344035 -2751593 -1897037 -388354
41564 -388354 1019654 1740242 1364491 -25108 -1606990 -2660893 -3626569 -5365819 -7402975
41555 -7402975 -8205985 -7430897 -6385332 -5782819 -4702751 -2634124 -872738 -626770 -1151416
41546 -1151416 -1089648 -309124 916875 2914937 5022714 4712852 851528 -3304853 -3283650
41537 -3283650 782018 4209139 3675880 551690 -1947944 -2442259 -1530584 -454761 -603960
41528 -603960 -2657492 -5292025 -6039039 -3996147 -457614 3199215 6399323 7955366
41520 7955366 6272123 2108891 -1001267 -681648 1503800 2592020 1887381 419540
41512 419540 -1604984 -4482012 -7093664 -7753197 -6717306 -5734737 -5092871 -3211982 373306
41503 373306 3598670 4495874 3818339 3656928 4236822 3722394 1320926 -841069 -35387
41494 -35387 3325316 5649522 4484215 1784770 1408590 3731970 4818340 1737289 -3198556
41485 -3198556 -5403795 -4133304 -3114118 -5039376 -8001317 -8602095 -6565658 -4215246
41477 -4215246 -2618334 -890697 818198 488243 -2382764 -4694402 -3167067 1176045
41469 1176045 4117283 3489137 1172577 -322311 -1050357 -2385121 -4353647 -5840714
41461 -5840714 -6493743 -6797425 -6649490 -5353938 -3120525 -1420721 -1419745 -2582469 -3089369
41452 -3089369 -1484011 1926317 5125958 6258768 5720334 5708286 7107294 7696368 4783779
41443 4783779 -670319 -4246221 -3098677 449266 1840189 411092 501249 5263779
41435 5263779 11126428 11334812 4944140 -1227205 -1369530 1866028 2042805 -1514482 -3782021
41426 -3782021 -2551115 -1005015 -1013525 107389 3522637 5096714 1857441 -2198400 -1816369
41417 -1816369 1401384 2214254 569105 935379 4023505 5626479 3916264 1879054
41409 1879054 1384279 401925 -1969380 -2670888 512188 5207395 8021551 8592183 7914759
41400 7914759 5817544 2378409 -913300 -3343187 -5606550 -6891651 -4894075 -544942
41392 -544942 1390645 -853156 -2703372 -251471 3312936 2730910 -1135199 -3355999
41384 -3355999 -2878911 -2830135 -4136182 -4493694 -3494856 -3422765 -4328076 -3261409 312920
41375 312920 2809484 2049752 593382 1322576 3087742 3420953 2819578 3162272 3637507
41366 3637507 1633605 -2768081 -6080802 -5823489 -3770890 -3608966 -6047087 -7543311
41358 -7543311 -4484340 1971096 6596969 6072242 2774905 1334596 2708672 3848012
41350 3848012 2683167 834716 813989 2654279 4447748 4849970 3953625 2552174 1414280
41341 1414280 756427 -25001 -1566673 -3354662 -4097450 -3366109 -1934442 -397164 1398446
41332 1398446 3234132 4076752 3476578 2534858 2693872 4043859 5329278 5212984 3258919
41323 3258919 206876 -2454942 -3738479 -4207516 -5215568 -6946159 -7971630 -7103159
41315 -7103159 -4924757 -2944027 -1835634 -1218106 -737711 -484178 -333284 271700 1391154
41306 1391154 1961853 928212 -1051686 -2046273 -1500141 -1387212 -3497535 -6300165 -6384858
41297 -6384858 -3098183 250884 633137 -993814 -1601505 -455009 207451 -1537498 -4768596
41288 -4768596 -6636231 -5171309 -1253532 1979534 2103077 -141870 -2054784 -2401362
41280 -2401362 -2208832 -2156259 -1323764 579381 1785667 731631 -1750075 -3763239 -4359921
41271 -4359921 -3164020 -9321 3589967 4812309 3231761 1912790 2763593 3492753
41263 3492753 2001990 856329 3244749 6775393 6391555 2366625 54895 1747883
41255 1747883 4011665 3837531 2351515 969251 -1239336 -4068991 -4397368 -787043
41247 -787043 3553282 5250932 5187956 5609210 5770471 3842216 871827 -692384 -943745
41238 -943745 -1810457 -3599648 -5175612 -6466586 -7798505 -7673861 -4521544 -373684 502783
41229 502783 -2791530 -6289785 -6300815 -3923321 -3015781 -5013323 -7366451 -6846116 -3248825
41220 -3248825 607279 2096723 1199334 -504540 -2180463 -3859642 -4922355 -4485693
41212 -4485693 -3485412 -4231734 -6921243 -8404318 -5905848 -785266 2880891 2741899
41204 2741899 19424 -2485331 -3159853 -2640841 -2721207 -3989459 -4674413 -2705796 1295121
41195 1295121 4543714 5637084 5767114 6049321 5717458 3932922 1623340 337150 502169
41186 502169 1503126 2109085 542656 -3836271 -8384911 -9115142 -5680353 -1941194 -557081
41177 -557081 10912 1545964 2498144 1062907 -1000567 -1036822 -30282 -982211 -3994286
41168 -3994286 -6249175 -6129150 -4483422 -2514165 -1137980 -1756010 -4837526 -8060789
41160 -8060789 -8362971 -5645385 -2456183 -667666 -562665 -2218797 -5154924 -7190276
41152 -7190276 -6295924 -3377510 -1070857 -261996 97379 449452 187407 -901263 -2777567
41143 -2777567 -5683006 -8502574 -8383859 -4758548 -1712165 -2699846 -4855971 -3195185
41135 -3195185 1019288 1795705 -2022702 -4873018 -3281376 -645294 -834536 -2221404
41127 -2221404 -1453190 840609 1762657 772501 -581579 -1410528 -1450766 -327039 1160782
41118 1160782 1307481 733422 2433209 6660871 9214294 7523056 4903686 5157984 6238412
41109 6238412 3944722 -486360 -1904520 579334 2268766 181833 -2884960 -2925634
41101 -2925634 136860 3481242 4993091 4317367 2131248 -363085 -2319909 -4086471
41093 -4086471 -6051438 -6913636 -4991023 -1294495 938247 395183 -700805 -130435 1069622
41084 1069622 452512 -1986885 -3676391 -2964357 -1247867 -1030748 -2633610 -3895093 -3330216
41075 -3330216 -2406988 -3317566 -5116236 -4417265 -528239 2603977 1317365 -2881619 -5670317
41066 -5670317 -5537863 -4205624 -2620203 -154143 2279669 2049630 -1150541 -4053935
41058 -4053935 -4011924 -1908468 448259 3058509 5856947 6781146 4606265 1809555 1385932
41049 1385932 2141291 767203 -2107299 -2165826 1671944 4741640 3139733 -520699 -794122
41040 -794122 3306571 7872618 9622626 8563649 5762254 1964594 -1178942 -1717579
41032 -1717579 -341355 -24346 -1347006 -821049 3999970 9941129 11594895 8109083
41024 8109083 3696518 1826505 1817921 1611936 1261749 2174226 4321698 5784818 4792019
41015 4792019 1422235 -2661260 -5740899 -7067227 -6405331 -3433263 1078500 3824234
41007 3824234 1123375 -6289553 -12675558 -13303786 -9414432 -5342610 -2815669 -960214
40999 -960214 -7569 -865940 -1753104 377130 4797291 7489033 7270853 7198413 8685678
40990 8685678 8755594 5412505 1625386 857966 2027212 2342297 2211064 3403456 4607247
40981 4607247 3100500 -423363 -2712017 -2915826 -2995497 -3588898 -3073718 -851385 1605244
40972 1605244 3280115 4491671 5188151 5085232 5486985 7975923 10983789 10756003 6533241
40963 6533241 1946841 212910 545889 568529 -213174 -928916 -1247393 -1057953 72506
40954 72506 1519169 1213510 -1649399 -4788461 -5509625 -4270646 -3795689 -5201726 -6719019
40945 -6719019 -6155034 -3275319 342005 2762487 2821698 636072 -2571318 -5397357 -7209962
40936 -7209962 -8267853 -9136010 -10054831 -10668472 -10378594 -9182113 -7922208 -7221187 -6399507
40927 -6399507 -4203494 -605719 2855997 4679102 4751847 4048262 3578888 3729475 4060239
40918 4060239 3634769 1974511 -325794 -2256539 -3340332 -3467881 -2447136 -672579
40910 -672579 325468 -627946 -2503961 -3137598 -2136503 -1168718 -1128218 -820729 698033
40901 698033 2173511 2046181 1150175 1561589 3023832 2573090 -1390549 -6036425 -6807480
40892 -6807480 -3078438 590501 -94646 -3602593 -4399128 -187039 4984243 5950888 2818717
40883 2818717 42272 278707 1828268 2236436 1857457 2553774 4425597 5563971 4733695
40874 4733695 3044439 2551060 3674344 4624170 3645430 1351321 -67033 155604 502596
40865 502596 -188339 -768741 343269 2594576 4162778 4375158 3521982 1297594 -2164370
40856 -2164370 -4216946 -1646103 4563037 8875425 7146539 1465857 -2344233 -1146800
40848 -1146800 2856896 5347011 4505324 2219189 1316295 2264819 3048338 1995964 -395322
40839 -395322 -2788660 -4736520 -6070761 -5955805 -4214132 -2640680 -3118049 -4974998 -5951847
40830 -5951847 -5240837 -3835455 -2549132 -1664098 -1858757 -3196179 -3684306 -1286028 2882251
40821 2882251 5618560 5398344 2721135 -2149115 -8318008 -12043646 -10025846 -5170173
40813 -5170173 -4143521 -7955529 -10006831 -5711044 963971 3917778 3302789 3040851
40805 3040851 3675404 3102306 2158503 3851930 7760468 10112963 9387461 7611113 6128045
40796 6128045 4297436 2726717 3478483 5935564 6350128 3166554 -514459 -1581007
40788 -1581007 -934382 -735820 -553194 830762 1935242 408074 -2585383 -3176653 -171776
40779 -171776 3144158 3350477 915782 -1120937 -762117 1837948 5338874 7736784 7150299
40770 7150299 4026950 1765987 2950568 5501783 5277148 2341446 1106774 3296159
40762 3296159 4856792 2451954 -839542 -507702 1653405 294765 -4453891 -6831102
40754 -6831102 -4508155 -1706925 -1679730 -1833436 752845 3903944 4285088 2978089 3003369
40745 3003369 4050609 3749646 2282061 2028337 3856337 6592355 8827133 9036777 5942610
40736 5942610 1051745 -1650497 -1066245 -1064323 -4199408 -6896125 -5063765 -1136250 -223502
40727 -223502 -1900819 -1877359 -90974 -546380 -3608374 -5017062 -3200302 -1569468 -2328542
40718 -2328542 -3558920 -4136318 -6351672 -11330972 -16137060 -17712116 -16181231 -12628476
40710 -12628476 -7361378 -2058727 195874 -965488 -2357090 -2100610 -1835664 -2608799
40702 -2608799 -2461994 -139447 2381090 3139106 2728596 1936632 356508 -1176912 -784030
40693 -784030 252740 -1927820 -6996886 -9384961 -6659293 -3380192 -3001722 -1910486
40685 -1910486 3262975 8000562 6465772 1531972 511758 3564763 4522025 2091253
40677 2091253 1844443 6209775 10105345 9007982 5261449 3144056 2363196 158235
40669 158235 -3088218 -3844676 -15457 6333452 10457924 9091889 4153695 1454531
40661 1454531 3872155 7167464 5484596 -294844 -3672149 -1504756 2602288 4400144
40653 4400144 4099265 3832251 3708856 2594766 472865 -1605748 -2321781 -416793 3685104
40644 3685104 6700130 5764507 2795760 2190768 4195979 4745869 2435387 810446 2122228
40635 2122228 3717897 3246724 2777902 4218432 4883514 2105544 -1163385 -569569 2080496
40626 2080496 1076194 -4218102 -8087656 -6761614 -3308738 -2590254 -4874712 -6800340
40618 -6800340 -6506697 -5287832 -4741989 -4220593 -1918975 1957225 4353111 2843177 -686189
40609 -686189 -1898488 306015 2523601 2179231 1207064 2410866 4826868 5617216 4632498
40600 4632498 3854460 3616192 2646654 992510 -278793 -1560918 -3676624 -5061371 -3570881
40591 -3570881 -768899 -510909 -3033706 -4504204 -3259946 -2315771 -3986877 -5949964
40583 -5949964 -5193472 -2685349 -1189692 -986657 -891525 -1555941 -4370946 -8139857 -9884722
40574 -9884722 -8543086 -5622182 -2912995 -1698221 -3112086 -6522516 -8301787 -5320226
40566 -5320226 455053 3870409 3236797 1829805 2086528 1953560 -942615 -4503585 -4690729
40557 -4690729 -1338798 1624049 1293113 -1424750 -4050252 -5196334 -4605750 -2613009
40549 -2613009 -450547 405178 82386 314126 1803061 2876482 1921585 71733 -104425
40540 -104425 1895271 3843766 3580501 1177180 -1819494 -4107274 -5218987 -5374013 -5232922
40531 -5232922 -5152390 -4474511 -2366116 442614 1837058 793004 -1254277 -2190222 -1588977
40522 -1588977 -689401 -849240 -2642478 -5461476 -7212083 -5637584 -1174848 2654760
40514 2654760 3171246 1657944 757865 213582 -1894273 -4523541 -4162584 -536065 2001647
40505 2001647 585991 -1934108 -1560001 705825 737850 -2222976 -4700543 -4263028 -2276291
40496 -2276291 -918578 -332704 202695 470902 -4154 -885980 -1664738 -2390839 -3193327
40487 -3193327 -4046691 -5292348 -7157481 -8487781 -7470219 -4205247 -1128068 -113336
40479 -113336 -462540 -579802 -359708 -857383 -2518639 -4648504 -5936809 -5095609 -2115696
40470 -2115696 675271 390206 -2722838 -4996676 -3907154 -1206360 65878 -21950 875226
40461 875226 3323652 5395516 5491493 3588485 24925 -4555022 -8005273 -7836846 -4253985
40452 -4253985 -317185 1418790 989075 -273833 -1179047 -568946 2019130 4813415 4973328
40443 4973328 2317429 11661 445272 2416685 3833128 5007915 6995130 8415319
40435 8415319 7041566 3928526 2850097 5221585 8167235 8510227 6445614 3953274
40427 3953274 1555265 -1319236 -3957713 -4815233 -4231352 -4457138 -6286396 -7536770 -6195658
40418 -6195658 -3585001 -2397696 -2443080 -1046116 1996616 2800903 -1339015 -7155877 -8840192
40409 -8840192 -5511399 -2017769 -1758520 -1927303 1923823 8664479 12167687 9068384
40401 9068384 3193481 852423 3277939 5783478 4145215 -296182 -2906977 -1613878
40393 -1613878 1386196 3163556 3024779 1579413 -844655 -3421818 -4110036 -1619255
40385 -1619255 2599602 5702988 6130666 4032294 413644 -2744332 -3161491 -1105443
40377 -1105443 -87342 -2359953 -5303904 -5234951 -3151344 -2730722 -3761335 -2535157 1194409
40368 1194409 2985422 723259 -2192682 -2745692 -2489134 -2955283 -1600816 3585715 9129666
40359 9129666 10284555 7620848 5176393 4312660 3664580 3148912 3523591 3543713 1994138
40350 1994138 1108419 3381961 6379082 5833907 2949136 2913845 6283896 7830373 4932882
40341 4932882 1289306 306701 192659 -1501348 -3116876 -2274982 -466908 -460607 -1598682
40332 -1598682 -1241149 754806 2070386 1309841 -1086906 -4250502 -7065670 -7902823 -6119727
40323 -6119727 -3275924 -1602763 -1937309 -3732400 -5706389 -5872518 -2816604 2057080
40315 2057080 5346906 5600532 4481923 3316775 1160206 -2369757 -5141512 -5368399
40307 -5368399 -4050560 -2636950 -726880 1723970 2530677 436910 -2031048 -1931853 -396184
40298 -396184 -686880 -3258082 -5824925 -7056188 -7052556 -5302468 -1536103 2103969 3051828
40289 3051828 2065561 1871399 2485155 1289026 -2142201 -4726607 -4245026 -2266310 -1626178
40280 -1626178 -3056004 -5227651 -6523930 -6137913 -4736247 -4263451 -5881616 -8303285
40272 -8303285 -9436394 -9030107 -8100075 -6716387 -4539334 -2639907 -2196534 -2137017 -973483
40263 -973483 -253703 -2620462 -6626972 -7535048 -4040492 -322904 -4969 -1712476 -2553318
40254 -2553318 -2565280 -3060502 -3371207 -2419460 -1659618 -3227345 -6048796 -6601748 -3417004
40245 -3417004 1114161 3389862 1894037 -1682863 -3659279 -1468276 3502765 7043559
40237 7043559 6834887 4736966 3517729 3167342 2169026 788265 684326 1995276 3042093
40228 3042093 2720223 1448001 -34616 -1280690 -1854136 -1864626 -2352777 -3700022 -4334069
40219 -4334069 -2860548 -861740 -1201944 -3664443 -4890067 -3162155 -636913 265061
40211 265061 87064 125537 -637056 -3546981 -6691557 -6761004 -4282618 -3493137 -6042487
40202 -6042487 -8054349 -5553258 -336192 2465906 1202625 -1143288 -1994152 -1899312 -1815625
40193 -1815625 -1043595 636092 1454908 291825 -1144286 -827662 434367 418554 -1229372
40184 -1229372 -3122521 -4317687 -4335611 -2352476 1158407 3125844 1106620 -2810179
40176 -2810179 -4194683 -1994775 835776 2117333 2547865 2827978 2207581 934016 1031042
40167 1031042 3143309 5083225 4876826 3030840 706305 -1870979 -3981790 -4120178
40159 -4120178 -2752631 -2762926 -5244645 -7330696 -6336212 -3659239 -2151988 -1919698 -1536976
40150 -1536976 -1369104 -2396609 -3202277 -1564765 1744730 3912152 4250076 4352093 4493855
40141 4493855 3154815 372696 -1437273 -819428 871596 1680953 1139214 -473729 -3028031
40132 -3028031 -5812981 -7286741 -6349186 -3154315 1254138 5095884 6177616 3769957
40124 3769957 -2221 -2341523 -3175248 -4486548 -6395788 -6335726 -2870493 1676627 3624185
40115 3624185 1816389 -1695947 -3965870 -3686423 -2251304 -2467640 -5424899 -8890333
40107 -8890333 -9869462 -8213778 -6162740 -4942915 -3977649 -3125677 -2990954 -2654691 47261
40098 47261 4825838 7979340 6760967 2844239 -189635 -1213180 -1663206 -2566996 -3333576
40089 -3333576 -2959083 -1169106 1184918 2232644 589684 -2536523 -4007503 -2416767
40081 -2416767 210846 1289476 675453 -379171 -1525998 -2851925 -3584962 -3207329 -2646089
40072 -2646089 -2435261 -1077427 2334988 5058046 3327346 -2268371 -6960133 -7493743
40064 -7493743 -5045386 -2372070 -1011302 -1811693 -4945590 -7955723 -6760825 -699462
40056 -699462 5774813 8554932 8687795 9196501 9647052 7763719 4866595 4814530 7356565
40047 7356565 7334767 2224115 -3613872 -4915171 -2457129 -553483 -135562 1257538 3714243
40038 3714243 4047006 1360268 -719922 632663 3090873 2755606 -148196 -2138382
40030 -2138382 -1755727 -830127 -702045 -182490 1785775 3647721 3101404 449793 -1578975
40021 -1578975 -1398028 -741211 -2476530 -6626048 -9684465 -8491695 -3944313 333664
40013 333664 2463830 3593992 4599788 3953248 436151 -3776489 -5036762 -2604456
40005 -2604456 845308 2797308 3130038 2785280 2051396 808518 -644011 -1643962 -1670592
39996 -1670592 -868814 -384219 -1400047 -3083863 -2647257 1118050 5457577 6755901 5128760
39987 5128760 3535642 2993998 1730185 -779590 -2127677 -357514 3562098 7644196
39979 7644196 10692427 11199185 7526907 1089182 -3428516 -3423327 -1580765 -1273167 -1415811
39970 -1415811 681592 3650796 3777861 1322919 331608 2028885 3121880 1830862
39962 1830862 1106616 3561384 7012308 8150546 7607893 7665715 7184080 3346936 -2333157
39953 -2333157 -4489559 -1299273 2590697 2565125 351894 937300 5177618 8977532 9311068
39944 9311068 7715206 7063853 7597102 7710726 6746744 5025254 2349889 -1262812 -3866856
39935 -3866856 -2962497 985868 4248071 3834696 477337 -3027585 -4922501 -4865626 -2735298
39926 -2735298 989933 4199740 4456154 1705446 -1478272 -2649609 -1574710 549189
39918 549189 2775370 4728087 6113903 6705529 6434630 5016744 1959342 -2432729 -6405949
39909 -6405949 -7912863 -6537896 -3831446 -1666550 -677316 -420417 -542218 -1232666 -2572586
39900 -2572586 -3942056 -4470399 -4000810 -3214228 -2580095 -1543197 602831 2990442 3218310
39891 3218310 -69606 -5072444 -8386479 -8669897 -7585357 -6850939 -5935480 -3748778 -1131263
39882 -1131263 296071 955296 2628925 5058980 5743715 3755933 1358388 594715 467451
39873 467451 -738150 -2194918 -1863083 139987 1794334 2025578 1139135 -921017 -4380459
39864 -4380459 -7894982 -9208097 -7743265 -4933163 -2180924 -164887 353924 -813747
39856 -813747 -2092736 -1803287 -757704 -891377 -1749302 -1234633 338932 395735 -1337010
39847 -1337010 -2180667 -1428807 -1904745 -4670155 -6070380 -3023651 1860593 3858274 2493387
39838 2493387 924285 884295 1734478 3090472 4852297 5629602 4502253 3474838 4769771
39829 4769771 6443977 4460463 -1103671 -5749816 -6776716 -6046284 -5683688 -4775316 -2205605
39820 -2205605 215837 -55065 -2683472 -5102132 -5705581 -4805927 -3225779 -1409846 237789
39811 237789 920756 -450584 -4296610 -8958248 -11136277 -9184799 -5313997 -2679154
39803 -2679154 -938022 2674858 7923500 10466097 7460318 1673997 -1891252 -1682380
39795 -1682380 6057 931556 1066146 1385356 2233401 2999374 2623040 606318 -2084582
39786 -2084582 -3742398 -3958099 -4055290 -4891631 -5293045 -3790188 -1206378 -64906 -1297694
39777 -1297694 -2668350 -1293084 2550217 5178797 3814734 414039 -450384 2435618
39769 2435618 5260903 4516847 1637498 208835 599177 456209 -754107 -1351449 -1129791
39760 -1129791 -1653096 -2620184 -1746544 855757 1947134 300372 -995896 602421 3235630
39751 3235630 4140021 4001784 4818639 5965129 5801573 5222229 5881855 6210574 3145064
39742 3145064 -2551383 -6368851 -5783227 -2810203 -268087 1569119 3417299 4528600
39734 4528600 3629425 1104579 -1280596 -2436562 -2835063 -3458958 -4341973 -4390999 -2908167
39725 -2908167 -1116190 -1250992 -3786884 -6597700 -7509447 -6592033 -5120455 -3559862 -1800810
39716 -1800810 -222243 920959 2173416 3551376 3739746 2308383 1431091 3140419
39708 3140419 5862075 6312023 4263932 2555359 2512256 2545459 1816124 1962451 3671996
39699 3671996 4530869 2740695 799096 2384780 6632946 8799968 6780923 3934174
39691 3934174 4155297 6557351 7285168 5224469 3057678 2719596 2713880 1221503 -481491
39682 -481491 -905 2158823 3237973 2419717 1679669 2164152 2262552 250262 -3124300
39673 -3124300 -5809283 -6701310 -5829307 -3721485 -1441895 5313 891776 2147724 3521252
39664 3521252 4226147 5260054 8264932 11735295 11759565 7602693 2979489 291352 -2320838
39655 -2320838 -5867022 -7002214 -3510640 547246 -15190 -4041503 -6616312 -6545360 -5814180
39646 -5814180 -3846471 1174888 6217306 5498910 -726086 -5626672 -5198550 -2472206
39638 -2472206 -890485 538824 2886582 3557666 638657 -2959390 -3406949 -1231011
39630 -1231011 346629 29560 -1076361 -1572752 -567627 1529843 2035702 -1257500 -5545488
39621 -5545488 -5170876 296552 4681461 4083682 2220459 3624548 6379756 6235751 3974636
39612 3974636 3316953 4296706 4128943 2724720 2114379 1771983 -388302 -3255982 -3714551
39603 -3714551 -2155281 -2071720 -4157887 -5289155 -3791831 -1627993 -655832 -437778 -667852
39594 -667852 -2470079 -6090522 -9679618 -11070007 -9030075 -3315297 4059722 8544821
39586 8544821 7432465 3996851 3607009 6116894 6441978 2894136 -68145 943571
39578 943571 2924257 1380251 -2741577 -4527401 -1783894 2723765 5036194 3924144
39570 3924144 1274129 -261257 -47444 -21648 -1909106 -4439726 -4833224 -2678725 -347913
39561 -347913 492823 773063 2099350 4644558 7233790 8313271 7248796 5896438 7456687
39552 7456687 11618855 12793439 6784698 -2191129 -5691366 -1703361 3749401 5612294
39544 5612294 4901869 3879374 2054014 -531106 -1274341 456708 1181614 -938215 -2347897
39535 -2347897 198322 4095603 5254996 4550976 5233569 6683678 5720298 2299139 -746430
39526 -746430 -2349486 -3425908 -3709263 -2381326 -686723 -78273 926498 4100287 7218510
39517 7218510 6817024 3915172 2151469 1258276 -2076232 -7004571 -8080052 -3290936
39509 -3290936 2570250 4456531 2731749 423898 -1167444 -1870719 -1096820 693897
39501 693897 1669738 1706863 3134678 6624940 9194454 8512690 6646353 6973412 9268490
39492 9268490 10338376 8336129 4487255 1395306 865819 2388926 3079371 586127
39484 586127 -3460610 -4873873 -2311125 1118445 2319874 1473401 -174241 -2481996
39476 -2481996 -4560944 -4006028 -591502 1987373 954075 -1354759 -1276676 355160 -88033
39467 -88033 -2814621 -3914365 -608557 5810972 12101822 15526174 14507862 9528584
39459 9528584 3515339 -733770 -3425320 -6336033 -9208797 -9886587 -7627469 -3935233
39451 -3935233 -321051 2490382 3415126 1633701 -1458266 -3190598 -2798935 -1775784
39443 -1775784 -1195001 -912681 -1263306 -2831454 -4209001 -2851845 825530 2754211 61917
39434 61917 -5291906 -9108535 -9576284 -8011651 -6411000 -5659748 -5279908 -4030133 -1573972
39425 -1573972 129805 -1385689 -5331662 -7567424 -5486016 -1319625 1009341 834543
39417 834543 430418 722060 851 -2684409 -5092608 -4312793 -839709 1596072 598055
39408 598055 -1841358 -2089390 59550 1097206 -1069490 -3988052 -4216536 -2122453 -709357
39399 -709357 -869744 -778914 339150 957260 247329 -441080 -53772 596037 806986 1344800
39389 1344800 2592508 3387125 3095437 3025907 4287776 5819847 5982214 4710745 2847203
39380 2847203 784406 -1056603 -1950692 -2172655 -2907561 -3986262 -3971797 -3517061 -5474699
39371 -5474699 -9651698 -11025530 -6675157 -1384640 -1571274 -5703546 -6491991 -2040985
39363 -2040985 1437805 -501061 -3682500 -1736570 4614746 8921792 7607518 3263192
39355 3263192 73074 -643223 39273 1017639 1918450 2716002 3553988 4537392 5213230
39346 5213230 4499446 1673164 -2272246 -4623310 -3288819 419047 2356838 -29429
39338 -29429 -4534900 -6746453 -5287643 -2989114 -2993397 -5330634 -7635264 -7895395 -6094442
39329 -6094442 -4156212 -4419038 -7172128 -9810014 -9607322 -7060747 -4961115 -4433627 -3927182
39320 -3927182 -2289384 -625796 -370025 -1420111 -3026651 -4710675 -5436044 -3897921
39312 -3897921 -952668 153430 -2209741 -5271975 -5130142 -1917527 355219 -1123630
39304 -1123630 -4831661 -7177471 -6737886 -5561602 -6432173 -9257816 -10966255 -9542168
39296 -9542168 -7046411 -6833502 -8448397 -8045089 -4228969 -433092 -61206 -2043911 -3388101
39287 -3388101 -3748800 -4610799 -5644848 -5192288 -3605996 -2888451 -3086672 -2081642 460580
39278 460580 1608150 -1113874 -6297442 -10172290 -10377872 -7301197 -2802105 1158835
39270 1158835 3185258 3033122 1886471 1506156 2532324 3566918 2495985 -807497
39262 -807497 -3713296 -3775076 -1958564 -1373842 -2932142 -4289924 -3536776 -1713930 -648589
39253 -648589 -427249 -469842 -1131404 -2486374 -3308050 -3120215 -3501737 -5367142 -6887175
39244 -6887175 -6499502 -5969382 -7443419 -9250934 -8260495 -5139156 -3257335 -3067121 -1882579
39235 -1882579 747915 1929750 603707 -307347 1393625 3796365 4192747 2924904
39227 2924904 1898823 1610275 1652243 2311859 3834767 5438992 6239157 5872494 3849452
39218 3849452 315283 -2327731 -1433634 1580529 2272746 -286862 -1779946 518541
39210 518541 3098076 1640705 -2332197 -4398797 -4235529 -4809627 -5999429 -4330819 617006
39201 617006 4261337 3143879 -353206 -1550602 365102 1829693 -372402 -5452106
39193 -5452106 -9572051 -9677059 -6146602 -1711162 1764112 4413469 6343740 6297776 3547231
39184 3547231 -161815 -2141874 -1688412 -392104 -146342 -1647789 -4016778 -5173737
39176 -5173737 -3642365 -578934 1338915 1421484 1322656 1436954 25166 -2699454 -3275853
39167 -3275853 -452576 1587791 -766303 -4395974 -3991904 -342825 1403956 238995
39159 238995 -64107 1615182 2120399 721655 1070003 4272184 5886225 3084747 -289362
39150 -289362 164935 2557737 2622594 1024608 1411034 3286525 2456244 -1898945 -5631602
39141 -5631602 -5830386 -4535901 -4852805 -6475139 -6983622 -5641744 -3983876 -3450073 -3861519
39132 -3861519 -4197233 -4155943 -4525698 -5840445 -7044456 -6369405 -3581615 -257214 2392857
39123 2392857 4567226 6269850 6376366 4345548 1359572 -1376439 -3907395 -5887330
39115 -5887330 -5674478 -3065713 -1106059 -2471195 -5312578 -5759134 -3787714 -3109864 -5134998
39106 -5134998 -6725726 -5204467 -2356814 -1243148 -1420872 -211262 2520046 3908877
39098 3908877 2433033 71217 -831222 -892042 -2283017 -5127267 -7263384 -7370364 -6360301
39089 -6360301 -5156691 -3016508 553775 3698526 4101137 2306762 1030071 1335905
39081 1335905 1653218 730212 -632975 -1250232 -752852 1407326 5592521 9633414 9796547
39072 9796547 6031728 3497457 6037704 10299555 9756117 3231504 -4157482 -7794993
39064 -7794993 -7532944 -5002876 -1080321 2696277 3539703 449152 -3998482 -6533851
39056 -6533851 -6554372 -5561709 -4777430 -4473033 -4334241 -3426063 -1040587 1548127 1695300
39047 1695300 -1109284 -3893557 -3877857 -2175917 -1988574 -4025188 -5797942 -5213662 -2966272
39038 -2966272 -1091334 -629680 -1254714 -2155933 -2628567 -2322693 -1380219 -180136 989273
39029 989273 1680491 1078958 -1091346 -3544867 -4488877 -4121184 -4809038 -7634280 -9771954
39020 -9771954 -7336553 -844877 4396955 4406111 1066104 -1179360 -1333317 -1692400 -2779890
39011 -2779890 -2281947 497114 2882527 3092269 2885509 3760463 3788226 1382969 -626237
39002 -626237 1227518 5198827 6795813 5774700 5606740 6495613 4698878 -203035 -3079057
38993 -3079057 -798278 2834993 3010370 727614 -204471 279367 -659931 -3569969 -6660696
38984 -6660696 -9468214 -12452856 -14045287 -12259870 -8686092 -6830158 -6714534 -5221914
38976 -5221914 -1986723 -627536 -3055800 -6544107 -8171935 -8666915 -9612760 -9893414 -7757919
38967 -7757919 -4372453 -2471660 -2621763 -3150248 -2950711 -2371335 -1982936 -2148929 -3162715
38958 -3162715 -4348090 -3910787 -1374576 661071 -785732 -4977409 -8026808 -7655232
38950 -7655232 -5630087 -5025313 -6467192 -7843222 -6962071 -3872891 -736148 472884
38942 472884 20641 -424226 -709760 -2798479 -7404803 -11541017 -11525269 -7806415 -4519195
38933 -4519195 -4235656 -5363616 -5217690 -3558632 -2078343 -2005239 -3348979 -5292971 -6372669
38924 -6372669 -5388463 -2962014 -1004856 21502 1712762 4660777 6779250 6376226
38916 6376226 5063734 5277861 6320791 5670370 3362547 1951267 2253585 2224668 492660
38907 492660 -1889349 -3975285 -6365729 -8967587 -10049608 -9134490 -8417331 -9498735 -10892681
38898 -10892681 -10629425 -9066074 -7024272 -3646057 1104580 4163683 3080160 92706
38890 92706 -1380704 -2460085 -6042707 -9512682 -6564651 2764965 10146311 9709778 5292814
38881 5292814 3245125 3068526 597240 -3196941 -3263101 1018647 4829735 5741644 6723104
38872 6723104 9763536 11669561 9098122 3993169 702338 252529 693179 1199905 2434954
38863 2434954 3824358 3721583 2173830 920507 513424 -229259 -1558302 -1867769 -318329
38854 -318329 1490327 1729271 883915 685771 1337258 1237878 -778253 -4015378 -6631567
38845 -6631567 -6967530 -4391426 141216 4239218 5702584 4426666 2226430 709219
38837 709219 63333 68797 1103332 3227985 5079111 4993011 3103200 1195636 388878
38828 388878 37283 -760074 -1692592 -2017449 -1895819 -1832445 -1263316 931525 4350383
38819 4350383 6769727 6654728 5088184 4155397 4019662 3119144 1212946 249255 1162914
38810 1162914 1596861 -1110615 -5694230 -8292008 -7663844 -6121121 -4941287 -2438614
38802 -2438614 1781146 4274979 2597621 -123940 554666 3527752 4133399 1826732
38794 1826732 547405 1466781 1118978 -1883873 -4015135 -3411147 -3835771 -7935628 -11216138
38785 -11216138 -8249632 -1668472 1184575 -1141025 -3223495 -1987149 -649847 -2270342
38777 -2270342 -4828649 -5170294 -3774518 -2859575 -2644318 -2025225 -873861 440247 2162042
38768 2162042 4175034 5434305 5560835 5372355 4933164 3085031 -41260 -2211546 -2056313
38759 -2056313 -818535 14339 560439 830514 -135923 -1762555 -1492047 872360 1411519
38750 1411519 -2157970 -5736140 -4036164 1307967 3634450 643315 -2993081 -3014515
38742 -3014515 -1007528 -690208 -2461392 -4137142 -4527705 -3716950 -1630712 1071976 1896871
38733 1896871 -971785 -5322274 -6473146 -2784526 1958724 2594522 -1778974 -7058878
38725 -7058878 -8667382 -5915695 -1690449 1190906 2148432 1709893 53791 -2292179
38717 -2292179 -3591297 -2453519 138240 1870006 2027824 1917387 2357372 2423024 1198777
38708 1198777 -687164 -2151154 -3223213 -4634621 -6610917 -8876007 -11170719 -12924104
38700 -12924104 -12936599 -10280702 -5368442 290436 4977893 7150896 5965903 2460129
38692 2460129 -507743 -966745 -367847 -1969577 -6417533 -10364700 -10275233 -6445623 -2196658
38683 -2196658 -94953 -434959 -2613192 -5735507 -7691875 -6006255 -905465 4060777
38675 4060777 5913654 5435300 4918525 4262918 1811903 -1729298 -3189610 -1009617 3086360
38666 3086360 6904673 9659152 10352578 7378759 1637565 -2412261 -1324600 3194534
38658 3194534 6846818 7887627 7305779 5422454 1676555 -2525014 -3989947 -1567852
38650 -1567852 2356996 4847205 5115481 3824117 1629393 -665542 -1965530 -1929822 -1391439
38641 -1391439 -1227368 -1514931 -1927446 -2044993 -1233690 699567 2630275 2996724 1694710
38632 1694710 57963 -1052580 -1938871 -2793730 -3092175 -2591609 -1800354 -1102279 -385252
38623 -385252 244565 352714 -13798 -272857 -185561 -97388 -465290 -1753322 -4117111 -6278219
38613 -6278219 -5820094 -2175452 1756910 3002879 2468302 2958903 4250890 3599930 987439
38604 987439 3648 2587042 6264196 7890390 7084188 4702776 1195095 -1806002 -1485343
38595 -1485343 2355599 6320532 8284485 10054490 12730684 13128994 8667118 2764371
38587 2764371 649718 1819725 1710824 -374124 -554138 2377368 4476340 2936463
38579 2936463 263990 -179934 762019 234093 -1879149 -3244508 -2660685 -869125 1356936
38570 1356936 3720685 5210164 4232346 546477 -3685028 -5454873 -3802179 -1074886
38562 -1074886 -694723 -3343236 -6182236 -6441054 -4627963 -3101167 -2777832 -3036351 -3778103
38553 -3778103 -5214461 -6101080 -4651490 -1231585 2002491 4096440 5713111 6735536
38545 6735536 6192588 4880409 5134326 7110566 8116616 6917999 5899337 7051722
38537 7051722 8381785 6968293 3830276 2723056 4745041 6887582 6149352 2984812
38529 2984812 6192 -1235497 -1091470 -93095 2267745 6252210 9873054 9859290 5601622
38520 5601622 726145 -1144252 -1206153 -3443344 -8136067 -10697452 -7958507 -2682271
38512 -2682271 -10819 -1570626 -4996994 -7495726 -7791672 -5904440 -3113458 -1376764
38504 -1376764 -1201233 -905399 806749 2871525 3897009 4508847 5583697 5620597 2641275
38495 2641275 -1972612 -4412823 -3370063 -1597528 -1967199 -3949713 -4951650 -3764683
38487 -3764683 -1586632 -216563 -90601 -259917 -189341 -1039431 -4176141 -8431711 -10406378
38478 -10406378 -8285153 -4027830 -846496 69408 -758510 -2874872 -5483511 -6634589
38470 -6634589 -5027362 -1918018 531367 1924044 2928327 3152278 1993706 641107
38462 641107 750272 1801641 2125237 1684440 1208307 -373702 -4193924 -7775694 -7180506
38453 -7180506 -3119428 -771312 -2427597 -4377974 -2954810 161419 1353120 578572
38445 578572 210049 673031 685153 383063 894677 1549587 470885 -2341098 -4955457
38436 -4955457 -6267513 -6572924 -5715565 -3125428 113362 1516299 226423 -1845859
38428 -1845859 -2557215 -1911678 -1366220 -1875582 -3158584 -4037753 -3148723 -177657 3229232
38419 3229232 4598512 3174662 814169 -29776 1207976 3034007 3828843 3526700 3388765
38410 3388765 4385561 6183692 7937312 9524816 11037171 11235026 8175451 2308237
38402 2308237 -2412836 -2325091 1364778 3576204 1376800 -2413762 -2702038 1569647 6045572
38393 6045572 6151961 2494290 -60848 1723750 6008335 8763101 8541738 6996389
38385 6996389 5697131 4428332 2455651 -340472 -3762778 -7146353 -8863840 -7827212
38377 -7827212 -5703580 -5500762 -7316370 -7723771 -4465263 372221 3245807 3213568 1534638
38368 1534638 -738990 -2739642 -3097922 -1542634 150441 802175 1763682 3909737 4689093
38359 4689093 1494830 -3367136 -4881697 -1984114 1697961 3603000 4781060 6175995
38351 6175995 6408808 4788762 3185080 3043714 3278625 2886902 2994166 4276001 4788152
38342 4788152 2721128 -605581 -2785203 -3664418 -4344144 -4375577 -2483565 886036 3994356
38333 3994356 6031821 7055400 6757831 5350455 4615587 5764431 7100052 6264540 4112995
38324 4112995 3628443 5288278 6360172 4989209 2210755 -650693 -3764910 -6751939
38316 -6751939 -7340307 -4038473 1262466 5106911 6091680 5403701 4579915 4103910 3832673
38307 3832673 3653255 3651065 4026933 4572255 4173754 1778791 -1706916 -3625380 -2637401
38298 -2637401 -691228 -665202 -2636756 -4003795 -3188069 -1556534 -1049732 -1278307 -308378
38289 -308378 2207946 4175805 3678702 1413127 -247543 -39310 1173859 1806983 1004881
38280 1004881 -1182410 -3911608 -5557619 -4743028 -2013772 351808 899963 641394 1456722
38271 1456722 3620698 5697574 6193396 4540779 1270647 -1888378 -2990589 -2013311
38263 -2013311 -1030743 -1098704 -359185 2930801 6891606 8202427 6936159 6106719 6656189
38254 6656189 6341595 4082061 1862482 1108600 604328 -206886 739796 4212381 6859169
38245 6859169 5647667 2806840 2648650 5109445 6289100 4295256 647035 -3322544
38237 -3322544 -7216809 -9046973 -6633797 -2199508 -984210 -3879802 -5878547 -3847051
38229 -3847051 -1205105 -1682710 -2864242 -771659 2374440 1077751 -3977539 -5785658
38221 -5785658 -1301222 3796750 3318870 -816852 -2122458 898499 3279959 1258872
38213 1258872 -2665657 -3805968 -1760374 -287458 -1535075 -3034989 -1455662 2375780
38205 2375780 4322716 2482564 -415518 -988968 439164 1176254 381788 -427841 -481898
38196 -481898 -789469 -1787948 -2197971 -1074912 624114 1362017 647272 -1195725 -3460036
38187 -3460036 -4702533 -3558606 -722936 1405940 1878386 2289874 3761868 4900518
38179 4900518 4383018 3541147 4050594 4705032 3365237 1053121 848601 2979198 4273892
38170 4273892 2947672 900448 331455 869753 1394090 2068299 2737983 1637334 -1915088
38161 -1915088 -5231046 -5313438 -3200894 -2648839 -4959718 -7653505 -8257369 -6983878 -5168708
38152 -5168708 -3271493 -1444984 -378551 -291035 -192954 684690 1558490 1300808 330929
38143 330929 98992 988336 1913203 2094650 2231142 3427971 5536405 7119255 6895566
38134 6895566 4838895 1966780 -479180 -1562065 -977012 542158 1403114 534455 -1295827
38125 -1295827 -2244191 -1679063 -877286 -1002230 -1350981 -538483 1288412 2613329 2561443
38116 2561443 1565138 256301 -1023409 -1668774 -1156488 -148264 55864 -611945 -1118643
38107 -1118643 -1612421 -3629924 -7075748 -9057354 -7618379 -5100555 -5306257 -8104072
38099 -8104072 -9635553 -7902183 -5235420 -4168914 -3483334 -560315 3843946 5892120
38091 5892120 3713197 7874 -1264077 431427 1936126 390904 -3439468 -5964868
38083 -5964868 -4380327 774614 6311768 9140614 8333762 5134330 1613227 -671129
38075 -671129 -1292143 -843087 -452170 -1255647 -3712448 -6694297 -7482732 -4058478 1839349
38066 1839349 5207723 2998493 -1702212 -2727975 1740252 6893461 7415774 3987010
38058 3987010 1832349 3924893 7949826 9973352 8947963 6588049 4202492 1344924
38050 1344924 -2411216 -5668473 -6274009 -4187066 -2264574 -3234930 -6236585 -7609159
38042 -7609159 -5358114 -1615566 -21915 -1699396 -4652127 -6252152 -5398596 -3060416
38034 -3060416 -1645666 -2949309 -5763827 -6756488 -5045334 -4285272 -7875421 -13351620
38026 -13351620 -14774093 -10438804 -4808382 -2223722 -2138291 -1969761 -1324674 -939898 -14513
38017 -14513 2336287 4484885 4091419 1672099 -166039 -349029 264939 1410113 3499828
38008 3499828 5328297 4578047 1218386 -1940568 -2754736 -1711170 142233 2706000
38000 2706000 4991000 4171955 -1159230 -7871223 -10673286 -7639942 -2076395 1126494
37992 1126494 66539 -3205001 -5402074 -5258836 -4230997 -4232382 -5201150 -5444521 -4040021
37983 -4040021 -1944758 -675455 -781218 -1796824 -2861627 -3142897 -2409750 -1419018 -1099513
37974 -1099513 -1361630 -1460657 -1315781 -1387508 -1461825 -976351 -514922 -1297404 -2945320 -3586340
37964 -3586340 -2736150 -2202013 -3260795 -4773383 -5224339 -4886217 -4638885 -4317890 -3729130
37955 -3729130 -3648726 -4094298 -3250822 -214724 2624898 2336023 -511139 -2979768 -3955744
37946 -3955744 -4509303 -4853415 -4010163 -2290493 -1071876 -69846 1998484 3768722 1949948
37937 1949948 -3098334 -6201409 -4104855 -359914 -459985 -4263588 -6704313 -4893251
37929 -4893251 -1044247 1483447 1877796 962244 -810784 -3082652 -4743180 -4568161 -2161734
37920 -2161734 2006689 6657768 9730841 9618383 6873191 3766513 1881364 1211073
37912 1211073 1704626 3796865 6403333 6375194 2175811 -2930446 -4016407 -745163 2203701
37903 2203701 1641976 -29482 902130 3547169 3977982 1552323 -128536 963429 2042678
37894 2042678 -104636 -4113155 -5963209 -4419744 -1933300 -749473 -557604 -98023
37886 -98023 842883 1553615 1336449 115880 -1013458 -112458 3526650 7772792 9346486
37877 9346486 7119651 2814742 -1158963 -3368950 -3462700 -2317505 -1859310 -3045140 -4200110
37868 -4200110 -3096797 -379907 1239863 1086997 1237591 2772866 4080477 3841915 3021446
37859 3021446 2448897 984934 -1935455 -4105626 -3229240 -230959 2299109 3514903
37851 3514903 3912051 3004478 219716 -2788461 -3754741 -3524587 -5186146 -8975290 -10786752
37842 -10786752 -7212304 -349059 4102653 2958793 -1423958 -4230519 -3477656 -1519467
37834 -1519467 -1257233 -2082752 -1160454 1801834 3622060 2208163 -508565 -1816961 -2066616
37825 -2066616 -2951847 -3917987 -3220785 -1353285 -422401 -875034 -1742184 -3438417 -7074250
37816 -7074250 -11221862 -12738278 -11183292 -9418285 -9396133 -10315023 -11322370 -12660540 -13217135
37807 -13217135 -10480704 -4697131 -103895 14817 -2869891 -5411764 -6556928 -6838160
37799 -6838160 -5971715 -3654296 -981381 1118107 3222811 5378870 5860030 4166732
37791 4166732 2991644 4480648 6644929 6560623 5085131 4758930 4867214 3047248 694125
37782 694125 1646844 5362644 6557090 3006476 -976175 -1111856 900409 1053642 -678344
37773 -678344 -1450228 -724630 -348775 -508751 518259 2535285 2760026 -48574 -3344601
37764 -3344601 -4057984 -2364334 -705523 -220740 110647 1091192 1740497 779898 -1237807
37755 -1237807 -2371038 -1741958 -507480 -2364 74201 684433 1484503 1369456 766376
37746 766376 1577436 4271380 6563182 6004294 2796951 -992842 -3977133 -5900335 -6443864
37737 -6443864 -5346931 -3546719 -2577866 -2580451 -2266767 -1296237 -1313234 -3640982 -6823036
37728 -6823036 -7716851 -4902223 -136774 3558778 4475289 2821761 -154800 -2806312
37720 -2806312 -3464235 -1599467 1012303 1442148 -1050793 -3537446 -2731477 376770 1047179
37711 1047179 -3191428 -8612723 -9138030 -3488161 3366620 5957451 3742681 241691
37703 241691 -1433799 -725991 1487430 4037217 5448024 4548145 1939968 -61879 196322
37694 196322 1817082 2427973 870908 -1634851 -2805827 -1422805 1675706 4462803
37686 4462803 5656557 5716236 5645558 5266614 3740111 1636440 762247 1270629 825369
37677 825369 -1850869 -4325208 -3717807 -1373789 -1106538 -3160592 -3713334 -1289300 311869
37668 311869 -1933972 -4539779 -1876338 5184998 9380238 6171068 -858942 -5115978
37660 -5115978 -4802149 -3587576 -5078243 -8810073 -11425085 -10329715 -5982268 -1324791
37652 -1324791 814860 126991 -1051053 50268 3982322 8121348 8533990 3826858
37644 3826858 -2654943 -5802261 -4436095 -2257150 -2119511 -1965087 925831 4044716
37636 4044716 2489525 -3062306 -6315061 -4248582 -1109893 -1206385 -2351857 -397606
37628 -397606 3221235 3501556 -284165 -3741671 -3978818 -2627153 -1894254 -1689907 -1745632
37619 -1745632 -3007764 -5258255 -6120588 -4129677 -618355 2729115 5806573 8151513
$$ [...]
##END NTUPLES=NMR SPECTRUM
##END=
