##TITLE=31Pdec_LR-683B-CS2
 DMSO-d6, 24 sc
 28.2.2020
##JCAMPDX= 6.0         $$ Bruker NMR JCAMP-DX V2.0
##DATA TYPE= NMR SPECTRUM
##DATA CLASS= NTUPLES
##ORIGIN= UXNMR, Bruker Analytische Messtechnik GmbH
##OWNER= root
$$ XWIN-NMR		Version 3.5
$$ Fri Feb 28 14:44:35 2020 Russian Standard Time (UT+4h)  she@DPX200
##.OBSERVE FREQUENCY= 81.013821
##.OBSERVE NUCLEUS= ^31P
##.ACQUISITION MODE= SIMULTANEOUS
##.ACQUISITION SCHEME= undefined
##.AVERAGES= 24
##.DIGITISER RES= 17
##SPECTROMETER/DATA SYSTEM= spect
##.PULSE SEQUENCE= zgpg30
##.SOLVENT NAME= DMSO
##.SHIFT REFERENCE= (INTERNAL, DMSO, 0, 182.463)
##AUDIT TRAIL= $$ (NUMBER, WHEN, WHO, WHERE, WHAT)
$$ ##TITLE= Audit trail, XWIN-NMR		Version 3.5
$$ ##JCAMPDX= 5.01
$$ ##ORIGIN= Bruker BioSpin GmbH
$$ ##OWNER= she
$$ F:/spectra/data/she/nmr/P31/1/pdata/1/auditp.txt
$$ ##AUDIT TRAIL=  $$ (NUMBER, WHEN, WHO, WHERE, WHAT)
(   1,<2020-02-28 14:43:41.48 +0400>,<she>,<DPX200>,
      <created by zg, POWCHK disabled, PULCHK disabled
       configuration hash MD5:
       00 E9 B6 7A A2 85 ED C7 34 08 36 98 17 FE 4E 26
       data hash MD5: 32K
       78 0E B4 DC 2F 48 38 06 3A D5 8F 12 F5 C3 82 0B>)
(   2,<2020-02-28 14:43:44.90 +0400>,<she>,<DPX200>,
      <Start of raw data processing
       efp BC_mod = 2 LB = 1 FT_mod = 6 PKNL = 1 PHC0 = -1496.917 PHC1 = 663.0013 SI = 64K 
       data hash MD5: 64K
       61 CF 63 37 CC 28 11 FF 46 A0 D7 B7 0B 8E 71 0F>)
(   3,<2020-02-28 14:43:56.46 +0400>,<she>,<DPX200>,
      <pk PHC0 = -40.37887 PHC1 = 0 
       data hash MD5: 64K
       7A 37 8C 07 BE AF C7 2E 20 F3 E0 21 AC 75 C3 CA>)
(   4,<2020-02-28 14:43:59.46 +0400>,<she>,<DPX200>,
      <abs ABSG = 5 
       data hash MD5: 64K
       CF A9 BF F0 F1 0C ED FB A7 58 38 57 B4 0F 9D 27>)
$$ ##END=
$$ 
$$ hash MD5
$$ 58 1A EA 14 7B D0 FA 41 36 29 C4 7B A8 07 46 B5
##$RELAX= 
##$RELAX= 
##$RELAX= 
##$RELAX= 
##$RELAX= 
##$RELAX= 
##$RELAX= 
##$RELAX= 
$$ Bruker specific parameters
$$ --------------------------
##$DU= <F:/spectra>
##$EXPNO= 1
##$NAME= <P31>
##$PROCNO= 1
##$TYPE= <nmr>
##$USER= <she>
##$AMP= (0..31)
100 100 100 100 100 100 100 100 100 100 100 100 100 100 100 100 100 100 
100 100 100 100 100 100 100 100 100 100 100 100 100 100 
##$AQSEQ= 0
##$AQ_mod= 1
##$AUNM= <au_zg>
##$AUTOPOS= <>
##$BF1= 81.014009
##$BF2= 200.13
##$BF3= 200.13
##$BF4= 200.13
##$BF5= 200.13
##$BF6= 200.13
##$BF7= 200.13
##$BF8= 200.13
##$BYTORDA= 1
##$CFDGTYP= 0
##$CFRGTYP= 5
##$CHEMSTR= <none>
##$CNST= (0..31)
1 1 145 1 1 1 1 1 1 1 1 1 1 1 1 1 1 1 1 1 1 1 1 1 1 1 1 1 1 1 1 1 
##$CPDPRG= <waltz16>
##$CPDPRG1= <>
##$CPDPRG2= <waltz16>
##$CPDPRG3= <>
##$CPDPRG4= <mlev>
##$CPDPRG5= <mlev>
##$CPDPRG6= <mlev>
##$CPDPRG7= <mlev>
##$CPDPRG8= <mlev>
##$CPDPRGB= <>
##$CPDPRGT= <>
##$D= (0..31)
0 1 0 0 0 0 0 0 0 0 0 0.03 2e-05 3e-06 0 0 0 0 0 0 0 0 0 0 0 0 0 0 0 0 
0 0 
##$DATE= 1582886620
##$DBL= (0..7)
120 120 120 11 120 120 24 19 
##$DBP= (0..7)
150 150 150 150 150 150 150 150 
##$DBP07= 0
##$DBPNAM0= <>
##$DBPNAM1= <>
##$DBPNAM2= <>
$$ [...]
##$SUBNAM3= <"">
##$SUBNAM4= <"">
##$SUBNAM5= <"">
##$SUBNAM6= <"">
##$SUBNAM7= <"">
##$SUBNAM8= <"">
##$SUBNAM9= <"">
##$SW= 369.568048894756
##$SWIBOX= (0..15)
0 1 3 0 0 0 0 0 0 0 0 0 0 0 0 0 
##$SW_h= 29940.119760479
##$TD= 32768
##$TD0= 1
##$TE= 0
##$TE2= 300
##$TE3= 300
##$TEG= 300
##$TL= (0..7)
0 120 53 12 22 120 120 120 
##$TP= (0..7)
150 150 150 150 150 150 150 150 
##$TP07= 0
##$TPNAME0= <>
##$TPNAME1= <>
##$TPNAME2= <>
##$TPNAME3= <>
##$TPNAME4= <>
##$TPNAME5= <>
##$TPNAME6= <>
##$TPNAME7= <>
##$TPOAL= (0..7)
0.5 0.5 0.5 0.5 0.5 0.5 0.5 0.5 
##$TPOFFS= (0..7)
0 0 0 0 0 0 0 0 
##$TUNHIN= 0
##$TUNHOUT= 0
##$TUNXOUT= 0
##$USERA1= <user>
##$USERA2= <user>
##$USERA3= <user>
##$USERA4= <user>
##$USERA5= <user>
##$V9= 5
##$VALIST= <valist>
##$VCLIST= <CCCCCCCCCCCCCCC>
##$VD= 0
##$VDLIST= <DDDDDDDDDDDDDDD>
##$VPLIST= <PPPPPPPPPPPPPPP>
##$VTLIST= <TTTTTTTTTTTTTTT>
##$WBST= 1024
##$WBSW= 4
##$XGAIN= (0..3)
0 0 0 0 
##$XL= 0
##$YL= 0
##$YMAX_a= 11365
##$YMIN_a= -10900
##$ZGOPTNS= <>
##$ZL1= 120
##$ZL2= 120
##$ZL3= 120
##$ZL4= 120
##$ABSF1= 182.463
##$ABSF2= -187.1042
##$ABSG= 5
##$ABSL= 3
##$ALPHA= 0
##$AQORDER= 0
##$ASSFAC= 0
##$ASSFACI= 0
##$ASSFACX= 0
##$ASSWID= 0
##$AUNMP= <proc_1d>
##$AZFE= 0.1
##$AZFW= 0.5
##$BCFW= 0
##$BC_mod= 2
##$BYTORDP= 0
##$COROFFS= 0
##$CY= -3
##$DATMOD= 1
##$DC= 0
##$DFILT= <>
##$DTYPP= 0
##$F1P= 0
##$F2P= 0
##$FCOR= 1
##$FTSIZE= 65536
##$FT_mod= 6
##$GAMMA= 0
##$GB= 0
##$INTBC= 1
##$INTSCL= 5.30512e-09
##$ISEN= 30
##$LB= 1
##$LEV0= 0
##$LPBIN= 0
##$MAXI= 10000
##$MC2= 0
##$MEAN= 0
##$ME_mod= 0
##$MI= 50
##$NCOEF= 0
##$NC_proc= -6
##$NLEV= 6
##$NOISF1= 182.463
##$NOISF2= 159.3651
##$NSP= 0
##$NTH_PI= 0
##$NZP= 0
##$OFFSET= 182.463
##$PC= 4
##$PHC0= -1537.296
##$PHC1= 663.0013
##$PH_mod= 1
##$PKNL= yes
##$PPARMOD= 0
##$PSCAL= 0
##$PSIGN= 0
##$REVERSE= no
##$SF= 81.0140089999434
##$SI= 65536
##$SIGF1= 159.3651
##$SIGF2= -187.1042
##$SINO= 113.3802
##$SIOLD= 16384
##$SREGLST= <1H.CDCl3>
##$SSB= 0
##$STSI= 65536
##$STSR= 0
##$SW_p= 29940.119760479
##$SYMM= 0
##$S_DEV= 0
##$TDeff= 32768
##$TDoff= 0
##$TI= <>
##$TILT= no
##$TM1= 0
##$TM2= 0
##$TOPLEV= 0
##$USERP1= <user>
##$USERP2= <user>
##$USERP3= <user>
##$USERP4= <user>
##$USERP5= <user>
##$WDW= 1
##$XDIM= 65536
##$YMAX_p= 587545844
##$YMIN_p= -22415631
$$ End of Bruker specific parameters
$$ ---------------------------------
##NTUPLES= NMR SPECTRUM
##VAR_NAME=  FREQUENCY,     SPECTRUM/REAL,   SPECTRUM/IMAG
##SYMBOL=    X,             R,               I
##VAR_TYPE=  INDEPENDENT,   DEPENDENT,       DEPENDENT
##VAR_FORM=  AFFN,          ASDF,            ASDF
##VAR_DIM=   65536,         65536,           65536
##UNITS=     HZ,            ARBITRARY UNITS, ARBITRARY UNITS
##FACTOR=    0.456856943014862, 1,           1
##FIRST=     14782.0589164792, 0,            0
##LAST=      -15158.0608439998, 0,           0
##MIN=       -15158.0608439998, -22415631,   0
##MAX=       14782.0589164792, 587545844,    0
$$ Real data points
##PAGE= N=1
##DATA TABLE= (X++(R..R)), XYDATA
$$ [...]
46470 293748 263128 -1859355 -4050205 -4746547 -4389485 -3792589 -3006702 -2190737 -1915600
46461 -1915600 -2134413 -2180264 -1969322 -1877888 -1536516 -418448 491601 -320557 -2130500
46452 -2130500 -2516836 -1090521 -113356 -568170 -439155 1556840 3284739 2519625 655299
46443 655299 321045 1081067 662978 -658380 -301231 2235946 4317588 3881663 1705168
46434 1705168 -479735 -1867391 -2060792 -844807 754857 1021579 -106292 -888399 -553425
46425 -553425 -388901 -1287638 -2085458 -1498284 -95333 982279 1880893 3133493 3992951
46416 3992951 3279457 1325469 -266744 -521440 177778 884464 913871 345401 206715
46407 206715 1411484 3058347 2960331 665544 -1417143 -1173855 263780 471216 -483761
46398 -483761 -496390 865936 1660550 815569 -280877 -214556 475084 864522 1404853 2603298
46388 2603298 3329038 2272019 349465 -160616 1305075 2933253 3018208 1755428 273653
46379 273653 -919027 -1945241 -2838227 -3430552 -3536879 -2945885 -1690811 -482843 -220356
46370 -220356 -795404 -1092438 -545893 78670 12713 -220364 301174 1343762 1902245 1732350
46360 1732350 1420575 1241493 1161130 1749968 3553530 5383537 4942892 1945538 -813530
46351 -813530 -640627 1858138 3957579 4268414 3575346 2868184 2215794 1538960 1046523
46342 1046523 650003 48772 -391005 128251 1458756 2319064 1832344 475633 -761618
46333 -761618 -1369804 -1204197 -220488 1234051 2480751 3196729 3534928 3477619 2800129
46324 2800129 1784781 1094611 735659 95049 -741453 -838024 -22469 573280 314088
46315 314088 188525 1106126 2178214 2062003 1198817 1126616 1979260 2288409 1258259
46306 1258259 -217582 -1017821 -981272 -308723 971289 2340375 2639122 1412186 -235102
46297 -235102 -874400 -403246 208622 425211 593477 973545 1082896 316117 -1150118
46288 -1150118 -2395550 -2589565 -1580502 246020 2342649 4064606 4698677 3974977 2624744
46279 2624744 1949435 2528777 3621772 4111898 3815850 3598548 4382914 6236378 8195292
46270 8195292 8849948 7502877 5022264 3148651 2659184 2699034 2259903 1584874 1404370
46261 1404370 1505680 1202232 817931 1329484 2513434 2847135 1679922 260431 -89493
46252 -89493 268670 296019 100407 460523 1053524 668039 -731459 -1518940 -551962 1190822
46242 1190822 1895013 1161051 85964 -484492 -755213 -1070542 -1207205 -907921 -344674
46233 -344674 393844 1582775 3055939 3792976 3127439 1829893 972000 145246 -1807545
46224 -1807545 -4333571 -5091339 -2996820 -5411 1180796 218762 -1167033 -1738249 -1620050
46215 -1620050 -1121212 -237562 619003 741243 315619 426500 1463003 2457938 2543448
46206 2543448 2259060 2699039 3864144 4593166 3953145 2171565 283359 -722945 -451696
46197 -451696 755117 1993340 2334651 1560456 488263 286615 1139089 1804010 1045866
46188 1045866 -592443 -1233175 -45830 1730476 2619366 2782401 3171563 3621467 3067230
46179 3067230 1346174 -446698 -1408783 -1657481 -1674184 -1673845 -1672975 -1511524 -948956 -358777
46169 -358777 -810103 -2479423 -3624517 -2635792 -696879 -524083 -2450014 -3829928 -2844039
46160 -2844039 -826662 164835 195329 453458 970393 1070215 1075967 1832483 3064351 3635997
46150 3635997 3076878 1761285 136291 -1133418 -953277 949166 3096476 3886177 3618773
46141 3618773 3560478 3606502 2599539 672469 -601695 -538125 -125787 -157680 -138243 466171
46131 466171 1319679 2127024 3105271 3906293 3417173 1497304 -293899 -722200 -584095
46122 -584095 -1255874 -2474678 -2948788 -2557246 -2406620 -2875720 -3069465 -2428087 -1624796
46113 -1624796 -1384986 -1406861 -1092987 -617073 -543022 -880480 -1240718 -1584770 -2070120 -2397023
46103 -2397023 -2166246 -1816583 -2210462 -3080667 -2993533 -1489310 -227361 -917125 -2846637
46094 -2846637 -3861365 -3424090 -3075691 -3750426 -4333615 -3590187 -2132468 -1419621 -1736530
46085 -1736530 -2212644 -2216216 -1826297 -1396490 -1313526 -1641254 -1560010 -87268 2055588 2555721
46075 2555721 531929 -1785430 -1787197 199491 1934070 2523251 2659249 2475311 1595849
46066 1595849 944627 1904840 3558469 3342078 969697 -826792 -360368 671156 232767
46057 232767 -928742 -1008837 -160079 279856 266229 644142 1104494 552243 -896818 -1993323
46047 -1993323 -2180583 -1910341 -1412168 -550126 238954 166977 -702609 -1443864 -1403520 -601285
46037 -601285 661807 1763111 1792385 613433 -531430 -501962 106768 -45428 -840422
46028 -840422 -832245 551074 2205119 2825988 2163513 753525 -685595 -1531455 -1640419
46019 -1640419 -1387307 -902194 124718 1263727 1059398 -827841 -2248923 -1100432 1547999
46010 1547999 2905410 2459558 2125624 2616751 2405523 757093 -857384 -1325245 -1468118
46001 -1468118 -1870502 -1442651 318312 1735453 1442210 657325 1035572 1936119 2008411
45992 2008411 1917535 2861824 3574776 1863708 -1339423 -2597374 -902523 893038 396707
45983 396707 -1166320 -1473121 -676830 -634013 -1846843 -2999254 -2995102 -2023286 -785442
45974 -785442 257014 851418 917548 710862 726326 1370798 2659977 3995900 4414853
45965 4414853 3566486 2318804 1746322 1675867 1115990 45215 -395696 264179 1005046
45956 1005046 872047 302543 226266 742499 1369066 1740076 1392507 -155919 -2276715
45947 -2276715 -3186667 -2098300 -514900 -215035 -877563 -1141995 -1112334 -1871742 -2994114
45938 -2994114 -2752247 -949139 516375 393555 -526416 -1426255 -2846836 -4856057 -5686523
45929 -5686523 -4005576 -1313335 -131803 -556097 -588563 457287 965306 -311909 -2357003
45920 -2357003 -3319110 -2553925 -589969 1798741 3686942 4094531 2970515 1579584 1083459
45911 1083459 1086916 366686 -1174592 -2124593 -1318466 556240 1527520 488737 -1456275
45902 -1456275 -2094840 -651904 1168206 1164453 -631830 -2011860 -1388876 388225 1410227
45893 1410227 1038649 135912 -427147 -548580 -394802 -54220 140753 -362515 -1595307
45884 -1595307 -2680834 -2589623 -1293889 27286 116387 -979188 -1864788 -1388292 -49239
45875 -49239 684598 351409 7778 550012 1359132 1236364 94004 -1081525 -1652995
45866 -1652995 -1919082 -2298721 -2577013 -2177429 -927220 554763 1267101 838274 62892
45857 62892 -36630 415992 540137 458824 1327012 3058722 3582248 1630741 -1027367 -1840761
45847 -1840761 -906401 -93021 403402 1915568 3860007 3530794 312893 -2621916 -2562911
45838 -2562911 -1107796 -1630967 -4344502 -6215167 -5147225 -2173595 336364 975177
45830 975177 -156296 -1786648 -2297701 -1300859 -303209 -844220 -2331732 -2934238 -2278683
45821 -2278683 -1768009 -2244188 -2879509 -2735572 -2080498 -1604010 -1406202 -1374181 -1676972 -2240509
45811 -2240509 -2410928 -1790643 -981561 -940726 -1762754 -2413920 -1695092 431773 2434638
45802 2434638 2618108 1257085 573774 1866022 3525216 3164549 1031104 -407528 -15579
45793 -15579 780927 542204 -253519 -439928 265545 1620654 3295965 4214618 3043573
45784 3043573 375608 -1049468 433857 3183742 4467341 3720636 2288932 1144576
45776 1144576 452162 378924 628803 30284 -1660062 -2410782 -410207 2761953 3788586
45767 3788586 2169186 652978 953068 1575953 735155 -838270 -1331279 -457317 732644
45758 732644 1467299 1516356 855727 125310 460478 1847090 2586772 1489968 -255456
45749 -255456 -568844 870909 2595779 3338491 2869681 1395055 -564669 -1934851 -1943679
45740 -1943679 -1214445 -1084852 -1904382 -2802866 -2970621 -2354971 -1317140 -461561 -536879
45731 -536879 -1532760 -2134351 -1212624 291906 263841 -1750526 -3956436 -4815274 -4672870
45722 -4672870 -4308361 -3396149 -1583381 69317 256035 -572528 -875054 -378294 -210826
45713 -210826 -663637 -499907 904012 2221788 2062894 1063514 683510 688169 -382280
45704 -382280 -2396018 -3243379 -1872122 14384 464170 113858 898284 2819345 3968630
45695 3968630 3550084 2915902 3240604 3907045 3919181 3412355 2794888 1684971 -87313
45686 -87313 -1414007 -1191923 -41366 512544 127115 -256592 -18274 603653 1294691
45677 1294691 1832082 1684572 607950 -488421 -422778 593531 1335897 1517845 2001907
45668 2001907 2928529 3091983 1719161 -317201 -1704658 -2145405 -1998090 -1370078 -279274
45659 -279274 937718 1975672 2803379 3238554 2996849 2484614 2659723 3624304 4250197
45650 4250197 3798928 3028211 2970892 3469779 3797151 3967152 4381333 4692809 4142383 2831303
45640 2831303 1691385 1159408 622685 -613084 -2180901 -2726713 -1331267 947395 1472349
45631 1472349 -1099811 -4604580 -5387731 -2642843 844310 2627623 3259492 4017690 4173105
45622 4173105 2545171 223522 -699450 -249627 -53892 -278518 423779 2064591 2910737
45613 2910737 2232727 1261068 974911 1027184 1349146 2623968 4397784 4910194 3902340
45604 3902340 3521058 5019000 6460073 5486806 2851775 1229992 1597767 2733211 3524285
45595 3524285 3810815 3370867 1952877 278420 -495304 -334204 -134238 -132241 220750
45586 220750 931657 1327774 1244115 1115487 897090 186232 -545976 -312993 495868 124021
45576 124021 -1915292 -3566970 -2751382 -255017 1216103 479045 -926478 -1074097 -54512
45567 -54512 569162 49501 -708635 -604877 136308 398117 -271278 -1179595 -1464841 -928371
45557 -928371 71208 829135 358830 -1770844 -4280407 -4907914 -3071940 -935210 -815653
45548 -815653 -2277946 -3030453 -2145907 -863644 -363201 -392814 -440547 -759930 -1492983 -1943106
45538 -1943106 -1619037 -1114887 -1014496 -705581 535639 1793624 1333579 -681135 -1674633
45529 -1674633 306942 3861479 5633430 4219850 1569330 254173 449034 471936 -421435
45520 -421435 -1136571 -616867 645997 1481721 1503925 1058888 415859 -258355 -592344 -370264
45510 -370264 100520 458823 717596 811663 344690 -617395 -1167192 -728883 39966 402057
45500 402057 889752 2301484 3874832 3942136 2344856 825450 794431 1836881 2716197
45491 2716197 2843341 2350036 1497315 449817 -777185 -2228572 -3509802 -3707594 -2499212
45482 -2499212 -989060 -561274 -1181814 -1715217 -1500828 -592161 965232 2695335 3096412
45473 3096412 1271962 -1135106 -1593421 -149077 911519 869486 1430196 3206408 4177181
45464 4177181 3037615 1560772 1709202 2475466 1824490 168723 -485811 231516 973113
45455 973113 1065482 855147 239627 -1087492 -2284080 -2170414 -1196746 -914440 -1703958
45446 -1703958 -2590354 -2990664 -3048635 -2622832 -1666296 -1261947 -2428320 -4135628 -4434080
45437 -4434080 -3378779 -2739121 -2827933 -1986717 318566 2200400 2053413 601790 -759855
45428 -759855 -1880226 -2972131 -3496542 -3303835 -3514648 -4805031 -5942501 -5532637 -4282964
45419 -4282964 -3901569 -4396630 -4210450 -2801838 -1348439 -592430 440311 2670880 4946205
45410 4946205 5113952 2955455 809030 753125 2126641 2849110 2448613 2086536 1774052
45401 1774052 -77659 -3413354 -5214113 -3442915 -498322 -58190 -1715919 -1981856
45393 -1981856 -116405 700850 -1386867 -3984105 -4253602 -2787793 -1757953 -1532893 -1287551
45384 -1287551 -1126418 -1349372 -998751 671621 2345234 2319196 1164818 776939 1521112
45375 1521112 2194536 2161707 1723589 1001545 247971 596071 2568211 4415909 3999113
45366 3999113 1889113 477806 364405 28127 -956828 -1042706 352625 1499858 1106692
45357 1106692 402601 1035589 2390209 2555748 1015399 -1015269 -2336026 -2698234 -2394063
45348 -2394063 -1880332 -1629756 -1688712 -1529151 -763186 228646 732506 548261 153216 200179
45338 200179 950828 2011637 2658199 2610050 2267310 1956379 1458912 786743 754706 1901974
45328 1901974 3393873 4050473 3965939 3887607 3532566 2142308 404185 -112251 457978
45319 457978 283548 -1074325 -1667828 -273013 1391785 1038501 -1016206 -2670045 -2995854
45310 -2995854 -2718515 -2429860 -2032250 -1730340 -2081209 -2913581 -3247394 -2472924 -928296
45301 -928296 690282 1899847 2503117 2659120 2845183 3350342 3880743 3865639 2930095
45292 2930095 1049262 -1222214 -2646631 -2299609 -923018 -298117 -886842 -1266783 -512308
45283 -512308 266733 -146033 -957849 -793744 -260421 -1135680 -3400446 -5007681 -4696522
45274 -4696522 -3381501 -2445370 -2102623 -1923855 -1773321 -1672103 -1635865 -2035836 -3250153
45265 -3250153 -4627239 -4713959 -2988462 -656518 655773 390120 -932283 -2364691 -2896262
45256 -2896262 -2004066 -350659 651055 333965 -672319 -1494602 -1811962 -1389640 117853
45247 117853 2253054 3525015 2983163 1505141 716084 1003420 1345984 820297 -442107
45238 -442107 -1606487 -1804031 -641975 1273321 2423236 1720607 -107447 -1091347 -240530
45229 -240530 1266916 1490361 34332 -1557152 -1753688 -888080 -589050 -1572423 -2770943
45220 -2770943 -2982401 -2596405 -2800573 -3555828 -3664113 -2893784 -2556064 -3264412 -3458316
45211 -3458316 -1510768 1488908 2736809 1408394 -217303 267019 2610820 4780301
45203 4780301 5480426 4801028 3236326 1425691 498206 1229664 2702541 3023020 1728529
45194 1728529 369686 226997 685862 727745 756331 1474297 1905513 572763 -1638890
45185 -1638890 -2058276 -112631 1575992 1081668 107027 1167364 3384585 3575122 921288
45176 921288 -1971207 -2831986 -2252212 -1781975 -1537229 -915894 -206762 -54866 -261656
45167 -261656 -421243 -1018252 -2552059 -4075071 -4044558 -2519990 -1184729 -1012700 -1144888
45158 -1144888 -577282 107454 -370783 -1921160 -2996785 -2661764 -1852556 -2029001 -3113234
45149 -3113234 -3656973 -3001413 -2237280 -2497655 -3211494 -3100395 -2344200 -2317572 -3192287 -3369982
45139 -3369982 -1890206 -8326 677818 577639 1154139 2262415 2128346 47137 -2384449
45130 -2384449 -3311307 -2860756 -2570487 -3198418 -3944216 -3712078 -2507123 -1357486 -1040849
45121 -1040849 -1101174 -319416 1750753 3957821 4594144 3161910 724404 -1430935 -2934119
45112 -2934119 -3972914 -4370360 -3621546 -1783803 150866 1046742 719089 78463 107447
45103 107447 751095 977376 -1771 -1743047 -2992890 -3001500 -2166756 -1376245 -1025515 -875070
45093 -875070 -627905 -244153 345845 1426345 3059646 4646761 5339837 4922994 3944900
45084 3944900 2935971 1902945 717462 -490277 -1592851 -2609079 -3214781 -2701185
45076 -2701185 -1030225 593638 980438 357626 -298380 -773063 -1289923 -1178196 469539
45067 469539 2818859 3764418 2801206 1676067 1497572 1082760 -628758 -2329991 -2299586
45058 -2299586 -1226252 -1002013 -1612240 -1452662 -275170 428741 -51226 -804289 -1150831
45049 -1150831 -1397251 -1465550 -723683 351894 303854 -849531 -1266852 -305925 157914
45040 157914 -1198816 -2686100 -2081324 -49831 1103876 1040365 1323087 2261896 2358155
45031 2358155 1150432 357064 1299698 2812720 2826004 1066614 -770067 -1030298 324650
45022 324650 1807789 1795806 194034 -1289173 -1058460 367208 1094307 396892 -649350
45013 -649350 -1070665 -1088696 -961631 -317117 553780 273989 -1493847 -2815447 -1983097
45004 -1983097 -210295 71886 -1114494 -1574304 -662566 -205487 -1160658 -1805704 -590985
44995 -590985 1179924 1352762 211104 -325037 19268 -397244 -2241478 -4022253 -4185193
44986 -4185193 -2905117 -1337984 -287011 -6152 -231928 -43231 1262208 2840759 2970364
44977 2970364 1377066 -333872 -983984 -1148110 -1512843 -1443423 -311296 1054521 1595914
44968 1595914 1651632 1952547 1985995 990791 -209278 -193467 690518 768621 -370751 -1497258
44958 -1497258 -1863849 -1917973 -1799274 -974387 229076 443578 -729831 -1942833 -1950378
44949 -1950378 -995657 141300 1167239 1810724 1643995 984827 786994 1134599 1082358
44940 1082358 354165 -286227 -728139 -1743579 -2922216 -2521210 -464070 703736 -589462
44931 -589462 -2463646 -2593801 -1669671 -1504392 -1578799 -462356 686970 -498386 -3276998
44922 -3276998 -4338793 -2790953 -1313911 -1715139 -2452764 -1762833 -475664 -70742 -139905
44913 -139905 374101 1058428 929479 243308 -151834 -282415 -518800 -536433 -116182 -73499
44903 -73499 -1027048 -1994318 -1593260 -111494 886482 613536 -405706 -1470562 -2243187
44894 -2243187 -2367245 -1579632 -215527 1040994 1774012 1773551 823768 -815113 -2128065
44885 -2128065 -2219237 -1204081 168650 1285404 1657817 884299 -704356 -1962501 -2144766
44876 -2144766 -1643770 -1025908 -188818 814775 1072934 -37948 -1732877 -2849474 -3301141
44867 -3301141 -3525136 -3317384 -2411719 -1449342 -1051862 -631252 495155 1556387 1483230
44858 1483230 888444 1052649 1562387 1114796 251804 743910 2183321 1951517 -671989
44849 -671989 -2953795 -2490570 -286781 1412098 2225741 2740372 2439537 892779 -345042
44840 -345042 399172 1898410 1428689 -1080451 -2797480 -2080914 -419011 412043 911468
44831 911468 2260560 3836204 4053903 2857880 1725585 1408645 1041729 -271711 -1979520
44822 -1979520 -2704688 -1870792 -236849 1013624 1332250 936845 244000 -496484 -1070461
44813 -1070461 -1194964 -755549 36197 875026 1578522 1981351 1904132 1401419 741579 -24911
44803 -24911 -1059832 -2059824 -2158494 -1017104 474997 1218872 1189832 1021987 870946 707177
44793 707177 1253471 3156989 5262234 5367216 3226468 1260300 1324267 2136253 1314659
44784 1314659 -1011706 -2382225 -1432981 575783 1829337 2060706 2040617 2139558 2212391
44775 2212391 2242242 2359001 2516813 2581646 2501123 2216940 1760800 1462392 1519577 1416935
44765 1416935 654773 144742 1598530 4880820 7260717 6541507 4017407 2751399 3430059
44756 3430059 3769041 2136448 -69187 -462731 1232476 3223118 4016049 3716102 3329782
44747 3329782 3623877 4569376 5386247 5230631 4115089 2908126 2263319 2009176 1792709
44738 1792709 1643459 1489393 868929 -214155 -836654 -393772 309499 206211 -304666
44729 -304666 -26314 903363 999029 -264026 -1493667 -1280147 52815 1257961 1732152
44720 1732152 1438380 156010 -2005433 -3794059 -3769323 -2115174 -543600 -204203 -484682
44711 -484682 -155713 1035108 2364087 3142139 3146102 2431786 1374251 719156 943146
44702 943146 1578272 1782418 1602981 1917072 2887468 3378223 2564684 1356406 1200777
44693 1200777 1966559 2279092 1776032 1542280 2006280 1930137 378937 -1469300 -1659145
44684 -1659145 71448 2198032 3257140 2826123 1210219 -731105 -1768251 -1353750
44676 -1353750 -317447 226518 161662 -272062 -1514687 -3662463 -5154997 -4373084 -2215222
44667 -2215222 -1050611 -1196207 -726304 941577 1888129 1107994 521607 1820491 3424593
44658 3424593 2876749 785245 -151480 781727 1729609 1453367 741959 502793 587420
44649 587420 995406 2322116 4182187 4777608 3157498 843735 77585 1083093 2097642
44640 2097642 1818316 874900 713111 1609142 2323226 1763039 458135 -278612 -412561
44631 -412561 -1230969 -2975068 -3827270 -2388623 -56545 695762 -227403 -650336 505258
44622 505258 1873957 1974783 1132245 398299 8599 -236194 -192714 153592 329277 224953
44612 224953 473769 1289903 1776494 1175349 91312 -314242 212646 1010031 1396417
44603 1396417 1036210 62925 -643873 -103197 1206138 1310118 -866909 -3856425 -5381740
44594 -5381740 -5034222 -4081635 -3217801 -1949542 -128089 1242360 1118378 -380661 -2116191
44585 -2116191 -2870824 -2264845 -1204337 -1162320 -2493277 -3849136 -3892608 -3024000 -2439634
44576 -2439634 -1978534 -290705 2855986 5786798 6848272 6140153 4914763 4107495 3904782
44567 3904782 4012489 3843865 2996088 1921215 1598800 2266531 3094947 3423867 3614151
44558 3614151 4230006 5062377 5550861 5612622 5422448 4841164 3723040 2411448 1279638
44549 1279638 136774 -1207574 -2124437 -1775829 -428418 692889 913604 698257 633231
44540 633231 650686 552382 520355 632482 526068 105168 -17481 500152 812994 -113528
44530 -113528 -1824085 -2707625 -2069300 -902139 -330891 -233826 61370 530227 663725
44521 663725 388702 10287 -377534 -697924 -489068 485029 1529749 1827712 1708217
44512 1708217 2083177 2769047 2607843 1378552 270814 50517 82219 -136672 172726
44503 172726 1535465 2650090 1902939 -128444 -1266202 -613482 696678 1678007 2763011
44494 2763011 4285683 5098945 3863169 1031360 -1514282 -2544075 -2367644 -1782224 -988245
44485 -988245 191716 1548811 2387815 2138765 906593 -589809 -1618766 -2055990 -2420240
44476 -2420240 -3175630 -3972092 -3841518 -2448640 -959563 -1033534 -2734300 -4110356 -3450972
44467 -3450972 -1420277 -35950 128734 472214 2013886 3879738 4715818 4427646 3650149
44458 3650149 2520730 1120520 328652 827035 1632041 1030441 -1016414 -2621945 -2337298
44449 -2337298 -771999 446794 553231 149505 345976 1578862 2987026 3154119 1866660
44440 1866660 626233 668861 1097058 220120 -1636498 -2284241 -789726 1144457 1523526
44431 1523526 489440 -399678 -308491 364884 959776 1226453 1364377 1809577 2621659
44422 2621659 3009411 2174997 693408 49028 576714 1056055 793026 737711 1678616
44413 1678616 2625637 2283618 1218763 1073531 2047286 2525195 1197021 -1433327 -3710699
44404 -3710699 -4377899 -3557868 -2633499 -2882112 -3916060 -4034236 -2490770 -582998 139569
44395 139569 -176927 -421668 -290299 -157512 104038 863398 1736328 2052109 1904966 1624957
44385 1624957 795370 -840528 -2069853 -1494223 154822 764041 -104451 -682891 265925
44376 265925 1950824 3212089 3920760 4029621 2918765 757149 -807720 -509924 892556
44367 892556 1802555 1749937 1239401 460809 -777665 -2304703 -3590100 -4150031 -3585376
44358 -3585376 -1956126 -477133 -724167 -2473546 -3551893 -2779480 -1730992 -2182811 -3101842
44349 -3101842 -2207562 226448 1531891 630608 -451818 240348 1865818 2424365 1649913
44340 1649913 759914 199265 -744890 -2299138 -3569820 -3777915 -3092539 -1835405 273415
44331 273415 3346969 6300744 7519182 6619095 4834326 3396189 2245780 904565
44323 904565 -85674 288782 1713940 2576283 2129796 1464288 1624124 1852832 874982
44314 874982 -775795 -1152732 489251 2740385 3887879 3658764 2797815 1911291 1336694
44305 1336694 1453601 2376105 3585170 4325715 4227486 3370587 2095207 974377 576364
44296 576364 925579 1470143 1787063 1960195 2079647 1914123 1481233 1395430 1999049 2523643
44286 2523643 1923473 430864 -541203 -173884 830509 1381292 1320975 1050764 449369
44277 449369 -886551 -2445471 -2857815 -1597695 25889 252678 -1031020 -2231140 -2005565
44268 -2005565 -625380 736810 1404054 1488148 1322421 1221663 1562211 2470213 3452598
44259 3452598 3855440 3712355 3642506 3865828 3908871 3485894 3052395 3048025 3076562 2420590
44249 2420590 1074229 -328980 -1396549 -2131717 -2374289 -1914652 -1211289 -1059151 -1227809
44240 -1227809 -443276 1568813 2999628 2155912 147703 -245505 1597798 3182991 2420633
44231 2420633 488055 -142529 667973 920021 -191585 -1188448 -903232 -369421 -1091897
44222 -1091897 -2606369 -3042852 -1609146 591197 2060451 2345859 1943544 1447841 1033239
44213 1033239 510848 -196643 -654014 -316430 521054 715136 -324813 -1685503 -2033477
44204 -2033477 -1321555 -669500 -708867 -857192 -314241 914268 2167378 2746869 2238830
44195 2238830 786694 -725483 -1258623 -662844 244609 817299 1305682 2152545 3042982
44186 3042982 3154674 2156987 562398 -857031 -1750118 -2280650 -2624220 -2436421 -1165205
44177 -1165205 759870 1531410 -223687 -3220636 -4374143 -2510465 -89462 -150186 -2454454
44168 -2454454 -4149637 -3683583 -2162106 -809988 730473 2616813 3231695 1222193
44160 1222193 -1860562 -2907105 -1010021 1746770 3225253 3335629 2951174 2400718 1833223
44151 1833223 1764768 2250515 2453616 1950909 1552991 1871410 2081949 1355636 546654 828875
44141 828875 1406023 581238 -1249263 -1936225 -1036250 -491105 -1137911 -1080741 912321
44132 912321 2653638 1555539 -1096154 -1699084 411652 2064010 835005 -1943577
44124 -1943577 -3561693 -3266271 -2067669 -800142 243505 759393 787100 983791 1612223
44115 1612223 1962322 1677791 1803724 3303551 5199710 5623398 4394442 3105720 2705174
44106 2705174 2480271 1699541 816977 435074 314252 229553 710872 1872556 2429694
44097 2429694 1237280 -747236 -1508159 -730822 41722 57996 418289 1872772 3207148
44088 3207148 3012332 1844312 1204785 1269589 1210230 1121639 1790143 2765621 2608642 1318655
44078 1318655 667530 1459586 2116877 972936 -1350380 -2920443 -2777627 -1264744 853181
44069 853181 2523673 2673212 1515230 709623 1118076 1444200 388027 -1043037 -1108546
44060 -1108546 -193177 15825 -469954 -103461 1270308 2040176 1572429 1077536 1287477
44051 1287477 1384744 869945 476335 464025 -29823 -1040955 -1125607 256574 1583870
44042 1583870 1735253 1754394 2691672 3517195 3014490 2161334 2518300 3494625 3457139 2634967
44032 2634967 2594472 3400576 3644857 3095356 3055594 3911083 4352380 3514731 2237237 1662628
44022 1662628 1936040 2748200 3932895 5006881 5125492 4034346 2451302 1292635 986075
44013 986075 1351069 1565516 718120 -820711 -1268131 251441 2078152 2192522 1228880
44004 1228880 1373875 2774196 3355653 2226096 910684 742952 1182118 1394312 1493380
43995 1493380 1399742 377247 -1349344 -2275801 -1852974 -1314482 -1394504 -1164305 -239340
43986 -239340 -13455 -1120575 -1687876 -132212 1998666 2251375 993423 491780 1237768
43977 1237768 1698487 1180240 497010 -28719 -994692 -2327718 -3247802 -3834727 -4726869
43968 -4726869 -5313725 -4323044 -2348379 -1551978 -2337559 -2534639 -830749 1003582 669117
43959 669117 -1437821 -3050685 -2992620 -1866213 -539494 641941 1427068 1543236 1010554
43950 1010554 61434 -980849 -1404366 -312969 2231421 4728015 5574297 4654144 3155325
43941 3155325 2121650 1612859 1018038 -173859 -1714027 -2562392 -1920000 -420415 298874
43932 298874 -510498 -1855122 -2417968 -2202634 -2189142 -2795975 -3337682 -2883907 -1249975
43923 -1249975 800176 2163988 2364313 1956478 1789139 2052309 2491877 3230618 4498402
43914 4498402 5664434 5642008 4428583 3116860 2075759 420388 -2084201 -3943375
43906 -3943375 -3856992 -2708634 -2348966 -3045005 -3394461 -2387011 -428890 1437569 2410434
43897 2410434 2295073 1768515 1866721 2526716 2397681 1031562 235060 1717328 4212430
43888 4212430 4903176 3310154 1629046 1253499 1288024 910405 744988 855489 -287031
43879 -287031 -3145180 -5294606 -4335031 -1346678 640741 620597 -170005 -1168478 -2895188
43870 -2895188 -4524037 -3919379 -1006519 1253783 655288 -1337545 -2078317 -1549405 -1590274
43861 -1590274 -2378077 -2228759 -806175 -27902 -942759 -1727497 -295590 2390690 3435628
43852 3435628 1946112 73590 -82404 880657 861496 -888047 -3075515 -4112135 -3672787
43843 -3672787 -2606137 -1985828 -2343778 -3313841 -3815477 -2921614 -807176 1245105 1892376
43834 1892376 833156 -960295 -1983327 -1407816 155270 1228914 1031027 199062 -358468
43825 -358468 -834258 -1939743 -3241850 -3308826 -1838249 -493245 -832885 -2242756 -2902242
43816 -2902242 -2221489 -1186941 -619939 -368806 -267328 -627001 -1352638 -1623764 -1088474
43807 -1088474 -542876 -710985 -1071062 -759639 -75447 -34301 -704755 -1104589 -800078 -536708
43797 -536708 -917144 -1362226 -1018812 -91142 455382 186836 -499672 -1220979 -2036914 -2895507
43787 -2895507 -3227305 -2502348 -991999 370201 915683 838765 767773 866485 644945 -193279
43777 -193279 -1002752 -769716 553430 1815297 2031977 1519060 1216434 1291686 1097638
43768 1097638 323491 -648956 -1637040 -3013768 -4674623 -5359755 -3875795 -798660 1820786
43759 1820786 2568877 1942769 1344300 1305177 1110530 -34124 -1891025 -3347997 -3518503
43750 -3518503 -2550425 -1353834 -657955 -477623 -442270 -337759 -138342 253529 938329
43741 938329 1697450 2006115 1463609 156193 -1319007 -2107539 -1638745 -250435 874228
43732 874228 809180 -104033 -723935 -511380 45389 390376 576497 712254 430556 -514895
43722 -514895 -1583135 -2029364 -1886221 -1741387 -1758864 -1625462 -1362598 -1397659 -1738859 -1875571
43712 -1875571 -1768377 -2134740 -3211012 -3920445 -3118499 -1327405 -298979 -821741 -1799875
43703 -1799875 -1800163 -791765 201376 652078 913739 1183089 982844 52040 -927540 -1211760
43693 -1211760 -1284992 -2376354 -4537390 -6023471 -5162898 -2377167 300182 1446798 1309015
43684 1309015 791083 256632 -399374 -1164840 -1871230 -2356414 -2295441 -1259900 585089
43675 585089 2139505 2281518 1025399 -689408 -2242965 -3763305 -5220731 -5777363 -4629476
43666 -4629476 -2306430 -515508 -434136 -1475171 -2125566 -1815226 -1324028 -1239749 -918091
43657 -918091 250140 1245291 494229 -1525898 -2366963 -909613 922489 943660 -63160
43648 -63160 313066 2252532 3380235 2429394 1110871 1435754 2834674 3280939 2211068
43639 2211068 876217 346817 549479 1141185 2127600 3369590 4269400 4285366 3407800
43630 3407800 2048971 736836 -135947 -514022 -563009 -295372 339484 920078 759181
43621 759181 -33338 -437846 -6433 344417 -216913 -1033716 -1082329 -737329 -987053 -1392105
43611 -1392105 -551763 1454441 2863782 2799214 2354366 2483490 2418666 1195499 -566996
43602 -566996 -1617418 -1820570 -1771658 -1482855 -675313 246388 681363 769279 775168 197936
43592 197936 -1234471 -2315451 -1706057 -206994 62358 -1201055 -1930168 -683635 1450053
43583 1450053 2672324 2735724 2405540 1928146 1310488 1227064 2205519 3316427 2992628
43574 2992628 1085354 -952579 -1928879 -1967857 -1612556 -913295 119716 926297 964526
43565 964526 555252 564932 1303616 2181352 2530183 2395283 2247984 2131017 1544387 293073
43555 293073 -976761 -1476579 -1272704 -1097402 -1253795 -1242476 -525003 840609 2386601
43546 2386601 3496194 3385824 1562183 -1313260 -3589005 -4091396 -3022580 -1239693
43538 -1239693 547885 1484334 617891 -1702647 -3315482 -2489395 -224850 1074366 876287
43529 876287 793392 1606639 1997465 957880 -301793 -119236 1214616 2258003 2724036
43520 2724036 3411312 4347851 4632316 4059886 3456824 3200869 2684083 1636116 880458
43511 880458 1201252 2259285 3159456 3438404 3053701 2091387 1029247 678508 1237591
43502 1237591 1856162 1708807 1079796 818968 1154941 1679406 2085279 2174375 1522251 96610
43492 96610 -972434 -357823 1532382 2606369 1544907 -609011 -1910304 -1854431 -1464421
43483 -1464421 -1529488 -1748971 -1563580 -946800 -133115 783398 1624253 1951419 1502355 547522
43473 547522 -457756 -1335216 -2062507 -2505430 -2642134 -2810824 -3246635 -3451213 -2546426
43464 -2546426 -394577 2023412 3570178 4042414 4089795 4237170 4260264 3551061 1985816
43455 1985816 322404 -421829 -54591 582099 730154 715374 1293159 2231786 2402915
43446 2402915 1397296 136593 -527114 -909597 -1495578 -1699287 -730582 776172 1238838
43437 1238838 186389 -1196483 -1648126 -1038106 57132 1037641 1393014 1039219 703584
43428 703584 1091463 1622169 1095018 -297840 -1035794 -714875 -806946 -2159504 -3368646
43419 -3368646 -2954009 -1748193 -1445471 -1853648 -1500993 -244889 784939 1469562 2763511
43410 2763511 4403850 4665802 2971610 1001370 443249 1004440 1361556 908253 -60198
43401 -60198 -838675 -540541 1052232 2586562 2466952 1390859 1796194 4132158 5690736
43392 5690736 4395524 1865434 967491 1895983 2762747 2864307 2985846 3168763 2643146
43383 2643146 1791653 1842842 2446650 1771222 -488861 -2241339 -1916648 -455699 603097
43374 603097 1363631 2553331 3550110 3093636 1400099 83332 26633 424106 89798
43365 89798 -1053430 -2083178 -2250916 -1730295 -1264102 -1268277 -1487158 -1498781 -1125194 -152530
43355 -152530 1675867 3750092 4361034 2530761 -225922 -1298960 -185989 1038436
43347 1038436 690259 -564221 -1323145 -1513748 -1684594 -1420602 -44699 1680466 2190493
43338 2190493 1445925 1177311 2404894 3899823 3897731 2549554 1579075 1717675 1673231
43329 1673231 166537 -1917963 -2539062 -1357041 -235718 -598091 -1647728 -2022196 -1891701
43320 -1891701 -2038437 -1900601 -413822 1709732 2588358 2020104 1702223 2326080 2500818
43311 2500818 1220325 -546250 -1641786 -2258672 -2581872 -1717522 559534 2566645 2863179
43302 2863179 2291729 2194079 1934601 193892 -2359585 -3893008 -4182163 -4389462 -4622794
43293 -4622794 -3996102 -2864992 -2681690 -3498845 -3725248 -2640678 -1228124 -252967 516023
43284 516023 833439 -186808 -2125347 -3121981 -2510430 -1744818 -1794453 -1530523 9720
43275 9720 1475155 998038 -986255 -2306276 -1775170 -156760 974238 451583 -1623829
43266 -1623829 -3454525 -2945735 -360963 1573821 1170393 -23164 109573 855501 4794
43257 4794 -2317817 -3503355 -2035013 773216 2806728 3239764 2310036 563017 -1129826
43248 -1129826 -1941810 -1947686 -1787802 -1437778 -409406 799080 882986 -211918 -761224
43239 -761224 480902 2585545 3815668 3751442 3147576 2470354 1687075 1082197 1158662
43230 1158662 1712315 1822062 961849 -344199 -1113423 -863311 72328 972834 1443229
43221 1443229 1783601 2567939 3813646 4797505 4838766 4011654 2853430 1636160 347422
43212 347422 -693695 -730159 622323 2685428 4203179 4529232 4053770 3415070 2731955
43203 2731955 1972139 1677557 2544614 4203330 5143776 4282107 2170312 256567 -689184
43194 -689184 -997727 -1292665 -1783879 -2238653 -2274118 -1755314 -1083646 -832112 -921843 -599537
43184 -599537 464974 1567321 1875492 1405199 569007 -601566 -1990963 -2732474 -2072414
43175 -2072414 -617812 346236 636117 1163143 2179552 2746815 2232537 1247311 616158
43166 616158 292848 -196270 -944441 -1751736 -2370555 -2296183 -1036397 968365 2414890
43157 2414890 2644590 2394274 2477050 2451674 1420020 -383040 -1726875 -1890708 -1249980
43148 -1249980 -494285 -6460 -8571 -597451 -1403440 -1716646 -1279068 -696838 -768797 -1497889
43138 -1497889 -2061396 -1851837 -1240992 -913109 -634166 495512 2280546 2903442 1089039
43129 1089039 -1875252 -3539576 -3363488 -2942267 -3230790 -3243863 -2034407 -407532 276519
43120 276519 -142862 -993080 -1857525 -2350965 -1814900 -335823 773070 588418 -132581
43111 -132581 -337808 -398680 -1129210 -2024378 -2098953 -1755322 -2020430 -2472931 -1921365 -809939
43101 -809939 -699345 -1297969 -454758 2223874 4084829 3014552 412656 -974278 -672451
43092 -672451 -138646 89600 800882 1982851 2204818 570688 -1876850 -3273324 -2929560
43083 -2929560 -1892967 -1735925 -2890834 -4210689 -4350997 -3377746 -2410420 -1862698 -1125821
43074 -1125821 -156385 5394 -987117 -1773443 -1130073 223521 884624 828177 700189
43065 700189 -32471 -2188519 -4479563 -4291675 -1339965 1375160 1203875 -996592 -2415146
43056 -2415146 -1859526 -487646 342985 557681 733876 1061620 1335844 1491502 1710117
43047 1710117 2005859 1952359 1130323 -97690 -712752 -314331 175028 -281896 -1282178
43038 -1282178 -1491296 -500665 819346 1764902 2454838 2888272 2605823 1776574 1439164
43029 1439164 1931431 2130659 1138533 -244194 -799854 -802716 -1312927 -2117916 -1894563 -340022
43019 -340022 1259836 1841062 1768783 1800948 1837097 1377919 615718 333142 880146 1718727
43009 1718727 2022794 1565487 946723 862894 1179712 1068334 231747 -487740 -196805 748212
42999 748212 1195302 752991 184861 245491 717344 727570 -314202 -2052800 -3247873
42990 -3247873 -2857862 -1416443 -719194 -1489554 -2121399 -888012 1224826 1523818 -692879
42981 -692879 -3214239 -4018192 -3544767 -3126158 -2783174 -1816008 -416096 668931 1341730
42972 1341730 1848339 1885518 1133505 166355 -198551 47863 663685 2067360 4439218
42963 4439218 6485079 6596384 5025659 3481548 2664598 1707816 176637 -962048 -909283
42954 -909283 -263485 51022 82461 320688 650763 611451 177420 -375737 -1038657 -1988826
42944 -1988826 -3152013 -4120429 -4347987 -3478466 -1855578 -515463 -71843 111596 768590
42935 768590 1124412 -143385 -2374369 -3151846 -1641060 72133 24032 -947387 -1107361
42926 -1107361 -878133 -1793234 -3314361 -3267274 -1407120 -80056 -670769 -1518943 -573070
42917 -573070 1498160 2363719 1210038 -612488 -1561253 -1188032 195610 1804701 2372079
42908 2372079 1104198 -1062621 -2136639 -1371754 -62667 339639 -29914 -307096 -651500
42899 -651500 -1939184 -3977058 -5281067 -4913370 -3609296 -2675225 -2578431 -3138035 -4269172
42890 -4269172 -5652565 -6216375 -5036399 -2664716 -688892 39185 -15348 -170302 -246614
42881 -246614 -48186 850298 2282345 3192656 2728996 1149634 -724276 -2374408 -3500260
42872 -3500260 -3755359 -3228850 -2742326 -3016846 -3789055 -4187902 -3680077 -2317018 -522703
42863 -522703 963169 1470056 1189525 1021501 1194781 833317 -449994 -1487433 -1192523
42854 -1192523 -471435 -1011930 -2531857 -2848147 -816778 2185304 4049532 4026244 2640725
42845 2640725 668286 -1151640 -2177328 -2281119 -1783246 -797268 695320 2039794 2167364
42836 2167364 1027673 -178370 -658284 -945551 -1552661 -1761694 -765652 737188 1265017
42827 1265017 503380 -526449 -1048284 -1242433 -1375173 -1226827 -723547 -417294 -842555
42818 -842555 -1734581 -2275649 -2004639 -1267523 -809084 -1032736 -1666359 -2088111 -1865573 -932525
42808 -932525 520604 2007717 2745900 2237732 1026225 439020 1250225 2777393 3534563
42799 3534563 2718945 993321 -164177 -9266 533626 -51616 -1592122 -1870614 479262
42790 479262 3460471 3773978 1240274 -868481 -459989 568838 -449479 -2811075 -3745252
42781 -3745252 -2731595 -1858894 -2075091 -1759579 211582 2214906 2139473 436363 -711129
42772 -711129 -425167 266183 505545 689691 1244196 1617534 1207033 519739 558980 1344655
42762 1344655 1848115 1466649 849107 837105 1088850 486793 -1167816 -2628829 -2663883
42753 -2663883 -1461678 -129180 757439 1451794 2108858 2321020 1777792 902021 513123
42744 513123 1037029 2200935 3338647 3834133 3365364 1942857 -93104 -2047207 -3054322
42735 -3054322 -2677006 -1428933 -409088 -215967 -420673 -273562 300510 644036 167551
42726 167551 -965230 -1876217 -1687434 -403362 940374 1318105 852661 442655 283746
42717 283746 -475930 -2275471 -4061855 -4333658 -2910542 -1098254 -300795 -881381 -2155463
42708 -2155463 -3084798 -3097147 -2469032 -1803514 -1226488 -560947 -131959 -456686 -981189 -292045
42698 -292045 1839563 3731803 3939592 3105249 2638096 2530895 1847534 682360 103934
42689 103934 439554 979737 1253733 1394676 1350811 869968 215861 -64954 55892 332531
42679 332531 839386 1413365 1246821 278621 130589 1995925 4367790 4889523 3853373
42670 3853373 3490049 4150618 3956299 2360451 1126681 1123633 1024122 170508 -174716 219645
42660 219645 -629603 -3193075 -4403331 -2017065 1375101 1797176 -437359 -1802321 -1043999
42651 -1043999 -84856 -59143 23474 522678 270818 -930069 -1610821 -1236040 -1126159 -1870322
42641 -1870322 -2009155 -477248 1430558 1802166 493988 -1273244 -2545284 -2942225 -2403664
42632 -2403664 -1508500 -1166571 -1315148 -840135 625176 1900548 2027076 1837663 2776031
42623 2776031 4784284 6283703 5980702 4131805 2215824 1578922 2143374 2524604 1817868
42614 1817868 825542 673236 798111 -200400 -1962144 -2487624 -1140536 337590 471678
42605 471678 -70923 -175969 -106924 -313236 69894 1828008 3739535 3736664 1549355 -1089993
42595 -1089993 -2484768 -2202618 -813582 579497 1061287 1024556 1891169 3881643 5089250
42586 5089250 3997104 1872406 1009872 1386960 1017757 -728782 -2211414 -2065241 -870147
42577 -870147 162297 694912 949853 1103310 1473275 2302771 3035429 2799768 1841542
42568 1841542 1427612 2130528 3315130 4450464 5576976 6211810 5402085 3544265 2593799
42559 2593799 3450518 4504085 3987013 2520144 1833870 1995427 1700867 719847 133560
42550 133560 242382 47902 -867410 -1500380 -1026115 36232 897737 1616467 2383683
42541 2383683 2692738 2162264 1434054 1249996 1220766 592036 -216162 -116413 724202 839690
42531 839690 -340567 -1491920 -1263811 -167108 296883 -329784 -1314262 -2092978 -2591056
42522 -2591056 -2438456 -1228074 264869 456406 -859098 -1855494 -1126917 168769 -79092
42513 -79092 -1719169 -2296831 -353532 2612541 4055877 3189982 1102480 -1043515 -2749701
42504 -2749701 -3538270 -2954836 -1533827 -693450 -942255 -854272 1226611 4686562 6842348
42495 6842348 5892272 2893249 322377 -679750 -867649 -1124682 -1279643 -957299 -670882
42486 -670882 -1238837 -2387211 -2722208 -1343308 910827 2218612 1755210 604959 484574
42477 484574 1751087 3086699 3147149 1989163 677380 89956 500355 1620924 2346910
42468 2346910 1193581 -1847976 -4367776 -3911704 -1182771 714451 366778 -413683 295838
42459 295838 1837752 2585298 2468452 2184820 1332798 -540254 -2002251 -1245054 870624
42450 870624 1656786 473164 -620113 -417866 -267697 -1232815 -1883873 -603651 1564764
42441 1564764 2279153 1101765 -399666 -1047112 -879661 -74363 1241992 2196449 1759111
42432 1759111 387826 -153189 1009706 2795917 3645667 3242573 2399267 1912340 1957637
42423 1957637 2180220 2059391 1440802 779591 564865 623857 462351 105889 -100300 -409900
42413 -409900 -1425761 -2756812 -3003591 -1678890 -208363 -94466 -766424 -450729 1143530
42404 1143530 2422822 2420021 2301368 3459728 5105492 5177393 3390991 1900011 2471346
42395 2471346 4158976 4678252 3379360 1767313 1334319 1969762 2642143 2694502 2032855
42386 2032855 723725 -1015170 -2739552 -4050201 -4688099 -4280280 -2615646 -506081
42378 -506081 362346 -822435 -2829407 -3724204 -3045508 -1809595 -678236 642246 2032532
42369 2032532 2342949 978304 -785847 -1154804 -56498 1026328 1246539 1216092 1502789
42360 1502789 1590829 1014102 443088 539272 473344 -963183 -3021373 -3392179 -1294223
42351 -1294223 1295040 2234871 1754233 1312613 1056279 -40563 -2069625 -3822210 -4394361
42342 -4394361 -3782991 -2012214 787360 3305011 3726579 2070790 461668 425027 1260763
42333 1260763 1815527 2325150 3306997 4010194 3576782 2779713 2895235 3517934 3266163
42324 3266163 2196380 1595817 1527446 637733 -1275794 -2497205 -1968084 -918699 -877100
42315 -877100 -1507053 -1694980 -1548853 -1762476 -1882882 -1004884 208657 89085 -1268848
42306 -1268848 -1550227 698958 3852355 5147790 4002971 2207969 1321465 1216381 1176459
42297 1176459 1069680 893739 223186 -993991 -1757541 -1165230 72310 304345 -916924
42288 -916924 -2334504 -2713614 -2077572 -983357 334969 1507920 1711459 741949 -221202
42279 -221202 99597 1397107 2261849 2089508 1647882 1849047 2709313 3530313 3593712 2808128
42269 2808128 2059634 2470564 3722056 3760863 1196612 -2462339 -4206683 -2971663 -419098
42260 -419098 1630152 3022028 4178071 4687085 3944388 2352263 1017230 647840 1150615
42251 1150615 1802114 1595618 137167 -1533398 -1817282 -548765 776823 1076233 875455
42242 875455 919889 864955 301060 -65541 437633 969166 353880 -770606 -642385 863866
42232 863866 1822394 1048486 -110832 311169 2115095 3206172 2356513 627282 -218087
42223 -218087 85075 386297 36733 -286657 49331 405994 -126069 -1119013 -1350284 -672800
42213 -672800 -83309 1140 98146 133395 -737300 -2123517 -1984254 476438 2898919 2451313
42203 2451313 -436523 -2728134 -2643528 -1197286 -161537 -185765 -1035625 -2204021 -2905637
42194 -2905637 -2558107 -1600363 -1032725 -1086864 -1182792 -1103311 -1193924 -1415348 -1271057 -791887
42184 -791887 -631589 -1095223 -1944544 -3056404 -4212105 -4374388 -2526004 611200 2960930
42175 2960930 3433819 2722504 1704603 549177 -296601 85436 1548509 2586844 2404230
42166 2404230 1946305 2013824 1773218 326667 -1467652 -2128801 -1606834 -905191 -448416
42157 -448416 -118020 -168576 -703317 -799461 411245 2138650 2751995 1977279 1043421 814286
42147 814286 987457 1103032 1241134 1623910 2311199 3197384 3695784 2919700 1017777
42138 1017777 -333690 110673 1414258 2016350 2208823 3149321 4022084 2717872 -521733
42129 -521733 -2776424 -2586895 -1973516 -2993723 -4550800 -4554225 -3432217 -3099611 -3598538
42120 -3598538 -3347357 -2222227 -1820934 -2549410 -2827963 -1823237 -861451 -1039662 -1164451
42111 -1164451 437811 3206475 5058713 5219086 4799238 4733437 4576601 3619077 2055245
42102 2055245 536565 -628248 -1290372 -1142269 -226846 701264 1016795 1122213 1776381
42093 1776381 2713992 2802291 1676320 371428 -51430 186761 177832 -342973 -932543 -1311030
42083 -1311030 -1552577 -1619530 -1443296 -1362249 -1730315 -2114629 -1690664 -546018 260959 230352
42073 230352 154681 826936 1810110 2233988 2187708 2368497 2702800 2393372 1353125 586485
42063 586485 809703 1484492 1730184 1600193 1801121 2501554 3173880 3574989 4130099 5011332
42053 5011332 5403214 4373899 2383269 1196077 1902012 3473732 3924999 2755303 1487246
42044 1487246 1576422 2564462 2938612 2276903 1567529 1506018 1552890 1076868 512807 569977
42034 569977 848346 290504 -1075825 -1876487 -1204432 119856 693757 379910 243148
42025 243148 880512 1639692 1665043 1106010 881087 1497698 2466716 2893719 2489184 1882032
42015 1882032 1855689 2360132 2613673 2287755 2058589 2482687 2795152 1747006 -431495
42006 -431495 -1935582 -1617050 -470290 -325789 -1701147 -3575915 -4759717 -4753388 -3639099
41997 -3639099 -1913186 -301744 834665 1735946 2441168 2238877 693073 -1220515 -2093321
41988 -2093321 -2039894 -2456187 -3686367 -4232766 -2873777 -455321 1337049 2187867 3024525
41979 3024525 4120543 4577826 3835163 2666567 2111254 1974853 1103612 -943365 -3116993
41970 -3116993 -4049322 -3603994 -2744548 -2023188 -973531 692988 2050198 1935201 642436
41961 642436 -254776 209470 1470698 2538759 3231625 3883626 4391655 4152928 2858883
41952 2858883 1065792 -74379 206125 1355076 1779686 540044 -1371913 -2002018 -604281
41943 -604281 1736404 3532577 4212722 4032745 3493975 3037685 2698208 2011834 873808
41934 873808 255659 1100338 2655246 3127885 2025169 506362 -650021 -1774446 -2699196
41925 -2699196 -2398088 -1084520 -733503 -2218786 -3683767 -3322703 -2124583 -1956438 -2416657
41916 -2416657 -1876271 -501546 283502 577317 1566861 2679039 1937364 -665079 -2726200
41907 -2726200 -2876905 -2346498 -2424834 -2530128 -1696226 -128111 1600875 3260838 4183900
41898 4183900 3481332 1710929 561355 274094 -586501 -2084413 -2086463 217364 2395007
41889 2395007 2209937 838501 527674 1002664 741850 214816 926390 2245369 2192662
41880 2192662 954326 734521 2118042 3266669 3042798 2389719 1948743 675806 -2002687
41871 -2002687 -4456007 -4648483 -2651195 -360580 595984 63488 -909796 -1154418 -619041
41862 -619041 -416430 -1066121 -1317065 105384 2229463 3029719 2483716 2319164 2747504
41853 2747504 1958386 -437860 -1945293 -621676 1938099 2827164 1667850 412218
41845 412218 245884 530227 418223 -79304 -654608 -1210646 -1665657 -1837970 -1480770 -241858
41835 -241858 1894425 3923261 4455748 3491887 2615848 2862253 3439982 3290951 2736254
41826 2736254 2551126 2515369 2161043 2031982 2766786 3631383 3432965 2373436 1555337
41817 1555337 1100078 293169 -666360 -644120 664037 2283231 3340268 3693272 3214159
41808 3214159 1766775 59567 -721637 -439610 -155099 -530198 -1011563 -748052 559970
41799 559970 2722604 4994947 6056481 5259472 3886240 3812945 4814324 4724307 2635008
41790 2635008 289965 -483129 -225984 -611965 -1910794 -2974309 -3028643 -2312902 -1390894
41781 -1390894 -779926 -865146 -1351992 -1197518 126161 1680978 2171244 1690808 1534057
41772 1534057 2367232 3279203 2750065 284446 -2824740 -4315918 -3012294 -199881 1693114
41763 1693114 1965554 2218496 3614001 4832417 3928196 1303749 -705479 -834886 27741
41754 27741 699827 1126455 1587364 1795054 1498308 1121295 1110090 1265807 1341288 1735413
41744 1735413 2881511 4319768 5112911 5007599 4511326 3942343 3215502 2682489 3222523
41735 3222523 4849157 5961099 5072567 3041731 2321051 3773462 5530832 5687499 4850361
41726 4850361 4781903 5518512 5574261 4567944 3757952 3875226 4225123 4372781 5006758 6373170
41716 6373170 7359162 7068831 6058446 5163653 4410800 3969619 4676131 6411827 7450877
41707 7450877 6872576 6174415 6787750 7489344 6489737 4817848 4890616 6430454 6796581
41698 6796581 5325959 4400489 5663737 7829017 9104259 9415680 9192194 8164296 6639038
41689 6639038 6019022 6714184 7274935 6850025 6642003 7451338 7729613 6085187 4133481
41680 4133481 4489094 6882790 8536965 7855422 5752842 3778548 2832796 3388993 5087183
41671 5087183 6263477 5611866 4152192 3894213 4856962 5332495 4930103 5143363 6614170
41662 6614170 8011695 8291415 8080948 7949279 7194377 5544014 4402662 4922662 6068978
41653 6068978 6112820 5127460 4531440 4862455 5466811 5921348 6357181 6635850 6488699 6334213
41643 6334213 6789213 7490544 7584576 7318071 7827665 9175325 9957526 9395052 8577237
41634 8577237 8799053 9692863 10124318 10190557 10916295 12227681 12753240 11968621 11186812
41625 11186812 11612939 12470711 12266082 11307491 11495794 13567757 15912091 16677452 16039889
41616 16039889 15603175 16276527 17675513 19239628 20988454 23156848 25751869 28608953
41608 28608953 31547760 34531040 37960504 42580400 48642741 55361678 61738278 67914951
41600 67914951 75289230 85224187 97897237 112526656 128871468 148765546 175894541
41593 175894541 213355277 261646858 319963310 388316164 464561521 537238250 584766431
41586 584766431 587545844 543175892 468541215 386776078 313488998 253898536 207646841
41579 207646841 172556398 145570582 123849828 105957030 91257608 78787320 67782218
41572 67782218 58609981 51915858 47230775 43325192 39412668 35245619 30791152 26656219
41564 26656219 23940135 22718000 21642717 20026587 19019696 19332112 19210411 16738663
41556 16738663 13122843 11258933 11542464 11620054 10211755 8587514 7846133 7244936 6158006
41547 6158006 5501734 5937343 6400628 5795987 4788148 4585888 5083656 5490658 5809010
41538 5809010 6364562 6639913 5895431 4512804 3659067 3913077 4936566 6029445 6388924
41529 6388924 5469917 3787017 2685566 2627973 2490896 1347703 70163 125212 1499694
41520 1499694 2917190 3531193 3341858 2506530 1359578 642783 652331 646824 98462 -187922
41510 -187922 565108 1447532 1185775 471193 1011226 2606769 3376773 2943100 3017278 4244051
41500 4244051 4860592 3719386 2537299 3362462 5337828 5986801 4759347 3323746 2894757
41491 2894757 3233286 4137076 5991211 8438641 10035470 9916231 8808141 7875660 7453924
41482 7453924 7447317 8085348 9460649 10829687 11228958 10717284 10457845 11517750 13894167
41473 13894167 16748676 19364392 21771727 24524656 27997457 31978715 35819392 38665714
41465 38665714 39559431 37902214 34279163 30425009 27702202 25690174 22813427 18292357
41457 18292357 12969023 8363487 5560428 4858850 5599160 6236113 5553730 4133700 3702861
41448 3702861 4635380 5181912 3890286 1712396 598654 855555 1271816 1269290 1312150
41439 1312150 1412602 1002994 549122 1574242 4327923 6804175 7056325 5497567 3984567
41430 3984567 3496908 3688743 3961319 3902773 3196431 2061233 1340960 1359974 1304430 597212
41420 597212 83432 683770 1635780 1541286 587447 69784 95973 -375599 -1328703 -1529406
41410 -1529406 -808985 -511428 -1147720 -1562375 -1162961 -974596 -1443438 -1212582 465199
41401 465199 1965846 1759678 1006992 1553786 2674257 2292549 606998 -131131 845298
41392 845298 2017902 2373597 2595528 3086578 3056749 2277980 1782324 2000265 1956171 1136132
41382 1136132 456239 471442 314831 -504207 -896688 -98483 745220 462636 27416 1039558
41372 1039558 2932838 3587628 2312897 552347 -211198 145039 945942 1402925 801039
41363 801039 -856692 -2395400 -2564092 -1430792 89839 1572737 2857290 3119433 1768906
41354 1768906 49581 10669 1671023 2802945 1987277 405628 -82940 664683 1504405
41345 1504405 1809908 1836219 1879263 1919473 1804116 1338017 567156 151479 793911 2092983
41335 2092983 2816946 2629342 2533059 3110904 3474760 2794048 1780141 1492751 1533753 801262
41325 801262 -542564 -1356138 -1489919 -1910542 -2772565 -2892715 -1665283 -275027 -226439
41316 -226439 -1439600 -2473061 -2076094 -53970 2743579 4741530 4632273 2827364 1473541
41307 1473541 2254992 4485210 6055038 5853926 4370047 2315767 21781 -1704789
41299 -1704789 -1628923 181655 1743205 1371172 -143687 -691149 296355 1386009 1318422
41290 1318422 281521 -1029867 -2202988 -2640750 -1795298 -510453 -630693 -2288267 -3116126
41281 -3116126 -1645002 -27839 -1189729 -4196728 -5176132 -2753921 228843 1094861
41273 1094861 728094 1148477 1999161 1638117 292115 -235633 596529 1526509 1540855
41264 1540855 821549 -165072 -1036545 -1177574 -547086 -535323 -2312728 -4432974 -4047024
41255 -4047024 -861344 2043057 2120309 363852 -684553 -416768 -153850 -650787 -1279725
41246 -1279725 -1447018 -1488305 -1946530 -2694531 -3003177 -2266058 -715025 630994 1122148
41237 1122148 1390414 2273435 2982411 1753350 -1318589 -3696495 -3549925 -1987524 -931162
41228 -931162 -323940 710552 1237052 -429130 -3477099 -4977444 -3755614 -1680448 -642910
41219 -642910 -435319 -406247 -1027023 -2472844 -3468595 -3189692 -2891440 -3897097 -5140267
41210 -5140267 -4651022 -2633109 -985077 -292982 476212 1431597 1283269 -137529 -1101930
41201 -1101930 -678090 -282888 -1254617 -2523612 -2326557 -957358 44745 499117 1274319
41192 1274319 1920412 972694 -1280942 -2661846 -2348906 -2017975 -2620354 -2285416 547104
41183 547104 3601737 3097001 -1023276 -4825002 -5384691 -3609922 -1685533 -300154 428056
41174 428056 -389789 -2888247 -5115786 -5237633 -4023220 -3233519 -2551165 -436127 2552582
41165 2552582 3954817 3130791 2310674 3171808 4531889 4596859 3675597 3170261 3199200
41156 3199200 2820343 1810385 822594 275005 139882 318483 381396 -322382 -1404469
41147 -1404469 -1235322 809193 2820408 2547164 376459 -1485804 -2151849 -2455613 -2646045
41138 -2646045 -1980670 -834954 -904760 -2424310 -3128715 -1280732 1713084 3100878 2141477
41129 2141477 297430 -1086554 -1824030 -2071876 -1931889 -1875677 -2470654 -3488362 -3988398
41120 -3988398 -3404389 -2075308 -753485 -5823 60965 -80846 275967 1211420 1947833
41111 1947833 1928730 1750493 2386660 3746681 4700293 4428545 3146369 1590573 413301
41102 413301 39089 488083 1211076 1497546 1083118 130573 -1070904 -1921599 -1486548
41093 -1486548 446339 2454902 2691206 1195536 23645 640599 2087035 2434757 1360246
41084 1360246 293729 277997 695057 370997 -760817 -1663556 -1648710 -1254239 -1392453
41075 -1392453 -1890077 -1480443 447710 2567193 2823273 919315 -1184604 -1594225 -609715
41066 -609715 89169 -178385 -526619 -178868 435239 684393 867926 1460747 1800442 684717
41056 684717 -1725290 -3640830 -3646776 -2192863 -679276 163607 373000 9203 -691840
41047 -691840 -852552 246759 1970125 2887775 2537501 1711250 1050481 518778 388003
41038 388003 1331024 2969548 3724989 3075894 2689912 3940889 5328933 4201225 613284
41029 613284 -2467668 -3005738 -2180713 -2178685 -3212561 -3879969 -3509023 -2782113 -2342966 -1998732
41019 -1998732 -1473583 -1053481 -1032928 -1092321 -830937 -637828 -1266044 -2436870 -2708305 -1327284
41009 -1327284 477160 1042143 637882 879557 1871870 1764796 -211346 -2099826 -1914267
41000 -1914267 -435522 428781 749909 1737682 2652415 1400522 -1708145 -3586298 -2599029
40991 -2599029 -765281 -471229 -1113120 -755664 523212 1038865 283059 -723284 -1378810
40982 -1378810 -1957785 -2287229 -1690892 -443605 171865 -324028 -893012 -586069 77385
40973 77385 13700 -744596 -1019557 6372 1783407 3009832 2988173 2130669 1188266 384277
40963 384277 -415622 -1052637 -1157461 -695911 151031 1411628 2867356 3464129 2306704
40954 2306704 185427 -1180109 -1527802 -2186518 -3523020 -4083567 -3118952 -2113571 -2438325
40945 -2438325 -3140308 -2801874 -2126080 -2518195 -3232547 -2486693 -849659 -774213 -2600626
40936 -2600626 -3605889 -1824281 1259170 2888530 2344427 1001968 262297 441263 940814
40927 940814 792747 -414308 -1856183 -2400495 -2206662 -2387816 -3109258 -3351970 -2722036
40918 -2722036 -2022621 -1672535 -1063068 18922 840234 1117691 1315147 957815 -1310488
40909 -1310488 -4863277 -6411717 -4057867 -401424 564512 -1493283 -3526725 -3561613 -2427857
40900 -2427857 -1406806 -642184 -187451 -545704 -1539950 -2193998 -2236837 -2388048 -2833030
40891 -2833030 -2855173 -2383059 -2416876 -3315879 -4032576 -3740325 -2929385 -2142046 -959955 768498
40881 768498 1947449 1713137 866211 484406 31446 -1517161 -3302732 -3295790 -1375472
40872 -1375472 176538 -212897 -1397244 -1482274 -483298 223420 214919 329806 999158 1683716
40862 1683716 2097544 2736255 3680016 3877093 2479409 365474 -580470 349259 1876848
40853 1876848 2216768 917519 -939540 -2077443 -2263046 -2156653 -2094214 -1489111 101569
40844 101569 1667040 1535572 -245715 -1417754 -239756 2131626 3176729 2368131 1512489
40835 1512489 1840114 2335975 1463701 -698338 -2791244 -3801285 -3679779 -2989440 -2499253
40826 -2499253 -2597708 -2726233 -1982552 -509821 543788 716241 817857 1368947 1685961
40817 1685961 1315147 1143354 1951565 2921063 2900353 2255734 1988283 1794937 714033
40808 714033 -829602 -1473822 -1178590 -1153387 -1525788 -1055864 471485 1533790 1294750
40799 1294750 945422 1574827 2315654 2004091 1373348 1859582 2993151 2805769 679178
40790 679178 -1789829 -2965982 -2903686 -2475383 -1917090 -1049831 -245891 -154334 -564700 -415105
40780 -415105 747854 1930466 1900128 895583 363586 1043167 2188406 2900762 3237599
40771 3237599 3464372 3266835 2652441 2649252 3739046 4352370 2664984 -474401 -2337175
40762 -2337175 -2038287 -1442176 -2009218 -2894163 -2988641 -2689673 -2336486 -957538 1582130
40753 1582130 2975682 1381525 -1311493 -1743283 112079 1138217 -165440 -1968082
40745 -1968082 -2494044 -2312187 -2283530 -1808816 -637099 -240147 -1495388 -2739996 -2223555
40736 -2223555 -1050742 -1268918 -2106342 -1014338 1796484 2875018 333937 -3355855
40728 -3355855 -4669239 -3235420 -1281309 -406859 -618189 -1474474 -2338999 -2057363 -125702
40719 -125702 2048720 2589043 1701472 1241996 1777956 1848903 577272 -720316 -524102
40710 -524102 560156 693734 -694358 -2394229 -3014491 -2259064 -893188 -57966 -319308
40701 -319308 -954940 -631087 820589 1938468 1440529 -234633 -1819398 -2814952 -3322002
40692 -3322002 -3066664 -1782199 -150925 705172 445126 -513250 -1692578 -2439019 -1953989
40683 -1953989 -589604 -193537 -1623237 -2786573 -1178921 2196596 3850161 2664655
40675 2664655 1136686 1293780 2019457 1559951 287373 -650644 -1422839 -2342300 -2240987
40666 -2240987 -208277 2138801 2346863 520076 -953022 -718957 321413 910864 765840
40657 765840 -40802 -1374562 -2412942 -2094768 -605284 622586 650403 -144485 -1069472
40648 -1069472 -1862532 -2240167 -1818544 -940017 -671453 -1416495 -2165820 -1662261 60767
40639 60767 1660755 1790941 331415 -1443632 -2004298 -1164568 -329482 -778820 -2105370
40630 -2105370 -2970296 -2957818 -2733258 -2606921 -2095831 -1032541 -23231 573405 1189282
40621 1189282 2026559 2284162 1198713 -532171 -1180429 93753 2274117 3697907 3943496
40612 3943496 4028263 4651773 4916995 3564926 1146238 -257018 237242 1076150 520576
40603 520576 -933416 -1512961 -800821 -61425 -247396 -952285 -1379812 -1388416 -1460975 -2222922
40593 -2222922 -3789892 -5091466 -4501871 -2037185 -148900 -946976 -3171618 -3616125 -1388718
40584 -1388718 1067080 1452511 337302 -289301 266197 1095887 1141342 95708 -1521322
40575 -1521322 -2624821 -2460032 -1584381 -1341508 -2119878 -2815414 -2216369 -236609 2281286
40566 2281286 4165617 4311555 2487482 -91797 -1868850 -2564071 -2702825 -1932937 445206
40557 445206 3235037 3745424 1234464 -1821313 -2903700 -2305194 -1717419 -1627808 -1644983
40548 -1644983 -2045080 -3138047 -3900507 -3005160 -817588 1054319 1808931 1741640 972360
40539 972360 -580585 -2115992 -2364400 -1331748 -436593 -545359 -850165 -243637 866971
40530 866971 893115 -781337 -2522040 -1976841 920346 3259633 2382674 -720858 -2622752
40521 -2622752 -1860214 -331879 17605 -183337 452094 1498545 1736920 1504764 2055181
40512 2055181 3182107 3318381 1856579 -74067 -1137623 -998270 -87403 887527 1291585
40503 1291585 1144362 1169238 1794121 2591214 3100614 3368761 3195674 2038779 387070
40494 387070 -224082 354104 59460 -2230460 -4357629 -3787238 -1477683 -314937 -626939
40485 -626939 -95632 2198684 4467019 5144167 4619839 3608536 2070502 378669 -414883
40476 -414883 -129183 358962 794114 1681900 2598387 2363359 1176744 449812 158347
40467 158347 -1225150 -3490262 -3980003 -1386573 2038573 3582956 3361305 2917446 2517229
40458 2517229 1782716 1383180 1905503 2161977 732279 -1550283 -2555057 -1771248 -591831
40449 -591831 -142392 -414251 -1194690 -2270802 -2781910 -1743437 576934 2643589 3081841
40440 3081841 1717854 -417745 -1718760 -1301250 -141770 -70801 -1180411 -1485546 81987
40431 81987 1885900 2099818 1526522 2054381 3424048 3744252 2637842 1592500 1285310
40422 1285310 750335 -476635 -1369412 -1218682 -768148 -717425 -470207 635615 1898982
40413 1898982 2139293 1366151 590346 349118 305103 147556 26943 -87577 -769346 -2289729
40403 -2289729 -3745884 -3793765 -2338903 -702831 278509 1374549 3286533 4798707 4183632
40394 4183632 1963279 316491 -233559 -1285931 -3181514 -3625422 -1121520 2262963
40386 2262963 3473699 2286489 570024 -903315 -2568086 -3899220 -3694765 -2310080
40378 -2310080 -1366882 -1171161 -417146 1336910 2764720 2769163 1835546 939251 376791
40369 376791 41748 -217233 -715907 -1495476 -1903873 -1616357 -1588928 -2601158 -3437523 -2452546
40359 -2452546 -617585 -644882 -2852032 -4370837 -3289203 -1273148 -758158 -1503823 -1638714
40350 -1638714 -676654 360420 937316 1375224 1655124 1347955 666996 471807 1119869
40341 1119869 2006065 2290257 1670122 486664 -703073 -1729487 -2884972 -4070427 -4222123
40332 -4222123 -2436619 457296 2472046 2691936 1941546 1194241 545889 8924 -36844
40323 -36844 234119 -94451 -1261536 -2219833 -2055774 -1060769 107420 1198162 1714069
40314 1714069 773182 -1458248 -3279280 -3370792 -2274860 -1135033 -88274 1019674 1437140
40305 1437140 442346 -1256002 -2402572 -2910110 -3404699 -3597864 -2579831 -581631 865805
40296 865805 679754 -742347 -2248216 -2936274 -2484709 -1184078 265818 1311704 1750691
40287 1750691 1324075 -175176 -2028851 -2745988 -1834047 -664879 -772535 -2008985 -3220152
40278 -3220152 -3932334 -4315737 -4221073 -3500041 -2767481 -2620426 -2493237 -1443610 300498
40269 300498 1687057 2273679 2165159 1167007 -450246 -849710 1694860 5868797 7976450
40260 7976450 6204496 2739227 862587 1263835 2252517 2580549 2684405 3416317 4644499
40251 4644499 5386326 4914122 3519124 2205408 1649928 1625905 1579934 1444640 1459832 1430444
40241 1430444 753933 -772307 -2555017 -3681491 -3663719 -2873424 -2317330 -2609727 -3082279
40232 -3082279 -2507019 -853954 517179 745011 489433 478750 246987 -714796 -1738244
40223 -1738244 -2177181 -2691225 -3779860 -4145664 -2519406 -270999 164559 -988263 -1310564
40214 -1310564 -360062 -499285 -2836921 -5113632 -5086608 -3740752 -3278022 -3671772 -3311432
40205 -3311432 -1891540 -557587 150865 569624 495927 -640011 -2167212 -2373144 -699101
40196 -699101 1457616 2555236 2570276 2407748 2478307 2517180 2360836 2214271 2179115 1992047
40186 1992047 1446829 862428 806206 1311491 1688652 1353513 631749 419206 1099904 2003515
40176 2003515 1917701 223794 -2132804 -2962410 -951625 2392696 4000363 2882317 1227321
40167 1227321 1091448 1622218 1082509 48049 257136 1308437 1260778 105234 -241738
40158 -241738 555393 728105 -163912 -349085 692406 998671 -206633 -696490 906909
40149 906909 2367574 1486855 -98537 118285 970615 -239863 -2556123 -2464032 288926
40140 288926 2001148 537574 -2058839 -3383590 -3836342 -4524467 -4754394 -3530518 -1656244
40131 -1656244 -520280 -92889 399736 938650 1177733 1463355 2144646 2645693 2290145
40122 2290145 1364552 502296 -207628 -666650 -230429 1241633 2578479 2673704 2086223
40113 2086223 2138087 2885137 3199406 2635090 1960321 1701877 1243811 -146769 -2056526
40104 -2056526 -3242662 -2989867 -1796995 -743157 -368123 -279495 187337 1148705 2173587
40095 2173587 2848574 2937166 2127546 250111 -2074001 -3540534 -3331731 -1952751 -609001
40086 -609001 64582 333889 509385 208793 -1108640 -2904969 -3500142 -1894519 629559
40077 629559 1660691 461794 -1439379 -2683959 -3650092 -4777243 -4931510 -3128388 -765426
40068 -765426 -10640 -570603 -432898 356158 -563679 -3647643 -5700528 -4036465 -369853
40059 -369853 1539695 776688 -439806 -530537 -154614 -37162 468269 1748529 2505120
40050 2505120 1353210 -861365 -1674370 18295 2522691 3335185 2019128 372879
40042 372879 -95833 146698 -75711 -713797 -893172 -623626 -686865 -973631 -447455 977919
40032 977919 1948638 1559317 459325 -446426 -1029259 -1003600 464576 3064104 4640081
40023 4640081 3670403 1413367 120445 98161 184259 177915 721977 1316600 727516 -639975
40013 -639975 -937260 259933 1361334 1598829 2320087 4341303 5883676 4808431 1733441
40004 1733441 -732792 -1154033 -172144 1186872 2469379 3145778 2580830 1146963 303952
39995 303952 896846 1961501 1827483 124242 -1818618 -2532568 -1996169 -1463127 -1843462
39986 -1843462 -2639341 -2773955 -2169688 -1785330 -1967500 -1632139 209999 2665508 3710184
39977 3710184 2649040 833178 -293732 -843656 -1546506 -2057897 -1383622 267276 1267862
39968 1267862 498467 -1384413 -2963237 -3548626 -3208052 -2172325 -986694 -562870 -1103633
39959 -1103633 -1444755 -510812 950751 1294649 401473 -241190 71913 353038 -166380
39950 -166380 -751138 -603212 -235225 -339129 -402795 338968 1458369 2054867 2162995 2252636
39940 2252636 2107811 1509095 1230621 1802208 1976850 276405 -2349245 -3399681 -2234620
39931 -2234620 -553415 589469 1903463 3416176 3373245 1011387 -1494986 -1709534 -304258
39922 -304258 108162 -1272100 -2682989 -2523630 -1224087 -265368 -479438 -1579672 -2697033
39913 -2697033 -3226330 -3384427 -3657021 -3619477 -2251608 61124 1102644 -374352 -2431977
39904 -2431977 -2189703 321335 2432598 2755728 2703099 3644393 4589425 3909774 1942989
39895 1942989 412420 67606 294518 594582 1050452 1404699 993875 -47582 -525922
39886 -525922 283968 1526642 1846662 1124829 365029 92757 -161105 -600280 -419735
39877 -419735 920246 2407425 2610564 1795482 1559059 2224663 2127115 251358 -1810396
39868 -1810396 -1908613 -434778 277144 -778772 -2348502 -3226877 -3657783 -3925910 -3289740
39859 -3289740 -1393888 522530 1089481 620245 268921 140805 -400317 -1110361 -1111130 -550428
39849 -550428 -427647 -667835 -5503 1719767 2721177 1659159 -363893 -1333218 -820814
39840 -820814 337477 1909858 4026263 5520454 4628391 1742759 -362931 23308 1320511
39831 1320511 1032335 -794880 -1972520 -1358063 -70872 324798 -502628 -1862657 -2751929
39822 -2751929 -2178825 119192 2949405 4542667 4409792 3484421 2390468 829138 -995782
39813 -995782 -1856548 -1280332 -540026 -721303 -990843 -254459 530170 -301679 -1999741
39804 -1999741 -1935265 480281 2584767 2105237 267067 -95452 1644425 3507865 3731355
39795 3731355 2561447 1369451 1113873 1813987 2789072 3264715 3145187 3044668 3173238
39786 3173238 2667463 819310 -1388616 -2108781 -1074627 -100859 -656880 -1869257 -1762992
39777 -1762992 53498 1908500 2192785 1125673 120236 -18006 290686 369907 221641
39768 221641 194445 122843 -565111 -1803555 -2552093 -1958592 -532471 395745 257167 -274683
39758 -274683 -363334 45738 500654 661012 354966 -424873 -1176474 -1043024 146330 1368691
39748 1368691 1520535 722220 -105429 -613535 -1128322 -1584939 -1410392 -613569 -1091
39739 -1091 16692 -113587 -237340 -1019724 -2563150 -3522728 -2732709 -943423 370109 1266094
39729 1266094 2718768 4089544 3337711 206250 -2812608 -3736992 -3569664 -4023759 -4331176
39720 -4331176 -2559181 638964 2155131 617004 -1738429 -2297824 -1409682 -1100378 -1720202
39711 -1720202 -1722396 -436032 692270 109647 -1702400 -2861687 -2359283 -1013279 -277180
39702 -277180 -667653 -1580650 -2328825 -2900221 -3597513 -4308149 -4527986 -4005894 -2979431
39693 -2979431 -1775023 -564143 431004 916221 853542 414746 -512475 -2233941 -4393555
39684 -4393555 -5828881 -5826227 -5022796 -4379081 -3700498 -2119231 177136 1853987 2264440
39675 2264440 2277918 2744045 3094583 2342483 823538 -88607 254767 1203191 1853415
39666 1853415 1795489 902168 -612844 -1759489 -1413045 158561 1266837 865343 -138171
39657 -138171 -302382 400291 1003814 1285415 1833202 2595639 2652214 1635899 333085
39648 333085 -487413 -973900 -1530573 -2044227 -2235511 -2119683 -1669732 -651891 737822
39639 737822 1701197 1833906 1716268 1946831 2161917 1701861 809121 443538 1139877 2537145
39629 2537145 3723205 3695429 2064119 -191831 -1310022 -664163 621541 1540711 2549328
39620 2549328 3992596 4484651 2700720 -15940 -1032374 -139362 406256 -331110 -627741
39611 -627741 692822 2130755 2033661 1284579 1610310 2623514 2603379 1382555 439563
39602 439563 459386 614135 287338 -27786 153843 430345 127512 -880968 -2098917
39593 -2098917 -2681053 -1939387 -81170 1812853 2955212 3507110 3711145 3343636 2802661
39584 2802661 3542640 6000292 7997448 7003338 3540280 579497 -154360 555152 1605900
39575 1605900 2829518 3759879 3326150 1612066 199170 -66396 -51352 -319568 51576
39566 51576 1496803 2516694 1729844 30717 -888499 -1022345 -1370209 -1753167 -1212120
39557 -1212120 -10932 602289 355042 -4855 -417736 -1538900 -2999812 -3303875 -1865170
39548 -1865170 122790 1235254 1204550 580272 75568 395129 1568203 2269924 1037258
39539 1037258 -1533152 -3061401 -2305656 -560105 430606 634289 938202 1407023 1546578
39530 1546578 1464082 1464783 1021773 -516994 -2375074 -2764268 -1080713 1208339 2206038
39521 2206038 1549987 483743 390102 1510171 2902700 3484622 3093557 2443041 2073575
39512 2073575 1700755 764831 -737105 -2234822 -3102330 -2992202 -2075306 -1223253 -1432409
39503 -1432409 -2613581 -3435463 -2916411 -1686701 -980682 -851567 -350387 747436 1490502
39494 1490502 1164274 204907 -623047 -1157751 -1503309 -1431321 -706716 377313 1289340
39485 1289340 1824864 1998612 1664178 720303 -416208 -974582 -554389 480215 1330522
39476 1330522 1401631 694143 -299338 -1043596 -1292881 -1049531 -475926 -2414 -152266 -840640
39466 -840640 -1148534 -386799 831072 1323638 1016359 913848 1305982 1168385 -115894
39457 -115894 -1512337 -1693036 -828343 -14170 437410 955627 1382520 1004543 -138643
39448 -138643 -1136473 -1444253 -1147780 -14217 2302635 4727497 4946002 2137487 -1519291
39439 -1519291 -3258989 -2958463 -2695155 -3490788 -3944851 -2352187 915579 3711041 4225681
39430 4225681 2404126 -276781 -1968703 -1678810 98318 1847210 2385822 1939059 1785949
39421 1785949 2691387 3807482 3534396 1581595 -412933 -843909 -172623 -39896 -676953
39412 -676953 -644225 586450 1407881 446570 -1163725 -1394979 -370368 -31722 -1113708
39403 -1113708 -2288965 -2438811 -1981813 -1423302 -265881 1678811 3251493 3414025 2748386
39394 2748386 2244537 1464667 -562745 -3121361 -4207494 -3279893 -2112688 -2380182 -3572420
39385 -3572420 -4063567 -3351121 -2284713 -1624837 -1423982 -1656701 -2407069 -3213781 -3141524
39376 -3141524 -2036142 -1017236 -986450 -1183813 -268164 1408968 1964268 736681 -515467
39367 -515467 -103832 1065355 906515 -608879 -1398228 -344129 1339467 2177610 2210381
39358 2210381 1941278 1019286 -799254 -2394668 -2357068 -821892 846641 1793192 2133614
39349 2133614 2123474 1907899 1813258 1907662 1510827 95611 -1565451 -2173001 -1629979 -903005
39339 -903005 -285699 891681 2610242 3539265 2720784 932371 -386910 -897278 -1252459
39330 -1252459 -1690058 -1642459 -770037 330454 836733 832068 1228030 2425830 3507109
39321 3507109 3299744 2043408 1204489 1527607 2143895 1984734 1197279 567286 383041
39312 383041 618796 1432480 2602330 3232064 2926573 2417528 2074981 984890 -1099608
39303 -1099608 -2236427 -830080 1348550 1299645 -614839 -1188661 567994 2166816 2115548
39294 2115548 2275135 4180981 6050752 5756404 4411427 4400339 5592319 6176627 5944241
39285 5944241 5990137 5981237 4457966 1616692 -568394 -1040743 -571888 -36704 424321
39276 424321 554954 11348 -693567 -747992 -464375 -713359 -1169361 -721943 501119 1159789
39266 1159789 720258 -106319 -867011 -1697557 -2191296 -1616713 -377872 275160 43500
39257 43500 -357718 -721645 -1264337 -1340408 -284602 662390 -353837 -2479464 -2702225
39248 -2702225 -226584 2267507 2503999 1167225 -413326 -2404543 -4767593 -5938892
39240 -5938892 -5155705 -4021760 -3838075 -3409605 -1613986 -112159 -887055 -2688354 -2797312
39231 -2797312 -1246805 -370119 -768453 -645028 852359 2191214 1783376 -145055 -2326196
39222 -2326196 -3573445 -3095586 -1150907 677906 1204078 1308903 2448343 4028309 4117802
39213 4117802 2484604 961976 793092 1397920 1818018 1716660 979052 -61087 -227403
39204 -227403 912284 1520250 -259150 -2932642 -3267318 -1231086 -182102 -1544693 -2681365
39195 -2681365 -1515195 -36429 -861953 -2887567 -3249832 -1876238 -1059413 -1458962 -1453150
39186 -1453150 -252784 888623 909691 439016 504964 1106588 1591067 1560536 1051214 351298
39176 351298 -277822 -983426 -2073967 -3084679 -2844077 -1105245 695872 1144046 510918
39167 510918 -211475 -1005284 -2229568 -3083251 -2343883 -440046 742888 249710 -974200
39158 -974200 -1658701 -1679365 -1708474 -2250994 -3262860 -4135472 -4055046 -2946354 -1895750 -1987885
39148 -1987885 -2926776 -3464636 -2895282 -1420468 501625 2210021 2641856 1271527 -819848
39139 -819848 -1829037 -1147933 437994 2132830 3561962 4076656 3073370 1195454 -7913
39130 -7913 111830 855254 1545786 2047929 1817106 87500 -2350328 -3105137 -1014628
39121 -1014628 2098382 3660568 3448948 3202541 3842056 4600287 4731506 4541275 4285813
39112 4285813 3288501 1114439 -1020690 -1266066 273763 1056754 -914671 -4226967 -5455559
39103 -5455559 -3434529 -692635 -49654 -1247133 -2209956 -2405959 -2971258 -3981903 -3810843
39094 -3810843 -1636597 1107000 2500905 2118853 638699 -1299871 -3066405 -3872534
39086 -3872534 -3526115 -2758241 -2239869 -1886218 -1485368 -1174480 -858459 -87301 915399
39077 915399 1014652 -338949 -2132152 -2979239 -2613251 -1632405 -530470 382358 790033
39068 790033 707627 421729 -201196 -1465878 -2687260 -2599033 -1432137 -1035909 -2046005
39059 -2046005 -2577847 -1053826 1238762 2115540 1647939 1345466 1330012 652276 -319800
39050 -319800 -315654 368578 291681 -313803 275597 1972704 2428432 755559 -756804 -17274
39040 -17274 1829208 2386820 1424453 504742 342852 346493 118550 -189988 -659811 -1428731
39030 -1428731 -2024538 -1944117 -1543261 -1356990 -1009911 52644 1160558 1071979 -115822
39021 -115822 -1044388 -1182270 -1515216 -2736076 -3955518 -4028288 -3321770 -3119563 -3640068
39012 -3640068 -3774193 -2956754 -2264009 -2843237 -3791366 -2837918 559612 3892354 4314652
39003 4314652 2079062 43342 -113574 185999 -1244595 -4247793 -6567359 -6717232 -5581782
38994 -5581782 -5014076 -5453447 -5438935 -3565317 -536863 1415034 1273616 401392 264298
38985 264298 151492 -1264176 -2900221 -2144167 1144126 3967491 4356903 3847819 4376767
38976 4376767 4960776 3704260 1462395 762796 1861484 2575674 1872008 1089944 1292595
38967 1292595 1680687 1344044 737202 574388 691580 706361 570202 10728 -1207884
38958 -1207884 -2060936 -909336 1965912 4080911 3851023 2417653 1450969 867138 52123
38949 52123 -371626 159370 475573 -568870 -1687553 -869880 1133083 1610969 87811
38940 87811 -952165 -65550 995617 362369 -894702 -618842 985548 1815937 1059688
38931 1059688 -20524 -300048 -62316 158718 524668 1118857 1359409 945289 587645
38922 587645 908145 1082665 -384020 -3461372 -5991213 -5766872 -2907736 254564 1576348
38913 1576348 1049430 321523 650966 1713097 2405225 2403590 2503723 3447123 4875096
38904 4875096 5802276 5889826 5696303 5600924 5082859 3497265 1165825 -901348 -2194734
38895 -2194734 -2982231 -3415946 -3064634 -1631007 328726 1743531 1874003 741051 -942785
38886 -942785 -2201423 -2555778 -2394624 -2168637 -1441507 357460 2326714 2659840 1326003
38877 1326003 639906 2005996 3483330 2355208 -834862 -2998304 -2859981 -2168425 -2244330
38868 -2244330 -1807194 528739 3501051 4653186 3459697 1493206 233589 50544
38860 50544 691711 1390760 954398 -896503 -2557402 -2190375 -165416 1350637 1084119
38851 1084119 -308068 -1772274 -2998555 -3796189 -3662854 -2534364 -1053979 294249
38843 294249 1492965 2232322 1899332 710435 -199330 -333409 -463597 -1128069 -1613626
38834 -1613626 -1291281 -930345 -1516250 -2506557 -2577490 -1697921 -1139973 -1499099 -1882799 -1250488
38824 -1250488 352312 2125403 3347591 3654618 3084123 2079759 1074248 60315
38816 60315 -1020576 -1650901 -1172653 180782 1387223 1835983 1766169 1476446 922311
38807 922311 336723 400825 1259807 1970366 1542691 186077 -1005470 -1376666 -1258353
38798 -1258353 -1299213 -1603973 -1575097 -551017 1325848 3003530 3571167 3245243 2827974
38789 2827974 2405379 1426449 78472 -528452 -3113 537927 83393 -749739 -767766
38780 -767766 -32776 542596 902672 1730636 2754387 2635161 895403 -1206284 -2236242
38771 -2236242 -2117184 -1602178 -1057061 -404452 324115 997571 1569315 1891279 1815832 1741455
38761 1741455 2364437 3474166 3766179 2496983 672862 -121581 487611 1719123 2781254
38752 2781254 3098855 2150776 298970 -749865 274337 2207991 2678490 1225173 -335543
38743 -335543 -679593 -327595 94397 898524 1702427 778663 -2292836 -4863271 -4192182
38734 -4192182 -1264534 493229 -243490 -1668415 -2165957 -2210415 -2425485 -2040580 -537606
38725 -537606 806076 527059 -840787 -1525236 -857348 241829 678426 179488 -781545
38716 -781545 -1336082 -865441 148614 422579 -478441 -1495927 -1676352 -1494647 -1673947
38707 -1673947 -1626815 -401502 1429599 2288005 1727607 711700 -72577 -804113 -1437965
38698 -1437965 -1399029 -638546 80460 171663 -379684 -1511378 -2871607 -3298456 -1962620
38689 -1962620 -52075 308301 -939044 -1622594 -675230 302773 -236354 -1381363 -1495385
38680 -1495385 -782683 -435400 -461370 -185390 51482 -380661 -670623 440279 2320766
38671 2320766 3066475 2309107 1513858 1466775 1413664 982497 1002956 1711845 1849479 532266
38661 532266 -1275782 -2166995 -2150484 -2159615 -2513885 -2783114 -2616611 -1974474 -975557 -34495
38651 -34495 289337 -59061 -569719 -882016 -977296 -741858 -241269 -308007 -1581101 -2962483
38641 -2962483 -2680715 -1175242 -920283 -2581024 -3525775 -1657593 1276012 2273733 1350030
38632 1350030 714971 864517 369787 -927147 -1452073 -789696 -343437 -626307 -454698
38623 -454698 396170 275261 -1414661 -2725212 -2168898 -1125781 -1386337 -2164452 -1795314
38614 -1795314 -860781 -972996 -1460185 -235516 2275062 3052943 917279 -1526788 -1483049
38605 -1483049 519405 2042346 2048625 1271573 479024 13405 353235 1584320 2635988
38596 2635988 2329470 977071 -161833 -707289 -1194553 -1521873 -917126 288913 369870
38587 369870 -1540369 -3980346 -4816148 -3562054 -1269036 998944 2470081 2216660 -20763
38578 -20763 -2672643 -3485202 -2169202 -771780 -1056594 -2640529 -4174159 -5071544 -5209494
38569 -5209494 -4139032 -1924628 75215 737774 875207 1785475 2618840 1317884 -1748733
38560 -1748733 -3517709 -2537718 -1296204 -2512367 -4890794 -5002087 -2465119 -512628
38552 -512628 -1274948 -2968302 -2717169 -375291 1758677 1962761 629525 -641687 -598236
38543 -598236 676144 1810772 1578791 452612 -49461 266079 -168906 -2109766 -3914184
38534 -3914184 -3771706 -2337760 -1529113 -1594292 -1351547 -833265 -1365729 -2809901 -3026536
38525 -3026536 -1003635 1399770 2146205 1923173 2712972 4501351 5270056 3908757 1481368
38516 1481368 -464085 -1481762 -1848394 -1742537 -1350189 -1094223 -1238664 -1557879 -1596639
38507 -1596639 -1032002 135418 1338134 1522118 78967 -2235162 -3827629 -3813940 -2623565
38498 -2623565 -1108360 355465 1735975 2862214 3383004 2997738 1709047 102217
38490 102217 -834106 -708039 -405520 -1059088 -2362659 -2792452 -1716521 -344407 -54509
38481 -54509 -596267 -731338 -78183 618885 797845 700177 594700 183921 -822164 -2007856
38471 -2007856 -2602041 -2369686 -1738076 -1014874 47038 1521471 2498599 1830983 -167166
38462 -167166 -1689644 -1687700 -1246423 -1727403 -2441970 -1841088 -539514 -887310 -3121931
38453 -3121931 -4286418 -2291277 876973 1859067 370866 -1261928 -1963824 -2623814 -3246068
38444 -3246068 -2272079 513896 2797981 2744668 1401665 693967 551856 -222696 -1321672
38435 -1321672 -1207139 295795 1485528 1052050 -492508 -1906568 -2551514 -2272280 -1105271
38426 -1105271 206279 295648 -1285154 -3037457 -2944143 -851302 1334270 1935094 1291367
38417 1291367 901121 1370126 1947720 1908444 1513278 1275688 983668 146989 -934616
38408 -934616 -1363958 -904780 -332027 -354585 -813523 -1211925 -1437629 -1558315 -1423290 -976592
38398 -976592 -536769 -196618 648066 2405248 4149894 4320461 2715423 981783 706164
38389 706164 1630074 2262022 1767273 625079 -244225 -263192 732449 2368585 3563395
38380 3563395 3282916 1791744 462002 -6900 -321040 -951143 -822761 1078946 3527198
38371 3527198 4234455 3066523 2174302 2587704 2728892 1293748 -350423 -293358 923454
38362 923454 1445541 1111722 1076763 1223549 501621 -465637 127839 1886630 2065084 -343246
38352 -343246 -2901483 -3345649 -2541579 -2252944 -2199046 -1415598 -676686 -1102516 -1688705 -773196
38342 -773196 955921 1470345 783606 724067 1657346 2071756 1442087 912827 857581 344229
38332 344229 -450030 37040 1680339 1960824 -220034 -2407514 -2139209 -573009 -352282
38323 -352282 -1475508 -1840209 -900086 -147941 -280283 -298648 346146 708928 -22295 -1309033
38313 -1309033 -2174773 -2276831 -1799933 -1219120 -1240699 -2004145 -2386628 -1222828 800738
38304 800738 1736059 977933 -78950 -311509 -373426 -1220082 -2319131 -2314588 -778393 1488377
38294 1488377 3379549 4125108 3561598 2335046 1409749 1024068 669630 295030 622065
38285 622065 1811150 2808361 2756608 2155212 1756104 1242309 171508 -571497 197535
38276 197535 1832033 2343322 1116968 -265651 -274444 702904 1249704 669080 -755547
38267 -755547 -2406582 -3538755 -3452441 -2186568 -727002 -17011 3546 77648 686441
38258 686441 1648564 2240860 1569843 -517916 -2587924 -2500620 174042 3238753 4167439
38249 4167439 2876948 1373056 1031910 1285660 937058 -269618 -1665495 -2470094 -2237610
38240 -2237610 -1054657 361926 1146529 1120122 890675 1060855 1663091 2362784 2786466
38231 2786466 2649924 2046125 1599518 1782915 2113953 1746233 895034 741467 1615757
38222 1615757 2293095 1755940 739040 522319 843969 298029 -1366872 -2648459 -2332601
38213 -2332601 -1140113 -691014 -1410496 -2212407 -2111367 -1474931 -1392406 -2134895 -2750577
38204 -2750577 -2310944 -1110560 -168673 169602 396337 643192 273750 -924329 -1990777
38195 -1990777 -1915139 -861097 441396 1829465 3257903 3825294 2583449 164198 -1660954
38186 -1660954 -2090119 -1801331 -1360555 -562090 326070 268315 -693934 -672120 1670415 4829512
38176 4829512 5993373 4418217 1984379 655246 660148 1136816 1280684 583962 -982349
38167 -982349 -2570624 -3018013 -2142115 -762189 721443 2677101 4677350 4889769 2334383
38158 2334383 -967333 -1712026 790354 3810990 4613137 3348181 1839869 766077
38150 766077 -513737 -1939466 -2293296 -1046303 650171 1439582 1283275 848015 260131
38141 260131 -586524 -1122948 -684431 180507 26231 -1769363 -4336931 -6331374 -6874173
38132 -6874173 -5656798 -3158586 -847567 -54066 -334973 -17674 1278981 1948757 928238
38123 928238 -435635 -338469 670653 501851 -1311736 -3001913 -3160547 -2338817 -1643249
38114 -1643249 -1173995 -626333 -314453 -593810 -975700 -787022 -254911 -35073 -1477 527334
38104 527334 1463264 1830976 1200620 468359 798445 2272492 3937753 4770057 4237354
38095 4237354 2402047 91789 -1297981 -934152 449764 1298459 1112199 896220 1440023
38086 1440023 1972296 1324827 -102779 -652744 360477 1800960 2388045 2247810 2188455
38077 2188455 2232045 1800800 989122 672572 1300663 2315102 2966570 3165398 3268372
38068 3268372 3442072 3548919 3375435 2639668 988648 -1527691 -3916838 -4676864 -3254320
38059 -3254320 -942928 234373 -286982 -1042682 -483770 1043846 1892709 1310651 198934
38050 198934 -246988 157014 714505 590400 -586332 -2113200 -2301757 -200889 2738371
38041 2738371 3959606 2963095 1722731 1545846 1343872 33925 -1244378 -1050554 -224405
38032 -224405 -336766 -711240 394920 2253489 2213229 -121444 -2111173 -2101758 -1430190
38023 -1430190 -1267757 -235581 2830092 5945193 6372921 4575410 3175617 2839508 1930204
38014 1930204 17565 -1086610 -413782 447448 -69341 -1050828 -777711 416861 775476
38005 775476 29796 -150168 1204775 2795647 2864220 1564001 507577 451851 590507
37996 590507 162877 -391858 -454210 -497928 -1351617 -2605799 -2855053 -1556690 279896
37987 279896 1450196 1786535 1795010 1894419 2391868 3399044 4241989 3717548 1634695 -530438
37977 -530438 -1303350 -1015842 -1076605 -1865190 -2407673 -2041017 -1350876 -1207941 -1652875 -2109932
37967 -2109932 -2210005 -2086633 -2173186 -2878025 -4163954 -5355129 -5681171 -5084486 -4155501
37958 -4155501 -3263439 -2267611 -1256655 -935897 -1706754 -2729665 -2684151 -1492222 -546368
37949 -546368 -902732 -1928816 -2393069 -2353863 -2907944 -4174253 -4775542 -3758528 -1934748
37940 -1934748 -581980 202014 847505 903595 -324163 -2191722 -3201812 -2899470 -2007046
37931 -2007046 -920341 447919 1476895 1245162 329666 427423 1714762 2299802 950668
37922 950668 -1286880 -2904837 -3640020 -3548461 -2276684 -411368 330010 -317712 -232439
37913 -232439 1814206 3840842 3634557 2198978 1763053 1986213 1079322 -508310 -759667
37904 -759667 246720 618340 247627 793325 2117923 2240297 1203994 1369564 2976384
37895 2976384 3095721 558595 -1535695 -406179 2279657 3354595 2724195 2304831 2504174
37886 2504174 2631199 3160266 4650612 5610223 4269711 1612011 26405 -177662 -237011
37877 -237011 178016 2388470 5338645 6055436 3881261 1432417 713333 872657 626632
37868 626632 387254 776410 1194682 1273679 1950857 3636958 4833561 4091390 2143819
37859 2143819 666090 -36756 -685949 -1302648 -1344477 -966496 -754087 -603281 -73275
37850 -73275 556997 783196 1027788 1968863 2934251 2415424 348125 -1432989 -1453730 -222664
37840 -222664 962818 1816176 2787067 3692577 3764105 2925281 2016209 1505408 768785 -856950
37830 -856950 -2853352 -4027512 -3984401 -3372452 -2710526 -1794031 -546917 340811 300761
37821 300761 -99214 135062 908691 1099554 188483 -1008101 -1552529 -1623440 -1972912 -2586093
37811 -2586093 -2582825 -1403461 472042 2154862 3289279 4028357 4285524 3549839 1701921
37802 1701921 -305711 -1092265 -284932 969092 1090236 -434593 -2642175 -4018827 -3871980
37793 -3871980 -2959744 -2633807 -3136062 -3078371 -1151364 1951998 4143981 4339407 3258043
37784 3258043 1882392 473691 -499814 1650 1984393 3629785 3392631 2059284 1441626
37775 1441626 1781216 1895825 1334238 809180 781080 1125685 2015759 3590705 4836659
37766 4836659 4414019 2713382 1523057 1474557 1451368 825372 476135 934482 1250077
37757 1250077 690525 71342 248006 550383 -43172 -1195302 -1878181 -1876972 -1496248 -650328
37747 -650328 520871 929543 -179883 -1759900 -2099202 -1078191 -70893 98015 -130062
37738 -130062 -224044 -294224 -584100 -1098772 -1756479 -2279869 -2162896 -1376391 -685178 -531413
37728 -531413 -194094 971571 2107822 1967287 963088 567399 900366 638398 -550802
37719 -550802 -1262782 -626246 245825 -36387 -1211467 -2118308 -2369465 -2236571 -1690316
37710 -1690316 -725779 -152267 -912918 -2749258 -4389632 -4967702 -4572264 -3582928 -2256724
37701 -2256724 -961781 -87997 407004 789843 807634 -177806 -1999662 -3213744 -2427718
37692 -2427718 47288 2354289 2933181 1876347 407535 -575829 -1120964 -1602608 -1970949
37683 -1970949 -1796438 -872541 403291 1250990 1150419 376949 -171593 117771 886625
37674 886625 1275173 1025841 757207 1088407 1862391 2358754 1948098 460712 -1664471
37665 -1664471 -3429807 -3914391 -3133517 -1989529 -1277368 -1111389 -1280121 -1465868 -1013636
37656 -1013636 593972 2621903 3349401 2072182 34856 -1270274 -1785949 -2017898 -1599881
37647 -1599881 -190442 933859 -9266 -2662117 -4552958 -4004865 -1802252 195322
37639 195322 879994 148570 -1359459 -2316949 -1614477 243143 1506423 1307194 508184
37630 508184 149938 164976 140591 252794 691167 1027767 917708 715849 727475 553474
37620 553474 -120178 -718932 -485093 481532 1421241 1668984 879506 -760269 -2128947
37611 -2128947 -1870762 -99053 1442295 1521921 784385 314612 11125 -602703 -1116777
37602 -1116777 -1166425 -1648518 -3338219 -4973562 -4590402 -2479997 -907802 -811978 -683681
37593 -683681 746888 2420977 2518886 961258 -654401 -924995 287417 2080186 3184799
37584 3184799 2869328 1638057 678224 448653 417242 299227 585720 1387347 1772253
37575 1772253 1131553 463987 1199781 3073501 4234504 3486941 1553265 -49998 -651157
37566 -651157 -616528 -489113 -454568 -449064 -349034 -6189 657105 1450060 1888568 1528483
37556 1528483 443834 -640808 -857113 3839 1203666 1726093 1317250 740513 840997
37547 840997 1443815 1474018 275862 -1443088 -2228665 -1358383 434739 1624599 1249697
37538 1249697 -146106 -906003 -7788 1555811 1870605 752140 147058 1207375 2409730
37529 2409730 2081483 1438077 2690260 4905749 4866708 2199599 295199 1079327 2245648
37520 2245648 1563946 589838 1198839 1456141 -1035198 -3809823 -2421539 2192658 4323255
37511 4323255 1880937 -758196 174521 2502236 2495248 833984 644995 2080637 2596837
37502 2596837 1337023 -137580 -941952 -1757744 -2643634 -2364793 -318268 2460100 4441124
37493 4441124 4695322 3116070 682637 -870887 -748653 -27643 21681 -255758 75811
37484 75811 666080 537730 -136154 -462351 -328573 65827 1308093 3552007 4995039
37475 4995039 3742282 736508 -1312084 -1540168 -1264890 -1132475 -555898 71266 -542549
37466 -542549 -1862190 -1711996 12913 627199 -1135298 -2902182 -2351178 -699683 -416846
37457 -416846 -1446770 -2056138 -1932013 -1998360 -2180812 -1718391 -1056161 -1237389 -1807828 -1358966
37447 -1358966 47800 877361 459934 -402794 -1132647 -1914643 -2383967 -1549271 397880
37438 397880 1644885 934709 -804067 -1755529 -1461714 -1053658 -1561361 -2566225 -2658346
37429 -2658346 -1164307 807848 1501271 655672 -246764 -62479 729154 1304244 1794546
37420 1794546 2390893 2439445 1783835 1823684 3492634 5167892 4697545 2819073 2135556
37411 2135556 2983453 3033901 1311771 -180422 156816 1067166 905716 401297 981531
37402 981531 1949547 1537619 -193154 -1615820 -2152102 -2648747 -3358530 -3421258 -2561130
37393 -2561130 -1738331 -1648192 -1751003 -1329800 -651303 -514514 -1138581 -1891620 -1887942 -770659
37383 -770659 858156 1867305 1710027 891438 81955 -721388 -1595351 -1828182 -651396
37374 -651396 1341591 2516566 2073815 804736 -174790 -640429 -903544 -992733 -757485
37365 -757485 -365924 -131399 20166 481123 1324051 2004364 1884216 1012149 139359 -239936
37355 -239936 -594403 -1544750 -2452796 -1784029 656672 2782121 2493967 331936 -1313617
37346 -1313617 -1361238 -1067069 -1754862 -2888931 -3099826 -2141829 -921199 -158303 91362
37337 91362 -90212 -629655 -1134893 -1109061 -565210 78712 736311 1691941 2702268 2655023
37327 2655023 710490 -2378402 -4642331 -4749925 -3169150 -1329510 -1529 1101061
37319 1101061 2347691 3437214 3767500 3143312 1913635 704718 133873 393773 939685
37310 939685 1009283 637807 611457 1158267 1458779 1026805 722661 1383783 2156355 1650576
37300 1650576 455171 720090 2869847 4457577 3292348 379720 -1576337 -1626127 -922223
37291 -922223 -196688 1117580 2945275 3583496 1846466 -817249 -1751728 -362183 1263765
37282 1263765 1147607 -244486 -1035403 -518520 263030 285306 -132455 -94773 519585 1079511
37272 1079511 1186430 983283 605433 -38623 -798896 -1079033 -436567 753977 1471628
37263 1471628 969379 -419895 -1430168 -1035096 431306 1585035 1563882 925888 693994
37254 693994 913084 669524 -677764 -2771079 -4581430 -5058447 -3783753 -1549885 6331
37245 6331 7529 -684418 -752134 -250692 -168864 -540695 -373487 506819 991751 489430 -115234
37234 -115234 93382 817427 1432180 1991204 2524589 2403163 1408911 559970 827718 1760338
37224 1760338 2325742 2316093 1913881 804114 -984602 -2201556 -1880111 -1090246 -1512412
37215 -1512412 -2709487 -2663295 -878359 964107 1622313 1678509 1836032 1653201 839602
37206 839602 295763 768816 1573626 1684789 1244089 1048981 1250204 1399846 1233296 772904
37196 772904 249097 362514 1769442 3744646 4355432 2798450 684114 76052 1066950
37187 1066950 2292173 3007949 3381831 3327624 2541321 1580049 1598660 2763891 3769925
37178 3769925 3167290 774498 -2080495 -3393999 -2112578 478680 1641091 226798
37170 226798 -1890158 -2363585 -1427430 -979154 -1444731 -1532480 -801000 -293636 -371074 -28435
37160 -28435 972730 1295605 372462 -273207 595383 1846511 1972550 1832717 3305154
37151 3305154 5947955 7245402 6105513 4076512 2723584 1638275 -115799 -2051323
37143 -2051323 -2988905 -2937151 -3016893 -3742822 -4348302 -3949052 -2749527 -1762309 -1564084 -1674176
37133 -1674176 -1305222 -555109 -435347 -1523843 -2982401 -3384860 -2350366 -849717 69658
37124 69658 354638 653552 1403278 2454683 3407646 4130205 4879421 5743808 6013087 4686644
37114 4686644 1995270 -210499 -396481 723417 1171696 382055 -344292 -132961 138541
37105 138541 -543463 -1577422 -1616761 -424266 1145733 2440141 3239533 3121543 1768172
37096 1768172 -111769 -1116664 -568554 980201 2550476 3411457 3180481 2104693 1178756
37087 1178756 1145344 1442448 1063442 373724 829291 2625513 3949131 3284835 1399803
37078 1399803 147323 185465 911149 1893164 3054283 3799084 3353535 2098192 1470801
37069 1470801 2247706 3719980 4754121 4829712 3813178 1732299 -593133 -1535119 -245333
37060 -245333 2069235 3304502 2774631 1640152 1126467 1225024 1385357 1549685 1808574
37051 1808574 1689986 770493 -285952 -390855 202946 -44983 -1684330 -3166055 -2876366
37042 -2876366 -1326344 -95928 654993 1972782 3707843 4266322 3157669 1991441
37034 1991441 2058072 2471847 1925889 962257 932357 1615237 1593374 549669 -415068 -547021
37024 -547021 -38683 1015109 2733962 4400488 4717701 3445610 1619327 -66140 -1857035
37015 -1857035 -3682201 -4633123 -4230331 -3138503 -2198417 -1763286 -2188842 -3606768 -4830152
37006 -4830152 -4091468 -1632362 5728 -717024 -2270680 -2510241 -1613273 -888413 -105145
36997 -105145 1688598 3512672 3193892 759825 -1207426 -1104213 -236370 -416275 -1284235
36988 -1284235 -1204348 224082 1763420 2191193 1470009 417245 -244180 -467366 -649133
36979 -649133 -881513 -800429 -426911 -501622 -1260808 -1531485 -184453 1963163 3091321
36970 3091321 2974846 3003318 3584195 3446069 2106201 1114861 1660719 2495639 1783551
36961 1783551 -80870 -1160653 -797235 -81293 185932 418171 1057131 1765598 2081197
36952 2081197 1925074 1278215 198562 -726960 -837329 -491262 -800968 -1934014 -2554260
36943 -2554260 -1544182 370422 1466694 1175876 633099 1035328 2052155 2269139 1024614
36934 1024614 -671095 -1288775 -549579 465494 903714 1115482 1732617 2518067 2884967
36925 2884967 3081896 3836618 4882805 4899014 3274679 1088684 -280503 -915727 -1928242
36916 -1928242 -3522780 -4406785 -3424104 -1191165 473421 620374 112041 286334 1147191
36907 1147191 1473543 609151 -618934 -1107427 -963651 -1098453 -1667077 -1775105 -815090
36898 -815090 632617 1529616 1482661 797863 -100231 -886668 -1304740 -1341854 -1225050 -943148
36888 -943148 -140294 1061498 1561551 404529 -1717625 -2975998 -2587903 -1653897 -1453753
36879 -1453753 -1747580 -1440406 -265111 1081765 2048608 2491815 2071121 472113 -1699968
36870 -1699968 -3224327 -3640028 -3453301 -2933765 -1872925 -772988 -792582 -1732351 -1512750
36861 -1512750 1040634 4005952 4564280 2668877 803704 502420 940189 931006 461574
36852 461574 -133976 -881806 -1453896 -1121386 -33259 673998 547295 322712 311872 -179270
36842 -179270 -1145247 -1326286 -440182 -227763 -1742174 -3222686 -2715576 -1515045 -2422521
36833 -2422521 -5177611 -6385900 -4246050 -891563 754066 375656 -616686 -1646574
36825 -1646574 -3044424 -4467531 -4767903 -3297444 -526547 2459835 4577389 5211984
36817 5211984 4631904 3728760 3017546 2196542 955961 -235483 -579715 120050 1342590
36808 1342590 2407320 2851883 2532365 1708754 905848 446280 183648 -228179 -941631
36799 -941631 -1812303 -2510969 -2755018 -2609188 -2461360 -2494179 -2396206 -1918106 -1417025 -1326298
36789 -1326298 -1333268 -794613 77985 191625 -1056703 -2879864 -3792142 -2988247 -1112113
36780 -1112113 137190 -466038 -2146894 -2684707 -1125270 782296 877079 -447622 -1117051
36771 -1117051 -694060 -760650 -1882708 -2415370 -1146979 786617 1772369 1857480 1740690
36762 1740690 1224221 291256 323415 2228321 4306028 4157273 2209771 1138531 1908105
36753 1908105 2662687 1946803 856245 939841 1617383 1125245 -838502 -2710779 -3004259
36744 -3004259 -1799210 -428124 -166965 -1101011 -2057253 -1904439 -953785 -576760 -1386742
36735 -1386742 -2520511 -2967889 -2829418 -2777412 -2956744 -3039119 -2840068 -2272897 -1206131
36726 -1206131 -49931 59604 -1395546 -3128828 -3310104 -1939943 -776782 -703658 -519214
36717 -519214 915929 2576134 2651393 1260369 91259 -456974 -1821418 -4380706 -5889788
$$ [...]
##END NTUPLES=NMR SPECTRUM
##END=
