##TITLE=31Pdec_LR-683B-CS2-CHL
 CDCl3, 24 sc
 2.3.2020
##JCAMPDX= 6.0         $$ Bruker NMR JCAMP-DX V2.0
##DATA TYPE= NMR SPECTRUM
##DATA CLASS= NTUPLES
##ORIGIN= UXNMR, Bruker Analytische Messtechnik GmbH
##OWNER= root
$$ XWIN-NMR		Version 3.5
$$ Mon Mar  2 14:14:56 2020 Russian Standard Time (UT+4h)  she@DPX200
##.OBSERVE FREQUENCY= 81.013821
##.OBSERVE NUCLEUS= ^31P
##.ACQUISITION MODE= SIMULTANEOUS
##.ACQUISITION SCHEME= undefined
##.AVERAGES= 24
##.DIGITISER RES= 17
##SPECTROMETER/DATA SYSTEM= spect
##.PULSE SEQUENCE= zgpg30
##.SOLVENT NAME= Acetone
##.SHIFT REFERENCE= (INTERNAL, Acetone, 0, 182.463)
##AUDIT TRAIL= $$ (NUMBER, WHEN, WHO, WHERE, WHAT)
$$ ##TITLE= Audit trail, XWIN-NMR		Version 3.5
$$ ##JCAMPDX= 5.01
$$ ##ORIGIN= Bruker BioSpin GmbH
$$ ##OWNER= she
$$ F:/spectra/data/she/nmr/P31/1/pdata/1/auditp.txt
$$ ##AUDIT TRAIL=  $$ (NUMBER, WHEN, WHO, WHERE, WHAT)
(   1,<2020-03-02 14:13:03.62 +0400>,<she>,<DPX200>,
      <created by zg, POWCHK disabled, PULCHK disabled
       configuration hash MD5:
       00 E9 B6 7A A2 85 ED C7 34 08 36 98 17 FE 4E 26
       data hash MD5: 32K
       9A 01 09 C5 EC 6F 0E A4 FA 8A 48 5C F0 48 D3 2B>)
(   2,<2020-03-02 14:13:06.92 +0400>,<she>,<DPX200>,
      <Start of raw data processing
       efp BC_mod = 2 LB = 1 FT_mod = 6 PKNL = 1 PHC0 = -1504.738 PHC1 = 671.0013 SI = 64K 
       data hash MD5: 64K
       7D 50 28 1B 68 1F 07 1F CF 79 5E 9B FF 07 29 4C>)
(   3,<2020-03-02 14:13:40.26 +0400>,<she>,<DPX200>,
      <pk PHC0 = -1.781574 PHC1 = 19.4 
       data hash MD5: 64K
       75 C0 31 0B 6B 14 AC 27 A2 9C BE 6E 2A 25 FB D4>)
(   4,<2020-03-02 14:13:43.68 +0400>,<she>,<DPX200>,
      <abs ABSG = 5 
       data hash MD5: 64K
       FF D7 3B 98 28 F1 94 C1 6C 0C 83 7B 19 93 83 A0>)
$$ ##END=
$$ 
$$ hash MD5
$$ 44 21 73 B1 C8 B2 B6 24 2C 77 02 C6 46 08 3A 6B
##$RELAX= 
##$RELAX= 
##$RELAX= 
##$RELAX= 
##$RELAX= 
##$RELAX= 
##$RELAX= 
##$RELAX= 
$$ Bruker specific parameters
$$ --------------------------
##$DU= <F:/spectra>
##$EXPNO= 1
##$NAME= <P31>
##$PROCNO= 1
##$TYPE= <nmr>
##$USER= <she>
##$AMP= (0..31)
100 100 100 100 100 100 100 100 100 100 100 100 100 100 100 100 100 100 
100 100 100 100 100 100 100 100 100 100 100 100 100 100 
##$AQSEQ= 0
##$AQ_mod= 1
##$AUNM= <au_zg>
##$AUTOPOS= <>
##$BF1= 81.014009
##$BF2= 200.13
##$BF3= 200.13
##$BF4= 200.13
##$BF5= 200.13
##$BF6= 200.13
##$BF7= 200.13
##$BF8= 200.13
##$BYTORDA= 1
##$CFDGTYP= 0
##$CFRGTYP= 5
##$CHEMSTR= <none>
##$CNST= (0..31)
1 1 145 1 1 1 1 1 1 1 1 1 1 1 1 1 1 1 1 1 1 1 1 1 1 1 1 1 1 1 1 1 
##$CPDPRG= <waltz16>
##$CPDPRG1= <>
##$CPDPRG2= <waltz16>
##$CPDPRG3= <>
##$CPDPRG4= <mlev>
##$CPDPRG5= <mlev>
##$CPDPRG6= <mlev>
##$CPDPRG7= <mlev>
##$CPDPRG8= <mlev>
##$CPDPRGB= <>
##$CPDPRGT= <>
##$D= (0..31)
0 1 0 0 0 0 0 0 0 0 0 0.03 2e-05 3e-06 0 0 0 0 0 0 0 0 0 0 0 0 0 0 0 0 
0 0 
##$DATE= 1583143983
##$DBL= (0..7)
120 120 120 11 120 120 24 19 
##$DBP= (0..7)
150 150 150 150 150 150 150 150 
##$DBP07= 0
##$DBPNAM0= <>
##$DBPNAM1= <>
$$ [...]
##$SUBNAM3= <"">
##$SUBNAM4= <"">
##$SUBNAM5= <"">
##$SUBNAM6= <"">
##$SUBNAM7= <"">
##$SUBNAM8= <"">
##$SUBNAM9= <"">
##$SW= 369.568048894756
##$SWIBOX= (0..15)
0 1 3 0 0 0 0 0 0 0 0 0 0 0 0 0 
##$SW_h= 29940.119760479
##$TD= 32768
##$TD0= 1
##$TE= 0
##$TE2= 300
##$TE3= 300
##$TEG= 300
##$TL= (0..7)
0 120 53 12 22 120 120 120 
##$TP= (0..7)
150 150 150 150 150 150 150 150 
##$TP07= 0
##$TPNAME0= <>
##$TPNAME1= <>
##$TPNAME2= <>
##$TPNAME3= <>
##$TPNAME4= <>
##$TPNAME5= <>
##$TPNAME6= <>
##$TPNAME7= <>
##$TPOAL= (0..7)
0.5 0.5 0.5 0.5 0.5 0.5 0.5 0.5 
##$TPOFFS= (0..7)
0 0 0 0 0 0 0 0 
##$TUNHIN= 0
##$TUNHOUT= 0
##$TUNXOUT= 0
##$USERA1= <user>
##$USERA2= <user>
##$USERA3= <user>
##$USERA4= <user>
##$USERA5= <user>
##$V9= 5
##$VALIST= <valist>
##$VCLIST= <CCCCCCCCCCCCCCC>
##$VD= 0
##$VDLIST= <DDDDDDDDDDDDDDD>
##$VPLIST= <PPPPPPPPPPPPPPP>
##$VTLIST= <TTTTTTTTTTTTTTT>
##$WBST= 1024
##$WBSW= 4
##$XGAIN= (0..3)
0 0 0 0 
##$XL= 0
##$YL= 0
##$YMAX_a= 19877
##$YMIN_a= -15250
##$ZGOPTNS= <>
##$ZL1= 120
##$ZL2= 120
##$ZL3= 120
##$ZL4= 120
##$ABSF1= 182.463
##$ABSF2= -187.1042
##$ABSG= 5
##$ABSL= 3
##$ALPHA= 0
##$AQORDER= 0
##$ASSFAC= 0
##$ASSFACI= 0
##$ASSFACX= 0
##$ASSWID= 0
##$AUNMP= <proc_1d>
##$AZFE= 0.1
##$AZFW= 0.5
##$BCFW= 0
##$BC_mod= 2
##$BYTORDP= 0
##$COROFFS= 0
##$CY= -3
##$DATMOD= 1
##$DC= 0
##$DFILT= <>
##$DTYPP= 0
##$F1P= 0
##$F2P= 0
##$FCOR= 1
##$FTSIZE= 65536
##$FT_mod= 6
##$GAMMA= 0
##$GB= 0
##$INTBC= 1
##$INTSCL= 5.30512e-09
##$ISEN= 30
##$LB= 1
##$LEV0= 0
##$LPBIN= 0
##$MAXI= 10000
##$MC2= 0
##$MEAN= 0
##$ME_mod= 0
##$MI= 50
##$NCOEF= 0
##$NC_proc= -8
##$NLEV= 6
##$NOISF1= 182.463
##$NOISF2= 159.3651
##$NSP= 0
##$NTH_PI= 0
##$NZP= 0
##$OFFSET= 182.463
##$PC= 4
##$PHC0= -1506.52
##$PHC1= 690.4013
##$PH_mod= 1
##$PKNL= yes
##$PPARMOD= 0
##$PSCAL= 0
##$PSIGN= 0
##$REVERSE= no
##$SF= 81.0140089999434
##$SI= 65536
##$SIGF1= 159.3651
##$SIGF2= -187.1042
##$SINO= 113.3802
##$SIOLD= 16384
##$SREGLST= <1H.CDCl3>
##$SSB= 0
##$STSI= 65536
##$STSR= 0
##$SW_p= 29940.119760479
##$SYMM= 0
##$S_DEV= 0
##$TDeff= 32768
##$TDoff= 0
##$TI= <>
##$TILT= no
##$TM1= 0
##$TM2= 0
##$TOPLEV= 0
##$USERP1= <user>
##$USERP2= <user>
##$USERP3= <user>
##$USERP4= <user>
##$USERP5= <user>
##$WDW= 1
##$XDIM= 65536
##$YMAX_p= 511042525
##$YMIN_p= -119471623
$$ End of Bruker specific parameters
$$ ---------------------------------
##NTUPLES= NMR SPECTRUM
##VAR_NAME=  FREQUENCY,     SPECTRUM/REAL,   SPECTRUM/IMAG
##SYMBOL=    X,             R,               I
##VAR_TYPE=  INDEPENDENT,   DEPENDENT,       DEPENDENT
##VAR_FORM=  AFFN,          ASDF,            ASDF
##VAR_DIM=   65536,         65536,           65536
##UNITS=     HZ,            ARBITRARY UNITS, ARBITRARY UNITS
##FACTOR=    0.456856943014862, 1,           1
##FIRST=     14782.0589164792, 0,            0
##LAST=      -15158.0608439998, 0,           0
##MIN=       -15158.0608439998, -119471623,  0
##MAX=       14782.0589164792, 511042525,    0
$$ Real data points
##PAGE= N=1
##DATA TABLE= (X++(R..R)), XYDATA
$$ [...]
46482F92435j585677M000310O389688N143332J586731j668680k483440j681978
46474A0392721j743929l015305l961457m414890m695458k665349K873472O717755
46466e12440K471417o267522q317492q19710O127867M875565J146553L013620
46458A717858P326215O210237R88185p12945J772543K071076j486154l783831
46450A4103184k813750k662603m846622m562970J048038O748933N412778k726221
46442I700767j0107872r826936k267242N500474O964003L050136Q5499P73627
46434C872456J298554q88343k026060R59411L865463J896810j531201k67154L583541
46425A0763477K686269l197725o610107l889824P82040L199447L430467J804705
$$ plain form
46482 692435 -893242 3107068 9496756 14640088 16226819 14558139 12074699 10392721
46474 10392721 8648792 5633487 1672030 -2742860 -7438318 -10103667 -7230195 -512440
46466 -512440 1958977 -4308545 -12626037 -13445747 -7317880 -2442315 -1295762 1717858
46458 1717858 9044073 15254310 16242495 15529550 17302093 19373169 17887015 14103184
46450 14103184 11289434 8626831 3780209 -782761 265277 7014210 12426988 9700767
46442 9700767 -407105 -10234041 -12501283 -7000809 -36806 3013330 3098829 3872456
46434 3872456 5171010 4282667 2256607 3216018 7081481 8978291 7447090 7179936 10763477
46425 10763477 13449746 10252021 3641914 -247910 534130 3733577 7164044 8968749
46417H968749j805603l869819p3348O362240O942662L07575n324437m428149j074834
46408F005036m45482j136620j58206J179526J047151R92566J730355N50973k886625
46399F878674l800369J39228L882533K458429j745619m025026m509804m975763
46391e697717l657994O19986L666552J892449p87493J040938M660340L134616
46383D871677l239820p049708m640502O8631K667826K838159J397533j306835
46375d393039l001870q05630L560845M494995J74640m491210m474441q01125J990458
46366g746377J934212R63333J665655M335183O548852N240709J95217m669255
46358H467529n128672j769353P07193k38986j609114O62328N361743O786787K272326
$$ plain form
46417 8968749 7163146 3293327 3219979 9582219 16524881 16832456 11508019 7079870 6005036
46408 6005036 5559554 4422934 4264728 5444254 6491405 7483971 9214326 9765299 6878674
46399 6878674 3078305 3217533 7100066 9558495 7812876 3787850 -721954 -5697717
46391 -5697717 -9355711 -8735725 -5069173 -3176724 -3964217 -2923279 1737061 4871677
46383 4871677 1631857 -5417851 -10058353 -9989722 -7321896 -4483737 -3086204 -4393039
46375 -4393039 -7394909 -8200539 -4639694 -144699 29941 -4461269 -8935710 -9736835 -7746377
46366 -7746377 -5812165 -4848832 -3183177 1152006 7700858 12941567 13136784 8467529
46358 8467529 3338857 1569504 2276697 2037711 428597 1090925 6452668 13239455 15511781
46349A5511781l635124m875217k205991j794054n214484o193329m41345O416708
46341b431055O547500J731659k17312J339446l11523n868784o796054Q55717Q544569
46332C394163P014884j080321o611013o147795k317452K641185O657551N646272
46324I197474j061329o503151m444677J013745J358606l454658n699891j874405
46316a1468286L480513N444688L774219O51615j232949N51265M398281M101354
46308I700700k323170o899089k296634N540966N222346k006384l721370L909492
46300G126857J0053907O022536l006966q008727q061819o226312k130670L930762
46292c00432O243885R72910o269182p280291k386042J575358J489202J03349P192
$$ plain form
46349 15511781 11876657 7001440 4795449 3001395 -2213089 -8406418 -8847763 -2431055
46341 -2431055 4116445 5848104 5630792 6970238 6658715 789931 -6006123 -5150406 3394163
46332 3394163 10409047 9328726 2717713 -3430082 -5747534 -3106349 3551202 9197474
46324 9197474 8136145 1632994 -2811683 -1797938 -439332 -3893990 -9593881 -11468286
46316 -11468286 -7987773 -2543085 1231134 1882749 649800 1201065 5599346 9700700
46308 9700700 7377530 478441 -1818193 3722773 8945119 6938735 3217365 7126857
46300 7126857 17180764 23203300 20196334 12187607 4125788 -2100524 -4231194 -300432
46292 -300432 5943453 6916363 647181 -6633110 -9019152 -7443794 -5954592 -5851243 -5844051
46283e844051J092355K791757M195085L029710j403616n340061m361910O27260
46275e213471M378787L599839k19690l436231l561079p72426K281762L065454
46267A22945K176573K096271K812088J671265j799564m492989m263099k291543
46259c968053N6893K646170L944674J957093j084076q64553Q06785k413244q921000
46250g839311p887660L581589J1868977N203914p433607q453215K421244Q891047
46242C52978L218305m518917m692307j370835j375938k127905J211884N484446
46234c818289N508428L635769M335522M748959K78037m707135k566378L451566
46226A0866479K455384o185954j0136840l042961M974865K896188m214482l759955
$$ plain form
46283 -5844051 -4751696 -1959939 2235146 5264856 3861240 -1478821 -5840731 -5213471
46275 -5213471 -834684 2765155 2545465 -890766 -4451845 -5224271 -2942509 122945
46267 122945 2299518 4395789 7207877 8879142 7079578 2586589 -1676510 -3968053
46259 -3968053 -3911160 -1264990 2679684 4636777 3552701 2688148 3494933 1081689 -7839311
46250 -7839311 -15726971 -12145382 -276405 4927509 -2506098 -10959313 -8538069 352978
46242 352978 3571283 -947634 -5639941 -7010776 -8386714 -10514619 -9302735 -3818289
46234 -3818289 1690139 5325908 9661430 14410389 14688426 9981291 7414913 10866479
46226 10866479 13321863 7135909 -3000931 -6043892 -1069027 1827161 -2387321 -6147276
46218f147276M683560R745000O183571P15824j170834k966474p479731r388678
46210e825038m449065J427682P17743l490919k887936K244441M459686K310551
46202e492855J538963L184830J422580m486370o673604j537309L402030J494464
46194g147271k672253k094238J059551J296795Q12130M474484Q352534M598506
46186H680238m172994o856095o60948M844621K816016j766231k144974N0999N08010
46177A298642O89016L357704M973562P27323n632460n320171K213073O934340
46169I241029J536939q402350j1547759n002827L204242N184835K229608P99718
46161b756565K719117L610680O32880k880808k674923J1984Q26918r32279j964464
$$ plain form
46218 -6147276 -1463716 8281284 14464855 15180679 14009845 11043371 3563640 -5825038
46210 -5825038 -10274103 -8846421 -8128678 -11619597 -14507533 -12263092 -7803406 -5492855
46202 -5492855 -3953892 -769062 653518 -3832852 -10506456 -12043765 -8641735 -7147271
46194 -7147271 -9819524 -11913762 -10854211 -9557416 -8745286 -4270802 4081732 8680238
46186 8680238 4507244 -2348851 -3009799 1834822 4650838 2884607 739633 790632 1298642
46177 1298642 1987658 5345362 10318924 11046247 5413787 93616 2306689 9241029
46169 9241029 10777968 2375618 -9172141 -14174968 -10970726 -5785891 -3556283 -2756565
46161 -2756565 -37448 3573232 4206112 1325304 -1349619 -1337635 -510717 -1442996 -3407460
46152c407460o33527J004199J186937R74588J744273K886212L250830K884474
46144I890526K248782J224764l81799k477188m851382o476446n353004j121352
46136g297099K895508L060057N93725K34466L371751N752161L132849l437449
46128H305969r180139j0233595n915637J256563O756240P385238M372405J402986
46120D150030l93259k702983n301811n165225j750017Q69382j93508j937812J53429
46111a2271774N324865Q522326O886992K413894j116489j667211r4073O47023
46103H645553j638531n300579o291435l622786p12734K40010J636308N219226
46095a824968P140395L284045k788299l312171K534140O838185L585299l977325
$$ plain form
46152 -3407460 -4040987 -3036788 -1849851 -875263 869010 3755222 7006052 9890526
46144 9890526 12139308 13364072 12982273 10505085 5653703 -822743 -6175747 -7297099
46136 -7297099 -4401591 -1341534 -747809 -513343 2858408 8610569 11743418 8305969
46128 8305969 -874170 -11107765 -17023402 -15766839 -9010599 -1625361 2747044 4150030
46120 4150030 3756771 1053788 -4248023 -9413248 -11163265 -10293883 -10487391 -12425203 -12271774
46111 -12271774 -6946909 1575417 8462409 10876303 9759814 8092603 7998530 8645553
46103 8645553 7007022 1706443 -4584992 -8207778 -8920512 -8680502 -7044194 -1824968
46095 -1824968 5315427 8599472 5811173 2499002 5033142 11871327 15456626 11479301
46087A1479301q680617p714541k929681L032665P215517O134845l23235o348257
46079A865997n887075l00079L529232K322704o42346j975320k588183l729207
46071g404277l401232n14135J115577j933073n629787k910887N117616Q949089
46063f611109L678357l710439m084674J457211M535438K079649n25707J343858
46055a837416N263863O603105N034527L100628J185032k459330p511390j0338823
46047i59804p729404q60602N088766N552697J114411k908049k053235K556104
46039a99116N938957M999974J137771k276383l039893p67085L424812O972681
46031A6191718P025073K761292l566394q031287p572472k336963L528788M663426
$$ plain form
46087 11479301 2798684 -4915857 -7845538 -4812873 2402644 8537489 8214254 1865997
46079 1865997 -4021078 -4321157 -791925 1530779 888433 -1086887 -3675070 -7404277
46071 -7404277 -10805509 -11319644 -10204067 -12137140 -17766927 -20677814 -15560198 -6611109
46063 -6611109 -2932752 -6643191 -10727865 -9270654 -4735216 -2655567 -3181274 -1837416
46055 -1837416 3426447 10029552 15064079 18164707 19349739 16890409 9379019 -959804
46047 -959804 -8689208 -9549810 -4461044 1091653 2206064 -701985 -2755220 -199116
46039 -199116 5739841 10739815 11877586 9601203 6561310 5794225 9219037 16191718
46031 16191718 23216791 25978083 22411689 14380402 6807930 4470967 7999755 12663181
46023A2663181k25838o524211q524030n127043M63728M795749N754978K433141
46015E709655l077768n456437j848916L389125M096740J218070P19069L284307
46007H033845L228269j123301l722533r68553J693540j049273m650770j588415
45999a47191N922688Q384299K790770l929283n666789m139370l267622k977587
45991c030085k078658k303513m850262o062654j717689N501352P810417K487337
45983d243755l837294l517293K187887N171469J560614l462018l203686J812644
45975g531432N673344N244359K581955J71230j927931l653083l557523j536263
45967d535344j17052j132672l056572l254266j306841J251188L096412L738531
$$ plain form
46023 12663181 12437343 5913132 -2610898 -7737941 -7274213 -2478464 3276514 5709655
46015 5709655 2631887 -2824550 -4673466 -1284341 2812399 4030469 4749538 8033845
46007 8033845 11262114 10138813 6416280 5447727 7141267 6091994 1441224 -147191
45999 -147191 5775497 14159796 16950566 13021283 7354494 3215124 -52498 -3030085
45991 -3030085 -5108743 -7412256 -12262518 -18325172 -20042861 -14541509 -6731092 -4243755
45983 -4243755 -8081049 -11598342 -9410455 -4238986 -2678372 -6140390 -9344076 -7531432
45975 -7531432 -1858088 3386271 5968226 6139456 4211525 558442 -2999081 -4535344
45967 -4535344 -4652396 -5785068 -8841640 -12095906 -13402747 -12151559 -9055147 -5316616
45959e316616K986702Q85614k003467m249044l616941O98497N103927M048860
45951a462468k071370n312569r01111M569886K544062l386629k394276N904249
45943b510226J0136569N149492p28400q34149n87705n216816p938265j016597
45935c546097R355635J1038518L702412k774642m030277m017355m352619k214534
45927C161041J514746K201503m2346p32416J82187j176632l577972j900584K161153
45918A790680J049248n133340o603197R29554Q734385P731643N40713m561357
45910D478329m749739k160023J654504M919899M011627j774180p126712o853994
45902g600289k349009J370828K150017J412662J143586K256784L579506K002018
$$ plain form
45959 -5316616 -2329914 -1444300 -3447767 -7696811 -11313752 -10615255 -5511328 -1462468
45951 -1462468 -3533838 -8846407 -9747518 -5177632 -2633570 -6020199 -8414475 -2510226
45943 -2510226 7626343 12775835 12047435 11213286 10625581 5408765 -2529500 -3546097
45935 -3546097 5809538 16848056 20550468 17775826 13745549 9728194 5375575 3161041
45927 3161041 4675787 6877290 6834944 6102528 6284715 5108083 1530111 -370473 1790680
45918 1790680 2839928 -2293412 -8896609 -7967055 767330 8498973 9039686 4478329
45910 4478329 -271410 -2431433 -776929 4142970 8154597 6380417 -746295 -7600289
45902 -7600289 -9949298 -8578470 -6428453 -5015791 -3872205 -1615421 1964085 3966103
45894C966103l044275o110079k032074N104777O323342R58852k736187q81548
45886A548911J574340J528072K339997M312463J712672n303820p057860R6029
45878G50804N588793J120406n298966l088371K783378J236233m754558l114447
45870d776728O208300J0882128O007515l63221k366866l279865m981834l311915
45862D017514J977060L781006r13498n586787n076663l275606m635470n794138
45854a5506582j878284M760707Q072321O401100K443286j189090k733777j341500
45846i71819N72894j049899n249186n429245J407417R092653R734125L395234
45838A1502174l210018n098737l025121r93486j904853m355891l537123K327972
$$ plain form
45894 3966103 921828 -5188251 -7220325 -2115548 4207794 5166646 2430459 1548911
45886 1548911 3123251 4651323 6991320 11303783 13016455 7712635 654775 750804
45878 750804 6339597 7460003 2161037 -927334 1856044 3092277 -1662281 -4776728
45870 -4776728 1431572 12313700 18321215 17957994 15591128 12311263 7329429 4017514
45862 4017514 5994574 9775580 8862082 3275295 -1801368 -5076974 -9712444 -15506582
45854 -15506582 -17384866 -12624159 -4551838 1849262 4292548 3103458 369681 -971819
45846 -971819 -398925 -1448824 -6698010 -12127255 -10719838 -1627185 8106940 11502174
45838 11502174 8292156 3193419 168298 -825188 -2730041 -7085932 -10623055 -8295083
45830h295083P492657N131746k369767n697512j770969K369249J014917k002077
45822d126839n37678M457148P598122O606853K809233j859126m391616j441685
45814I114412N310763Q469163L812265l824087p499417o890924n715112m765866
45806a988803k846629j088260q15886j4125K846826M422689J442342k777580k763734
45797c583160M14717J098277j873485m167982l102736n5110L399258O149470N349585
45788C628834l25337n705846l832593L994209R014002O607604R83712k821417
45780A1543168m952924o231474m091923K471361Q343050P672573J550267l735135
45772A2568963m719752l625314l827981n351232n387668j962893L538922P522971
$$ plain form
45830 -8295083 -802426 4329320 1959553 -3737959 -5508928 -3139679 -2124762 -4126839
45822 -4126839 -4664517 -207369 7390753 13997606 16806839 14947713 10556097 9114412
45814 9114412 14425175 22894338 26706603 22882516 15383099 8492175 2777063 -1988803
45806 -1988803 -4835432 -5923692 -6739578 -6753703 -3906877 515812 1958154 -819426 -3583160
45797 -3583160 -3168443 -2070166 -3943651 -8111633 -11214369 -11269479 -7870221 -1720751 3628834
45788 3628834 3303497 -2402349 -6234942 -2240733 6773269 13380873 14364585 11543168
45780 11543168 6590244 358770 -3733153 -1261792 7081258 14753831 16304098 12568963
45772 12568963 7849211 4223897 395916 -4955316 -10342984 -12305877 -8766955 -1243984
45764a243984P771681N093449J175403l178504o263016m759315J730211P436653
45756G762578O286123J41218l674646k750730j791688l572026m072290J02978
45748a568483M768337L620961k337331n842904k705182L910394Q207165P555006
45740A5607963L369984j279570m067552m538343l562640k008985n99153m87800
45732B433904k062425l166004j057855L152621M818527J882470k101145l072845
45724H27248j870286j733298k739262k392457n03503M55312j98226j29059J968075
45715f315456M052687L904225K417423J976278K885015L179707J421441j720264
45707A1801056m444107n256399l587651k46096K434275K196984l93584j787872
$$ plain form
45764 -1243984 6527697 11621146 12796549 9618045 3355029 -1404286 325925 7762578
45756 7762578 14048701 14189919 10515273 7764543 5972855 2400829 -1671461 -1568483
45748 -1568483 3199854 6820815 4483484 -1359420 -4064602 -154208 8052957 15607963
45740 15607963 18977947 17698377 13630825 9092482 5529842 3520857 2921704 2433904
45732 2433904 371479 -2794525 -3852380 -699759 4118768 6001238 3900093 827248
45724 827248 -1043038 -2776336 -5515598 -7908055 -8411558 -7956246 -8154472 -8283531 -6315456
45715 -6315456 -2262769 1641456 4058879 6035157 8920172 12099879 13521320 11801056
45707 11801056 7356949 2100550 -1487101 -1733197 701078 2898062 2504478 716606
45699G16606L91494L527241K560723l155966p951027o422451j23093M614410M349555
45690a492508J356071p48888j229314j359813j585932r42224J546242N466569
45682A010203Q568144Q129650L823244j310691l977998l992332l207726k455033
45674F587461j689116j748528k940987k970628P4476L403191K531115j505746
45666A741238k923191j2945K178850J08187k591580j155480K994633N189949M367818
45657I897479K601931N62410j931497k895273m54474L022842L256962l23426m776916
45648H960038p958811q812700n401314K150777P977419N817327j741437n381012
45640d389713j624003K798820J614068k020318j723439J657316K038679j631517
$$ plain form
45699 716606 1108100 4635341 7196064 4040098 -3910929 -10333380 -10456473 -5842063 -1492508
45690 -1492508 -136437 -885325 -2114639 -3474452 -5060384 -6002608 -4456366 1010203
45682 1010203 9578347 17707997 21531241 20220550 16242552 12250220 9042494 6587461
45674 6587461 4898345 3149817 208830 -2761798 -2687322 715869 3246984 1741238
45666 1741238 -1181953 -1194898 983952 1092139 -1499441 -2654921 339712 5529661 9897479
45657 9897479 12499410 13061820 11130323 8235050 7780576 10803418 14060380 13736954 8960038
45648 8960038 1001227 -7811473 -13212787 -11062010 -3084591 2732736 991299 -4389713
45640 -4389713 -6013716 -3214896 -1600828 -3621146 -5344585 -3687269 -1648590 -3280107
45632c280107l696041r46381K184654M24313m037033m240464J656180P398013
45624d536866O755427J463416j659125K61747L468512L504991K13966l875190
45616E596878o659192o530487k718564K345535M138636J878718n7737P61215M78619
45607g66379l987784p718018m098715M205903Q037394M677240L81305n10040j074602
45598h53696m050225n943822l135062J652020L581516K451255J221645J197712
45590c878657K157079L986622N044396K454727k802390n099174k073215J000983
45582G90371p94943m111664l197050J64201k27013m054499m396096J370038P357116
45573g099539P411299K534104j644852j349310K310955M277338J07459p690197
$$ plain form
45632 -3280107 -6976148 -7922529 -5737875 -5313562 -9350595 -13591059 -11934879 -4536866
45624 -4536866 2218561 3681977 2022852 2284599 5753111 9258102 9472068 5596878
45616 5596878 -1062314 -7592801 -10311365 -7965830 -3827194 -1948476 -2006213 -1244998 -766379
45607 -766379 -4754163 -12472181 -16570896 -12364993 -4327599 349641 730946 220906 -853696
45598 -853696 -4903921 -10847743 -13982805 -12330785 -8749269 -6298014 -5076369 -3878657
45590 -3878657 -1721578 2265044 7309440 9764167 6961777 1862603 -210612 790371
45582 790371 -4572 -4116236 -7313286 -7149085 -7376098 -11430597 -15826693 -14456655 -7099539
45573 -7099539 311760 2845864 1201012 -148298 2162657 6439995 6547454 -1142743
45565a142743j0056550k413695P345170Q195392J269937k427256R09326L128351
45557D807932j056894m850419j135287N073108M590235j211617l321675J62201
45549C057584K012592j604344n604995m992136j810398K53208J951443M628848
45541b108198N141404L54117n924741o467088o31877M394637L315919q85329k427134
45532e238290o88071Q62293J027886J563207K411520J203662j692432k223704
45524b773929J117750M022546K273328k290730n048841m878018l303838k93751
45516a1175483M171495O626310M095370K37823J140726N459343N822228P58195
45508A7136007k472897N34807M352804K529941k969718o238227o031035m469246
$$ plain form
45565 -1142743 -11199293 -13612988 -6267818 1927574 3197511 770255 1679581 4807932
45557 4807932 3751038 -1099381 -2234668 2838440 7428675 6217058 2895383 3057584
45549 3057584 5070176 3465832 -2139163 -7131299 -8941697 -8688489 -6737046 -2108198
45541 -2108198 3033206 3387323 -2537418 -9004506 -9636383 -5241746 -1925827 -2811156 -5238290
45532 -5238290 -5926361 -5064068 -4036182 -2472975 -61455 1142207 -550225 -2773929
45524 -2773929 -1656179 2366367 4639695 2348965 -2699876 -7577894 -10881732 -11175483
45516 -11175483 -7003988 -377678 3717692 3955515 5096241 10555584 16377812 17136007
45508 17136007 14663110 15197917 19550721 22080662 19110944 12872717 6841682 2372436
45500B372436j831874J492475J981225j807538m585631j548547L065696K101729
45492A239971k560023k868827J806760L436025j316643n600444l291786K372439
45484f782528N230549M871675M155155L194737Q65018j399339j927368k065940
45476F141959l203022l428537j062371J311483N49158j765266k153228j231439
45468d841263k008027l703594k602107J373744M271262M758851N780960P945437
45460A0975263O698964l07253p321944p121213j207041K344451N45073j389097
45452C217203j2597K01539m521080q257172l110253O665974Q036874k061339j0792555
45443a0633406o641569N463703J2539344J0306178L795503l124443r231058j0655000
$$ plain form
45500 2372436 540562 2033037 4014262 2206724 -2378907 -3927454 -861758 1239971
45492 1239971 -1320052 -4188879 -2382119 1053906 -262737 -5863181 -9154967 -6782528
45484 -6782528 -1551979 3319696 7474851 10669588 11534606 10135267 8207899 6141959
45476 6141959 2938937 -489600 -1551971 -240488 308670 -1456596 -3609824 -4841263
45468 -4841263 -6849290 -10552884 -13154991 -11781247 -7509985 -2751134 3029826 10975263
45460 10975263 17674227 17366974 10045030 2923817 1716776 4061227 4606300 3217203
45452 3217203 3204606 3406145 -1114935 -9372107 -12482360 -5816386 2220488 159149 -10633406
45443 -10633406 -17274975 -11811272 728072 11034250 14829753 11705310 2474252 -8180748
45435h180748m717013K401396K192468k561289j640354M940435N811029k361957
45427d116033p802430k300255N425201M224926k059319k844174J616503L218702
45419d636879R73393M37865J661525j12583l639187l165940L68051R37735m98525
45410g674545K546638Q287226P058376k151192q068318m205481K106337K999147
45402H98188J072928N93698j189725n445334m752195M681170J2316329P088879
45394A5263938m359151o578817J512024O531467K496503j856069O5431K251637
45386A5326963j694842p060675o591855k346756m78444j05987L678487R386228
45378A0113119J0609313O359201J807019q88498m503548q626947p843241j195091
$$ plain form
45435 -8180748 -12897761 -10496365 -8303897 -10865186 -12505540 -7565105 -1754076 -4116033
45427 -4116033 -11918463 -14218718 -8793517 -4568591 -6627910 -9472084 -7855581 -4636879
45419 -4636879 -3663486 -3225621 -1564096 -1676679 -5315866 -8481806 -8113755 -7176020 -7674545
45410 -7674545 -5127907 3159319 10217695 8066503 -1815 -4207296 -2100959 898188
45402 898188 1971116 2564814 1375089 -4070245 -8822440 -4141270 8175059 15263938
45394 15263938 10904787 4325970 5837994 12369461 14865964 13009895 13075326 15326963
45386 15326963 13632121 6571446 -20409 -2367165 -2845609 -2951596 726891 10113119
45378 10113119 20722432 27081633 28888652 28000154 23496606 14869659 7026418 5831327
45370E831327L897288K231679q10069J796088O273442L419090n793044j0140734
45362F705067m941037R31503r17331o030596n583206m26631K025570N44316K02807
45353g489538J926452J646695l30703J304806O581079Q306486L296023k639673
45345A2601627m448908m629329n907594n118597l01673L299935J457479r13275
45337c960335K316179P515107O733333J84107n351405p367285p909482n812059
45329a3651840J289077Q567628Q168069J924015m96915K777983L135432k759659
45321H953790o080130n38050O282725M549859k612102m905113o79050K619813
45313G591742J162366j086392n18480J151742J003645j243071m291875o360800
$$ plain form
45370 5831327 9728615 11960294 11150225 12946313 19219755 22638845 16845801 6705067
45362 6705067 1764030 2695533 1778202 -4252394 -9835600 -10262231 -8236661 -7692345 -7489538
45353 -7489538 -5563086 -3916391 -4247094 -2942288 3638791 11945277 15241300 12601627
45345 12601627 8152719 3523390 -2384204 -7502801 -7804474 -4504539 -3047060 -3960335
45337 -3960335 -1644156 5870951 12604284 12788391 7436986 69701 -7839781 -13651840
45329 -13651840 -12362763 -3795135 4372934 6296949 5800034 8578017 11713449 8953790
45321 8953790 2873660 2335610 8618335 13168194 10556092 5650979 4971929 7591742
45313 7591742 8754108 7667716 7149236 8300978 9304623 8061552 3769677 -2591123
45305b591123n207019n07486M171090N012280K862234J392346J507617J141337
45297G781276l89110j661400k245910k961815l441893k658410j262455l47316
45289g187033J008443L616342N161427L438397J042782J814524L813144J863103
45281A4571129l222194m831293j113006J737229m91749l443381j975547J315258
45273B546446J065628j721768k033463L27417J006429p83734r06263K250626M620380
45264F371698K765679r92950k474156j691638j943560m255230n543736k556905
45256a0320798L774940Q619192P864744K378214k750813l483864q02136J014971
45248F294450p25215m733637p489871o474948k258432J840489K796776J110111
$$ plain form
45305 -2591123 -7798142 -8305628 -4134538 877742 3739976 5132322 6639939 7781276
45297 7781276 7392166 5730766 3484856 523041 -2918852 -5577262 -6839717 -7187033
45289 -7187033 -6178590 -2562248 2599179 6037576 7080358 8894882 12708026 14571129
45281 14571129 11348935 6517642 5404636 7141865 6650116 3206735 1231188 2546446
45273 2546446 3612074 1890306 -143157 184260 1190689 406955 -499308 1751318 6371698
45264 6371698 9137377 8144427 5670271 3978633 2035073 -2220157 -7763893 -10320798
45256 -10320798 -6545858 2073334 9938078 12316292 9565479 6081615 5279479 6294450
45248 6294450 5569235 835598 -6654273 -13129221 -15387653 -13547164 -10750388 -9640277
45240i640277k0442Q80413J854469J209117M60927J444158K706915J819237k91251
45231D23266o94219Q71026K126858K255137K119546J261664j132135k845771j244139
45222C141233Q04972k218899q497022q830625o8187Q315859O805024o90071l375892
45213d613608N52078L511156K141054J503519M450759N862492J405065m820939
45205I991576o263181k746647J260379L363426L810187K606893M98441J85520
45197A2706594K405704L345972Q7461m202561n236596m735618o573934q293770
45189a0496748m126407M145479P608902L010673k575507k640250N41255K498965
45181b033638M117298O803107O409661m34800q217488q819538l232594Q87034
$$ plain form
45240 -9640277 -9660719 -8780306 -6925837 -5716720 -5255793 -3811635 -1104720 714517 423266
45231 423266 -270953 600073 2726931 4982068 7101614 8363278 7231143 4385372 3141233
45222 3141233 3946205 1727306 -6769716 -15600341 -15668528 -7352669 -547645 -1237716 -4613608
45213 -4613608 -4061530 -550374 1590680 3094199 7544958 13407450 14812515 9991576
45205 9991576 3728395 981748 2242127 5605553 9415740 12022633 12521074 12706594
45197 12706594 15112298 18458270 18545731 14343170 9106574 4370956 -2202978 -10496748
45189 -10496748 -14623155 -10477676 -2868774 141899 -2433608 -5073858 -4532603 -2033638
45181 -2033638 2083660 8886767 15296428 14861628 6644140 -2175398 -5407992 -4520958
45173d520958J284455K143809M157473L110653p98096j850326N71256j29665n259163
45164a290562n971132K692900J1702933J0521687K680621r18313J037759Q81115
45156B1337008l692036p131988o772931n417506l317546J949269P028399N122729
45148I105398j547515k892495K580095M384081k185181p416048l765726Q80121
45140h57270l042102r834245p968265Q97500N782548M266581K923274L178129
45132d653850O42503k872509o16617N453895N808661j87745k282572L123301O729153
45123A1144220K502798k622361j836306M86449j103145k527712Q63059L802578
45115A0709580N1593n418123m050402K112495M676938K771440J697444J304974
$$ plain form
45173 -4520958 -3236503 -1092694 3064779 6175432 5377336 3527010 4098266 3968601 -1290562
45164 -1290562 -7261694 -4568794 7134139 17655826 20336447 19418134 20455893 21337008
45156 21337008 17644972 10512984 3740053 -1677453 -4994999 -3045730 3982669 9105398
45148 9105398 7557883 4665388 7245483 11629564 9444383 2028335 -1737391 -857270
45140 -857270 -3899372 -13733617 -21701882 -20804382 -15021834 -10755253 -7831979 -4653850
45132 -4653850 -4011347 -6883856 -7500473 -2046578 3762083 3574338 1291766 4415067 11144220
45123 11144220 13647018 11024657 9188351 9674800 8571655 6043943 6907002 10709580
45115 10709580 10761173 5343050 1292648 3405143 8082081 10853521 12550965 13855939
45107A3855939k660454p473158n499817K367051O297714K375557k000977n34328
45099F727527L008682K541190q14014k070602k98248J647978K162120J692582
45091A4597215M84624j473202l234939l383327j357493J819459L497614J283274
45083A2233225l497955n887470k988682K276725N363051N455335L832782L39903
45075A7126914m320644o092630k578526K149523L072221J616221J617562J338392
45067A3929033k897913p768519o473391m6833L679464K070257q6283j94533m61053
45058A750229n74379K300236N059720P53269q517422j1629995m992096J798345
45050a4052093J587283j68112K568875M992977R45567m974945m656838O97568
$$ plain form
45107 13855939 11195485 3722327 -1777490 589561 6887275 9262832 7261855 6727527
45099 6727527 9736209 12277399 11463385 9392783 9094535 10742513 12904633 14597215
45091 14597215 15081839 13608637 10373698 6990371 5632878 7452337 10949951 12233225
45083 12233225 8735270 2847800 -140882 2135843 7498894 12954229 16787011 17126914
45075 17126914 12806270 6713640 4135114 6284637 9356858 10973079 12590641 13929033
45067 13929033 11031120 3262601 -3210790 -3257623 421841 2492098 2405815 2211282 1750229
45058 1750229 1175850 3476086 8535806 9289075 771653 -10858342 -15850438 -14052093
45050 -14052093 -12464810 -12632922 -10064047 -5071070 -4125503 -9100448 -13757286 -13059718
45042a3059718M295783M795163M803600L520957k21611k233020P90942L590727
45034F282823N4380n383737l875600L292901O440064K223684k987744l932958
45026B113813j914917M74819K315860K192457n5313m10202L716912P077396L638548
45017A9149373k445367k403186K456691K674460k980807n184205l24878K961758
45009A3903839j574672p292264n702422L38518K344520p44320l001842j452059
45001c180702J312380K684949K830837K564570K037751J270217K31400r02007
44993H849395j288586r01194j774580m840117o675798l806901P40413R16206k615350
44984a1396512l036930J404908M175467J002652l424599l168574N93183L223049
$$ plain form
45042 -13059718 -8763935 -3968772 834828 4355785 4134174 1901154 2692096 6282823
45034 6282823 6337203 953466 -2922134 370767 6810831 9034515 6046771 2113813
45026 2113813 198896 673715 2989575 5182032 5126719 4716517 8433429 15510825 19149373
45017 19149373 16704006 14300820 16757511 19431971 16451164 11266959 10942081 13903839
45009 13903839 12329167 5036903 -665519 -327001 2017519 1273199 -1728643 -3180702
45001 -3180702 -1868322 816627 3647464 6212034 8249785 9520002 9751402 8849395
44993 8849395 7560809 6659615 4885035 44918 -6630880 -10437781 -9697368 -8781162 -11396512
44984 -11396512 -14433442 -13028534 -8853067 -7850415 -11275014 -14443588 -13850405 -10627356
44976a0627356L471115K356049j79627l262976l918618j764057o26168j869582
44968a6421220j114901M006903Q131822N935827J030041L52785L141140K883378
44960G945775j704515n144657m206551j443450J054259M838253R647475J0353081
44952B1339670L628970n325044p433257q86836O064081N080626j982847n936109
44944A4549254k474443K984109M044337J814681O06791k65212l786234p160489
44936A0312794m630275K022044M091100j473091p653587p695872k747245L054656
44928d719476P549725P847950J074311p928282q210734K056760J0062220N400880
44920A3133354m756589o479633R45470O097091K764255m066322p939039p321073
$$ plain form
44976 -10627356 -7156241 -4800192 -4979819 -8242795 -12161413 -13925470 -14551638 -16421220
44968 -16421220 -17536121 -13529218 -5397396 538431 1568472 1921257 5062397 7945775
44960 7945775 6241260 1096603 -3109948 -4553398 -3499139 1339114 10986589 21339670
44952 21339670 24968640 19643596 12210339 11323503 17387584 22468210 20485363 14549254
44944 14549254 12074811 15058920 19103257 20917938 21524729 21259517 17473283 10312794
44936 10312794 5682519 7704563 11795663 10322572 2668985 -5026887 -7774132 -4719476
44928 -4719476 2830249 10678199 11752510 3824228 -4386506 -2329746 7732474 13133354
44920 13133354 8376765 1897132 2842602 8939693 11703948 7637626 -301413 -7622486
44912g622486k750873M008285P683189L811820l868090o683058k290794L039256
44904d672751L760500J017683j394008j855684o44643J085238J361579m15504
44896a757590j714157l28557J678227Q83946k255309m577252m665264k747571
44888a5483527J116565N119641N489494K198641M41082J888551N92241n950996
44880d588308q943851j226412Q520355P265527j241348j906845O765398R745087
44872A4389603j08544j0768599j0215586k963474P50223O43770J682279K795826
44864c794502N19595k331670j051360K156576J835201j461053k386697J106903
44856e407007O031697Q221975M596828m388482j1630751q514582K984320R977418
$$ plain form
44912 -7622486 -10373359 -6365074 1318115 5129935 1261845 -5421213 -7712007 -4672751
44904 -4672751 -912251 105432 -1288576 -3144260 -3788903 -2703665 -1342086 -1757590
44896 -1757590 -3471747 -3800304 -2122077 -1238131 -3493440 -8070692 -12735956 -15483527
44888 -15483527 -14366962 -9247321 -3757827 -1559186 -1118104 770447 1362688 -4588308
44880 -4588308 -13532159 -14758571 -6238216 1027311 -214037 -2120882 4644516 14389603
44872 14389603 14281059 3512460 -6703126 -9666600 -8916377 -8272607 -6590328 -3794502
44864 -3794502 -3274907 -5606577 -6657937 -4501361 -2666160 -4127213 -6513910 -5407007
44856 -5407007 624690 8846665 13443493 9055011 -2575740 -11090322 -8106002 1871416
44848A871416N367838k424048k890746J108332M04722m256915m276991J764752
44840c331640O375958N680070L429551J882690j657602o872583p602116j137610
44832c233282N985662O227310R70196k310028m57458K081732K57527m429586n732394
44823f40321r98017M920027O024340L177601J584981J633655j268546o777727
44815G655993p325397R0329O832045L910595m747947p877201k483060L766357
44807a78286M083820n82979n500883o728507k316741N365537R265513N181756
44799H589230j478958k533949Q17191K13237n739897q227214j521337Q083686
44791a798011J0799758N251302k462818p290723q220214n594323p6774O207929
$$ plain form
44848 1871416 7239254 4815206 1924460 3032792 3437514 -819401 -5096392 -3331640
44840 -3331640 3044318 8724388 12153939 14036629 12379027 5506444 -2095672 -3233282
44832 -3233282 2752380 8979690 9949886 7639858 7182400 9264132 9521659 5092073 -640321
44823 -640321 -1638338 3281689 9306029 12483630 14068611 15702266 14433720 7655993
44815 7655993 330596 420925 7252970 11163565 6415618 -1461583 -3944643 -178286
44807 -178286 3905534 3322555 -2178328 -8906835 -11223576 -5858039 3407474 8589230
44799 8589230 7110272 4576323 5393514 5606751 -133146 -8360360 -9881697 -1798011
44791 -1798011 9001747 14253049 11790231 4499508 -3720706 -9315029 -9391803 -3183874
44783c183874J0160358R556557M212073l399105q784704q875300n129829j309386
44775f753210J337242L871822N325020K849078k813170o047503k815715M250566
44767g95870R194458R036499M942316p83046o302219r648589q972365m381739
44759g710555J098979L650353K605953J454117L168269N395554L582710j229596
44751A2015784k661176J219003L933284L22850n001266m732965k27013J405668
44743F274169j072895k217636J29233J850812K80055j897132j920453n15059R59061
44734A870155J798488l0498n583220j0305635p908983L34751O452048O687645
44726f685249M733615L233442K47570l583080l087606K182240M932481J459748
$$ plain form
44783 -3183874 6976484 16533041 20745114 17346009 8561305 -313995 -5443824 -6753210
44775 -6753210 -5415968 -1544146 3780874 6629952 3816782 -2230721 -5046436 -795870
44767 -795870 8398588 17435087 22377403 21594357 15292138 5643549 -3328816 -7710555
44759 -7710555 -6611576 -2961223 -355270 1098847 4267116 9662670 13245380 12015784
44751 12015784 9354608 10573611 14506895 14829745 9828479 5095514 4868501 6274169
44743 6274169 5201274 2983638 3112871 4963683 5243738 3346606 1426153 911094 1870155
44734 1870155 3668643 3638145 -1945075 -12250710 -20159693 -19824942 -13372894 -6685249
44726 -6685249 -1951634 1281808 1529378 -2053702 -5141308 -2959068 1973413 3433161
44718C433161j770299R96717M831329K708020k363801k818333O17930J298877
44710F933601j117129r21129K227963K161234k468641m924276j387280K585780
44702C090123R87165l299382l464052Q00315L600524K094728Q7691J386011L422243
44693H705366N63967p235692j2435214q345611K192784R480767Q089783K348176
44685C364326m9357K871186O250261M489618k908758j0415164j1215518m591955
44677a2205361K248876K712337k46408J095322O382442O918668l718n326735j721581
44668a46158N106131N722874Q96561k388169l333394n539111o610126j192640
44660g484032O776485O815818j635984o775016j975075M546965L028179l735227
$$ plain form
44718 3433161 1662862 2659579 7490908 10198928 7835127 5016794 5634724 6933601
44710 6933601 5816472 4895343 7123306 9284540 6815899 1891623 504343 3090123
44702 3090123 4077288 777906 -2686146 -1885831 1714693 3809421 3897112 5283123 8705366
44693 8705366 9269333 2033641 -10401573 -18747184 -16554400 -7073633 1016150 3364326
44685 3364326 3314969 6186155 12436416 16926034 14017276 3602112 -7613406 -12205361
44677 -12205361 -9956485 -7244148 -7490556 -6395234 -12792 6905876 6902158 1575423 -146158
44668 -146158 4959973 10682847 11579408 9191239 5857845 318734 -6291392 -7484032
44660 -7484032 -707547 6108271 4472287 -2302729 -4277804 269161 3297340 -437887
44652d37887o564820l460896N90619K752664L925080M113824K744329J670720
44644E333633K350497J969759k223125o642883n366979O31655M308341K620938
44636B981836j0029O66484K935780L064096R26475q82986q92755L23822J188212
44627A0300935N3690k803610l783205L34253O528557P338650N22722o943048p603511
44618C945433k838662N40716R5092r84681p06120m69227m93049J130723L552984
44609C773209K812720j343532l428196k97261L477803K720342o6581O98968L748841
44600A2096313K614831l535837p622906m593554J908067N077777L004397j062346
44592G886742l263797k083384N95202L71874m698624r573166o902845K612701
$$ plain form
44652 -437887 -7002707 -10463603 -9872984 -7120320 -3195240 918584 3662913 5333633
44644 5333633 7684130 9653889 7430764 787881 -4579098 -3947443 360898 2981836
44636 2981836 2971807 3638291 6574071 9638167 10564642 9681656 8788901 9112723 10300935
44627 10300935 10354625 7551015 3767810 4102063 10630620 17969270 18491992 11548944 3945433
44618 3945433 1106771 1647487 1742579 757898 51778 -417449 -910498 220225 3773209
44609 3773209 6585929 5242397 1814201 1516940 4994743 7715085 7648504 8347472 12096313
44600 12096313 14711144 11175307 3552401 -1041153 866914 5944691 8949088 7886742
44592 7886742 4622945 2539561 3134763 3506637 -1191987 -10765153 -17667998 -15055297
44584a5055297R495242P442894J108764j421715P39372K707805K122438P16668
44576G856171n0825M9245J740770M336438L810549k265043r042811q927814j613374
44567d106694N206508N445025O00936m242015o032037m430783q32026J910912
44559f480174J796364N11937J005198K129098j10128m998265n714532J462524
44551a0397978J0251479J0994454K695007n579097n535586J152536N935639L927942
44543A3444396j110685k792926o89867J54823k249178l368330L33776M448440
44535H170449K264909m503297o808592q84797N962446N232793j364845n042228
44527C026838k467954K51711k749474p863880o488227K648361J0530095R043560
$$ plain form
44584 -15055297 -5560055 1882839 2991603 1569888 2309260 5017065 7139503 7856171
44576 7856171 7805346 7854591 9595361 13931799 17742348 15477305 6434494 -2493320 -4106694
44567 -4106694 1099814 6544839 7145775 2903760 -3128277 -7559060 -8391086 -6480174
44559 -6480174 -4683810 -4171873 -3166675 -1037577 -1147705 -6145970 -11860502 -10397978
44551 -10397978 -146499 10847955 13542962 7963865 2428279 3580815 9516454 13444396
44543 13444396 12333711 9540785 8850918 9005741 6756563 3388233 3722009 8170449
44535 8170449 10435358 5932061 -876531 -1761328 4201118 9433911 8069066 3026838
44527 3026838 558884 810595 -1938879 -9802759 -16290986 -13642625 -3112530 5931030
44519E931030J128010m116676l503287j239712O7213K207550M116521M12946q425144
44510c421549j2095524l631386R131654J3186119P273438P00368j400479j886945
44502G855696k375000p86915J233699j274266o385295n207761M048514J0899502
44494H008174P015408j824322m898295j576372M94714j650653l169161l67821
44486B031672L579744L149377k469555p884213o608071J500277Q539770P236682
44478I075683P03735j295221L884398Q114250M761605k166575n318623m431244
44470A3328008l881772m371624l196649k8092K923600M564866M673576K414747
44462A6426660j286983k854917j048191O54438N0387m0430J841408J402209l455079
$$ plain form
44519 5931030 7059040 2942364 -560923 -1800635 -1733422 474128 4590649 5003595 -3421549
44510 -3421549 -15517073 -19148459 -10016805 3169314 10442752 11143120 9742641 7855696
44502 7855696 5480696 4693781 5927480 4653214 -1732081 -6939842 -2891328 8008174
44494 8008174 15023582 13199260 8300965 6724593 7219307 5568654 2399493 2031672
44486 2031672 5611416 8760793 6291238 -1592975 -8201046 -6700769 1839001 9075683
44478 9075683 9779418 8484197 12368595 20482845 25244450 23077875 17759252 13328008
44470 13328008 9446236 5074612 1877963 1849871 4773471 9338337 14011913 16426660
44462 16426660 15139677 12284760 11236569 11891007 11941394 11900964 13742372 15144581 11689502
44453A1689502o086943n28310P236216O798732j046421o197861m822654k404633
44445D637628j802177L78397L969887L110661k452813m419789N27686M056449
44437H005929K6457l949055J624898J1094524J0066871l284959j4424082j1646711
44429b486128k33123O588273M494038K00259j95214J254416m55707m710596n612679
44420a156461m28403N706717N679704o18215o089742n120366K15309L575428K006108
44411C770079j284586j016176M138866R364182P887412j528893j1656958j3175544
44403c501618m432730O486313R968648M179861m171090p381940m265921j04734
44395c223211L80817j445801j047901K306644M910043M829488M281888M394447
$$ plain form
44453 11689502 5602559 5074249 12310465 19109197 18062776 11864915 7042261 4637628
44445 4637628 2835451 3213848 7183735 10294396 7841583 3421794 3949480 8005929
44437 8005929 8032386 4083331 5708229 16802753 26869624 23584665 9160583 -2486128
44429 -2486128 -2719251 3869022 8363060 8563319 8368105 9622521 9166814 4456218 -1156461
44420 -1156461 -1584864 4121853 9801557 9183342 3093600 -2026766 -1811457 1763971 3770079
44411 3770079 2485493 1469317 5608183 14972365 22859777 21330884 9673926 -3501618
44403 -3501618 -7934348 -1448035 8520613 12700474 8529384 1147444 -3118477 -3223211
44395 -3223211 -2842394 -4288195 -5336096 -3029452 1880591 6710079 10991967 15386414
44387A5386414K506965k312112n811526m850085k772321l391346l931945m16829
44379e592785L821936K969617p73654n23594L184022L609089O55814J354614O024077
44370A4729136N904417j286349n276409M38836O985471M123499l137256l343069
44362A9138276K399462L029584l844266q524727m612310L040161P532381P833422
44354B5991983M990035j235822q249361r940380m462429K106455L471631M28079
44346A3100191k535784l778521m114485l311407r19716J379075J471882k78283
44338A012952j856987k039465o62787J764029L498644K714689M65362Q2279K150561
44329G129277K885573k91571m265435m324705p33102K240801K633400K359672
$$ plain form
44387 15386414 17893379 15581267 9769741 4919656 2147335 -1244011 -5175956 -5592785
44379 -5592785 -1770849 1198768 425114 -98480 3085542 6694631 7350445 8705059 14729136
44370 14729136 20633553 19347204 14070795 14509631 21495102 25618601 22481345 19138276
44362 19138276 21537738 24567322 20723056 12198329 7586019 10626180 18158561 25991983
44354 25991983 30982018 29746196 21496835 11556455 7094026 9200481 12672112 13100191
44346 13100191 10564407 6785886 2671401 -640006 -1559722 -180647 1291235 1012952
44338 1012952 -844035 -2883500 -3546287 -1782258 1716386 4431075 4896437 4978716 7129277
44329 7129277 10014850 9723279 5457844 1133139 400037 2640838 5274238 7633910
44321G633910K603239J424179k502473o350283n869620r90721L529637L841164
44313C319032J866820K433784N880024O645117J171507n624050n919545J46388
44305I919077M394400K064021k302531l103651k221844m185846o908164m318164
44297f662702L073954P323337L805813k876015n571792k513352L208970P560668
44289G348881O960631N20014o472066o153819J390198O213749J696174n384607
44281F119155m432742L306345O910166J899684m479103m741429j18797M006862
44273H470141N002494K817242j398550m148065k288563J382861J017343k431167
44265H423736j621329M489351P182229J890824l467655j158927L753453K680118
$$ plain form
44321 7633910 10237149 11661328 9158855 2808572 -3061048 -4051769 -522132 3319032
44313 3319032 5185852 7619636 13499660 20144777 21316284 15692234 9772689 9919077
44305 9919077 14313477 16377498 14074967 10971316 8749472 4563626 -2344538 -6662702
44297 -6662702 -3588748 3734589 7540402 4664387 -907405 -3420757 -211787 7348881
44289 7348881 14309512 14829526 8357460 2203641 3593839 9807588 11503762 6119155
44281 6119155 1686413 4992758 11902924 13802608 9323505 4582076 4463279 8470141
44273 8470141 13472635 16289877 14891327 10743262 8454699 9837560 10854903 8423736
44265 8423736 6802407 11291758 18473987 20364811 16897156 15738229 19491682 22171800
44257B2171800j766289j432746K279481J389992l695936n107605k200414k182774
44249I455509n545052m340316K419490N121329J07101l085527J851175O263006
44241A2246715Q27547q189279q381730k53841M828578J910858l044589m041649
44233d097390j147379L382350P159544O590232P61483m514637l109773K265874
44225G290304M012225J121435q66393k15254o55141k384076m46851N542481Q341733
44216B1740463L779733k234752k318212J891419L107143j196769o795128r130379
44208H843518p368741l100002J309870L237390J461514k214464m423463l448183
44200e702561k48928L192171N453845N745072L585525o02717m580126n197653
$$ plain form
44257 22171800 20405511 18972765 21252246 22642238 18946302 13838697 11638283 9455509
44249 9455509 3910457 -429859 1989631 7110960 7218061 4132534 5983709 12246715
44241 12246715 13074262 4884983 -3496747 -3750588 1077990 2988848 -55741 -4097390
44233 -4097390 -5244769 -1862419 5297125 11887357 12648840 8134203 5024430 7290304
44225 7290304 11302529 12423964 11557571 11342317 10687176 8303100 7856249 13398730 21740463
44216 21740463 25520196 23285444 20967232 22858651 25965794 24769025 17973897 8843518
44208 8843518 1474777 -1625225 -315355 2922035 4383549 2169085 -2254378 -5702561
44200 -5702561 -5951489 -2759318 2694527 8439599 12025124 11422407 6842281 1644628
44192A644628j651116K616918L232055K61285j939009p16081J730672K293359
44184G472711J126801j5267j007202k565527m120287m377786k464239K106814
44176c843982P893226R966548M699978l059176m007671K192105N182990l42557
44168A8681461o037666l902474L29859j757283m913154R66542J0670342Q882275
44160B2919902m986643j3783404p606320L561266P792765P251362P929541O377489
44152B9455958j869458j0010035q497332r4320M730841L370015J702895K175141
44144B0963705J346926j932119m706630n815351o329084n001566j84503M934753
44136C276131O037845N217815P174504R210301M262891n606165q794884o95797
$$ plain form
44192 1644628 -6488 2610430 5842485 6103770 4164761 3448680 5179352 7472711
44184 7472711 8599512 8584245 7577043 5011516 891229 -3486557 -5950796 -3843982
44176 -3843982 4049244 14015792 18715770 15656594 11648923 13841028 19024018 18681461
44168 18681461 12643795 8741321 9071180 7313897 2400743 3367285 14037627 22919902
44160 22919902 17933259 4149855 -3456465 104801 7897566 15148928 23078469 29455958
44152 29455958 27586500 17576465 9079133 8984813 13715654 17085669 18788564 20963705
44144 20963705 22310631 20378512 15671882 9856531 3527447 -1474119 -1658622 3276131
44136 3276131 9313976 14531791 21706295 30916596 35179487 29573322 20778438 20082641
44128B0082641Q097292N737488n200391j2505734j0418360l959255P10603L277815
44120E822099N837493P738086O663701K683560j110659j756657O21609K923179
44112B9422411K100486j505017m085224k583803J046525J591185k288856m802384
44104A8895323j31876Q206035J0105828K402586n838154n589366m00883k5148
44096B7624345m971249o352912o42368N024503M774487K363041K886421L695388
44088C4401656P1012n565193p207013m423261j282212J286400N481508J0317029
44080C3079926J1280840O301371j919376q897507j0801985o049502J979865O176593
44072C1150225L434531j284755k087041K07783J792117K795416M588895M513976
$$ plain form
44128 20082641 28179933 33917421 28717030 16211296 5792936 1833681 2544284 5822099
44120 5822099 11659592 19397678 26061379 28744939 27634280 25877623 26499232 29422411
44112 29422411 31522897 30017880 25932656 23348853 24395378 25986563 23697707 18895323
44104 18895323 18763447 26969482 37075310 39477896 33639742 28050376 27649493 27624345
44096 27624345 22653096 16300184 15657816 20682319 25456806 27819847 30706268 34401656
44088 34401656 34472668 28907475 21700462 17277201 15994989 17281389 22762897 33079926
44080 33079926 44360766 50662137 48742761 39845254 29043269 22993767 24973632 31150225
44072 31150225 34584756 33300001 31212960 31420743 33212860 36008276 40597171 45111147
44064D5111147P99649r00865N125558J3103773J1770758J513779n159032k024586
44056F9340181K538673j55487n903591n340580J732789P160909O153678J856501
44048G7383073n95694j31660L19276j844385m721323l124181L992810R632113
44040H0910029P039878Q8564j412223L859038P380092M929121K463588M204705
44032A09462792M763265N8426k451366N681478J8353502K0884553J0206696o81474
44024A66277872J82819R889620J6922687J5846221J1629005J1516218J6183555
44017B48447997K0042298J9419330J7817490K0367431K4899074K4106833J7190218
44010C92290671J2620276J6042341K1772178K1562907J6366803J2617895J0992818
$$ plain form
44064 45111147 45910796 45009931 50135489 63239262 75010020 76523799 71364767 69340181
44056 69340181 71878854 71723367 65819776 60479196 62211985 69372894 75526572 77383073
44048 77383073 76787379 76655719 76974995 75130610 70409287 67285106 71277916 80910029
44040 80910029 87949907 88038471 86626248 90485286 97865378 102794499 105258087 109462792
44032 109462792 114226057 114284483 111833117 117514595 135868097 156752650 166959346 166277872
44024 166277872 166460691 176350311 193272998 209119219 220748224 232264442 248447997
44017 248447997 268490295 287909625 305727115 326094546 350993620 375100453 392290671
44010 392290671 404910947 420953288 442725466 464288373 480655176 493273071 504265889
44003E04265889O776636q72316p968090j3121404j8350478k2505425k1503849
43996D26720963j6523459j4972344k0540967k7696571k9010617k3833423j7221481
43989B76922101j3741847j4382926j6638095j6335180j2206502q818769j1104194
43982A83694588j6191154j6210967j0053078n708508q245919j2113300j0042353
43975A05129309l985072j178861l372338o463790q155956r224937q559119l775716
43967F0413520K946729N638310K356394k589110n254567o056009n788182k958699
43959D8708386K029814M585763J794554k628901l408906j258529p67120k406196
43951D6648865k050213J403150L286222J71427m431382m672737k50587L808805
$$ plain form
44003 504265889 511042525 510170209 502202119 489080715 470730237 448224812 426720963
43996 426720963 410197504 395225160 374684193 346987622 317977005 294143582 276922101
43989 276922101 263180254 248797328 232159233 215824053 203617551 194798782 183694588
43982 183694588 167503434 151292467 141239389 135530881 127284962 115171662 105129309
43975 105129309 101144237 99965376 96593038 90129248 81973292 72748355 64189236 60413520
43967 60413520 63360249 68998559 71354953 68765843 63511276 57455267 51667085 48708386
43959 48708386 50738200 55323963 57118517 54489616 51080710 49822181 49055061 46648865
43951 46648865 44598652 46001802 49288024 49459451 45028069 40355332 40104745 43913550
43943D3913550M148333K375632J218056N77369r30723k380308r06192M177280
43935E2192997R150765R038853L139397l321769l945897K318332J0093541J3222037
43927I1888256J0625999O030240L034984K043549J839294K381551M837409R245639
43919A31926921J3221472J3774330J0610262P036273O765595J0092864J4321966
43912B07749683J7626816K0429316K2556401K1853170J7622685J3103499J1426618
43905C32368188J0549900N929832k223931q435494r441341q288040r171449j1664161
43897B99623504j2938494j3119476j4647083j7363544j8047661j5356824j2255693
43890A95894729j2062012j3965804j4379509j1959287r293892r191212j0818603
$$ plain form
43943 43913550 48061883 50437515 51655571 52232940 51302217 48921909 48015717 52192997
43935 52192997 61343762 70382615 73522012 70200243 66254346 68572678 78666219 91888256
43927 91888256 102514255 108544495 111579479 113623028 115462322 117843873 122681282 131926921
43919 131926921 145148393 158922723 169532985 176569258 183334853 193427717 207749683
43912 207749683 225376499 245805815 268362216 290215386 307838071 320941570 332368188
43905 332368188 342918088 348847920 346623989 338188495 328747154 320459114 311287665 299623504
43897 299623504 286685010 273565534 258918451 241554907 223507246 208150422 195894729
43890 195894729 183832717 169866913 155487404 143528117 134234225 125043013 114224410
43883A14224410j0915243q281050n381075n107105p312425r326177q868009n778649
43875E3254677j994318l80257j989812l776389j438506L963082N298705j657502
43867E1279680j1240548j4259712r599457m237378k400256q68578L564334P761605
43859A9999690O750658Q68561m927413o678839m129522L5385J947702k07094l483868
43850A0175260l324662j41974J051180j151902j628265L058279Q211937P207150
43842B3457003P30030m903486o175560m443784j590536J489471L090857J937328
43834A3591323q6562j17479J240061J053124r53147k063778j037843K31846l81255
43825A1476290k955287n754798o042698k073177L779815O090744L103890m02818
$$ plain form
43883 114224410 103309167 95028117 89647042 84539937 77227512 67901335 59033326 53254677
43875 53254677 51260359 50880102 48890290 45113901 43675395 47638477 52937182 51279680
43867 51279680 40039132 25779420 16179963 11942585 9542329 8673751 12238085 19999690
43859 19999690 26750348 27618909 22691496 16012657 11883135 11918520 13866222 13659128 10175260
43850 10175260 6850598 6708624 7759804 6607902 4979637 8037916 16249853 23457003
43842 23457003 24187033 19283547 13107987 8664203 7073667 8563138 11653995 13591323
43834 13591323 13504761 13387282 14627343 15680467 14727320 12663542 11625699 11857545 11476290
43825 11476290 8521003 2766205 -3276493 -5349670 -1569855 4520889 7624779 7221961
43817G221961k39068P74681j490181l780475J78708Q003246R685725J727723p251160
43808A4831160q236625l008561O56624J38669r96306l69163L50907k72421n52704
43799B541580J460201M368711M526682N62093m428979o082097l509207O43820
43791H2804M269391P051969P441755K731560n411384r650725n413918K323298
43783C424750N281045K465343n62066q91676o84091j231017q41436P55079J196351
43774H912282l37013k077196l291869m759711n514732l522148L03698L090103
43766g196586M653456O477604O967973L598872p09851k01197M194178M965232
43758B2749681q90489p579015r121234n829645n37284M726420O316990P78828
$$ plain form
43817 7221961 6982893 7757574 6267393 2486918 2665626 10668872 20354597 22082320 14831160
43808 14831160 6594535 3585974 4242598 4381267 3384961 3015798 3366705 3094284 2541580
43799 2541580 4001781 8370492 12897174 13459267 9030288 2948191 -561016 82804
43791 82804 4352195 11404164 18845919 21577479 16166095 6515370 1101452 3424750
43783 3424750 8705795 11171138 10609072 9717396 9033305 7802288 6960852 7715931 8912282
43774 8912282 8575269 6498073 3206204 -1553507 -7068239 -10590387 -10286689 -7196586
43766 -7196586 -2543130 3934474 10902447 14501319 13791468 13590271 17784449 22749681
43758 22749681 21859192 14280177 5158943 -670702 -1207986 3518434 9835424 10614252
43750A0614252p927749j0342755m167072K180785K293852J80485J196984K700692
43742c270526L33346l203405k941039J28311K332214L810857N351363M031513
43734F572634j169444m609912k019488J817486R80439j311957R45366M778257
43726E983381K831438l612984o449881l543499Q1725K198106M562755N215917
43718G266958M2834p633823r017049k698941L490049M684061L903815L380417
43710C418321P67450l200582k871789K282602M429620p28063o446796n144191
43702g493428L77899K385168K0711j029748K036679N760511N533627N94589n344919
43693B841089o925651k265349M126732O081388L309490N51641k86985j704594
$$ plain form
43750 10614252 2686503 -7656252 -11823324 -9642539 -7348687 -7168202 -5971218 -3270526
43742 -3270526 -2937180 -6140585 -9081624 -8953313 -6621099 -2810242 2541121 6572634
43734 6572634 5403190 793278 -1226210 591276 1571715 259758 1205124 5983381
43726 5983381 8814819 5201835 -1248046 -4791545 -4709820 -2511714 2051041 7266958
43718 7266958 7309792 -324031 -9341080 -12040021 -8549972 -3865911 37904 3418321
43710 3418321 4185771 985189 -1886600 396002 4825622 4097559 -2349237 -7493428
43702 -7493428 -7115529 -4730361 -4709650 -5739398 -3702719 2057792 7591419 8186008 2841089
43693 2841089 -4084562 -6349911 -2223179 3858209 7167699 7719340 7432355 5727761
43685E727761l886607l030019J308342L384975n67996o248849p173028k932132
43677a3417553J597929K143567k021528p616265q523267j680863P149751Q755611
43669a3612618K765990j798534K184K704660R65097j778348o58288J949453J900029
43660g560375J168626K787869L403179p57569m967307k297187M142391M969002
43652H88629o72121l833220j04792L948686J747040l387522m053336K25968L094363
43643b146305Q52049k408337l64183O463269R812655L721475o416894r414201
43635I9528l033349K858726M08186n403835n227157P67745M563939K596162j036799
43626c406854k228401j151477M87197J026835j327132n362462n645867m2794M558102
$$ plain form
43685 5727761 1841154 -1188865 119477 3504452 2936456 -3312393 -10485421 -13417553
43677 -13417553 -11819624 -9676057 -11697585 -19313850 -27837117 -29517980 -22368229 -13612618
43669 -13612618 -10846628 -12645162 -12642978 -9938318 -8973221 -10751569 -11409857 -9460404 -7560375
43660 -7560375 -6391749 -3603880 -200701 -958270 -5925577 -8222764 -4080373 888629
43652 888629 216508 -3616712 -3721504 227182 1974222 -1413300 -5466636 -5240668 -2146305
43643 -2146305 -1294256 -3702593 -4066776 2396493 12209148 15930623 9513729 99528
43635 99528 -2933821 -75095 333091 -5070744 -10297901 -9530156 -4966217 -2370055 -3406854
43626 -3406854 -5635255 -6786732 -6299535 -5272700 -6599832 -11962294 -17608161 -17650955 -13092853
43617a3092853J467704l756222m23923R143201J0518634j125426j1970872q543960
43609a7783717L803126R974174N813168j86814j967534k220531l858048m486990
43601a0913166k238638l94502j940856l723879q00957N361561P845181L666138
43593c139118j901355k394856J469974L832905K318334K69444N43369J818102
43585B816799K319958K492250J751547k313490p956046p879542N63714Q453806
43577B48996N999206l170225p154932l362152o35108l206382l881890K232599
43569a2929888P418407K875879o351691p716730P48731Q214262O842506J331551
43561D33027L4555L091359M297402J385042j142463O16760M239365M806839J724125
$$ plain form
43617 -13092853 -11625149 -15381371 -15805294 -6662093 3856541 2731115 -9239757 -17783717
43609 -17783717 -13980591 -4006417 1806751 1619937 -347597 -2568128 -6426176 -10913166
43601 -10913166 -13151804 -13546306 -15487162 -19211041 -20011998 -14650437 -6805256 -3139118
43593 -3139118 -5040473 -7435329 -5965355 -2132450 185884 455328 998697 2816799
43585 2816799 5136757 7629007 9380554 7067064 -888982 -8768524 -8204810 248996
43577 248996 6248202 3077977 -4076955 -7439107 -8074215 -11280597 -15162487 -12929888
43569 -12929888 -5511481 -2635602 -8987293 -16704023 -15955292 -7741030 -898524 433027
43561 433027 467582 3558941 7856343 9241385 8098922 8715682 12955047 17761886 19486011
43552A9486011j518424l042431m039886m575178k601906J221049K461399l14934
43544G075700k226084K61047K755831j76505n188004m413303K471022P940292
43536H499996P452263L240819k085264p798998j0781228p404376r03047J340978
43528h438857p02275K59895N409563O562624K49175n271929l077293J849089K423387
43519g36621R64144K184032K807600j370868m589435R01368J0066871J0335677
43511B0562768p1264j0077864j1609548p488335l264636o62705k40226k053313
43503a4905123k396851K430130Q424867P916523J812406j091683J690494K655027
43495F535790k125114n701112j980923L734273L050569k874179o391036m873360
$$ plain form
43552 19486011 17967587 14925156 10885270 6310092 3708186 4929235 7390634 7075700
43544 7075700 4849616 5110663 7866494 7689989 2501985 -1911318 559704 8499996
43536 8499996 15952259 19193078 17107814 9308816 -1472412 -8876788 -9779835 -8438857
43528 -8438857 -9141132 -8881237 -3471674 3090950 3340125 -1931804 -5009097 -3160008 -736621
43519 -736621 227523 2411555 5219155 3848287 -741148 160220 10227091 20562768
43511 20562768 20491504 10413640 -1195908 -8684243 -11948879 -12611584 -12851810 -14905123
43503 -14905123 -17301974 -14871844 -6446977 1469546 3281952 2190269 3880763 6535790
43495 6535790 4410676 -1290436 -3271359 462914 3513483 639304 -5751732 -10625092
43487a0625092k156584j091250r50729r54245j259614j073683M26509J983035
43479a5701653J950149R83952N64300L54050m64641q51875M19319K078539J895600
43470h772260m17j348675n22991K201799M975396N192009J908764j760131j270193
43461F03301L124552N779377L070028j804300l893788l183074k774467k955441
43453b033812j411963J639825K668015k57540m419824n280606j272905M434309
43445e934501O602139L023335k779547n115032k440463J639385L553363L143720
43437A692399J502939r85649l101697k901021j244234j468061l330467j812323
43429a1648114M492519Q610072M429664l100322m383018K14426Q54017n848838
$$ plain form
43487 -10625092 -12781676 -13872926 -14823655 -15777900 -17037514 -18111197 -17684688 -15701653
43479 -15701653 -13751504 -12767552 -12203252 -11849202 -12313843 -13165718 -12746399 -10667860 -8772260
43470 -8772260 -8772677 -10121352 -10644343 -8442544 -3467148 1724861 3633625 1873494 603301
43461 603301 3727853 9507230 12577258 10772958 6879170 3696096 921629 -2033812
43453 -2033812 -3445775 -1805950 862065 604525 -3815299 -9095905 -10368810 -5934501
43445 -5934501 667638 3690973 911426 -4203606 -6644069 -5004684 -1451321 1692399
43437 1692399 3195338 2209689 -892008 -3793029 -5037263 -6505324 -9835791 -11648114
43429 -11648114 -7155595 1454477 5884141 2783819 -1599199 -1384773 -530756 -6379594
43421f379594j0400272m450079N869174Q041604J029336l488664J820478R462608
43413A504591P930559k211083r610560p730623j964950L36694J18076K145546
43405i481750N306868M509294K38273j414418J276907K861702R455l013781j732435
43396a439885J493407K466915K228915L496969M016278J38127n314475n801739
43388A284512j127635J888666l36376l191257j363973L460948N574658K941600
43380I131143j218427l073607j855248O46770K390095K462998J030957j171785
43372H342896k948342l037951j615014q80089k434267m515903m208701j950696
43364a3248067n34191K02978L133608P475196Q080025L384020j349554j977658
$$ plain form
43421 -6379594 -16779866 -21229945 -15360771 -7319167 -6289831 -9778495 -7958017 1504591
43413 1504591 9435150 7224067 -2386493 -10117116 -12082066 -11745372 -11627296 -9481750
43405 -9481750 -4174882 334412 572685 -841733 435174 3296876 3306331 292550 -1439885
43396 -1439885 53522 2520437 4749352 8246321 12262599 12400726 7086251 1284512
43388 1284512 156877 2045543 1709167 -1482090 -2846063 614885 6189543 9131143
43380 9131143 7912716 4839109 2983861 3630631 6020726 8483724 9514681 8342896
43372 8342896 5394554 2356603 741589 -138500 -2572767 -7088670 -11297371 -13248067
43364 -13248067 -13782258 -13579280 -10445672 -2970476 5109549 8493569 7144015 5166357
43356E166357j130223j751226r69204L593643O771805K694724n192939q813477
43348C69460p060956m673160k565254J399648M132317M04800n961750m685049
43340a8639944N547649J4003478J2607928M692195l097248q067281q060138j247787
43332b261148O566791N015977n085050r671342j759207P219444N360190j303058
43324D082597m79727N216714L821974m424972p169177o94757M460590J064804
43316E878046m643650n006620k601556l706843p566077q308387l147612N521679
43308b3581020J2774602J3597257O692845k305501n607354k664021k65783k246716
43300c605691m756128l681556p18836J093755K315117L701552K937340o29534
$$ plain form
43356 5166357 4036134 2284908 1315704 4909347 11681152 14375876 9182937 369460
43348 369460 -6691496 -11364656 -13929910 -12530262 -8397945 -7993145 -13954895 -18639944
43340 -18639944 -13092295 911183 13519111 18211306 15114058 7046777 -1013361 -2261148
43332 -2261148 4305643 9321620 4236570 -5434772 -7193979 25465 5385655 4082597
43324 4082597 3602870 8819584 12641558 8216586 1047409 352652 4813242 5878046
43316 5878046 1234396 -3772224 -6373780 -10080623 -17646700 -25955087 -29102699 -23581020
43308 -23581020 -10806418 2790839 9483684 7178183 1570829 -1093192 -1358975 -3605691
43300 -3605691 -8361819 -12043375 -12762211 -11668456 -9353339 -5651787 -2714447 -3343981
43292c343981k329231J401135O095618M506225k894413q154173o303562p67135
43284a1789517K541959K589690K519746L788829L934575P25292l325553l133907
43276b148886J899950O032726M706367J119562J211899M263802M313929K35620
43268B1634969k634532k206488l380149q356600j0386152l598686O094971P881522
43260E048855J297426l542013p73419L906193K974956k206093m684639k314391
43252b93125p9860k525435p138617o744204J961805J3203593J6720251Q334870
43244B3439278n057286j2331459r170503q52324M892361N271358K671615K67260
43236I130300q45834j127384r88694l75771M35048N29148m44573j259091n07123
$$ plain form
43292 -3343981 -5673212 -4272077 1823541 6329766 3435353 -4718820 -11022382 -11789517
43284 -11789517 -9247558 -6657868 -4138122 -349293 3585282 4310574 985021 -2148886
43276 -2148886 -248936 5783790 10490157 11609719 12821618 17085420 21399349 21634969
43268 21634969 19000437 16793949 13413800 5057200 -5328952 -8927638 -2832667 5048855
43260 5048855 6346281 2804268 2030849 5937042 8911998 6705905 2021266 -293125
43252 -293125 -372985 -2898420 -10037037 -16781241 -14819436 -1615843 15104408 23439278
43244 23439278 18381992 6050533 -3119970 -3972294 920067 6191425 8863040 9130300
43236 9130300 8284466 7157082 6168388 5792617 6227665 6756813 6312240 5053149 4546026
43227D546026J114109J355024o43380l461718n415682n542554k857057K338044
43219h567188O105882L927389k309245m852183n20198M162058K871329k50641
43211E67203K453848Q124813O182307m327434j0571532l775453P347971Q568279
43203A4570002k56026o737503m411795L59003P68785o41238R43559K980433R7011
43194G672231n476471n781895Q32958O377072M078641k566500n166067j449564
43186a479595L332800M334872K068983m73594j762665j612599k9125K053458K682717
43177I115252J125892j037167k223196k859715l762627l960279k093263Q22065
43169d873038K153686J173670L9107O99224K067575J311606k277887n611474m880530
$$ plain form
43227 4546026 5660135 7015159 6371779 2910061 -2505621 -8048175 -10905232 -8567188
43219 -8567188 -2461306 1466083 -843162 -5695345 -6215543 -2053485 817844 567203
43211 567203 3021051 11145864 17328171 13000737 2429205 -1346248 6001723 14570002
43203 14570002 14313976 7576473 3164678 3523681 4292466 3651228 4594787 7575220 7672231
43194 7672231 2195760 -3586135 -2753177 3623895 7702536 5136036 -30031 -1479595
43186 -1479595 1853205 6188077 8257060 7783466 6020801 4408202 4379077 6432535 9115252
43177 9115252 10241144 9203977 6980781 4121066 358439 -3601840 -5695103 -4873038
43169 -4873038 -2719352 -1545682 -1506575 -807351 1260224 2571830 293943 -5317531 -10198061
43160a0198061m42939K683801O78216l681227m101582O64758M742568L252300
43152f402166q88197j657247J080311K193639K22710n1298M061120P334171L556968
43143I450011m634994q380154m520215O54391J132454o50266O75337L765238K671887
43134A63689k698095n249832j414322L252987K943126N03773J725313M832752
43126D059391L238127k907954o100025l150816L66964j1717o85059K461562N731837
43117C002310L411623j997420k623448K998726P647295N519672p21249m708780
43109A2528729m260947k189404j526148k303814k593210j344024N05845J788570
43101F05597K773216L512439J787477l870904r419298q414717j271821L910299
$$ plain form
43160 -10198061 -10641000 -7957199 -7278983 -10960210 -15061792 -14397034 -9654466 -6402166
43152 -6402166 -7290363 -8947610 -7867299 -5673660 -5450950 -5502248 -1441128 5893043 9450011
43143 9450011 4815017 -3565137 -8085352 -7430961 -6298507 -6948773 -6273436 -2508198 163689
43134 163689 -2534406 -7784238 -9198560 -5945573 -3002447 -2498674 -773361 4059391
43126 4059391 7297518 4389564 -1710461 -4861277 -4494313 -4506030 -5191089 -2729527 3002310
43117 3002310 6413933 4416513 1793065 4791791 12439086 17958758 17237509 12528729
43109 12528729 8267782 6078378 4552230 2248416 -344794 -1688818 -1182973 605597
43101 605597 3378813 6891252 8678729 4807825 -4611473 -13026190 -14298011 -10387712
43093a0387712K626016M16432L386584P797163O145397k90501l479189j490902
43085D723288m73516l385001n235971j974729K976917M434240K187791j151838
43077B101181m190697n468051k662903L302117O956111M557497j057257m570063
43069a032065m288018j786917J360775L711722L606478J459882J827N3881j005458
43060B082107m160511n567091j961043L433540M551052P11681k573550q16546
43052d300361M233203P076849M758916M6734j976474n50342m01251m311063p534823
43043b958612m367247K060852L631615K06933r226N284067P557248J355318o056396
43034F704552o060741j916335j805238m867665m326357k91989J337009L35426
$$ plain form
43093 -10387712 -7761696 -7345264 -3958680 3838483 9983880 9693379 6214190 4723288
43085 4723288 4249772 864771 -4371200 -6345929 -3369012 1065228 3253019 2101181
43077 2101181 -2089516 -7557567 -10220470 -6918353 37758 4595255 3537998 -1032065
43069 -1032065 -5320083 -7107000 -5746225 -2034503 1571975 3031857 3033684 3087565 2082107
43060 2082107 -2078404 -7645495 -9606538 -6172998 -1621946 -910265 -3483815 -4300361
43052 -4300361 -67158 7009691 11768607 11815341 9838867 9288525 8887274 4576211 -2958612
43043 -2958612 -7325859 -5265007 -1633392 -1426459 -1435685 3848382 11405630 12760948 6704552
43034 6704552 643811 -1272524 -3077762 -7945427 -12271784 -12563773 -11226764 -10891338
43026a0891338J539092L729464N38295o487074p138224J634432R466166P513254
43018i5933Q07621j149286J103940L36639m063695n257488m00796M781726M280783
43009C43511n91219m052760l102749L07809K740655K839237J446013m70751k603299
43000c143553l976946k836120N33940K586784P96731j999499r52196L606704O255890
42991H71735M124641K99180j630908k278560l420719l882182j732472J721910
42983e927375L391054K535813P64389j065384l351898n629829o203489m110253
42975a9596972k43751L373868M727055K946299n55300k541662p35869L729555
42967h896777P169917O732473K869995j289285k870783j611253O25611K105526
$$ plain form
43026 -10891338 -9352246 -5622782 -5084487 -11571561 -18709785 -17075353 -7609187 -95933
43018 -95933 711688 -437598 666342 1002981 -3060714 -8318202 -8718998 -3937272 343511
43009 343511 -247708 -4300468 -7403217 -7095408 -4354753 -1515516 -69503 -540254 -3143553
43000 -3143553 -7120499 -9956619 -9422679 -6835895 -6039164 -8038663 -8990859 -5384155 871735
42991 871735 4996376 5295556 3664648 1386088 -2034631 -5916813 -7649285 -5927375
42983 -5927375 -2536321 -508 763881 -301503 -3653401 -9283230 -15486719 -19596972
42975 -19596972 -19840723 -16466855 -11739800 -8793501 -9348801 -11890463 -12626332 -8896777
42967 -8896777 -1726860 5005613 7875608 6586323 3715540 2104287 2729898 4835424
42959D835424K127758K98563l026811n379899l910183M11560L056767J992387
42951D05566L50795P90374R12307j942868m814467l270595R68496K487940Q87511
42942c224941P14607L072592L904884J588691j7423J837477M464792M452878K350425
42933A9143982K51392j649797l982838o584474r137469j0689220q640350j944544
42925b3233318N174686P371111N498534M376647M110885O78682m907364o335394
42917g265531k371274Q52497K16889j96783J852518K496569K74819k38137K256805
42908b121628K401065q40994l37774N633698P359357j43106o470734k361690M213169
42899G331363J921000m107398k319848L746085K275818m270699l245121M390003
$$ plain form
42959 4835424 6963182 7261745 4234934 -1144965 -5055148 -4643588 -1586821 405566
42951 405566 756361 1546735 2459042 516174 -4298293 -7568888 -6600392 -4112452 -3224941
42942 -3224941 -2510334 562258 4467142 6055833 6038410 7875887 12340679 16793557 19143982
42933 19143982 19395374 17745577 13762739 7178265 -1959204 -12648424 -21288774 -23233318
42925 -23233318 -18058632 -10687521 -5188987 -812340 3298545 3977227 -930137 -7265531
42917 -7265531 -9636805 -8784308 -8567419 -8764202 -6911684 -4415115 -4140296 -4378433 -2121628
42908 -2121628 279437 -561557 -899331 4734367 12093724 11950618 5479884 3118194 7331363
42899 7331363 9252363 5144965 2825117 6571202 8847020 4576321 1331200 5721203
42891E721203M979623k934008n443482J867346O268333R18608m000890j450877
42883E925856j85866o384416r778191j584368Q333764P233390L85413M15379N498756
42874I859717M700934j951633n095064l136150k371466l048452J26911N265785
42866D350582M797326p67457k958895O71861L793783K523334o95146l783221n911869
42857B020298l487652M331478Q697365J664999q808983q385358Q95533L561781
42849D89461l348746n633358K831505Q995560L026012n291900l860197K548415
42841b43248L452829Q23426J810569L202982j674832p903048o114093N27112J516694
42832d601609k540642j851586M132217N477239n56982m898066k061518K554082
$$ plain form
42891 5721203 10700826 7766818 2323336 4190682 10459015 11377623 7376733 5925856
42883 5925856 5739990 -644426 -10422617 -12006985 -3673221 3560169 3945582 4360961 9859717
42874 9859717 14560651 12609018 7513954 4377804 2006338 -1042114 -915203 4350582
42866 4350582 9147908 8380451 5421556 6093417 9887200 12410534 11715388 7932167 2020298
42857 2020298 -1467354 2864124 11561489 13226488 4417505 -3967853 -3072320 489461
42849 489461 -2859285 -8492643 -5661138 3334422 6360434 1068534 -2791663 -243248
42841 -243248 3209581 4033007 5843576 9046558 7371726 -531322 -6645415 -6118303 -4601609
42832 -4601609 -7142251 -8993837 -4861620 615619 58637 -4839429 -6900947 -4346865
42824d346865L931849M306492M935095K005863m308452o485672r80099N267974
42816D326185N035789K57959l652543n723812o508506m158908R52712L744414
42808e726710J884418l6160J328325K176427o70962k847562M3339M192798M166490
42799D510403J951168J616232O77936m157133p747449l488329M094305M910604
42791B367737o24435k675030J458650L834653K79776l364533k624721j227851
42783b575754j988487q40625M064921O157538O83058n905970m820693J849562
42775c376450M721848O41655m651546n509150j904475K887867N282765L081044
42767A173558k036762n021752l266085K85304K068230K273615J589152j384168
$$ plain form
42824 -4346865 -415016 3891476 8826571 10832434 6523982 38310 -941789 4326185
42816 4326185 9361974 9619933 5967390 243578 -6264928 -10423836 -9471124 -5726710
42808 -5726710 -3842292 -3878452 -2550127 -373700 -1044662 -3892224 -3848885 343913 4510403
42799 4510403 6461571 8077803 8755739 4598606 -3148843 -6637172 -2542867 2367737
42791 2367737 1743302 -931728 526922 4361575 4641351 1276818 -1347903 -2575754
42783 -2575754 -4564241 -5404866 -1339945 4817593 5500651 -405319 -5226012 -3376450
42775 -3376450 1345398 1987053 -2664493 -8173643 -10078118 -7190251 -1907486 1173558
42767 1173558 -863204 -5884956 -9151041 -8865737 -6797507 -4523892 -2934740 -4318908
42759d318908n302557m338086K676627O801712P50088q177191o689768N091595
42751a3506488J3299477R633451Q98666l028184j605429k4792n94404k385993
42743B686304m140018l751687M45070N137574M182008j883573m729031n03779
42735b557132L474448j7540o286605n833090R49700M932580K353357r20328J38609
42726c766001K690904K166100l50418p19071J511299K568141l51864n408053p599737
42717i258700l772312L390751P349051N009502N63644k90096J747249J293540
42709F032629k823460n341854k555893J952989K527167p06471k800083j235281
42701d950257J340314J414265j133372l582416l411837l74923L236974M355295
$$ plain form
42759 -4318908 -9621465 -13959551 -11282924 -4481212 -3731124 -11908315 -18598083 -13506488
42751 -13506488 -207011 9426440 10325106 7296922 5691493 5666701 5072297 2686304
42743 2686304 -1453714 -5205401 -4760331 377243 4559251 2675678 -2053353 -2557132
42735 -2557132 917316 899776 -5386829 -11219919 -10270219 -5337639 -2984282 -3904610 -3766001
42726 -3766001 -1075097 1091003 740585 21514 1532813 4100954 3749090 -1658963 -9258700
42717 -9258700 -13031012 -9640261 -2291210 2718292 3281936 2991840 4739089 6032629
42709 6032629 3209169 -2132685 -4688578 -2735589 -208422 -914893 -3714976 -4950257
42701 -4950257 -3609943 -2195678 -3329050 -6911466 -10323303 -10698226 -7461252 -3105957
42693c105957K311823p6590j52781M02886k309000p813543j0246968n996722P14244
42684b6272608L367221J991470J666368L283646K142874k744008m534619J668376
42676a9431280R796562J0091043K988079j423734K179466P421974O056823q69479
42668A6809454n653089m276845J33595K633838J552918j582152m592505o304872
42660a279658o538824n050885j239651M184050Q089123P568148L573814k24227
42652I081890k106195l263053m122043l148039l97163J009535j062878m543523
42644h551469n684198k948977K488748P563019P869356J125931p956172j0065137
42636a6158899j800081R002899J1867047N382944l016146o768580n545778k096349
$$ plain form
42693 -3105957 -794134 -870724 -1023505 -620619 -2929619 -10743162 -20990130 -26986852 -26272608
42684 -26272608 -22905387 -20913917 -19247549 -15963903 -13821029 -16565037 -21099656 -19431280
42676 -19431280 -9634718 456325 3444404 2020670 4200136 11622110 17678933 16809454
42668 16809454 11156365 6879520 7013115 9646953 11199871 9617719 5025214 -1279658
42660 -1279658 -7818482 -12869367 -14109018 -9924968 -1835845 5732303 9306117 9081890
42652 9081890 6975695 3712642 -409401 -3557440 -3954603 -2945068 -4007946 -8551469
42644 -8551469 -14235667 -17184644 -14695896 -7132877 736479 1862410 -6093762 -16158899
42636 -16158899 -17958980 -8956081 2910966 8293910 5277764 -1490816 -7036594 -9132943
42628i132943J803843N445657P911502P908266M451723j675223o937964p548229
42620B226632l964554o84502m78838j624143k070733k525219l195700j800904
42612a4117961J793705L251460M28323j845456R34366M884498L844874L24068
42604e02123J844536P622620Q151186n14667j0297872j1966207n847898J648331
42596i862094O344809P206206L958886j532585m745614l377071m94986P4019j032773
42587c461203r59627L71618O90003p70117k460997k572097l78082L106143M991583
42578a442776L158624k16692n76709K567195M465040K051865j584804k217153
42570F204590o53386n09173k141790k477848Q8493L485951M435886J723044k433257
$$ plain form
42628 -9132943 -7329100 -1883443 6028059 13936325 18388048 16712825 9774861 2226632
42620 2226632 -1737922 -2422424 -2901262 -4525405 -6596138 -9121357 -12317057 -14117961
42612 -14117961 -12324256 -9072796 -8644473 -10489929 -9555563 -4671065 -826191 -502123
42604 -502123 1342413 8965033 17116219 16601552 6303680 -5662527 -11510425 -9862094
42596 -9862094 -3517285 3688921 7647807 6115222 1369608 -2007463 -2502449 -2428430 -3461203
42587 -3461203 -4420830 -4049212 -3359209 -4129326 -6590323 -9162420 -9540502 -6434359 -1442776
42578 -1442776 1715848 1499156 922447 3489642 7954682 10006547 8421743 6204590
42570 6204590 5551204 5042031 2900241 422393 510886 3996837 8432723 10155767 7722510
42561G722510l998906j683771M87544j798119n896906m875398J702633N899953
42553b440460L310560K19627L358663Q361781O452502j012841m165015p5295K921719
42544A6931241j469587q180076r127405m620420q70207k19705J82661J907105
42536e466393L044191K450487J783289K243962K360164M43820k644804m465437
42528b50721l643071q58009J747684J726380j675377n836037o510310k528012
42520a7827473K512252M721988M568927M707846M715767J964878k424971l383068
42512d43854N32699L893512K014190k105305k867390q88381j082718l843107m514017
42503i304371j493564J300209J159950K73272Q31720J279117k32475k536465l661298
$$ plain form
42561 7722510 3723604 2039833 2527377 729258 -5167648 -10043046 -8340413 -2440460
42553 -2440460 870100 1089727 4448390 12810171 19262673 18249832 14084817 14009522 16931241
42544 16931241 15461654 7281578 -1845827 -6466247 -7336454 -7556159 -7373498 -5466393
42536 -5466393 -2422202 28285 1811574 4055536 6415700 6859520 4214716 -250721
42528 -250721 -3893792 -4751801 -3004117 -1277737 -2953114 -8789151 -15299461 -17827473
42520 -17827473 -15315221 -10593233 -6024306 -1316460 3399307 5364185 2939214 -443854
42512 -443854 88845 3982357 5996547 3891242 1023852 135471 -947247 -4790354 -9304371
42503 -9304371 -10797935 -9497726 -8337776 -8064504 -7232784 -5953667 -6186142 -8722607 -12383905
42494a2383905l006506j25880M752309Q096618N868437L39489j473247J743407
42486C810722L050847j553806o205426m569312R4792J028098r62221m66678K053237
42477c719747J451510j994213k259442K186055N332303K652290k665894m703408
42469c720546j832129K876809N084187K359219l182175n650924j887005L766084
42461b186480M864497J629638l96111O91206J226484j011957l480666l436868
42453b100257j075185K411931N257556L762275l738115j1204957r816062j53436
42445a6656250P119617N295093k18073j423804Q63986N26923l527452o552688
42437a4572648n181077o00754M094036O173337M430195J031763M24426L676033
$$ plain form
42494 -12383905 -15390411 -15516291 -10763982 -2667364 3201073 3540562 2067315 3810722
42486 3810722 6861569 5307763 -897663 -5466975 -5372183 -4344085 -5306306 -5772984 -3719747
42477 -3719747 -2268237 -4262450 -6521892 -4335837 996466 3648756 982862 -3720546
42469 -3720546 -5552675 -2675866 2408321 4767540 1585365 -4065559 -5952564 -2186480
42461 -2186480 2678017 4307655 3911544 4602750 5829234 4817277 1336611 -2100257
42453 -2100257 -3175442 -763511 4494045 8256320 4518205 -6686752 -16502814 -16656250
42445 -16656250 -9536633 -4241540 -4459613 -5883417 -5019431 -4492508 -8019960 -14572648
42437 -14572648 -19753725 -20354479 -16260443 -10087106 -5656911 -4625148 -4200722 -524689
42429e24689N992910K790935l709157o990994l905026K686659P436684O567184
42421A0344506K77374o624105q228607l694613J823558L752997K889923K044571
42413B585604J555511Q12036O83175J164077J5489k721220k644447K142173N911213
42404I503611K732963m133949o796877m246980j980404j735884j22708K493958
42396d286270J011399m178228m964432J922427Q040560N229764j968758l537713
42388b731251J090308M000736K013824k72648k90612j339515m711009n909707
42380h149874k244867K232439L387594K954860L420140K495305j575239m007446
42372a487088O2805O372421O591493P79669l292574k531642j552109k592601j558607
$$ plain form
42429 -524689 5468221 8259156 4549999 -2440995 -6346021 -3659362 3777322 10344506
42421 10344506 10621880 3997775 -4230832 -7925445 -6101887 -2348890 541033 2585604
42413 2585604 4141115 4953151 5636326 6800403 6815892 4094672 1450225 3592398 9503611
42404 9503611 12236574 8102625 1305748 -2941232 -4921636 -6657520 -6780228 -4286270
42396 -4286270 -3274871 -7453099 -12417531 -10495104 -2454544 2775220 806462 -2731251
42388 -2731251 -1640943 2359793 4373617 4100969 3810357 2470842 -2240167 -8149874
42380 -8149874 -10394741 -8162302 -4774708 -1819848 1600292 4095597 2520358 -1487088
42372 -1487088 -1424283 4948138 11539631 12319300 9026726 6495084 4942975 2350374 791767
42363G91767L008423N592573K822872n57943q8878R28316j616477m557417l265233
42354C058003k3910P62852O19096K384374K684726j883107n691309j745783N152243
42345E317185M604310k278033m646567q0920K508777p67899l439029k507922l346305
42336d636403o063985j837702R680317J3873033K731585j0010263q393613J992110
42328b664921M861907o64808k033451L493857N586729M52238k986392M59780L750209
42319A0255148N45207m719280n364398k238550M16741J765006K263460O96785
42311C620119k486555l789658j830593N66143J514273K418074L569021K835393
42303F416217M65257m24111K22281r54161l429115j985351M174765Q424816O272720
$$ plain form
42363 791767 3800190 9392763 12215635 11657692 11568814 12497130 10880653 6323236 3058003
42354 3058003 3034093 3796945 4416041 6800415 9485141 7602034 1910725 164942 5317185
42345 5317185 9921495 7643462 2996895 2915975 5424752 4656853 1217824 -1290098 -4636403
42336 -4636403 -10700388 -12538090 -2857773 11015260 13746845 3736582 -4657031 -2664921
42328 -2664921 2196986 1532178 -501273 2992584 8579313 9031551 6045159 6504939 10255148
42319 10255148 10800355 6081075 716677 -1521873 -1105132 659874 2923334 3620119
42311 3620119 1133564 -2656094 -4486687 -3920544 -2406271 11803 3580824 6416217
42303 6416217 6881474 6457363 6679644 5725483 2296368 311017 4485782 12910598 19183318
42294A9183318J312051k131324n357090r498922j0256089m798927J567149K500566
42286g479268Q1777M43627L771406N753819N847605O449088N907984M54916p334053
42277A3896901r764565m907143L42489J04657l101080l388089M94789N093547
42269a228494P039078N286581Q84538l215021l837742j015590J489942N30459
42261E933751k673589m303265k380368J738383N328412O408936M494042P50737
42253A5297039k425711l109537j758698q84090k131456m114098m179902k129748
42245e436201n04924n98792j98885K917211O733053O796734J850571m522804p700116
42236f64153n748167k07366M541645L691118l037957r280469q285295j145378
$$ plain form
42294 19183318 20495369 18364045 13006955 3508033 -6748056 -11546983 -9979834 -7479268
42286 -7479268 -7397491 -6953864 -3182458 2571361 8418966 14868054 20776038 21230954 13896901
42277 13896901 4132336 -774807 -432318 -327661 -3428741 -6816830 -6322041 -1228494
42269 -1228494 5810584 11097165 11981703 8766682 4928940 3913350 5403292 5933751
42261 5933751 3260162 -1043103 -3423471 -1685088 3643324 10052260 14546302 15297039
42253 15297039 12871328 9761791 8003093 7119003 4987547 873449 -3306453 -5436201
42245 -5436201 -5941125 -6539917 -6738802 -3821591 2911462 9708196 11558767 7035963 -664153
42236 -664153 -6412320 -6619686 -2078041 1613077 -1424880 -10705349 -18990644 -20136022
42228b0136022M877573O020393N266456N322212M152685K87432k634072j066920
42220B089737K269107K263105p99217k131322l2615J920318L89109l439346n716989
42211c188113m034470M53603L665619K131973k668919m874523j075745M864156
42203d726419O256128J621665m462239p572227p225063m652795l78252M591668
42195a6547534P642906O888296L891784K242370L139771L756806J120808l255098
42187H880109m803770k123852J137568K010605K318320M009776M048600p44320
42179A4733036o340194n887631m51250K275569K33084n70833K288742K937847
42171I218370j679606n135998k344558J222721q07898m145923j682174K997957
$$ plain form
42228 -20136022 -15258449 -9238056 -3971600 1350612 5503297 5790729 3156657 2089737
42220 2089737 4358844 6621949 5822732 3691410 3658795 5579113 5968222 2528876 -3188113
42211 -3188113 -7222583 -6768980 -3103361 -971388 -3640307 -8514830 -9590575 -4726419
42203 -4726419 1529709 3151374 -1310865 -8883092 -16108155 -20760950 -21139202 -16547534
42195 -16547534 -8904628 -2016332 1875452 4117822 7257593 11014399 12135207 8880109
42187 8880109 4076339 1952487 3090055 5100660 7418980 11428756 15477356 14733036
42179 14733036 8392842 2505211 2053961 4329530 4562614 3991781 6280523 9218370
42171 9218370 7538764 2402766 58208 1280929 473031 -3672892 -5355066 -2357109
42163b357109J307057m850984n433363J210308O178129M997888L155752M379426
42155H587104M507558J042467j292618K14772N51748l302542n219816n2406N960751
42146A0997018L732434m415242q074523l693482K377395M617002M014953K741864
42138A2297419M60535k433924l820927l994893n641924p766000n070519L330442
42130a2639791R502915O047970l163564p436961l395742J455064M82192k734836
42122a1882753q69162N406585Q130198L556815k859351m367690j163033J832983
42114b215408J963570M47947p87953q92406J2553N77557p59118l039872l239851
42105g932981q94767Q91590J127914L443237R282918J2878619Q441202p99478
$$ plain form
42163 -2357109 -1050052 -5901036 -11334399 -10124091 -3945962 1051926 4207678 8587104
42155 8587104 13094662 14137129 12844511 13059283 13611031 10308489 5088673 5036267 10997018
42146 10997018 14729452 10314210 2239687 -1453795 923600 5540602 9555555 12297419
42138 12297419 12757954 10324030 6503103 2508210 -3133714 -10899714 -15970233 -12639791
42130 -12639791 -3136876 2911094 -252470 -7689431 -11085173 -9630109 -9147917 -11882753
42122 -11882753 -12751915 -7345330 784868 4341683 1482332 -2885358 -4048391 -2215408
42114 -2215408 -251838 196109 -591844 -1484250 -1471697 -894140 -1653258 -4693130 -7932981
42105 -7932981 -8827748 -7936158 -6808244 -3365007 5917911 18796530 27237732 26438254
42097B6438254o845076p741041p417141o748331k911788K526326L422854j020854
42089b96797l606474M05330O348102P238372K730084k592725n607903n879160
42081a261171l943350j441707l96194n49769r7517L97088j302262m126319m284063
42072a7005264j462400R94149K651713O094349R384628O482742j989768o723713
42064a573564k827404K925676L183881N36045N53871J786832M08780j542568p96371
42055B655178j44021k753093m538380j072177L078325J642922j573471R53989
42047a750728O442040O129427P33197j307257N64950j006756n605020m002030
42039A97823M469019P932594O29411p523574o805996j251281J495267K671654
$$ plain form
42097 26438254 19593178 11852137 4434996 -2313335 -5225123 -2698797 724057 -296797
42089 -296797 -3903271 -3497941 2850161 10088533 12818617 10225892 4617989 -1261171
42081 -1261171 -5204521 -6646228 -7042422 -7592191 -7689708 -7292620 -8594882 -12721201 -17005264
42072 -17005264 -18467664 -17473515 -14821802 -8727453 657175 7139917 5150149 -1573564
42064 -1573564 -4400968 -1475292 1708589 2244634 2798505 4585337 4994117 3451549 2655178
42055 2655178 2511157 -241936 -4780316 -5852493 -2774168 -1131246 -2704717 -1750728
42047 -1750728 4691312 10820739 11553936 10246679 10811629 9804873 4199853 197823
42039 197823 4666842 12599436 13228847 5705273 -1100723 -2352004 -856737 1814917
42031A814917N280160M504008l390348j0279783o561509K955520N760888Q36445
42023I20298j223300L886668Q165672M702510k961684p731872p479455l985929
42015e707092J66477J424911k078819n833987k904670N442882R383201L664350
42007C557253m963887p215593k701013K585109N337899O008250M341069j39218
41999F809869m900165o782165o449988o116707m573264L59403N921557P261131
41991h470329N761351P289165J1046066Q492704k645180j1401181p825111J882831
41983D130316L960942k740281o252839q04786N171918L815824k94654J02289K086272
41974I175001j244743p405933p661906j019488M558575M382976J799339K91541
$$ plain form
42031 1814917 7095077 11599085 8208737 -2071046 -8632555 -5677035 83853 920298
42023 920298 -303002 3583666 11749338 16451848 13490164 5758292 -1721163 -5707092
42015 -5707092 -5540615 -4115704 -6194523 -12028510 -14933180 -9490298 -107097 3557253
42007 3557253 -1406634 -8622227 -11323240 -8738131 -3400232 2608018 6949087 6809869
41999 6809869 1909704 -4872461 -11322449 -17439156 -22012420 -21653017 -15731460 -8470329
41991 -8470329 -2708978 4580187 15626253 24118957 21473777 10072596 2247485 4130316
41983 4130316 8091258 5350977 -901862 -1706648 3465270 7281094 6986440 7088729 9175001
41974 9175001 7930258 524325 -7137581 -8157069 -3598494 784482 2583821 2875362
41966B875362q88379j630024P48234N358302O489517J755237l940326n509930
41958E257993l688555j278856J293745L594443L483330J180286K38437J344274
41950A1425097M17819l692981n654982k373670R03088p81957l141326J09599N663368
41941B874055N078041j807122o724842n230713j015650J673024K252726M81661
41933b418820l428416n069087j86073O397297M955242l903667p574167M98707
41925a0728984J0042618Q284643k004327p694532m192128N53332k18959l478393
41917i436730l398185K8528K796393K861168Q68980k231531n039703m795641K33849
41908a8112872P562916J1741935R342344J905603n897821r918666q391069k095113
$$ plain form
41966 2875362 1986983 356959 1105193 6463495 12953012 14708249 10767923 5257993
41958 5257993 1569438 290582 1584327 5178770 8662100 9842386 10080823 11425097
41950 11425097 11842916 8149935 2494953 121283 1024371 242414 -2898912 -2789313 2874055
41941 2874055 7952096 6144974 -579868 -5810581 -6826231 -5153207 -2900481 -2418820
41933 -2418820 -5847236 -10916323 -11102396 -4705099 250143 -3653524 -11227691 -10728984
41925 -10728984 -686366 7598277 5593950 -2100582 -6292710 -5739378 -5958337 -9436730
41917 -9436730 -12834915 -12806387 -10009994 -7148826 -6279846 -8511377 -13551080 -18346721 -18112872
41908 -18112872 -10549956 1191979 10534323 12439926 6542105 -3376561 -11767630 -13862743
41900a3862743N617245R804696P501692J168857l266804l042613j435934k352869
41892A31527m264703k823232J718482M078934J530328k257492k910229j338096
41884f134481r82842j737580p21288J890320K187145j404950m883555l711514
41876a5498745J035419M217911L321305P55671m99148n11327m49693J51559J718436
41867e758612K360524N71364j252667k3766K198543O89064l458829l599299J641476
41858f632202M595471R1863n550552l902759K118296K886720k591377n654895
41850a4639435j930461L351143N423920N915955N698769J275433o481439q657912
41842a0044027p64326P986614O538399j903132n176651l63936L812532K133682
$$ plain form
41900 -13862743 -8245498 1559198 9060890 10229747 6962943 3920330 2484396 131527
41892 131527 -4133176 -6956408 -5237926 -1158992 371336 -1886156 -4796385 -6134481
41884 -6134481 -7117323 -8854903 -9576191 -7685871 -5498726 -6903676 -11787231 -15498745
41876 -15498745 -14463326 -10245415 -6924110 -6168439 -6667587 -7178914 -7628607 -7477048 -5758612
41867 -5758612 -3398088 -2826724 -4079391 -4103157 -1904614 -1215550 -4674379 -8273678 -6632202
41858 -6632202 -2036731 -1944868 -7495420 -11398179 -9279883 -6393163 -8984540 -14639435
41850 -14639435 -16569896 -13218753 -7794833 -1878878 3819891 5095324 -1386115 -10044027
41842 -10044027 -10808353 -2821739 3716660 1813528 -3363123 -3727059 85473 2219155
41834B219155k99563J143269K572732m59461m095656k131409L340848M441094
41826F731009p47639n492069m326523k53076P26302j464124j816658J262696L182776
41817b197306N76433k459630K61159O975158Q620401R02998q818643j0174960
41809f314390k585641M801946M993473O36646j290517J172599L543004J631412
41801F588532k954707n111972k864616M17343J019280r4548N03152L006111M299555
41792D808130L079277J124176q00167l752848o076341l289440M346065Q959424
41784H398276M616331l618423n720520O457N287406L207187l742829p827715m849717
41775d243547K208041O357269L351108l561010o832104l595843J279749K732217
$$ plain form
41834 2219155 1919592 3062861 5635593 5176132 1080476 -1050933 2289915 6731009
41826 6731009 5983370 491301 -3835222 -4088298 -3361996 -4826120 -6642778 -5380082 -2197306
41817 -2197306 -1620873 -4080503 -3819344 3155814 11776215 12679213 3860570 -6314390
41809 -6314390 -8900031 -4098085 895388 1532034 241517 1414116 4957120 6588532
41801 6588532 3633825 -1478147 -4342763 -3925420 -2906140 -3000688 -2497536 508575 4808130
41792 4808130 7887407 9011583 8211416 4458568 -1617773 -4907213 -561148 8398276
41784 8398276 13014607 9396184 3675664 3682121 8969527 12176714 8433885 606170 -4243547
41775 -4243547 -2035506 4321763 7672871 4111861 -2720243 -6316086 -5036337 -2304120
41767b304120J805328J125743p84595n001066o621252j363535N529188N738229
41759a876080J051669K54633L884545L573579k046335l236851M284249J0239841
41751A6129250M925175n943217j0622867q110994n384744l635274J278530P490142
41743c873999P750856J577998l013280j496701J725339J959577O99160M32418
41735E761368k73656k393411k596354J310606M949667K726105l420514n914107
41727A49704k047102K181096N95015m269974m560589J684557P311396N913604
41719F957707R01010J76006M000453M606158j526691p716082o714240r18967J883412
41710A648766n94876l658476l017328Q80925M790399N536164K188536k171121
$$ plain form
41767 -2304120 -498792 626951 -157644 -5158710 -11779962 -13143497 -7614309 -1876080
41759 -1876080 -824411 -569778 3314767 6888346 4842011 1605160 5889409 16129250
41751 16129250 21054425 15111208 4488341 -3622653 -9007397 -12642671 -11364141 -3873999
41743 -3873999 3876857 5454855 2441575 944874 2670213 4629790 5328950 5761368
41735 5761368 5487712 3094301 497947 1808553 6758220 9484325 6063811 149704
41727 149704 -1897398 283698 878713 -3391261 -7951850 -6267293 1044103 6957707
41719 6957707 7858717 8034723 12035176 16641334 15114643 7398561 684321 -234646 1648766
41710 1648766 1053890 -2604586 -5621914 -4740989 49410 5585574 7774110 5602989
41702E602989k991092n51646l3384k769589k948711K325076N907926J018909o449385
41693h88907n677075K296312O295999K197457k888485m027891m363222n194698
41685a2250510j925423N294949P693766J295845n104767l034872K821609L484945
41677a724458J27071l01032J708337M00817l145113k342112K519962L914070q7028
41668A070514k538339L58009K905041k54999n189398m889020M87415M890662M882417
41659A722302K253798k1792n64941P33897K734453L070939K85849m199018p429591
41650a414104p687658n180151j242685J953241K311275L27815j70360L887754
41642g214873J0015000J1811453O353904k064107p182034p813317o808993m589750
$$ plain form
41702 5602989 2611897 2060251 2026867 -742722 -3691433 -1366357 4541569 5560478 -888907
41693 -888907 -6565982 -4269670 2026329 4223786 1335301 -2692590 -7055812 -12250510
41685 -12250510 -14175933 -8880984 -1187218 108627 -4996140 -8031012 -5209403 -1724458
41677 -1724458 -1597387 -1898419 -190082 210735 -2934378 -5276490 -2756528 1157542 1070514
41668 1070514 -1467825 -1109816 1795225 1540226 -3649172 -8538192 -8050777 -3160115 1722302
41659 1722302 3976100 3954308 3389367 4123264 6857717 9928656 10214505 6015487 -1414104
41650 -1414104 -9101762 -14281913 -15524598 -13571357 -11260082 -10932267 -11102627 -7214873
41642 -7214873 2800127 14611580 20965484 18901377 11719343 3906026 -2902967 -7492717
41634g492717J152479Q248535Q448643k219140j5160363j7505592p421138M751891
41626b7197402J0103997R406327P113073M327004Q89147j276117j033374l65056
41618A967599o93262p04833l38710k149968n652018n675566l92130M440855L988277
41609e209756J519470J541693J744073j081137k902934P34171M592998J149198
41601B087776n177429l414286N326656P745144j011093r298153o599941J809085
41593h532241M960344K218381P00737K435804K702330j269041o420697p807970
41585a1012353k938446N962837J1967773R097566j2722o237179n500183k710147
41577a382854k036393o20382L669015N897896K220405k202519j457831N95639
$$ plain form
41634 -7492717 -6340238 1908297 10356940 8137800 -7022563 -24528155 -31949293 -27197402
41626 -27197402 -17093405 -7687078 -574005 3752999 4642146 3366029 2332655 1967599
41618 1967599 1274337 569504 230794 -1919174 -7571192 -13246758 -13638888 -9198033 -5209756
41609 -5209756 -3690286 -2148593 -404520 -1485657 -4388591 -3654420 938578 2087776
41601 2087776 -3089653 -6503939 -1177283 6567861 5556768 -3741385 -10341326 -8532241
41593 -8532241 -3571897 -1353516 -652779 1783025 4485355 3216314 -3204383 -11012353
41585 -11012353 -13950799 -7987962 3979811 13077377 13064655 6827476 1327293 -1382854
41577 -1382854 -3419247 -4039629 -370614 5527282 7747687 5545168 4087337 4682976
41569D682976k610503p305338m405804M580122Q358774L125933k137373m95533
41561C793254L016916J338095l148931l720337j00026K601488K027436l34437
41553E473458l364106n882169m307397K999706J0007020Q159899j747511q740918
41545B597982n355291K693781M629856j070832o006404m213258R55534L663359
41537b105273L642648L709276L442203P05622k653907k473239O84374J686164
41529F637868j200276l766202k901822j076582j257818k041294j147977K75580
41521f478523N40357J065236L261538M953002L948095K166783J887003Q90137
41513A2233628l544664q206185p252131q02220N063965O292417M025853M70699
$$ plain form
41569 4682976 2072473 -5232865 -9638669 -5058547 3300227 6426160 4288787 3793254
41561 3793254 6810170 8148265 4999334 1278997 1178971 3780459 5807895 5473458
41553 5473458 2109352 -3772817 -8080214 -5080508 4926512 13086411 11338900 2597982
41545 2597982 -2757309 -63528 4566328 3495496 -2510908 -6724166 -5768632 -2105273
41537 -2105273 1537375 5246651 8688854 9394476 6740569 4267330 4951704 6637868
41529 6637868 5437592 1671390 -1230432 -2307014 -3564832 -5606126 -6754103 -6478523
41521 -6478523 -5938166 -4872930 -1611392 3341610 7289705 9456488 11343491 12233628
41513 12233628 8688964 482779 -6769352 -7571572 -2507607 3784810 7810663 8281362
41505H281362l293057n366912l808269j67588J554720M1920k318873l262563k327663
$$ plain form
41505 8281362 4988305 -378607 -4186876 -4354464 -2799744 -2757824 -5076697 -8339260 -10666923
$$ [...]
##END NTUPLES=NMR SPECTRUM
##END=
