##TITLE=31Pdec_LR-683B-CS1
 DMSO, 24 sc
 28.2.2020
##JCAMPDX= 6.0         $$ Bruker NMR JCAMP-DX V2.0
##DATA TYPE= NMR SPECTRUM
##DATA CLASS= NTUPLES
##ORIGIN= UXNMR, Bruker Analytische Messtechnik GmbH
##OWNER= root
$$ XWIN-NMR		Version 3.5
$$ Fri Feb 28 16:23:49 2020 Russian Standard Time (UT+4h)  she@DPX200
##.OBSERVE FREQUENCY= 81.013821
##.OBSERVE NUCLEUS= ^31P
##.ACQUISITION MODE= SIMULTANEOUS
##.ACQUISITION SCHEME= undefined
##.AVERAGES= 24
##.DIGITISER RES= 17
##SPECTROMETER/DATA SYSTEM= spect
##.PULSE SEQUENCE= zgpg30
##.SOLVENT NAME= DMSO
##.SHIFT REFERENCE= (INTERNAL, DMSO, 0, 182.463)
##AUDIT TRAIL= $$ (NUMBER, WHEN, WHO, WHERE, WHAT)
$$ ##TITLE= Audit trail, XWIN-NMR		Version 3.5
$$ ##JCAMPDX= 5.01
$$ ##ORIGIN= Bruker BioSpin GmbH
$$ ##OWNER= she
$$ F:/spectra/data/she/nmr/P31/1/pdata/1/auditp.txt
$$ ##AUDIT TRAIL=  $$ (NUMBER, WHEN, WHO, WHERE, WHAT)
(   1,<2020-02-28 16:22:43.25 +0400>,<she>,<DPX200>,
      <created by zg, POWCHK disabled, PULCHK disabled
       configuration hash MD5:
       00 E9 B6 7A A2 85 ED C7 34 08 36 98 17 FE 4E 26
       data hash MD5: 32K
       4D EA A5 21 D4 15 27 91 A9 AE 8A 39 F8 AB 6F 1D>)
(   2,<2020-02-28 16:22:48.32 +0400>,<she>,<DPX200>,
      <Start of raw data processing
       efp BC_mod = 2 LB = 1 FT_mod = 6 PKNL = 1 PHC0 = -1610.753 PHC1 = 671.0013 SI = 64K 
       data hash MD5: 64K
       7A 8A BD 02 AB B7 3B EA 74 04 2F 54 47 4F D8 61>)
(   3,<2020-02-28 16:22:59.50 +0400>,<she>,<DPX200>,
      <pk PHC0 = 67.13357 PHC1 = 0 
       data hash MD5: 64K
       E9 78 53 15 DA B4 E7 4A 29 3E E8 03 8E 23 05 39>)
(   4,<2020-02-28 16:23:03.14 +0400>,<she>,<DPX200>,
      <abs ABSG = 5 
       data hash MD5: 64K
       B8 43 DD F6 FD 85 37 78 3E B1 9F 52 68 70 0D 68>)
$$ ##END=
$$ 
$$ hash MD5
$$ AA B6 31 2C F7 9B 74 B3 8E E4 84 6F FC 96 45 E6
##$RELAX= 
##$RELAX= 
##$RELAX= 
##$RELAX= 
##$RELAX= 
##$RELAX= 
##$RELAX= 
##$RELAX= 
$$ Bruker specific parameters
$$ --------------------------
##$DU= <F:/spectra>
##$EXPNO= 1
##$NAME= <P31>
##$PROCNO= 1
##$TYPE= <nmr>
##$USER= <she>
##$AMP= (0..31)
100 100 100 100 100 100 100 100 100 100 100 100 100 100 100 100 100 100 
100 100 100 100 100 100 100 100 100 100 100 100 100 100 
##$AQSEQ= 0
##$AQ_mod= 1
##$AUNM= <au_zg>
##$AUTOPOS= <>
##$BF1= 81.014009
##$BF2= 200.13
##$BF3= 200.13
##$BF4= 200.13
##$BF5= 200.13
##$BF6= 200.13
##$BF7= 200.13
##$BF8= 200.13
##$BYTORDA= 1
##$CFDGTYP= 0
##$CFRGTYP= 5
##$CHEMSTR= <none>
##$CNST= (0..31)
1 1 145 1 1 1 1 1 1 1 1 1 1 1 1 1 1 1 1 1 1 1 1 1 1 1 1 1 1 1 1 1 
##$CPDPRG= <waltz16>
##$CPDPRG1= <>
##$CPDPRG2= <waltz16>
##$CPDPRG3= <>
##$CPDPRG4= <mlev>
##$CPDPRG5= <mlev>
##$CPDPRG6= <mlev>
##$CPDPRG7= <mlev>
##$CPDPRG8= <mlev>
##$CPDPRGB= <>
##$CPDPRGT= <>
##$D= (0..31)
0 1 0 0 0 0 0 0 0 0 0 0.03 2e-05 3e-06 0 0 0 0 0 0 0 0 0 0 0 0 0 0 0 0 
0 0 
##$DATE= 1582892562
##$DBL= (0..7)
120 120 120 11 120 120 24 19 
##$DBP= (0..7)
150 150 150 150 150 150 150 150 
##$DBP07= 0
##$DBPNAM0= <>
##$DBPNAM1= <>
##$DBPNAM2= <>
$$ [...]
##$SUBNAM3= <"">
##$SUBNAM4= <"">
##$SUBNAM5= <"">
##$SUBNAM6= <"">
##$SUBNAM7= <"">
##$SUBNAM8= <"">
##$SUBNAM9= <"">
##$SW= 369.568048894756
##$SWIBOX= (0..15)
0 1 3 0 0 0 0 0 0 0 0 0 0 0 0 0 
##$SW_h= 29940.119760479
##$TD= 32768
##$TD0= 1
##$TE= 0
##$TE2= 300
##$TE3= 300
##$TEG= 300
##$TL= (0..7)
0 120 53 12 22 120 120 120 
##$TP= (0..7)
150 150 150 150 150 150 150 150 
##$TP07= 0
##$TPNAME0= <>
##$TPNAME1= <>
##$TPNAME2= <>
##$TPNAME3= <>
##$TPNAME4= <>
##$TPNAME5= <>
##$TPNAME6= <>
##$TPNAME7= <>
##$TPOAL= (0..7)
0.5 0.5 0.5 0.5 0.5 0.5 0.5 0.5 
##$TPOFFS= (0..7)
0 0 0 0 0 0 0 0 
##$TUNHIN= 0
##$TUNHOUT= 0
##$TUNXOUT= 0
##$USERA1= <user>
##$USERA2= <user>
##$USERA3= <user>
##$USERA4= <user>
##$USERA5= <user>
##$V9= 5
##$VALIST= <valist>
##$VCLIST= <CCCCCCCCCCCCCCC>
##$VD= 0
##$VDLIST= <DDDDDDDDDDDDDDD>
##$VPLIST= <PPPPPPPPPPPPPPP>
##$VTLIST= <TTTTTTTTTTTTTTT>
##$WBST= 1024
##$WBSW= 4
##$XGAIN= (0..3)
0 0 0 0 
##$XL= 0
##$YL= 0
##$YMAX_a= 9331
##$YMIN_a= -9217
##$ZGOPTNS= <>
##$ZL1= 120
##$ZL2= 120
##$ZL3= 120
##$ZL4= 120
##$ABSF1= 182.463
##$ABSF2= -187.1042
##$ABSG= 5
##$ABSL= 3
##$ALPHA= 0
##$AQORDER= 0
##$ASSFAC= 0
##$ASSFACI= 0
##$ASSFACX= 0
##$ASSWID= 0
##$AUNMP= <proc_1d>
##$AZFE= 0.1
##$AZFW= 0.5
##$BCFW= 0
##$BC_mod= 2
##$BYTORDP= 0
##$COROFFS= 0
##$CY= -3
##$DATMOD= 1
##$DC= 0
##$DFILT= <>
##$DTYPP= 0
##$F1P= 0
##$F2P= 0
##$FCOR= 1
##$FTSIZE= 65536
##$FT_mod= 6
##$GAMMA= 0
##$GB= 0
##$INTBC= 1
##$INTSCL= 5.30512e-09
##$ISEN= 30
##$LB= 1
##$LEV0= 0
##$LPBIN= 0
##$MAXI= 10000
##$MC2= 0
##$MEAN= 0
##$ME_mod= 0
##$MI= 50
##$NCOEF= 0
##$NC_proc= -6
##$NLEV= 6
##$NOISF1= 182.463
##$NOISF2= 159.3651
##$NSP= 0
##$NTH_PI= 0
##$NZP= 0
##$OFFSET= 182.463
##$PC= 4
##$PHC0= -1543.62
##$PHC1= 671.0013
##$PH_mod= 1
##$PKNL= yes
##$PPARMOD= 0
##$PSCAL= 0
##$PSIGN= 0
##$REVERSE= no
##$SF= 81.0140089999434
##$SI= 65536
##$SIGF1= 159.3651
##$SIGF2= -187.1042
##$SINO= 113.3802
##$SIOLD= 16384
##$SREGLST= <1H.CDCl3>
##$SSB= 0
##$STSI= 65536
##$STSR= 0
##$SW_p= 29940.119760479
##$SYMM= 0
##$S_DEV= 0
##$TDeff= 32768
##$TDoff= 0
##$TI= <>
##$TILT= no
##$TM1= 0
##$TM2= 0
##$TOPLEV= 0
##$USERP1= <user>
##$USERP2= <user>
##$USERP3= <user>
##$USERP4= <user>
##$USERP5= <user>
##$WDW= 1
##$XDIM= 65536
##$YMAX_p= 302631395
##$YMIN_p= -29191399
$$ End of Bruker specific parameters
$$ ---------------------------------
##NTUPLES= NMR SPECTRUM
##VAR_NAME=  FREQUENCY,     SPECTRUM/REAL,   SPECTRUM/IMAG
##SYMBOL=    X,             R,               I
##VAR_TYPE=  INDEPENDENT,   DEPENDENT,       DEPENDENT
##VAR_FORM=  AFFN,          ASDF,            ASDF
##VAR_DIM=   65536,         65536,           65536
##UNITS=     HZ,            ARBITRARY UNITS, ARBITRARY UNITS
##FACTOR=    0.456856943014862, 1,           1
##FIRST=     14782.0589164792, 0,            0
##LAST=      -15158.0608439998, 0,           0
##MIN=       -15158.0608439998, -29191399,   0
##MAX=       14782.0589164792, 302631395,    0
$$ Real data points
##PAGE= N=1
##DATA TABLE= (X++(R..R)), XYDATA
$$ [...]
44304a345033J326382J39085r28802p74730J18983O50673O00465N58028O81973
44295A027024M26188l29626p29575j13507Q33432R01768P0446m63721k7340N84759
44285B179848L25343n24904o99059K38018J131787P16229n75472j068631j63470
44276A559689P62077L57515p28240j051400q27728j394195k400903j794365P09452
44267d808098K399316J341552n20511j86668J841575K410569M98594j526106j538481
44258h8258j66109Q65587Q95741J43764r49717j498859p48957N53601P83153j48799
44248c58853n87689J86088Q61298L78882n13788q96747j055807j159566l85078
44239c531260J324331K335273J587613J91360n92692j153923j780197j239673
$$ plain form
44304 -1345033 -18651 120434 -808368 -1583098 -1464115 -813442 -212977 345051 1027024
44295 1027024 1453212 1123586 394011 280504 1113936 2015704 2086150 1622429 1595089 2179848
44285 2179848 2505191 1980287 1281228 1519246 2651033 3367262 2791790 1723159 1559689
44276 1559689 2321766 2679281 1951041 899641 71913 -1322282 -3723185 -5517550 -4808098
44267 -4808098 -2408782 -1067230 -1587741 -1774409 67166 2477735 2976329 1450223 -88258
44258 -88258 -254367 611220 1506961 1650725 701008 -797851 -1546808 -993207 -210054 -358853
44248 -358853 -946542 -760454 100844 479726 -34062 -930809 -1986616 -3146182 -3531260
44239 -3531260 -2206929 128344 1715957 1907317 1314625 160702 -1619495 -2859168
44231b859168P51583J729055r9792k383710j778181P79729J544414j24525j237423
44222c678018l84071N86529O17150J145297K506408K424652K9769j906705j072376
44213B68635Q49376J227297N03500L52103J24522j486043k884506j445161J781985
44204g08292K946113J061315o55234J19019J507840P79525j436259k389135j271074
44195d6182J00915K11644l49764l03384L24819L99502n32686j438698j071323
44186b705157M07122J659561J842404J278606M85688m57675j260562j220048l26875
44177b96936L71740K51802J983K13182J93115o54105j347990p44533M25261O23516
44167i62965n0554l15507o9328k20075m56284M44947J905832J619136q89222l008060
$$ plain form
44231 -2859168 -2107585 -378530 -478322 -2862032 -4640213 -3860484 -2316070 -2440595 -3678018
44222 -3678018 -4062089 -3475560 -2858410 -1713113 793295 3217947 3247716 1341011 268635
44213 268635 1118011 2345308 2848808 3200911 3325433 1839390 -1045116 -2490277 -708292
44204 -708292 2237821 3299136 2643902 2762921 4270761 5050286 3614027 1224892 -46182
44195 -46182 54733 266377 -83387 -386771 -61952 337550 -195136 -1633834 -2705157
44186 -2705157 -2298035 -638474 1203930 2482536 2968224 2510549 1249987 29939 -296936
44177 -296936 74804 326606 328589 541771 734886 80781 -1267209 -2011742 -1586481 -962965
44167 -962965 -1013519 -1329026 -1398354 -1618429 -2074713 -1629766 276066 1895202 1005980 -2002080
44157b002080k536640n31166P20867Q76345J021105J331724J162826O80587O10457
44148A334025P62386L80880k84743k55165L63976K52712j110994k391929j945865
44139b894717O2594J587372Q49736j424329k306421L6796L535039M082692O34216
44130D162978l156033l432161p43482J452030J552142Q38523M88215J57107l38492
44121I80827k91892K94309L09517m90623q12010L6960R19369P19184p2031o09504
44111I84106j033438j400587q14665Q95673K014077J203706k19296k20722P26867
44102B135721N98174o57154j073235o3397P05790K89257j06241M11130O92134
44093B932179l59604j692590j653368l74594Q30054J396302J424292O62290q59640
$$ plain form
44157 -2002080 -4538720 -5069886 -4349019 -3472674 -2451569 -1119845 42981 723568 1334025
44148 1334025 2096411 2477291 2192548 1937383 2301359 2554071 1443077 -948852 -2894717
44139 -2894717 -2832123 -1244751 -395015 -1819344 -4125765 -4088969 -553930 3528762 4162978
44130 4162978 1006945 -2425216 -3168698 -1716668 -164526 673997 1162212 1319319 980827
44121 980827 688935 983244 1292761 802138 -9872 27088 946457 1665641 1593610 984106
44111 984106 -49332 -1449919 -2264584 -1368911 645166 1848872 1629576 1408854 2135721
44102 2135721 2733895 2076741 1003506 940109 1645899 1935156 1828915 2240045 2932179
44093 2932179 2572575 879985 -773383 -1147977 -317923 1078379 2502671 3164961 2305321
44084B305321j930133j473708k40570K89763J33223L11606O42279j8220j381695
44075a362134j632412k09363J126049Q44828k00671k25309R81408K075656J966141
44066C364193O85704r95330k057324j785138m86658O75612R42678N73964K3270
44057I40971o34776j055285m59574J084230K116773J502422m731q75148p95686
44048A819196m67008j01000M98556P80829o7167j499032j946500j034990j21826
44039b138942j84888m52951J18327J057645J084970K5933r63702r14311o2580
44030b430499O49762O35807J48512j04559J77279M73884J44346n64488p56435
44021a626391k17013J92817j46769n78471j35663R18733J415074R86654M83276
$$ plain form
44084 2305321 375188 -1098520 -1339090 -1049327 -916104 -604498 37781 19561 -1362134
44075 -1362134 -2994546 -3203909 -2077860 -1233032 -1433703 -1659012 -677604 1398052 3364193
44066 3364193 4049897 3054567 997243 -787895 -1274553 -598941 343737 917701 940971
44057 940971 306195 -749090 -1208664 -124434 1992339 3494761 3490030 2614882 1819196
44048 1819196 1352188 1251188 1749744 2530573 2463406 964374 -982126 -2017116 -2138942
44039 -2138942 -2323830 -2776781 -2658454 -1600809 -515839 -489906 -1453608 -2367919 -2430499
44030 -2430499 -1780737 -1144930 -996418 -1100977 -923698 -449814 -305468 -869956 -1626391
44021 -1626391 -1843404 -1650587 -1797356 -2375827 -2511490 -1592757 -177683 808971 1292247
44012A292247M82697L64872m74750j220945n22984J383285K552452J676438l26509
44003E206803j653242j797582j534160j270398n92952N81579J498298J520078
43995A958424Q23898j09917r90279j487960j291906o74775k69404q0999M08109
43986a714809R69887O37574n71342j222506n15635M60158M80180J208O9960N44182
43976h61143P35536P82914R37562N34772o76479j259461j15905J207789N81015
43967A866600j128055j253239L02740R58291j52995q72367J32007J273636J091105
43958B217723N62146P19819N20114r06173k071374j407874O4972N20788J64727
43949C84868J29529J12558n25002p32516N60844J898359J139261r79909j851508
$$ plain form
44012 1292247 1774944 2139816 1665066 444121 -78863 1304422 3856874 5533312 5206803
44003 5206803 3553561 1755979 221819 -1048579 -1641531 -1059952 438346 1958424
43995 1958424 2782322 2672405 1682126 194166 -1097740 -1772515 -2041919 -2122918 -1714809
43986 -1714809 -744922 -107348 -678690 -1901196 -2416831 -1956673 -1476493 -1475285 -1405325 -861143
43976 -861143 -125607 657307 1594869 2129641 1453162 193701 77796 1285585 1866600
43967 1866600 738545 -514694 -211954 746337 593342 -279025 -147018 1126618 2217723
43958 2217723 2779869 3499688 4019802 3113629 1042255 -365619 -300647 220141 384868
43949 384868 514397 626955 101953 -630563 -69719 1828640 2967901 1987992 136484
43940A36484r49305l6470J09309L07022N17095k47254j401653j114934M37874
43931b241832J048902K99398L39808J812451K166087j64275k701160k432950k20171
43922b093742R32412M31783J38930P70039J025833J68302q57642j153123r22139
43913a559347m43900N11966J742875K240623J362132k94631j543513j673356p51118
43904d08269O11476J615266J746054J064798O499r41082j342620j024739l66648
43895I60735J0922l2491j89170l91373p15582o74779K42962J180903N54230j330067
43885c83710j953247m0496K205954K006241o3856j085442j9197J316584J308288
43876C291119L86771n05576j283727j845455j503680k65373N74208J20919p40284
$$ plain form
43940 136484 -812821 -849291 -739982 -432960 84135 -163119 -1564772 -2679706 -2241832
43931 -2241832 -1192930 -893532 -553724 1258727 3424814 3260539 559379 -1873571 -2093742
43922 -2093742 -1161330 -729547 -590617 179422 1205255 1373557 515915 -637208 -1559347
43913 -1559347 -2003247 -1491281 251594 2492217 3854349 3559718 2016205 342849 -408269
43904 -408269 203207 1818473 3564527 4629325 4635824 3694742 2352122 1327383 960735
43895 960735 971657 939166 749996 358623 -356959 -1031738 -788776 392127 946357 -383710
43885 -383710 -2336957 -2377453 -171499 1834742 1770886 685444 666247 1982831 3291119
43876 3291119 3677890 3172314 1888587 43132 -1460548 -1725921 -1151713 -1030794 -1771078
43867a771078n65325P31532J962840K143417J255755J0478o59376l09438M48599
43858C247404N67521n3835m93168k97206j28283n42896j137475j465526j726297
43849b029761j796379p80319J324255K630760J624689l44401o76674P57093J551012
43840B260275N08230p14167m49601M59679L41791n88223q93194l99129k21069
43831C04592o48299o92536J30699R75196J008483N20656K49751M12254P86223
43822C047019J077404R13920J38925o75690p31138k05057j08662p15876j152080
43813A588765r16336o08775n07382J95740J619899K027438J80751k090386j883086
43804c93372N34667J843904L94542j528002j249044M56959Q19065q48937k450579
$$ plain form
43867 -1771078 -2336403 -1604871 357969 2501386 3757141 3767619 3108243 2798805 3247404
43858 3247404 3814925 3761090 3267922 2970716 2842433 2299537 1162062 -303464 -2029761
43849 -2029761 -3826140 -4606459 -3282204 -651444 973245 628844 -47830 709263 2260275
43840 2260275 2768505 2054338 1604737 2064416 2406207 1817984 924790 525661 304592
43831 304592 -343707 -1036243 -905544 69652 1078135 1598791 1848542 2260796 3047019
43822 3047019 4124423 5038343 5177268 4501578 3770440 3565383 3456721 2740845 1588765
43813 1588765 672429 63654 -443728 -247988 1371911 3399349 3580100 1489714 -393372
43804 -393372 141295 1985199 2379741 851739 -397305 59654 878719 29782 -2420797
43795b420797k085095j06209J809004K404851J506217p0430j006616n94505M55249
43786a08331Q67023M40860J27682M28901O29115L0327q35305r56741l77143j35051
43776A11337p05387j261698q17109M01665J213950R07610o9233p86303p72153
43767a777321k49823J71982r046o35960q63660j52680Q53345J197082J177608
43758b88473J798079K550750J557509j259345l128071k186248m54939o69510j695551
43749c775799l96926K711102L635130J129658j232127o46665R49479P48446l72914
43740B749384j78414O61114J39390j077130q85151K01563m7647j292210j012023
43731g41124Q98131J650208J77193j267975j056051m57841o60749n44036P96140
$$ plain form
43795 -2420797 -4505892 -4612101 -2803097 -398246 1107971 1037541 30925 -563580 -108331
43786 -108331 758692 1199552 1327234 1756135 2385250 2415577 1580272 623531 246388 111337
43776 111337 -594050 -1855748 -2672857 -2271192 -1057242 -149632 -218865 -1005168 -1777321
43767 -1777321 -2027144 -1855162 -1864208 -2500168 -3363828 -3516508 -2663163 -1466081 -288473
43758 -288473 1509606 4060356 5617865 4358520 1230449 -955799 -1410738 -2080248 -3775799
43749 -3775799 -4172725 -1461623 2173507 3303165 2071038 1424373 2373852 3122298 2749384
43740 2749384 2570970 3232084 3371474 2294344 1409193 1610756 1563109 270899 -741124
43731 -741124 157007 1807215 1984408 716433 -339618 -797459 -1458208 -2002244 -1206104
43722a206104J893769J329930K23180K28177P61229L19253q10333j237293q37390
43713F64418m98740k87585L44575J093913J122232M25723l57934r99733j496936
43704I933j539814j123011p94791m10408J031344L135662L417338P58402k009075
43695B475580j497098J349397K587635Q79733j297884j947715j816993j767384
43687a034729j039812M90660J030176l35030j705339j205136R0096K62285k2544
43678c469373J091980K793168K222744r32559l307453k302126N26618J936252
43670a440749J236536K91417K57688L23107l68517j231316j243989l77838O06571
43661a947090J088839Q13440j43103j075223r78831J37469Q96211L27921o32872
$$ plain form
43722 -1206104 687665 2017595 2240775 2468952 3230181 3549434 2739101 1501808 664418
43713 664418 165678 -121907 222668 1316581 2438813 2864536 2506602 1506869 9933
43704 9933 -1529881 -2652892 -3447683 -3858091 -2826747 308915 3726253 4484655 2475580
43695 2475580 978482 2327879 4915514 5795247 4497363 2549648 732655 -1034729
43687 -1034729 -2074541 -1583881 -553705 -888735 -2594074 -3799210 -3709114 -3446829 -3469373
43678 -3469373 -2377393 415775 2638519 1705960 -1601493 -3903619 -3377001 -1440749
43670 -1440749 -204213 87204 344892 667999 299482 -931834 -2175823 -2553661 -1947090
43661 -1947090 -858251 -44811 -187914 -1263137 -2241968 -2104499 -1208288 -880367 -1513239
43652a513239n14926M05382O59369J22827J78088J137797J444789K20442j154172
43643I86357j162174l28439Q9482J80673N26781N39130m01376j146271l28132
43634a043969R81242N75055j253736j961517p36689M33597K49045l6775O30420
43625b163327J016303L451j000614k23419J382680J502592m237j146057q85922
43616a518550j14597K74410L49428J19395o40483j229877l64925J721204K944876
43607A540881J963229L941q13731j79750M06244q5929r69705r89084l3546P43070
43597A585620M00773n94638r99337m82604q0847o82288j656770j625605k51600
43588d387296J421128K215350J772270M90646p23091q16566L82990J496451R17739
$$ plain form
43652 -1513239 -2028165 -1622783 -963414 -840587 -662499 475298 1920087 2140529 986357
43643 986357 -175817 -504256 -414774 -234101 292680 831810 430434 -715837 -1043969
43634 -1043969 -62727 512328 -741408 -2702925 -3439614 -3006017 -2756972 -2793747 -2163327
43625 -2163327 -1147024 -1143573 -2144187 -2367606 -984926 517666 513429 -632628 -1518550
43616 -1518550 -1633147 -1358737 -1009309 -889914 -1530397 -2760274 -3125199 -1403995 1540881
43607 1540881 3504110 3508051 2694320 2514570 2920814 2834885 1865180 876096 842550 1585620
43597 1585620 1986393 1391755 392418 -90186 -171033 -853321 -2510091 -4135696 -4387296
43588 -4387296 -2966168 -750818 1021452 1512098 789007 -27559 355431 1851882 2769621
43579B769621j002268k115251j232722L18533O58047n1357j61084P81486J345612
43570A310617M29114j067930j517984p45341K8181P8658m3026K46751N72241M53619
43560b55100L82645J076669K017718J845589K81401j352581j843883j407047q58769
43551a13358m22882n6473j08372o82860r71480k99693N99074N11541l40847n82203
43541b467553J92576R13667Q57717O11832O68121L06317j143561k716290k616593
43532e393767m53267K066195K772987J158190j066088j585713K9435J714824J432606
43523F75402q1556l52025J120281J952291M07057j918519k371449q95338M19821
43514a044035N95266M96992O15409K79592n70662p66346J24543P57244j3164j292412
$$ plain form
43579 2769621 1767353 -347898 -1580620 -1262087 -604040 -655397 -816481 -34995 1310617
43570 1310617 1739731 671801 -846183 -1591524 -1563343 -1484685 -1527711 -1280960 -708719 -255100
43560 -255100 127545 1204214 3221932 5067521 5348922 3996341 2152458 745411 -113358
43551 -113358 -536240 -592713 -701085 -1383945 -2355425 -2655118 -2056044 -1544503 -1885350 -2467553
43541 -2467553 -2274977 -1361310 -503593 108239 776360 1082677 -60884 -2777174 -5393767
43532 -5393767 -5847034 -3780839 -1007852 150338 -915750 -2501463 -2472028 -757204 675402
43523 675402 593846 241821 1362102 3314393 3721450 1802931 -568518 -1463856 -1044035
43514 -1044035 -448769 48223 663632 943224 372562 -393784 -269241 488003 474839 -817573
43504h17573j458637m75184L46372M00884L64543Q14432J349669J327423P45984
43495B597913P1993l52635m34934j87978J97779L06123r2272n41699k53530P12357
43485B023117J043241k75384k153548k312112m05401J087684J48626j790673j835677
43476d470127J76880J679444J412220R46023J503649J743117K64191j624023j710591
43467g9217k21528P72464N31248J34614J97318J74704o0028J18515N64063K45427
43457B377580q62869j339709m13755Q37805J093219M14811m53073j298088k052054
43448a696133k088817r44336P37890J787886J737543R46131j05256j098075j715454
43439b438621j664902q70702L63391J274497J109278J62884j65953P90516J643529
$$ plain form
43504 -817573 -2276210 -2751394 -2405022 -2004138 -1639595 -825163 524506 1851929 2597913
43495 2597913 2669906 2317271 1882337 1694359 1892138 2198261 2105989 1564290 1310760 2023117
43485 2023117 3066358 2790974 637426 -1674686 -2080087 -992403 -843777 -2634450 -4470127
43476 -4470127 -4293247 -2613803 -1201583 -255560 1248089 2991206 3255397 1631374 -79217
43467 -79217 -300745 471719 1002967 1137581 1334899 1509603 1449575 1568090 2132153 2377580
43457 2377580 1514711 175002 -238753 599052 1692271 2107082 1654009 355921 -1696133
43448 -1696133 -3784950 -4729286 -3991396 -2203510 -465967 480164 374908 -723167 -2438621
43439 -2438621 -4103523 -4974225 -4610834 -3336337 -2227059 -2064175 -2230128 -1439612 203917
43430B03917P29734j239756k002056j030300q641R5197J31297L98385k45716j704254
43420d672193j683967O60438K487311J229587j130959q38520J882033L271423
43412A205153J715513m91002j270824j330561j670942j450344J00413J746693
43404a445901J902877Q48741k328L1778P16477J513758J605498L76327j472227
43395D075000k370159j919866j259297j034097n82457L25499P28060K95610J32317
43386a609390P31500R28791Q4947n57724j22699K38072l43719m95223Q34494J801737
43376A490786M73225j403549q14229J361072J412837j174454k724917j111652
43368b490881J255598J672421J002034J127164J355415J29877j637510j884463
$$ plain form
43430 203917 933651 -306105 -2308161 -3338461 -3347102 -3251905 -3120608 -2722223 -2967939 -4672193
43420 -4672193 -6356160 -5695722 -3208411 -1978824 -3109783 -3948303 -2066270 1205153
43412 1205153 2920666 2429664 1158840 -171721 -1842663 -3293007 -3192594 -1445901
43404 -1445901 456976 1305717 1303389 1335167 2051644 3565402 5170900 5547227 4075000
43395 4075000 1704841 -215025 -1474322 -2508419 -3090876 -2765377 -2037317 -1741707 -1609390
43386 -1609390 -877890 50901 135848 -421876 -544575 -306503 -650222 -1145445 -310951 1490786
43376 1490786 1964011 560462 -253767 1107305 2520142 1345688 -1379229 -2490881
43368 -2490881 -1235283 437138 1439172 2566336 3921751 4051628 2414118 529655
43360E29655q77518n66961j124286q65214M97764J148832J88128q86421o04160
43351b560181L63072O41319L50799N49308J309377J625895R07398m07654j555579
43342A223754k028290j608886n25073M78521Q02137O94626P84091J023144P93087
43333A637111Q9800k29926K40460O45153M4153j084662j372715m33178O38843
43324A75039P59113J10418m16798m66545m22198o51919r65310p94547J86841J521685
43314i64221K139980J413640j4350q96150q11402l60578j9322L26516N73645J89854
43304A577612p11854j098645n12808J16402J3179q8678O83296J493144Q85641
43295B357289p67711j602050r33006L6797L21235L51136O57137Q37840M92924
$$ plain form
43360 529655 -347863 -914824 -2039110 -2904324 -2406560 -1257728 -1069600 -1956021 -2560181
43351 -2560181 -2197109 -1555790 -1204991 -655683 653694 2279589 3186987 2779333 1223754
43342 1223754 -804536 -2413422 -2938495 -2459974 -1657837 -963211 -179120 844024 1637111
43333 1637111 1726911 1496985 1737445 2382598 2426751 1342089 -30626 -463804 175039
43324 175039 934152 1044570 627772 161227 -260971 -912890 -1878200 -2672747 -2485906 -964221
43314 -964221 1175759 2589399 2575049 1678899 867497 506919 487597 814113 1387758 1577612
43304 1577612 865758 -232887 -745695 -629293 -616114 -704792 -21496 1471648 2357289
43295 2357289 1589578 -12472 -945478 -908681 -587446 -236310 420827 1258667 1751591
43286A751591l9379m94182j053551j339995m18961J343733J888259K42674j546307
43277C33882r77310J269641K264441J046972k82257n5721N10359m15631k120688
43268A573688k302075n87406Q08243K55928j017722q08322R13936K084584J434326
43259B355180j35687j256609j739272j801172r72668Q89381K359192J883648J67839
43250A749832n43738L90271J267288P97860j23954k21523J36611r5996q24973
43241B531678j289109j475216j700815j460010j42747J446896J699021L24710
43233f5592j193902j315432J63788K209990L264565K235758k69278k064252j751726
43224A213919n43835n30541j627075j856142m81540R89125J210071O32684J51698
$$ plain form
43286 1751591 1712212 1218030 164479 -1175516 -1594477 -250744 1637515 1880189 333882
43277 333882 -643428 626213 2890654 3937626 3655369 3599648 4110007 3694376 1573688
43268 1573688 -728387 -1315793 -507550 -251622 -1269344 -2077666 -1163730 920854 2355180
43259 2355180 2219493 962884 -776388 -2577560 -3550228 -2660847 -301655 1581993 1749832
43250 1749832 1206094 1596365 2863653 3661513 3537559 3316036 3452647 3356651 2531678
43241 2531678 1242569 -232647 -1933462 -3393472 -3536219 -2089323 -390302 -65592
43233 -65592 -1259494 -2574926 -2411138 -201148 3063417 5299175 5029897 2965645 1213919
43224 1213919 670084 139543 -1487532 -3343674 -3825214 -2836089 -1626018 -993334 -841636
43215h41636k24342n26628j93858O69154P98865k42985q98943R4598J404233R20687
43205I59145q97230j595401m19184O83074J21184j146189j308170j32760J331568
43196b403963K386869K846204K304860N51539j487580k297957j458335j39437
43188C02200K49080m89048j333449j202852k8931J195856J472459Q97034M29674
43179A492023N11160M71856k98549j190683j153985k93010K62216K9011k89418
43170d59379j55736n8076m37925o31055K10419J614798K150065J151644o24751
43161B760004j948242k055436q62208R24408J956559J410408J27293k76607L90436
43152B426615O09079n18762j766754j499713l0471R42296Q02638N94678J102342
$$ plain form
43215 -841636 -1065978 -1592606 -1786464 -1117310 -318445 -561430 -1460373 -1365775 38458 959145
43205 959145 61915 -1533486 -1952670 -1269596 -1148412 -2294601 -3602771 -3735531 -2403963
43196 -2403963 -17094 2829110 5133970 5685509 4197929 1899972 441637 302200
43188 302200 551280 62232 -1271217 -2474069 -2503000 -1307144 165315 1062349 1492023
43179 1492023 2003183 2475039 2176490 985807 -168178 -461188 -198972 -169961 -459379
43170 -459379 -615115 -673191 -1111116 -1742171 -1531752 83046 2233111 3384755 2760004
43161 2760004 811762 -1243674 -2105882 -1181474 775085 2185493 2312786 2036179 2426615
43152 2426615 3035694 2516932 750178 -749535 -780006 162290 964928 1559606 2661948
43143B661948J591061R93221m48172j409969j061282Q6196Q33638N40472l14096
43134C473017p77452n70721l18314m91020o00003m502Q26074P44248l50571j136377
43124G94379n98707O10494J119909O00797r8052k43148P8187M39682N91197L99332
43114C694070j85383q81770j155545p66452k8501N78187P96244N07405l35943
43105B222312j378485j785993j025217L53219J228936J258589J132954J283038
43097C289353J053431j86604j665839j978588j086983l98228o14824p54472r878
43088b352632O31544n1678j135750n27470J736684L010461J556751r38937j573665
43079C55308R369J496175J156956k21736q68515l36258L55270K76705l85594p58740
$$ plain form
43143 2661948 4253009 5246230 4798058 3388089 2326807 2413003 3246641 3787113 3473017
43134 3473017 2695565 2124844 1806530 1315510 715507 711005 1537079 2281327 1930756 794379
43124 794379 195672 806166 1926075 2526872 2428820 2185672 2263859 2703541 3294738 3694070
43114 3694070 3508687 2626917 1471372 704920 676419 1254606 2050850 2558255 2222312
43105 2222312 843827 -942166 -1967383 -1614164 -385228 873361 2006315 3289353
43097 3289353 4342784 4156180 2490341 511753 -575230 -973458 -1588282 -2342754 -2352632
43088 -2352632 -1721088 -1772766 -2908516 -3435986 -1699302 1311159 2867910 1928973 355308
43079 355308 364677 1860852 3017808 2796072 1927557 1591299 1946569 2223274 1837680 1078940
43069A078940l77397K46316J95834o47529j261313p50662K62276K41320j166277
43060b178492k420141j927416L4092J861241K571206K350775J524964J75644j048731
43051I43142r75256M62337J466643L33112k175964l513346k432804l51689P17778
43042e526047O15018O06355J157841J318613M09918p00204o64554N21283J572281
43033f89496J680407J376884J341004J176179J76865j178329j638538j075962
43025A169014p53235j276813j495690l45272J210851J383190J10309r98819r77243
43016a973708k92607N60512J613210K291572J415793q94710k660431k328727o15447
43007b884543P26957R40001K60077r18154j786211j118470J142201L103995L019549
$$ plain form
43069 1078940 701543 947859 1143693 496164 -765149 -1515811 -1253535 -1012215 -2178492
43060 -2178492 -4598633 -6526049 -6491957 -4630716 -2059510 291265 1816229 1991873 943142
43051 943142 -32114 430223 1896866 2229978 54014 -3459332 -5892136 -6243825 -5526047
43042 -5526047 -4911029 -4304674 -3146833 -1828220 -1418302 -2118506 -2783060 -2261777 -689496
43033 -689496 990911 2367795 3708799 4884978 5061843 3883514 2244976 1169014
43025 1169014 415779 -861034 -2356724 -2701996 -1491145 -107955 2354 -996465 -1973708
43016 -1973708 -2266315 -1705803 -92593 2198979 3614772 2720062 59631 -2269096 -2884543
43007 -2884543 -2157586 -1217585 -957508 -1875662 -3661873 -4780343 -3638142 -534147 2485402
42998B485402J425907l0462r62225j856323k206435j096794O87528J229222K73333
42989e0847m18990J87308J045071R09441N7241m86250k47934N86467J311493Q61319
42979C754319r12780k223161j257761R05852J350698m21212j626908l92268J606164
42970G82943K008007J024160R8306o57625j606608j875535q34910N6264o80749
42961a685747j738692r04516J077860J408543k90555j336455j55027J609571J955227
42952e9791J166092N00875J52778k07261l01245P5545K62134l23151j196667j532371
42942a463062j172502l72325O89639J641582J895760J327074L64870o79659j559793
42933F71584j517641n2052J711923J957541P13899k10872j57203m44837j559928
$$ plain form
42998 2485402 3911309 3880847 2918622 1062299 -1144136 -2240930 -1553402 -324180 -50847
42989 -50847 -469837 -282529 762542 1671983 1729224 1242974 995040 1581507 2893000 3754319
42979 3754319 2841539 618378 -639383 266469 1617167 1195955 -430953 -823221 782943
42970 782943 2790950 3815110 3913416 3255791 1649183 -226352 -1061262 -1004998 -1685747
42961 -1685747 -3424439 -4328955 -3251095 -1842552 -2133107 -3469562 -3624589 -2015018 -59791
42952 -59791 1106301 1607176 1759954 1552693 1251448 1326993 1589127 1265976 69309 -1463062
42942 -1463062 -2635564 -3007889 -2318250 -676668 1219092 2546166 2911036 2231377 671584
42933 671584 -846057 -898109 813814 2771355 3485254 3274382 3117179 2672342 1112414
42924A112414j814031k35078J330982R79938j54690J12487J331543J340312m2634
42915C961243j003363r39023q96881r29257J21126J861236K216200Q26226j50486
42906E067021K72206J69631j687778l111533j762528Q86840J635546K43364q24654
42897H88115m81811Q6600K26467N37774O90737n34646k431235k437995j14657
42888c570651J625743P84596o98678k16496J385379J537491K11610m76252n2199
42879E30543n3233q09537p89342M12962J086574L01334m85472Q0376J073457J009614
42869B357276J74790l00618m52780r36983j351209p68259N14456J239227J028710
42860A504610P21635Q83850J023108M69790o29202j399035j110862p2313M16011
$$ plain form
42924 1112414 -701617 -936695 394287 1374225 1219535 1332022 2663565 4003877 3961243
42915 3961243 2957880 2018857 1121976 192719 313845 2175081 4391281 5217507 5067021
42906 5067021 5339227 5508858 3821080 709547 -1052981 -166141 1469405 1712769 888115
42897 888115 406304 492904 719371 1257145 1947882 1413236 -1017999 -3455994 -3570651
42888 -3570651 -1944908 -1160312 -1858990 -2075486 -690107 847384 1058994 582742 530543
42879 530543 477310 -332227 -1121569 -708607 377967 679301 193829 274205 1347662 2357276
42869 2357276 2532066 2231448 1778668 841685 -509524 -1277783 -763327 475900 1504610
42860 1504610 2226245 3110095 4133203 4602993 3973791 2574756 1463894 1391581 1807592
42851A807592m31091j487166q97832J137673K210668J009699p63667r41742J28893
42842A773027P37847O26586O41789N34470n73869j970626j943745n77083K48140
42833e03464j47767l84388M11158J267442J290713R83415P75107N7208j253595
42824B495829j841433r22211L28566N16678k3196k42785j77816l96001o28763
42815h91132l15560K51116N51798Q65773J490569J720198Q73675l67164r43828
42806C235445j037427j301547j208301J01163J718578J653810k29350j682434
42798A249937j000597Q70379J817076J120732j78771p84189l36788N40173R65245
42789D263197P05549M09438P05436J272064J311146P93572N65895J169511K138799
$$ plain form
42851 1807592 1376501 -110665 -1008497 129176 2339844 3349543 2585876 1644134 1773027
42842 1773027 2510874 3137460 3779249 4313719 3739850 1769224 -174521 -751604 -503464
42833 -503464 -651231 -1035619 -624461 642981 1933694 2917109 3692216 3749424 2495829
42824 2495829 654396 -267815 60751 577429 554233 311448 133632 -262369 -891132
42815 -891132 -1206692 -955576 -403778 461995 1952564 3672762 4546437 4179273 3235445
42806 3235445 2198018 896471 -311830 -210667 1507911 3161721 2932371 1249937
42798 1249937 249340 1119719 2936795 4057527 3878756 3094567 2757779 3297952 4263197
42789 4263197 4968746 5378184 6083620 7355684 8666830 9460402 10026297 11195808 13334607
42780A3334607K602239K147213J032319p1636n64503n22782p50541j814342l134280
42771A2258294l520083k574906j107249j51287j786k45734l58945j49467J87262
42762D336099L67139L50312K46914K413m31754o85356l38205K60410L11110j49287
42752D269795k22701K77804L50927m91517j207091q23305O53J40962j81570l4079
42742B079878N43629Q05852N98366J04229r54994k413960k775635j015297J370290
42733a657642K109606J439868J364020J943961J111502j432181l003655j845488
42725B9991K04401O59052J7688L72381J757368K219931J037577j99426O2657J314856
42715G476476J830544Q80109l40223j0633K076053L958830L752439J983887N90661
$$ plain form
42780 13334607 15936846 18084059 19116378 19044742 18480239 17957457 17206916 15392574 12258294
42771 12258294 8738211 6163305 5056056 4904769 4902983 4657249 4298304 4148837 4336099
42762 4336099 4703238 5053550 5300464 5302877 4871123 4185767 3847562 4107972 4419082 4269795
42752 4269795 4047094 4324898 4675825 4184308 2977217 2153912 2154565 2295527 2113957 2079878
42742 2079878 2623507 3429359 4027725 4131954 3176960 763000 -2012635 -3027932 -1657642
42733 -1657642 451964 1891832 3255852 5199813 6311315 4879134 1875479 29991
42725 29991 234392 893444 911132 1283513 3040881 5260812 6298389 6098963 6161620 7476476
42715 7476476 9307020 10187129 9846906 9836273 11912326 15871156 19623595 21607482 22198143
42706B2198143p115j083385k799411l429267k278088j274720k095404l385558
42698E845195k806026o73002N89571L0140q60564o53315L04965Q86486N68680
42689C232130m10848j324584j313650k68877P55675P28940n6081o10626o86974
42680D5105o52352m49595J63363O87808L85164m80834r51372p12974j65005N02839
42670a627853J234334J486350Q54091j5579k98497l44099q54418j255539n36572
42661a357782O57794O81711m19933q62970j9496O16261p3563j178138j369887
42652c326003o07320N01603J555522J922022J024948k16340N0012J722675K273345
42643D900464L57189j978357k289132j174076o95045q45543p3797J548298K272821
$$ plain form
42706 22198143 22191028 21107643 18308232 14878965 12600877 11326157 9230753 5845195
42698 5845195 3039169 2366167 2955738 2985878 2125314 1471999 1776964 2663450 3232130
42689 3232130 2821282 1496698 183048 -85829 669846 1398786 1342705 732079 45105
42680 45105 -607247 -1056842 -893479 -205671 179493 -301341 -1252713 -1965687 -2130692 -1627853
42670 -1627853 -393519 1092831 1946922 1931343 1632846 1288747 434329 -821210 -1357782
42661 -1357782 -699988 -18277 -438210 -1301180 -1320676 -704415 -777978 -1956116 -3326003
42652 -3326003 -3933323 -3431720 -1876198 45824 1070772 854432 904444 2627119 4900464
42643 4900464 5257653 3279296 990164 -183912 -878957 -1724500 -1798297 -249999 2022822
42634B022822J544755N68496n1533r93953k157407k060256k08187J600214J463881
42625A728832k16253j516427j391938m24331L12427L85593J93244L79689R67279
42616D18115J192449N66528k65197m49372l08192p00347j266429p73590O68182
42607i17853J326606L47777r26685r85530j74569L64214N88973J033792J285597
42598A942322N61996o32898r55787k30271L40174L8560n19816o35782m79286l84619
42588i55407j96057J00347q3821j004316j722018j046544P76728K081797J727960
42579c21331N37473K82243J365213K210676J389997k71517p44608K44064P66982
42570E459192k98653j412151q13056N07771L02268j189411j468582J51178J293301
$$ plain form
42634 2022822 3567577 4136073 4084540 3090587 933180 -1127076 -1335263 264951 1728832
42625 1728832 1512579 -3848 -1395786 -1820117 -1507690 -1122097 -928853 -549164 418115
42616 418115 1610564 2177092 1911895 1462523 1154331 453984 -812445 -1586035 -917853
42607 -917853 408753 756530 -170155 -1155685 -1330254 -966040 -377067 656725 1942322
42598 1942322 2504318 1871420 915633 685362 1025536 1064096 544280 -91502 -570788 -955407
42588 -955407 -1151464 -1051117 -1134938 -2139254 -3861272 -4907816 -4131088 -2049291 -321331
42579 -321331 216142 498385 1863598 4074274 5464271 5192754 4448146 4692210 5459192
42570 5459192 5160539 3748388 2935332 3443103 3745371 2555960 1087378 1238556 2531857
42561B531857K69993j293012j222198k13708k59353j054095o52571R05035J450805
42552D62753L50487l95244M27109J181955K76192r23304k32743J589139J763287
42543D499631k21653j776195j132070J47181j90551j616519j808082k54182J117324
42534a235116R02918O324j56885K43213K37730j04833j6150L71527K49157k37037
42524B60848r7268O46886P89173L5365l60958J69794L41107o73111j377669k46619
42514e12452J430577J294624l35449j076559m72984m43243j466173j439462N28092
42505b493029K102621J346825j37181k4725Q47081K37382j358367j532289j79660
42496a191342M08837l71508n13516P88951J444507l3228j838409j561020K53289
$$ plain form
42561 2531857 2801850 1508838 286640 72932 -186421 -1240516 -1893087 -988052 462753
42552 462753 813240 417996 845105 2027060 2303252 1379948 1147205 2736344 4499631
42543 4499631 4277978 2501783 1369713 1516894 1326343 -290176 -2098258 -2352440 -1235116
42534 -1235116 -332198 -325874 -482759 -239546 -1816 -106649 -122799 248728 497885 260848
42524 260848 163580 810466 1599639 1635004 1274046 1443840 1784947 1111836 -265833 -512452
42514 -512452 918125 2212749 1877300 800741 327757 -115486 -1581659 -3021121 -2493029
42505 -2493029 -390408 956417 819236 794511 1641592 1878974 520607 -1011682 -1191342
42496 -1191342 -782505 -1154013 -1667529 -878578 565929 532701 -1305708 -2866728 -2613439
42487b613439J235023O47031k63050n76565m59206J7776J009480J812213J220227
42478B029490o22820j908711j275626N43516J713071J368556J64224q44984j199372
42469c2656r52848k44451O26190J006242M21316o07843r11469j73792N21289J88330
42459a59692o47671q57354m54546l00335m12215O2776J194728J951940J736982
42450B114613R78426K7288j111532j731010q44535Q09132J092708k91863r24567
42441A18660N95027K114593J183163r59755j292118L25107J342572P38212l8800
42432D126661k27194p19406j427034p79498J120039J728052l6386j722060j085238
42423I77936M31177L14907q57595p22921O65014J029237j43672p91209K10395
$$ plain form
42487 -2613439 -1378416 -731385 -994435 -1571000 -2030206 -2012430 -1002950 809263 2029490
42478 2029490 1406670 -502041 -1777667 -1234151 478920 1847476 2011700 1166716 -32656
42469 -32656 -985504 -1229955 -603765 402477 823793 215950 -695519 -869311 -348022 -159692
42459 -159692 -807363 -1664717 -2119263 -2419598 -2831813 -2769037 -1574309 377631 2114613
42450 2114613 3093039 3120327 2008795 277785 -566750 242382 1335090 1043227 118660
42441 118660 713687 2828280 4011443 3051688 1759570 2084677 3427249 4165461 4126661
42432 4126661 3899467 3180061 1753027 973529 2093568 3821620 3785234 2063174 977936
42423 977936 1409113 1724020 866425 143504 808518 1837755 1694083 902874 1113269
42414A113269J308197R32890j59071m04443J81134M41112j0104n26335o56103
42405B220546o71354r28127j270254j205879n71504P6147L5274m65359l96455
42396c176965M17123O36039o22557j985769j524934K54276J034825K40832j99076
42387d926206Q44896J865673J360192L14516L25147Q09243K14829r96307r06182
42378a094199O62892J706103R73367m87915j127001o94140J85376Q59683O19524
42369A603690q39834k390478k221376k72536J356397J189413K31885M5934L71039
42360i25866J91949L3514J082405K449968J662007j574669m089998l014468M60463
42351c724695K656769K081714P45372P16672J189379J64245k044535k828855r04894
$$ plain form
42414 1113269 2421466 3354356 3195285 2790842 2971976 3413088 3402984 2876649 2220546
42405 2220546 1549192 621065 -649189 -1855068 -2426572 -2350425 -2315151 -2780510 -3176965
42396 -3176965 -2759842 -2123803 -2746360 -4732129 -6257063 -6002787 -4967962 -4727130 -4926206
42387 -4926206 -4081310 -2215637 -855445 -540929 -215782 593461 808290 -188017 -1094199
42378 -1094199 -431307 1274796 2248163 1760248 633247 -60893 124483 984166 1603690
42369 1603690 763856 -1626622 -3847998 -4120534 -2764137 -1574724 -1342839 -1296905 -925866
42360 -925866 -733917 -700403 382002 2831970 4493977 2919308 -1170690 -4185158 -3724695
42351 -3724695 -1067926 1013788 1759160 2475832 3665211 3829456 1784921 -1043934 -1948828
42342a948828J695538K127729J83780j908145k464722j745124o21502N79376J520404
42333b581494J470070L17346q08297p33489L61957J272126J100377q2213j427080
42324a110697j851197r50874L45730O71134k1261m16281J88343R39020R37315
42315a268768N22294L45515L52883N05239J200061J961751J219623j190389k851717
42306G96492j960284k13649j77066j133711n57490J210251J380012l05328q81369
42297a842142P70652J968160R02232l10797M21271J331544l3883k238151k057981
42288a089095L26432J726193P87261p40429j269196j019257m33599M38874Q81169
42279c91647K00592n08348L14010J692114J193520q08773j098960J276837L039085
$$ plain form
42342 -1948828 -253290 1874439 2058219 150074 -2314648 -4059772 -4681274 -4101898 -2581494
42333 -2581494 -1111424 -794078 -1602375 -2335864 -1973907 -701781 398596 316383 -1110697
42324 -1110697 -2961894 -3912768 -3567038 -2895904 -2917165 -3333446 -3145103 -2206083 -1268768
42315 -1268768 -746474 -400959 -48076 457163 1657224 3618975 4838598 3648209 796492
42306 796492 -1163792 -1377441 -1554507 -2688218 -3245708 -2035457 -655445 -960773 -1842142
42297 -1842142 -1071490 896670 1798902 1488105 1909376 3240920 3207037 968886 -1089095
42288 -1089095 -762663 963530 1750791 1010362 -258834 -1278091 -1711690 -1272816 -391647
42279 -391647 -191055 -699403 -385393 1306721 2500241 1691468 592508 1869345 4908430
42270D908430J500448j394572k144535o56574N22944M78397N37725J211540J258935
42261F222738O0301j199125j349406p61548m03454m36876l94250m4252M89661
42252B183789J079155J624251J872578J475658L69021q45558j173274l42167N46639
42243F790092K39694q66045j185747l50998K06727l58354q52998j26582P69927
42234D265716K14639j140187j214388J69935R60801J20913q21914k70270J038578
42225C323823J303392K36872q82410j120439p12153k44093L9788J22061N7902
42216B124743J0369N4908j8930l85373p28445m59430N39961J590709J762997P81803
42206E273312o16921j346809j064149m21109j06503j264L19237O17508K54939
$$ plain form
42270 4908430 6408878 5014306 2869771 2213197 2736141 3214538 3752263 4963803 6222738
42261 6222738 6283039 5083914 3734508 2972960 2569506 2132630 1738380 1694128 2183789
42252 2183789 3262944 4887195 6759773 8235431 8604452 7758894 6585620 6243453 6790092
42243 6790092 7029786 6163741 4977994 4626996 4833723 4475369 3622371 3495789 4265716
42234 4265716 4480355 3340168 2125780 2295715 3256516 3377429 2555515 2285245 3323823
42225 3323823 4627215 4864087 3981677 2861238 2149085 1904992 1944780 2066841 2124743
42216 2124743 2135112 2190020 2171090 1785717 1057272 597842 1137803 2728512 4491509 5273312
42206 5273312 4656391 3309582 2245433 1824324 1717821 1716557 2035794 2653302 2908241
42197B908241o67841j225579r13536l10975j99511n69474q53259p06727k11141
42188b749802L69032P58236Q66679R16714J035553Q16185o2329q39240l36994
42179G74034J083212J436934k32253k189021k140507k42366J357867J427038O12487
42170A887425j83221p30883p15014K56632J423322J224585l70517j321325k87161
42161A183843J366158J573729M39048m39765o09319q69191j202046o47559O13243
42152A408141R86469q9707j087027p08146J45844m3311r59705j097517k66244
42143a711203J38110o33460j512509j096556N42073J995312K013082N95734j051383
42134g20800j505864m00091J177681J798055J184171K87932k1576J43653J63583
$$ plain form
42197 2908241 2240400 1014821 101285 -209690 -409201 -978675 -1831934 -2538661 -2749802
42188 -2749802 -2380770 -1622534 -755855 160859 1196412 2012597 1950268 1111028 774034
42179 774034 1857246 3294180 3061927 872906 -1267601 -1509967 -152100 1274938 1887425
42170 1887425 1704204 973321 258307 514939 1938261 3162846 2792329 1471004 1183843
42161 1183843 2550001 4123730 4562778 4123013 3513694 2644503 1442457 794898 1408141
42152 1408141 2394610 2304903 1217876 509730 655574 612263 -347442 -1444959 -1711203
42143 -1711203 -1573093 -2206553 -3719062 -4815618 -4273545 -2278233 -265151 330583 -720800
42134 -720800 -2226664 -2626755 -1449074 348981 1533152 1821084 1799508 1943161 2106744
42125B106744k10888p04430r55510q58970n68156k68776L4562L88636N36308Q4787
42115d15693o94606p41615M56191J746145J472870k61735j534163j101618O1705
42106a012519M01530M7001L17031J410714J923953Q91750p60884j439649r00748
42097H78179k87048m28484q86771p85088J1693Q36633R73587K07488j037459j802119
42087b319389j219792M55217J726766J399516P4885o27016k23163K31306Q083
42078d93587k32914J86430O92571N39273K09294M79269P92061P6201j175489j312282
42068b39173o2347R72661P56795J94766L20457N14365l06863j674903k061787
42059a586029r65994O10133J607987J903220J830410J498774Q46271l1462q63396
$$ plain form
42125 2106744 1895856 1191426 235916 -623054 -1191210 -1459986 -1425424 -1036788 -500480 -415693
42115 -415693 -1110299 -1851914 -1395723 350422 1823292 1561557 27394 -1074224 -1012519
42106 -1012519 -610989 -563988 -246957 1163757 3087710 3979460 3218576 1778927 878179
42097 878179 591131 162647 -724124 -1509212 -1497519 -660886 312701 520189 -517270 -2319389
42087 -2319389 -3539181 -3083964 -1357198 42318 117203 -509813 -732976 -501670 -493587
42078 -493587 -726501 -540071 152500 691773 901067 1380336 2172397 2248598 1073109 -239173
42068 -239173 -301520 671141 1427936 1622702 1943159 2457524 2150661 475758 -1586029
42059 -1586029 -2552023 -1941890 -333903 1569317 3399727 4898501 5744772 5713310 4849914
42050D849914j421154j655450j564563r77063K03482J360951J353690l0495j340919
42041G78393j178063k33951k74109j258456j223914N77371K245126J922009L81080
42032A735486m19991j98772k22363j051801j901583j914462r36436O35918J858221
42023b415783J642506J59743p95966J4768J366001J151727o22554j890078j334889
42014b724525K09221J122490O35898q11431j923741j535759p0476O29681j19479
42005d588121n16829R66853K714888K106175l02961j486944n45280M30681L47904
41996h73634P19777K203350K645368N54327j900899j752077N09386J857843R15864
41987D879305q69504j658701j104694q1760L08217k22116n41501N77384K173410
$$ plain form
42050 4849914 3428760 1773310 208747 -768316 -564834 796117 2149807 2119312 778393
42041 778393 -399670 -633621 -907730 -2166186 -3390100 -2812729 -567603 1354406 1735486
42032 1735486 1315495 1116723 894360 -157441 -2059024 -3973486 -4909922 -4274004 -2415783
42023 -2415783 -773277 -613534 -1409500 -1394732 -28731 1122996 500442 -1389636 -2724525
42014 -2724525 -2515304 -1392814 -756916 -1568347 -3492088 -5027847 -5098323 -4468642 -4588121
42005 -4588121 -5104950 -4138097 -1423209 682966 380005 -1106939 -1652219 -1221538 -873634
41996 -873634 -153857 2049493 4694861 5249188 3348289 1596212 2105598 3963441 4879305
41987 4879305 4009801 2351100 1246406 1164646 1472863 1250747 709246 1286630 3460040
41978C460040J815295o15804k064651p48881Q71358o1639k102907j854235M34340
41969h67084J351860j25597j402124q45899O0380O0009J76257R44613P34831j102473
41959a015227k103372k67060K290907K136851l63312j696589l56443J553447J953440
41950B132642J379409J170446J183501N83645m30450j013886j081979j212793
41942B710535j481484j333314n84661J77806L81611J67916K8943P8320Q8900R4601
41932C29173L96328Q61697Q31463J19532m61231k12729K99395R6464n77219o19763
41922A063110M5474L01441k35376n52720o7523L24600m8674k43457O56947J611312
41912B855134J004352p25560j622257j050939k23480L1702J65379L33880j55678
$$ plain form
41978 3460040 5275335 4659531 2594880 1845999 2717357 2655718 552811 -1301424 -867084
41969 -867084 484776 359179 -1042945 -1888844 -1828464 -1768455 -1592198 -647585 87246 -1015227
41959 -1015227 -3118599 -3385659 -1094752 1042099 678787 -1017802 -1374245 179202 2132642
41950 2132642 3512051 4682497 5865998 6449643 6019193 5005307 3923328 2710535
41942 2710535 1229051 -104263 -688924 -511118 -129507 38409 67352 145672 234572 329173
41932 329173 725501 1587198 2418661 2538193 2076962 1864233 2163628 2260092 1682873 1063110
41922 1063110 1108584 1410025 1174649 621929 554406 879006 830332 586875 1243822 2855134
41912 2855134 3859486 3133926 1511669 460730 237250 268952 434331 768211 612533
41903F12533j145458j159764K87349J464232Q73516l63846k42917R80797J346073
41894B652515M04656k34741K89416P69351J07434q95614j029088o30716p10390
41885G22823j024173n29562O67854J292112P83735q3467o23647j029189j344025
41876a167539q75268N53220J696438J330480O3488m63446M2636K30787n95728
41867H15068j181868j68685J625414K018316L98921j314809j041363R36331K427514
41858D514839J882332j70324k054519k651730k045298r65049J8722P87491J342702
41849F59166J387671N62046p84679j489751p58075P34977J491638R22034j13545
41840B611482n19718j52128L26614K45220n44806j445191j433158k52410Q34515
$$ plain form
41903 612533 -532925 -1692689 -1405340 58892 932408 568562 325645 1306442 2652515
41894 2652515 3057171 2822430 3111846 3881197 3988631 3093017 2063929 1433213 722823
41885 722823 -301350 -830912 -163058 1129054 1912789 1829322 1205675 176486 -1167539
41876 -1167539 -2042807 -1489587 206851 1537331 1600819 1137373 1180009 1410796 815068
41867 815068 -366800 -535485 1089929 3108245 3507166 2192357 1150994 2087325 4514839
41858 4514839 6397171 6226847 4172328 1520598 -524700 -1489749 -1471027 -683536 659166
41849 659166 2046837 2608883 1824204 334453 -423622 311355 1802993 2725027 2611482
41840 2611482 2091764 1939636 2266250 2511470 1966664 521473 -911685 -1164095 -329580
41831c29580M77041o07531l55901J370730K025793N0131k352298k009246P28567
41822a002294K510100J536031o34180j815490j587074n67821P14667J511457J053632
41813A719028j33216m66252M92694J393609J207887N43397K49904K32860L33560
41804E573471P78167R99410j96604k338579l104279j649429r1815j57185n36122
41795g22965L85810J378684O85859l70623N69464K494371K296553r0579j553030
41786E073544q49131r2584n38518n43006Q74763J696260J58353k167226k726833
41777H85622j541316l51073K81971R87483J762040J938832J327773J43825j415004
41768D020153k565691k033249J59091K079791K128515Q11178n60103j481725j585608
$$ plain form
41831 -329580 147461 -460070 -815971 554759 2580552 2630683 278385 -1730861 -1002294
41822 -1002294 1507806 3043837 2409657 594167 -992907 -1560728 -846061 665396 1719028
41813 1719028 1585812 1119560 1612254 3005863 4213750 4757147 5007051 5239911 5573471
41804 5573471 6351638 7351048 7154444 4815865 1711586 62157 -29658 -186843 -722965
41795 -722965 -337155 1041529 1727388 1356765 1926229 4420600 6717153 6626574 5073544
41786 5073544 4224413 4131829 3593311 3050305 3925068 5621328 5779681 3612455 885622
41777 885622 -655694 -1006767 -724796 262687 2024727 3963559 5291332 5435157 4020153
41768 4020153 1454462 -578787 -419696 1660095 3788610 4599788 4039685 2557960 972352
41759I72352j81187K009348K442991N5405k551890k425340m15973M64688k73129
41750I7265m62406P08135J584176J116467K78534j75680r12359k079818k315066
41741b160752q73152R06670J453240R78433N34342J87682o29818j626719j645175
41732b875249m8939K381123L883845L148556P64269j002751o14420Q46012J160621
41723G643067K7768p46574q2337Q97222O62386p24824j983313k037754p14595
41714B941046J080337J755593O85684n38276Q8250J904202K160594R5558j696384
41705H476604j031398P39118R97869l78721j528937j726546j783541j888622j222915
41696F52911K14869J214464J151385P87851Q64150J033351O91149k746m47370
$$ plain form
41759 972352 791165 2800513 5243504 5298909 2747019 321679 -94294 370394 97265
41750 97265 -365141 342994 1927170 3043637 3322171 3146491 2234132 154314 -2160752
41741 -2160752 -3033904 -2127234 -673994 304439 838781 1026463 396645 -1230074 -2875249
41732 -2875249 -2924188 -543065 3340780 6489336 7253605 6250854 5636434 6482446 7643067
41723 7643067 7670835 6924261 6841924 7739146 8401532 7676708 5693395 3655641 2941046
41714 2941046 4021383 5776976 6462660 5924384 6012634 7916836 10077430 10172988 8476604
41705 8476604 7445206 8184324 9182193 8803472 7274535 5547989 3764448 1875826 652911
41696 652911 867780 2082244 3233629 4021480 4885630 5918981 6610130 6607384 6160014
41687F160014m05705j27993K3306l8328Q3497Q63282J937670K086536P67682q03519
41677A0546442j012758K4733P38608L61826k81429m01004m19318r54796j615673
41668F986631j636705j091997n98332j71280O87986J786763K047472R77032k76881
41659H710689j29705J268150J907665M14526j953648k626484q09859J677753K732087
41650A1191174K128521R79191N9415m80749m78897N7216M43486M4687n66926j48023
41640A3229095J417662K746495K662181J553819O71336O46459J120946J416342
41632B5464335J169222N81369L45381J056473K406968L228190K712159J474938
41624C8439035J033343K173886M112073N437923N746172O025813P327315R367390
$$ plain form
41687 6160014 5754309 5626316 5649622 5611294 5694791 6558073 8495743 10582279 11349961 10546442
41677 10546442 9533684 9558417 10297025 10658851 10377422 9976418 9557100 8602304 6986631
41668 6986631 5349926 4257929 3659597 3488317 4176303 5963066 8010538 8987570 8710689
41659 8710689 8580984 9849134 11756799 12171325 10217677 7591193 6781334 8459087 11191174
41650 11191174 13319695 14298886 14358301 13877552 13398655 13455871 13899357 13944044 13377118 13229095
41640 13229095 14646757 17393252 20055433 21609252 22280588 22927047 24047993 25464335
41632 25464335 26633557 27214926 27560307 28616780 31023748 34251938 36964097 38439035
41624 38439035 39472378 41646264 45758337 51196260 56942432 62968245 70295560 79662950
41616G9662950J0927890J1604066J2526146J4979837J8821822K2888395K6559706
41609A97970812K9771777L1173919K7491612J6223275q00761j7526474k8119733
41602B56184427l1183405k9444227k6143124k2772955j9786882j7551776j5753797
41595I3548261j3245927r761995o869428n905969n864077m997255l756033l905771
41587C9241806n041619m670864k256411m52100j054277k199837j469448K68783
41579B2366033M22586j396984l404225m498530m678328l484454o62804K051979
41571F715273K400842P65397m72580n78484r29065j834545j774760l97273M83601
41562D378406j00299p30415k37176M50352L87214L01610P56294Q03429O4860l6721
$$ plain form
41616 79662950 90590840 102194906 114721052 129700889 148522711 171411106 197970812
41609 197970812 227742589 258916508 286408120 302631395 301830634 284304160 256184427
41602 256184427 225001022 195556795 169413671 146640716 126853834 109302058 93548261
41595 93548261 80302334 70540339 63670911 57764942 51900865 46903610 43147577 39241806
41587 39241806 34200187 29529323 27272912 26820812 25766535 23566698 22097250 22366033
41579 22366033 22788619 21391635 17987410 13488880 8810552 5326098 4663294 6715273
41571 6715273 9116115 9881512 9408932 8830448 7901383 6066838 4292078 3894805 4378406
41562 4378406 4278107 3547692 3310516 3760868 4148082 4449692 5205986 6009415 6074275 6037554
41552F037554J069014J462783o9059j415940m04681J306396Q05166j149285j441136
41543F200812P0779M80948j025055j928235r58300j96469j190844k205000j264414
41534b015778O52665J560068J474491J334332P56722p31928j637787k95205K025897
41525C123477K345924J56702j867815j590128R9500J080313O80951k98865j060855
41516B669204j245817n70911Q95472K242542K363598J282927K14563n4285k35882
41507G561411j248168k304179j655445N87890K055565J472488O92495J628515
41499H790572K744882J386253j313061j447741J496296L359587J623256o94329
41491A5945715j4314K112823J859049n79793j698334n87508J42521p63827j493497
$$ plain form
41552 6037554 7106568 8569351 8500292 7084352 6679671 7986067 8791233 7641948 6200812
41543 6200812 6271591 6752539 5727484 3799249 2840949 2644480 1453636 -751364 -2015778
41534 -2015778 -1363113 196955 1671446 3005778 3762500 3030572 1392785 1097580 3123477
41525 3123477 5469401 5626103 3758288 2168160 2267660 3347973 4028924 3730059 2669204
41516 2669204 1423387 852476 1747948 3990490 6354088 7637015 7851578 7797293 7561411
41507 7561411 6313243 4009064 2353619 2941509 4997074 6469562 7162057 8790572
41499 8790572 11535454 12921707 11608646 10160905 11657201 15016788 16640044 15945715
41491 15945715 15931401 18044224 19903273 19323480 17625146 17037638 17180159 16416332 14922835
41482A4922835j038042j047033k406783l166112j731227M44540J306901J132025
41474H417104J017091M79671j140993k534947k141828q27938m44730p30151j95633
41465A897646O87116P7992j656209j960745k08389J020415n1456j559772r56043
41456b709445J048632J727662N04826m72783K02712J253445Q73392o42295j489130
41447B97016q44408L09488P20707L47643j5660p3381l91582j398032k450491k293052
41437e791752m88043J816665K785357J670549l82252j468501q47629M95188J206260
41428a004158J024377O09436M17357L87182M88861Q02083J027360O18978m30423
41419C941053j458437j852698j446367l86950O91131O74424p39160j926839r90464
$$ plain form
41482 14922835 13884793 12837760 10430977 7264865 5533638 5978178 7285079 8417104
41474 8417104 9434195 9913866 8772873 6237926 4096098 3268160 2823430 2093279 1897646
41465 1897646 2584762 2662754 1006545 -954200 -1162589 -142174 -193630 -1753402 -2709445
41456 -2709445 -1660813 66849 571675 98892 301604 1555049 2428441 1786146 297016
41447 297016 -547392 -237904 482803 830446 814786 741405 349823 -1048209 -3498700 -5791752
41437 -5791752 -6279795 -4463130 -1677773 -7224 -389476 -1857977 -2705606 -2210418 -1004158
41428 -1004158 20219 629655 1047012 1434194 1923055 2725138 3752498 4371476 3941053
41419 3941053 2482616 629918 -816449 -1203399 -512268 162156 -577004 -2503843 -3494307
41410c494307J338516K182658M79126j420337j194869K51557O76801k7738l53764
41401a562357J4157K46410M55690J279674J814186N51958j655837k200151o00590
41392a656860Q07047O71471L90017R75337R30913q52339k401584j366671J106318
41383a396351J857328K70977j199181q79296Q4940l5171j088695j623620q48307
41374d857376O87809J814285J761529Q14958O7093K50960R05000R59997k5042
41365B379213j426425k113300j392948J71688R93032K57045o88801L3660J861681
41356G4845K218860L56653j324156r02460K38892M799r10342n45875O89653P29751
41346F30620n13333j062812k49240N10266M39958L57479N16766k7068j235957
$$ plain form
41410 -3494307 -2155791 26867 505993 -914344 -2109213 -1857656 -1180855 -1208593 -1562357
41401 -1562357 -1548200 -1301790 -846100 433574 2247760 2799718 1143881 -1056270 -1656860
41392 -1656860 -849813 -178342 211675 1187012 2117925 1265586 -1135998 -2502669 -1396351
41383 -1396351 460977 731954 -467227 -1346523 -1261583 -1296754 -2385449 -4009069 -4857376
41374 -4857376 -4169567 -2355282 -593753 221205 288298 539258 1444258 2404255 2379213
41365 2379213 952788 -1160512 -2553460 -2381772 -1388740 -1131695 -1820496 -1786836 74845
41356 74845 2293705 2650358 1326202 423742 662634 667433 -242909 -788784 -99131 630620
41346 630620 117287 -945525 -1194765 -684499 -244541 112938 629704 602636 -633321
41337f33321j590090o46742M1231m20913p32213K54139J472924J374911K47681
41328f32393n86419o85644l55069K85735R41280Q90692J42431k13606K71136N43884
41318F02027j12040p32871l37015M02150M60469J69243K17307J91699l76373p17572
41308b32976j93136K33914l54010r14080j72684Q58424M12664q67162q77847L36535
41298a770358O62599m27521j010767L4147J357444J514599R26754N41475K89538
41289B117910j68323n70782p26881q67701q71953m17911j12293q52582j829127
41280d299643j135304J091388K281311J116051n11498m81768O21046J133039R98831
41271H13453R44255N65397n99217j331015l69731J069792P57598j077373k046799
$$ plain form
41337 -633321 -2223411 -2870153 -2828922 -3249835 -3982048 -3727909 -2254985 -880074 -632393
41328 -632393 -1218812 -1904456 -2259525 -1973790 -1032510 -141818 613 -212993 58143 602027
41318 602027 489987 -242884 -579899 -177749 282720 451963 669270 860969 484596 -232976
41308 -232976 -426112 -192198 -546208 -1460288 -1632972 -774548 -361884 -1229046 -2106893 -1770358
41298 -1770358 -1107759 -1535280 -2546047 -2511900 -1154456 360143 1286897 1828372 2117910
41289 2117910 1949587 1378805 651924 -215777 -1087730 -1505641 -1617934 -2470516 -4299643
41280 -4299643 -5434947 -4343559 -2062248 -946197 -1457695 -1939463 -1318417 -185378 813453
41271 813453 1757708 2323105 1723888 392873 23142 1092934 1850532 773159 -1273640
41262a273640j212318j44529j63672n94347l54368M06425R85404J162815R27003
41253b61227K31644m56208l44225M81009R34245M29123l61204o17785l92057j11170
41243d67855Q2171L4106n66127j470422j683975o21674R88303J866412J528552
41234c10509N30728k84760m70370j75719R3654P7977Q4517M10771O63637K56270
41224H76196n28808p42072j17354N35805M97792O530l02832j98176J98897P00088
41214I26066R87469P26532j3656q04519j354686j535718j066947J23200J290248
41205g22011J454736O52142j64359m35952l43221K3345O80284R64208J05199j234463
41195I79908j463987m05757M68967N21543P26745J284770P46328j117271j888542
$$ plain form
41262 -1273640 -2485958 -2630487 -2794159 -3388506 -3742874 -3336449 -2351045 -1188230 -261227
41253 -261227 -29583 -485791 -830016 -349007 585238 1014361 653157 35372 -356685 -467855
41243 -467855 -385684 -351578 -917705 -2388127 -4072102 -4693776 -3705473 -1839061 -310509
41234 -310509 220219 -64541 -534911 -710630 -616976 -538999 -454482 -43711 619926 876196
41224 876196 347388 -394684 -512038 23767 521559 528089 225257 27081 225978 926066
41214 926066 1913535 2640067 2626411 1821892 467206 -1068512 -2135459 -2012259 -722011
41205 -722011 732725 1384867 1220508 784556 441335 464680 1144964 2109172 2214371 979908
41195 979908 -484079 -889836 -420869 100674 827419 2112189 2858517 1741246 -147296
41186a47296m7356K051413J412629q95416j362072N53497J973761J323142J15723
41177D978025l60893q69487j759862j701479l13837N95733R4314n9872J342313
41168A944955K254253M95434k236540k473445n6424J883769J582905L78962k78876
41159C494993p43165j372593j262711j7956J008636O35446k69661k01399O12298
41150A883888O60508m83451j526011j199012K33516J400346J281840J26797q47350
41141A531071o70972L46534R57631M66400m21195n39192J92003O79356J84491
41132B726127n91060m35281N81509J000319n6706j539358j829533r23268j63093
41123a230344l7149L19589J187709J420790L94226o15119l02562N20828K78363
$$ plain form
41186 -147296 -194652 1856761 3269390 2373974 1011902 1565399 3539160 4862302 4978025
41177 4978025 4617132 3747645 1987783 286304 -27533 568200 662514 602642 1944955
41168 1944955 4199208 4694642 2458102 -15343 -71767 1812002 3394907 3773869 3494993
41159 3494993 2751828 1379235 116524 98568 1107204 1742650 1472989 1271590 1883888
41150 1883888 2544396 2060945 534934 -664078 -430562 969784 2251624 2378421 1531071
41141 1531071 860099 1206633 2164264 2630664 2209469 1670277 1862280 2541636 2726127
41132 2726127 2135067 1699786 2281295 3281614 3224908 1685550 -143983 -1067251 -1230344
41123 -1230344 -1267493 -947904 239805 1660595 2054821 1439702 1137140 1657968 1936331
41114A936331o44301m20921J195234K282211J490192k28207j179653r22201p8295
41105C430390P22842R96111L64748q96041j839659j854448j203842l62904M79784
41096a63019J051663R79531M89618L15106N55571M75678j83440o39078l44204
41087B537426J15065J07905Q6098P20429J518442J276144l12092k174736k883162
41078I91519j836464K25223J618372J127065o25757j681450r09368Q41377J960162
41069A710679J775031P52165k71180o45203k99138J20374K9027j97704Q7992M22732
41059C484775j65919j228287j265164k86469j3461q98675j165290N3740R58319
41050e26431J99597m94286Q05501K623807K273838L24424l53001O85492R95126
$$ plain form
41114 1936331 1292030 871109 2066343 4348554 5838746 5610539 4430886 3508685 3430390
41105 3430390 4153232 5149343 5514091 4618050 2778391 923943 -279899 -642803 -163019
41096 -163019 888644 1868175 2357793 2672899 3228470 3704148 3520708 2881630 2537426
41087 2537426 2652491 2760396 2846494 3566923 5085365 6361509 6049417 3874681 991519
41078 991519 -844945 -619722 998650 2125715 1499958 -181492 -1090860 -249483 1710679
41069 1710679 3485710 4237875 3966695 3321492 3022354 3142728 3171755 2974051 3062043 3484775
41059 3484775 3318856 2090569 825405 538936 525475 -373200 -1538490 -1484750 -526431
41050 -526431 -326834 -821120 -15619 2608188 4882026 5206450 4853449 5538941 6534067
41041F534067n32172k139190k368445j909869j528023p28792N04935R27827J15201
41032a124461o13809m04156j60392o09554q95291k67327N06553O31601O44413
41023b292423J067385J178692L87782n13071p04597o42165q01978n01289O70135
41014b151529J529139R06889m81167j178081r92136n24848K17852J264207J726954
41005C17280R82780k5180j53086Q7894m62541j542760j946967j390088m46118
40996d578786O44544J683755J885712J043841L74494N91683L33811j472619k944599
40987b438164j613536J373201K485220R67095m62254l13705l10593j588438k155916
40978d057090j77551K618538L223167J543829L0725k7605K86882k22788j140935
$$ plain form
41041 6534067 6001895 3862705 1494260 -415609 -1943632 -2672424 -2167489 -1239662 -1124461
41032 -1124461 -1738270 -2142426 -2302818 -2912372 -3807663 -4074990 -3568437 -2936836 -2292423
41023 -2292423 -1225038 -46346 341436 -171635 -876232 -1518397 -2320375 -2821664 -2151529
41014 -2151529 -622390 284499 -196668 -1374749 -2366885 -2891733 -2673881 -1409674 317280
41005 317280 1300060 1274880 1121794 1209688 747147 -795613 -2742580 -4132668 -4578786
40996 -4578786 -3934242 -2250487 -364775 679066 1053560 1645243 1979054 506435 -2438164
40987 -2438164 -4051700 -2678499 -193279 773816 311562 -2143 -312736 -1901174 -4057090
40978 -4057090 -4234641 -1616103 1607064 3150893 3181618 3154013 3440895 3218107 2077172
40969B077172j305729m62986L66638M1106j196741j709666n41513R82309R30439
40960h18971k77407l39516J332247K492169J332546r73281k193439j912651j074200
40951b432503l6482J232857K001925J523667L79592l29897n96652j032155j427012
40942g16660j183078o49486n82981o94729j93501N63045N06992k01832k44449
40933c396679P49646J613171J431045O21960j30627q11984j406724j345159l60414
40924c035765P60458R89645L36079j63322L34818J453729J854312O89875j219254
40915B000575k140594j458792k23418N52912J041785J443097J057886k32372q12962
40906A228117N31770K207673J656552q35509k432917j760827k83404N35513R62031
$$ plain form
40969 2077172 771443 308457 675095 716201 -480540 -2190206 -2731719 -1749410 -818971
40960 -818971 -1096378 -1435894 -103647 2388522 3721068 2747787 554348 -1358303 -2432503
40951 -2432503 -2468985 -1236128 765797 2289464 2669056 2339159 1742507 710352 -716660
40942 -716660 -1899738 -2549224 -3132205 -3826934 -4020435 -3457390 -2950398 -3152230 -3396679
40933 -3396679 -2647033 -1033862 397183 1019143 888516 76532 -1330192 -2675351 -3035765
40924 -3035765 -2275307 -1285662 -949583 -1112905 -778087 675642 2529954 3219829 2000575
40915 2000575 -140019 -1598811 -1822229 -1269317 -227532 1215565 2273451 2041079 1228117
40906 1228117 1759887 3967560 5624112 4788603 2355686 594859 311455 846968 1808999
40897A808999J218427M87268j098613j708079n78952M58009o2932o89282M00829
40888B35674J967232J476755p20302j787297o33801Q72372J049447L91649l9054
40879B812675j50101r8330K29581L61575n62931k080406k383915p55897J335870
40870a291879K276243K068491J330117L5675j648989k587888k040757q77283k69671
40861c005941n6333M54348R68403Q15587L39944L22873N74315L88256j14110l70623
40851C16719n60549j032108j100848m965J340525J307703J20401l88965L18125
40842C16038P37821r4241j122440j132243m62541P3281N44759J136639J269761
40833A266834O13041n2334l5776J53655r8737l42928j08426o9638q33581j494436
$$ plain form
40897 1808999 3027426 3514694 2416081 708002 129050 587059 524127 -165155 235674
40888 235674 2202906 3679661 2959359 1172062 538261 1410633 2460080 2851729 2812675
40879 2812675 2662574 2564244 2793825 3155400 2592469 512063 -1871852 -2627749 -1291879
40870 -1291879 984364 3052855 4382972 4418647 2769658 181770 -1858987 -2736270 -3005941
40861 -3005941 -3062274 -2607926 -1639523 -823936 -483992 -161119 413196 801452 687342 316719
40851 316719 -243830 -1275938 -2376786 -2381751 -1041226 266477 386878 -2087 316038
40842 316038 1053859 959618 -162822 -1295065 -1757606 -1684325 -1139566 -2927 1266834
40833 1266834 1879875 1827541 1791765 1945420 1846683 1503755 1395329 1325691 492110 -1002326
40823a002326r03972L63718R00082O74796O41716O54684k29491j519592j489013
40814a909398M9141J155711O58684j81172P4362P32294L47036p51261r73244L2974
40804g64873R66584Q71097K15126k36217m95449p73728o90822R4860Q72252M83952
40794E42782r23297j677055p08135Q52782J239408O81544R13308K076290K120789
40785E118416J50211j621908r57796R26169J224868j77975r81491n44000o76892
40776B459602k016486k565150r92311J106605J729958J133020L93276o30940j954531
40767a336957j936763M39695L016091K786852J22545j766341j223014L43690J206733
40758A652531J211949O71347m09851j402432j257623l19238j79180j020533r65433
$$ plain form
40823 -1002326 -1906298 -1542580 -642498 32298 674014 1328698 1099207 -420385 -1909398
40814 -1909398 -1860257 -704546 -45862 -227034 -152672 579622 926658 175397 -797847 -764873
40804 -764873 201711 1072808 1287934 1051717 556268 -217460 -908282 -813422 58830 542782
40794 542782 -380515 -2057570 -2765705 -1912923 -673515 8029 921337 2997627 5118416
40785 5118416 5268627 3646719 2688923 3615092 4839960 4661985 3680494 3136494 2459602
40776 2459602 443116 -2122034 -3114345 -2007740 -277782 855238 1248514 617574 -1336957
40767 -1336957 -3273720 -2834025 182066 2968918 3091463 1325122 102108 445798 1652531
40758 1652531 2864480 3535827 3125976 1723544 465921 146683 -32497 -1053030 -2018463
40749b018463Q44970K293645J053434j893610l356123k001419M02213J702129
40741b973224J700207J356771R87076K49789o51766q56108q5284P51534O93444
40732A172439J6614l04291j64236l70000j016006j021290O9549R48710L29871
40723c38640r51282j021677L03362J383392J210263M93655J28134Q705j93997
40714A021915l10122k67570l76549n06020J3640J088326J451976L23863j299082
40705A140377j817086r74465P9723L40196j9249l6000Q43088J872809J599652
40696C029045j99026j709526j243707K58480M29149r82334j721047n68091Q55151
40687a851906Q54098K50376O04158J418776J075638m26096j572952j567223p50778
$$ plain form
40749 -2018463 -1173493 1120152 2173586 279976 -3076147 -5077566 -4675353 -2973224
40741 -2973224 -1273017 83754 1070830 1320619 668853 -187255 -272539 478995 1172439
40732 1172439 1189053 884762 720526 350526 -665480 -1686770 -1617221 -668511 -338640
40723 -338640 -1289922 -2311599 -2008237 -624845 585418 1079073 1207207 1215912 1021915
40714 1021915 711793 444223 67674 -438346 -424706 663620 2115596 2439459 1140377
40705 1140377 -676709 -1651174 -1571451 -1231255 -1250504 -1286504 -443416 1429393 3029045
40696 3029045 2830019 1120493 -123214 135266 564415 -417919 -2138966 -2707057 -1851906
40687 -1851906 -997808 -747432 -143274 1275502 2351140 1925044 352092 -1215131 -1965909
40678a965909O21259K236587K761204R74717k051914l619715k572381m62646O97572
40669c381226N66058J4022k66445j44814J89582M31734N17645P21234R78570O11978
40659B38338n01291j122617j71486J461130J960623J043590p2706p20451j094734
40650A020396q59580N07203J957305J618331l45062j705167j479418j066172j407423
40641a759587j414559l35860O57275P11043Q60304J646242J472933m61595j813151
40632d36955m70538J567480J008033j367967j882499J26407J543415Q10694K8494
40623I26564O68317R35565o63880k244057j515926M54837J084636K19694l19724
40614d53974L2400L16273K61495M42840O56749K65158j48707M70241J433415R77060
$$ plain form
40678 -1965909 -1344650 891937 3653141 4627858 2575944 -1043771 -3616152 -4078798 -3381226
40669 -3381226 -2815168 -2801146 -3067591 -3212405 -3022823 -2591089 -2073444 -1352210 -373640 238338
40659 238338 -262953 -1385570 -1557056 -95926 1864697 2908287 2835581 2115130 1020396
40650 1020396 160816 668019 2625324 4243655 3898593 2193426 714008 -352164 -1759587
40641 -1759587 -3174146 -3510006 -2852731 -2141688 -1281384 364858 1837791 1376196 -436955
40632 -436955 -907493 659987 1668020 300053 -1582446 -1456039 87376 898070 926564
40623 926564 1594881 2530446 1866566 -377491 -1893417 -1438580 -353944 -134250 -453974
40614 -453974 -421574 -105301 156194 599034 1255783 1520941 1372234 1842475 3275890 4252950
40604D252950p49293j496241k28839J290415J067063n35563j733750j646824p58895
40595e38977J0053o0132r47221j443369k81257J743932K100596p8275k256494
40586a751144j621200J051424K458784J197019q13152j378746o40217L980M6606
40577a446646q7715j42703o2088M72960J476454J971348R31925j111417k351384
40568c49266j815294m44599K79089R7725k22187l33550o35508j162476j057917
40559e643983K93358K088351K773213J835848L50193l99480l14693j68056l06435
40550E08316k88227J86855N82985J82304q04105j315231p63977J49296L25298
40541a236486l02638p83914n30969J2473K96286N15264R85457J291454Q87348
$$ plain form
40604 4252950 3503657 2007416 1778577 3068992 4136055 3600492 1866742 219918 -538977
40595 -538977 -528924 -589056 -1536277 -2979646 -3260903 -1516971 583625 505350 -1751144
40586 -1751144 -3372344 -2320920 137864 1334883 521731 -857015 -1497232 -1493252 -1446646
40577 -1446646 -1534361 -1677064 -1739152 -1266192 210262 2181610 3113535 2002118 -349266
40568 -349266 -2164560 -2609159 -2330070 -2232345 -2454532 -2788082 -3423590 -4586066 -5643983
40559 -5643983 -5350625 -3262274 -489061 1346787 1696980 1297500 982807 814751 508316
40550 508316 220089 406944 989929 1172233 368128 -947103 -1711080 -1561784 -1236486
40541 -1236486 -1539124 -2323038 -2854007 -2841534 -2545248 -2029984 -1044527 246927 1134275
40532A134275J75001K2657L58389K84135l43136n68862M4428N28023p8952j268241
40522B87717j855102j616217j229678r90000n29051L16386J160599J610983J592749
40513a251614J186668O10041K08052J4836m04958j144679j370143l45556J189542
40504a307811J638463O12167n27501m85023L52978N93223l25243j463698j473335
40495b385780j33723J268378J241294k03912j518305j449479l50693O79940J185090
40486a667190J169061L69879j125424k130491j634909m96341l30613r11752m90056
40477g247836J168889K122438J314866K83515N79768J282629P87731l33265l40118
40468c81383O54077Q79542j27213q76401m67594J56133J38081J87582J032193
$$ plain form
40532 1134275 1309276 1331933 1690322 1974457 1631321 1062459 1106887 1634910 1555958 287717
40522 287717 -1567385 -3183602 -4413280 -5403280 -5932331 -5615945 -4455346 -2844363 -1251614
40513 -1251614 -64946 545095 753147 767983 363025 -781654 -2151797 -2497353 -1307811
40504 -1307811 330652 942819 415318 -69705 283273 876496 551253 -912445 -2385780
40495 -2385780 -2519503 -1251125 -9831 -213743 -1732048 -3181527 -3532220 -2852280 -1667190
40486 -1667190 -498129 -128250 -1253674 -3384165 -5019074 -5515415 -5846028 -6757780 -7247836
40477 -7247836 -6078947 -3956509 -2641643 -2358128 -1778360 -495731 292000 -41265 -381383
40468 -381383 272694 1152236 1025023 148622 -318972 -162839 -24758 162824 1195017
40459A195017J648760N01934j962309l418416k354098K59334K254775K527322
40451F52319J564424K67735r34861j785125j810573q33133M57307J046465O87815
40442f87627M9258j45163K57408Q69891R53928j07322j835880k516416j054504
40433d216427J209343J825601M52894p05809r0897J148471J150417J4948p55048
40424C3493m90066K58690Q82248J108912P86137K21918J22377L88953p6256j402463
40414A833943j841477k93915J460564J026647r85583j876009r19626l8767l71618
40405b005841o76471J95263J421471J807703J517265J130159M15825q31706j829271
40396A144397j694271n42094R04060J952419J862990L19129j572402k071072j145491
$$ plain form
40459 1195017 2843777 3345711 1383402 -2035014 -4389112 -4129778 -1875003 652319
40451 652319 2216743 2484478 1549617 -235508 -2046081 -2879214 -2421907 -1375442 -687627
40442 -687627 -638369 -783532 -526124 343767 1297695 1190373 -645507 -3161923 -4216427
40433 -4216427 -3007084 -1181483 -728589 -1434398 -1525295 -376824 773593 788541 33493
40424 33493 -456573 -197883 684365 1793277 2579414 2801332 2923709 3312662 3236406 1833943
40414 1833943 -7534 -301449 1159115 2185762 1200179 -675830 -1595456 -1634223 -2005841
40405 -2005841 -2682312 -2487049 -1065578 742125 2259390 3389549 3805374 2973668 1144397
40396 1144397 -549874 -1091968 -187908 1764511 3627501 3946630 2374228 303156 -842335
40387h42335n90486j139105j168850N41753K400969K087441k5904j398553p59454
40378h94524O65007J197245N43335n18904j174997j033525k21795P60506J474716
40369G97064J671412J040578m41709j790946j709907m43782K63317k68797n35875
40360a418645O28206J855560J238029n69930j268659l77600L13905l01047j226962
40351a127143j266586o37456m6715M72486J001161J046305K83455o49306q57957
40342a781756l58378K9328j86108n30695j53312J027454J976345J671470M64483
40333B158831l36442k99109l53791j093871j680544j193341q1882O81719J000252
40324a198178J158546Q62355M147m95616m938N09979J6692o53695k41868M52628
$$ plain form
40387 -842335 -1432821 -2571926 -3740776 -3199023 -798054 1289387 1263483 -135070 -894524
40378 -894524 -229517 967728 1511063 992159 -182838 -1216363 -1438158 -677652 797064
40369 797064 2468476 3509054 3067345 1276399 -433508 -877290 -613973 -882770 -1418645
40360 -1418645 -790439 1065121 2303150 1733220 464561 86961 400866 99819 -1127143
40351 -1127143 -2393729 -3031185 -3077900 -2605414 -1604253 -557948 -274493 -923799 -1781756
40342 -1781756 -2140134 -2110806 -2296914 -2827609 -2980921 -1953467 22878 1694348 2158831
40333 2158831 1822389 1523280 1169489 75618 -1604926 -2798267 -2880149 -2198430 -1198178
40324 -1198178 -39632 822723 826870 331254 326316 836295 852987 199292 -42576 410052
40314D10052k10792j601443j540978o012O58417m38832j470441j179725o69355
40305f049109p33355j15531J819646L055535J782590m96766j052106J83900J086604
40296e18592P33071N7344l04990o92455j133799j142760p22459k62000K39040
40287c747600O80632L14051r12670j348167K15888K162078J953215q0023j226969
40278a989565m89182L86561K24957Q3872P24549R27270k12844j329845q54258
40269b528485M73548Q95930K71684k94842n04526p80277q26155o5996Q63006P81783
40259a714330k2265j19267P07827J113203M99814O125M60555Q49788M162j263426
40249E22186j181748K91256J300740P06932m40302n89999J44486M38649j58588
$$ plain form
40314 410052 199260 -1402183 -2943161 -2949173 -2290756 -2729588 -4200029 -5379754 -6049109
40305 -6049109 -6782464 -6897995 -5078349 -2022814 -240224 -736990 -1789096 -1605196 -518592
40296 -518592 214479 271823 -33167 -725622 -1859421 -3002181 -3724640 -3986640 -3747600
40287 -3747600 -3066968 -2752917 -3665587 -5013754 -4797866 -2635788 -682573 -762596 -1989565
40278 -1989565 -2478747 -2092186 -1867229 -1783357 -1058808 -131538 -344382 -1674227 -2528485
40269 -2528485 -2054937 -1159007 -887323 -1182165 -1686691 -2466968 -3293123 -3359119 -2496113 -1714330
40259 -1714330 -1736595 -1855862 -1148035 -34832 464982 471107 931662 1781450 1785612 522186
40249 522186 -659562 -368306 932434 1639366 1199064 609065 753551 1192200 1033612
40240A033612p22570n50535j76612k73194l83717L36498J536548J886410Q91473
40231C577913m67745j156430j249248j221353r43777j74003N57395N33404Q1905
40222d61939K63449J285141K060762J610092K72116q07501r61716m56962K8624
40213B832066P4179k08955m11313l61284l14562m36209l75450J58814O00989O8700
40203A626975j190525j693218n13026J385149K152216J066399q93890k161508
40195b21428j848143k78792J191069J169925l52162j734420j414623K14465J298876
40186a975233Q59482j16553j63139P52944J353633P77971m00546r80614n91061
40177d83116P193O7791j28958J35316O50403L37359j066384k245758j923781n60051
$$ plain form
40240 1033612 311042 -239493 -416105 -689299 -1073016 -736518 800030 2686440 3577913
40231 3577913 3110168 1953738 704490 -516863 -1460640 -1634643 -1077248 -543844 -461939
40222 -461939 -198490 1086651 3147413 4757505 5029621 4222120 3260404 2803442 2832066
40213 2832066 2906245 2697290 2285977 1924693 1610131 1173922 798472 957286 1558275 1626975
40203 1626975 436450 -1256768 -1769794 -384645 1767571 2833970 1940080 -221428
40195 -221428 -2069571 -2348363 -1157294 12631 -339531 -2073951 -3488574 -3274109 -1975233
40186 -1975233 -1115751 -1232304 -1395443 -642499 711134 1489105 1088559 107945 -483116
40177 -483116 -475923 -408132 -537090 -401774 248629 585988 -480396 -2726154 -4649935 -5209986
40167e209986N14225J127805K132330L357639L214988R12463k046727l407473
40159E95264k552312o79270Q08906J337522J007216K49841l89567o33625o51432
40150i07457o56267n53248k26409J32300L09211M49912Q54475J541186K163887
40141C107590K201256J298730j89509j136884p85176J05003J19065p40221r93757
40132B986097n2844O92019K5039j018335n33666J462995K932432K231637l36751
40123H388623l076439m133555k641253L43773K358297J927769J41880r54350r10441
40114A444304p09739p54742n73567k22517l19179o38018k27212Q55062J379281
40105B33673Q58103K48282L04557N32637L20378r3009l85457p81669j265862j198606
$$ plain form
40167 -5209986 -4695761 -3567956 -1435626 1922013 5137001 6049464 4002737 595264
40159 595264 -1957048 -2636318 -1827412 -489890 517326 767167 377600 -256025 -907457
40150 -907457 -1563724 -2116972 -2343381 -2211081 -1901870 -1451958 -597483 943703 3107590
40141 3107590 5308846 6607576 6418067 5281183 4496007 4601010 4720075 3979854 2986097
40132 2986097 2933253 3625272 3650311 2631976 2098310 3561305 6493737 8725374 8388623
40123 8388623 5312184 1178629 -1462624 -1118851 1239446 3167215 3309095 2354745 1444304
40114 1444304 734565 -20177 -593744 -816261 -1135440 -1773458 -2000670 -1145608 233673
40105 233673 1091776 1340058 1644615 2177252 2497630 2404621 2019164 1237495 -28367 -1226973
40095a226973m33994J06304k62435q98082q13807j03518L64549K12549j32815
40086c188222r7546M75550J172929J295479O65324O1173K47775P37644L90310
40077A760416q30722j723005j519665o53936K29415R15641J151230O96218K2321
40068D7913j51375m8815l27834n39102K75001J516193J555856M72345J370L80465
40058C182017j28820j761570k230062o69633L67892r08785k108707l64769K747775
40049a874662L460533J492073j80670l94746q50670k122537k270479l04151J879477
40040a165832K215061R86966l67866j146089j161263k54258J047070J583043R46334
40031B683166j39711j029639j618153j586721n78834P44819J202159P64760M04735
$$ plain form
40095 -1226973 -1660967 -1554663 -1817098 -2715180 -3528987 -3632505 -3267956 -3055407 -3188222
40086 -3188222 -3285768 -2810218 -1637289 -341810 323514 384687 632462 1370106 1760416
40077 1760416 929694 -793311 -2312976 -2966912 -2737497 -1821856 -670626 25592 47913
40068 47913 -103462 -152277 -480111 -1019213 -744212 771981 2327837 2800182 2801552 3182017
40058 3182017 3053197 1291627 -938435 -1608068 -1240176 -2148961 -4257668 -4622437 -1874662
40049 -1874662 1585871 3077944 2897274 2502528 1651858 -470679 -2741158 -3045309 -1165832
40040 -1165832 1049229 2036195 1668329 522240 -639023 -893281 153789 1736832 2683166
40031 2683166 2543455 1513816 -104337 -1691058 -2269892 -1525073 -322914 441846 846581
40022H46581K87455l76803j620915k405041k153848j214734J45525J697385K444364
40013b350031J620794K53391j65274j33949r62252j661562j35774K509357K520309
40004A495009p04010l019945j460333J611141K514724J368803M41615L2857p94556
39995A485305j371474o44220K01801m52095j449356p20723P19860K45869j569306
39986c554339j555623N80380J468901k86217j599528O0905K481037K240012k6547
39977a91019j051928j37922L94222n03206j054330K2241J305020J098335J22260
39968C673L5542N60958J47959j059477j146972M33833J741961J257201Q0777j79828
39958A875627j21346j132750k414441j922416J13839J246410O03494N5895Q57161
$$ plain form
40022 846581 1134036 757233 -863682 -3268723 -5422571 -6637305 -6491780 -4794395 -2350031
40013 -2350031 -729237 -475846 -641120 -775069 -1737321 -3398883 -3534657 -1025300 1495009
40004 1495009 790999 -2228946 -3689279 -2078138 436586 1805389 2247004 2279861 1485305
39995 1485305 113831 -530389 -328588 -780683 -2230039 -2950762 -2230902 -1985033 -3554339
39986 -3554339 -5109962 -4529582 -3060681 -3346898 -4946426 -4885521 -2404484 -164472 -191019
39977 -191019 -1242947 -1380869 -986647 -1489853 -2544183 -2521942 -1216922 -118587 3673
39968 3673 39215 600173 748132 -311345 -1458317 -1024484 717477 1974678 2055455 1875627
39958 1875627 1754281 621531 -1792910 -3715326 -3601487 -2355077 -1751583 -1695688 -838527
39949h38527J598649Q12085n43649q81087n50765p56797j214360p84682M37652
39940b721481J366237J570785J270651M46514o87860j160754n53205N3651j91943
39931f07405l11427P60204J937215J456586k65509j327852j232658r66354p86578
39922a343778k25048R8044q61662k153500j575219Q68175K594671K031188L77239
39913a89890p73929j337553j453416n19421J265953K229368J416836j2050p19872
39904i3974r91036j351545r76538Q30059K721178K729198J004276n10071p93454
39895B568093o11788p47492q28510l16086L81601M47511j47341n66831k01815
39886b2658N42317P96166L76549q0498j57256j69278l76648m66669l42542n35716
$$ plain form
39949 -838527 760122 1572207 1028558 147471 -403294 -1160091 -2374451 -3159133 -2721481
39940 -2721481 -1355244 215541 1486192 1932706 1244846 84092 -469113 -415462 -607405
39931 -607405 -918832 -158628 1778587 3235173 2969664 1641812 409154 -557200 -1343778
39922 -1343778 -1568826 -1470782 -2332444 -4485944 -6061163 -5192988 -2598317 -567129 -189890
39913 -189890 -963819 -2301372 -3754788 -4274209 -3008256 -778888 637948 625898 -93974
39904 -93974 -1085010 -2436555 -3413093 -2583034 138144 2867342 3871618 3361547 2568093
39895 2568093 1956305 1208813 380303 64217 445818 893329 745988 179157 -22658
39886 -22658 519659 1315825 1692374 1611876 1454620 1285342 908694 442025 99483 -436233
39876d36233j035167p07423R01356K116367J125492j204032k319942j427783l7802
39867c025167O91775J047147J159490N53091l09430j76625P39472P79472k70820
39858A188405o03353M12890R33989j05703r32383n2186Q40414l95834k431469
39849a145230k242956J25911J562934N02427j137284j101449K69907J122192O33916
39840a409632m27202q87002k69279Q82327J532169J209176M13493j91370m97996
39831C54684n80097l46258o1248l49004j018949q65626M86982J568210J022218
39822B10912l62910r12269m87953j30073K839N66347J288423J118706J07737n19016
39812H82743l47808l23761r64479j400491p92203L03439O35928j92234j239773
$$ plain form
39876 -436233 -1471400 -2178823 -1277467 838900 1964392 760360 -1559582 -2987365 -3025167
39867 -3025167 -2333392 -1286245 -126755 426336 116906 -59719 679753 1459225 1188405
39858 1188405 585052 997942 1931931 1826228 893845 841659 1682073 1286239 -1145230
39849 -1145230 -3388186 -3262275 -1699341 -1196914 -2334198 -3435647 -3165740 -2043548 -1409632
39840 -1409632 -1836834 -2723836 -2993115 -2110788 -578619 630557 1044050 852680 354684
39831 354684 -225413 -571671 -632919 -981923 -2000872 -2866498 -2379516 -811306 210912
39822 210912 -151998 -1064267 -1552220 -1682293 -1679454 -1113107 175316 1294022 1401759 882743
39812 882743 534935 211174 -753305 -2153796 -2945999 -2642560 -2006632 -2198866 -3438639
39803c438639j064059P97787K893760K998561P96595j406848j625222q12099r70328
39794a830492j615106n62658J940923K743502M29599k047596j267243J799037
39786d10034L181575J438133p01839n51926Q68815Q02211r19541j612765J41324
39777B235953K129329J527732r94229k188428q95880M50018l94690k245270k426959
39768b802424n11347J551989K150003J278722k45468j353084j050729L64186R57285
39759C39133m78452k282040j853628O94100K659577K345749P02962n61225o82344
39750H83832L84250K019922K631700J152090r70939j227263L34126J150420J70071
39741F528209p38887k94338j5841j302870k654108j991752n4758Q23302J44975
$$ plain form
39803 -3438639 -4502698 -3704911 -811151 2187410 2984005 1577157 -48065 -860164 -1830492
39794 -1830492 -3445598 -4008256 -2067333 676169 1105768 -941828 -2209071 -410034
39786 -410034 2771541 4209674 3507835 2955909 3824724 4626935 3707394 2094629 2235953
39777 2235953 4365282 5893014 4898785 2710357 1814477 2264495 1869805 -375465 -2802424
39768 -2802424 -3313771 -1761782 388221 1666943 1421475 68391 -982338 -618152 339133
39759 339133 -139319 -2421359 -4274987 -3580887 -921310 1424439 2127401 1566176 883832
39750 883832 1268082 3288004 5919704 7071794 6100855 4873592 5207718 6358138 6528209
39741 6528209 5789322 5494984 5479143 4176273 1522165 -469587 -524345 298957 443932
39732D43932p09646r68807r07658m78763M86371J193053Q80285M48574J194632
39723A581973K333932J865699k42935j874064j877317j241019p99507L409J263873
39714A014044J661454O48783j62773O18773J799194J382096l15097j276656r15884
39705D453934n49455q68321r47704j95167M63351J40109o14145q50586n89095
39696D42921k73186J67326P90216J082320Q69698Q37228J121881N71011j160583
39687D448832k048463l44414K169480K226202p1525j482528q18603m38478j591113
39678B049390j941828J26434K029518Q77965j641699j854726J42525J103883J7620
39669I09082r71742o74957j74714R3064J013117K075639J440838n04090j036862
$$ plain form
39732 443932 -265714 -1234521 -2142179 -2620942 -2134571 -941518 -61233 387341 1581973
39723 1581973 3915905 5781604 5538669 3664605 1787288 546269 -253238 -249829 1014044
39714 1014044 2675498 3324281 3161508 3780281 5579475 6961571 6646474 5369818 4453934
39705 4453934 3904479 3036158 2088454 1893287 2356638 2496747 1882602 1032016 442921
39696 442921 169735 337061 1127277 2209597 3079295 3916523 5038404 5609415 4448832
39687 4448832 2400369 2055955 4225435 6451637 6380112 4897584 4078981 3640503 2049390
39678 2049390 107562 233996 2263514 3141479 1499780 -354946 -212421 891462 909082
39669 909082 -62660 -737617 -912331 -819267 193850 2269489 3710327 3206237 2169375
39660B169375L81385Q88028r63722k535061j390694P61031J094246J83763M74057
39651A062408J948043K398589J082399n98840j560399j937141j881421j322736
39643h09098o27321o9872P85429J923917K056080M31170j545279k146636j757710
39634a759320j709348j766002q80560M01591O27221O5471L58724J679432K371381
39625f11410J539093J39915o59053n87217L02475J699640K465217J551009l73009
39616E466660j565099j469403r94874p04235k30738N25458J062495J178212R98001
39607D266477L39602o94315j031654j36889M36447r22329k742350j946322J357693
39598a073640L281118J338292k077531k918229n83714J854938J701577n19116
$$ plain form
39660 2169375 2550760 3438788 2475066 -59995 -1450689 -689658 404588 588351 1062408
39651 1062408 3010451 5409040 6491439 5892599 4332200 2395059 513638 -809098
39643 -809098 -1436419 -1506291 -720862 1203055 3259135 3690305 2145026 -1610 -1759320
39634 -1759320 -3468668 -5234670 -6115230 -5713639 -5086418 -5020947 -4662223 -2982791 -611410
39625 -611410 927683 1067598 408545 -178672 123803 1823443 4288660 5839669 5466660
39616 5466660 3901561 2432158 1437284 733049 502311 1027769 2090264 3268476 4266477
39607 4266477 4606079 3911764 2880110 2743221 3179668 2257339 -485011 -2431333 -1073640
39598 -1073640 2207478 3545770 1468239 -1449990 -2033704 -178766 1522811 1003695
39590A003695k128155j430015M61861J095549q9919j022699j37144J160715P24588
39581c61524q99587j504328q06623l65887m10429K79340J345715R38099o31238
39572b416462o20992J589625K904720J254355j007486q42460P53268O49785j397531
39563H66822k611878j376130J007728K544465K505490J203482n15289j437292
39555B187398r22738J61397L29164o81536j623564j282117J29452J121229M84511
39546i6804j116921j605454j93527J216729P00044n60464m2924J792134J942345
39537B035158j80793j549598l14713J411570J243545M4556l57627l44432r68703
39528A018963j500069j015958m54605o48881l40629J299973K309560R66364q77087
$$ plain form
39590 1003695 -1124460 -2554475 -2092614 -997065 -1086984 -2109683 -2246827 -1086112 -361524
39581 -361524 -1261111 -2765439 -3572062 -3937949 -4348378 -4069038 -2723323 -1785224 -2416462
39572 -2416462 -3037454 -1447829 1456891 2711246 1703760 861300 1614568 2264353 866822
39563 866822 -1745056 -3121186 -2113458 431007 2936497 4139979 3624690 2187398
39555 2187398 1264660 1426057 1755221 1073685 -549879 -1831996 -1702544 -581315 -96804
39546 -96804 -1213725 -2819179 -3012706 -1795977 -1095933 -1656397 -1699321 92813 2035158
39537 2035158 1854365 304767 -9946 1401624 2645169 2689725 2332098 1987666 1018963
39528 1018963 -481106 -1497064 -1951669 -2600550 -2941179 -1641206 668354 1634718 757631
39519G57631o99801M02926r2564j445347j155812K38736K23617p82496j64785
39510b717895J692282J710277k90302j135380m1830J01185j583902j960491L78781
39501c847275K039898L74007j957233j395492Q56023J376671K10402L2305J224081
39492a086613J589734K90964j152728j584855j375712r25210l1787J198736K179006
39483h98465K393320J403040p60539k527880j788224R06901K155077L78429j506851
39474b45192m06339K104941K329825K00017j151288o68963l49766r99720q52812
39465c9297P49804J665160L62550j615157k170230j498529q63747l55009M53721
39456c310734J008158O08285k04598m98266m11333n24326m87941M21065J793250
$$ plain form
39519 757631 57830 460756 368192 -1077155 -2232967 -1994231 -1770614 -2553110 -2717895
39510 -2717895 -1025613 684664 394362 -741018 -782848 -681663 -2265565 -4226056 -3847275
39501 -3847275 -1807377 -1433370 -3390603 -4786095 -3930072 -2553401 -2342999 -2310694 -1086613
39492 -1086613 503121 794085 -358643 -1943498 -3319210 -4244420 -4276207 -3077471 -898465
39483 -898465 1494855 2897895 2137356 -390524 -2178748 -1271847 883230 1261659 -245192
39474 -245192 -651531 1453410 3783235 3983252 2831964 2163001 1813235 813515 -39297
39465 -39297 710507 2375667 2738217 1123060 -1047170 -2545699 -3409446 -3764455 -3310734
39456 -3310734 -2302576 -1694291 -1898889 -2397155 -2808488 -3332814 -3820755 -3399690 -1606440
39447a606440K321511J444859o4368j080246j105956m11775L15591N26761K72836
39438F12773j9427k46836o48457j050006p91694K05884R41482N20205n29887p77870
39428a783833L64920J922807K462507J623370L60720k64775k70686m21185q59528
39419C134317p98182P8179O88547r3623j642015k219280j268555M1429O01717
39410a477466N29632K74478k39377r21713r55581J52998J547046J915225J102399
39401A927641J06774k98978k71194l13854n62758p08044l43216N43507J267973
39392A347851R45014m01282j555908j410332l03797M73563L69581J03618M31433
39383b59J051947J158394O28100M8225k99277p63544j398723j393660j53401J356052
$$ plain form
39447 -1606440 715071 2159930 2095562 1015316 -90640 -502415 -186824 339937 612773
39438 612773 593346 346510 -301947 -1351953 -2143647 -1937763 -996281 -476076 -1005963 -1783833
39428 -1783833 -1418913 503894 2966401 4589771 4950491 4685716 4415030 3993845 3134317
39419 3134317 2336135 2414314 3102861 3009238 1367223 -852057 -2120612 -2079183 -1477466
39410 -1477466 -947834 -673356 -912733 -1834446 -2790027 -2637029 -1089983 825242 1927641
39401 1927641 2034415 1735437 1464243 1150389 587631 -120413 -463629 79878 1347851
39392 1347851 2292865 1891583 335675 -1074657 -1378454 -904891 -535310 -431692 -259
39383 -259 1051688 2210082 2838182 2886407 2587130 1823586 424863 -968797 -1122198 233854
39373B33854J352762m07327j930556j335089P26911J933399J254843n9941n44331
39364A224525m05137p01837j423247j413012j31051J362287J607756N67901l17800
39355C70385M764P98920N46940q56054j799194j130892K59376P76524L20839N3763
39345f54629L78462N21161J63889P7360O30130R26417K69118n22969l23640M92240
39335A957539O46659n2411n85142m76037m03156q16778j111712p15199m9556K94840
39325a310953N37379R66274R31428j60155j218647m64389J687879K446293L73899
39316C789008k142531j889729N81287J622933k75616k378402j814298L61167J098206
39307a047975o4402p30159M71317K049646K109813Q21909l79285q00851p98086
$$ plain form
39373 233854 1586616 1179289 -751267 -2086356 -1359445 573954 1828797 1768856 1224525
39364 1224525 819388 117551 -1305696 -2718708 -2849759 -1487472 120284 688185 370385
39355 370385 375149 1174069 1721009 864955 -934239 -2065131 -1805755 -1029231 -708392 -654629
39345 -654629 -276167 244994 408883 486243 1116373 2042790 2311908 1788939 1465299 1957539
39335 1957539 2604198 2551787 1966645 1490608 1087452 270674 -841038 -1556237 -1605793 -1310953
39325 -1310953 -773574 192700 1124128 963973 -254674 -719063 968816 3415109 3789008
39316 3789008 1646477 -243252 338035 1960968 1685352 -693050 -2507348 -2146181 -1047975
39307 -1047975 -1112377 -1842536 -1371219 678427 2788240 3610149 3230864 2430013 1631927
39298A631927q38879r81616q83596q9135J179634J643480L75875j428570j488272
39289h79152M05292J813122J034435m81127m21163R68167J489040K79459j328517
39280B879556j983640j679510r17361j6986N09132K17074l32857r4937P42177
39271f77352Q28003j69299q33231j48838R22652J024149M44869L18250O07890
39262B317093L54787m99487j008041q37256o14721n48336m7524R00053J252915
39253A269483N02882l22261j16485O81597R05915M26604l9309m06560j185999
39244A715867k081584j985571o79449O16364Q99000O14143O14910P72107M51635
39235I37422k35606n40099j22415O53657J177328Q71105m50302j906906j911298
$$ plain form
39298 1631927 793048 -188568 -1072164 -1161299 18335 1661815 2037690 609120 -879152
39289 -879152 -473860 1339262 2373697 1892570 1471407 2439574 3928614 4208073 2879556
39280 2879556 895916 -783594 -1700955 -1717941 -1208809 -991735 -1324592 -1419529 -677352
39271 -677352 150651 -18648 -851879 -1000717 -78065 946084 1390953 1709203 2317093
39262 2317093 2671880 2172393 1164352 327096 -287625 -835961 -883485 16568 1269483
39253 1269483 1772365 1450104 1333619 2015216 2921131 3347735 3308426 2901866 1715867
39244 1715867 -365717 -2351288 -3030737 -2414373 -1515373 -901230 -286320 485787 937422
39235 937422 701816 161717 39302 692959 1870287 2741392 2291090 384184 -1527114
39226a527114p4245J837664J907468N36896l22289j1233K72833l12644j111039
39217A196297j370140j285315j066228l41420P53716J156494M56260k11870J53084
39208e59122Q50988O89615j47510o65105p27163q37954q26315j29408R48342J529119
39198A25487J438897J026598J43939j292128k114050j037627J035920J702047
39190A029083L87935q23533l66487O53694N96097j11789j27585L05215m3217r90437
39180E08976j177475n03257l13460r19435r13783K82746J040970L6499j320592
39171c278811q22390J026076J575251k5535j603873j206838L92930J462880J823838
39162f56472K051415J612763j09077j787528j515536M0390K71639j317064k167538
$$ plain form
39226 -1527114 -1601359 236305 2143773 2680669 2358380 2347147 2619980 2307336 1196297
39217 1196297 -173843 -1459158 -2525386 -2866806 -2113090 -956596 -500336 -712206 -559122
39208 -559122 291866 981481 833971 168866 -558297 -1396251 -2222566 -2351974 -1403632 125487
39198 125487 1564384 2590982 2734921 1442793 -671257 -1708884 -672964 1029083
39190 1029083 1417018 593485 226998 880692 1476789 1365000 1237415 1542630 1499413 508976
39180 508976 -668499 -1171756 -1485216 -2404651 -3318434 -3035688 -1994718 -1958219 -3278811
39171 -3278811 -4101201 -3075125 -1499874 -1525409 -3129282 -4336120 -3943190 -2480310 -656472
39162 -656472 1394943 3007706 2898629 1111101 -404435 -364045 -92406 -1409470 -3577008
39153c577008o55044J374897J563855M76902P1520L32320j60140j273574j464553
39144c310825n22646J86428K33614O42135J556151J540839o922j515837j301865
39135b498928L24160J859439K395220J863568N94397o01242q35211k61093J04922
39126B945232N0313L93013J056512N72490j430915k833031j724681O50158J494099
39117A173190K57518j078173j140732n82971k40789J96723R82594J281738L76589
39108A225687j019199j644621j334896q90876o59693j97050O24427J046834M72966
39099b376421m05721k85460R40281J797909J071916n73993j500436j179061m48599
39090b959585P3070O28471J198352J005383j77176j165109p18933P58607J676491
$$ plain form
39153 -3577008 -4232052 -2857155 -1293300 -816398 -744878 -412558 -572698 -1846272 -3310825
39144 -3310825 -3833471 -3647043 -3413429 -2771294 -1215143 325696 318774 -1197063 -2498928
39135 -2498928 -2174768 -315329 2079891 3943459 4537856 3936614 3101403 2840310 2945232
39126 2945232 2995545 3388558 4445070 5017560 3586645 753614 -971067 -320909 1173190
39117 1173190 1430708 352535 -788197 -1371168 -1611957 -1415234 -432640 849098 1225687
39108 1225687 206488 -1438133 -2773029 -3663905 -4323598 -4520648 -3896221 -2849387 -2376421
39099 -2376421 -2782142 -3067602 -2127321 -329412 742504 168511 -1331925 -2510986 -2959585
39090 -2959585 -2886515 -2258044 -1059692 -54309 -231485 -1396594 -2115527 -1356920 319571
39081C19571J140457j81460r00953l19517P82421P89298q01308k288927j642480
39072c102898O36315J990731J372226M83762P32262J029566J13911q99825m75640
39063A880410L58155l72210j968045k017439n71072j83576j458292j739699N66778
39054e504990L147371L078315R09030n79726k48798P74136J333343J164114J86142
39045D258937j322988k144269j286954L74292J010240L22042k19590L03979J031616
39036B327305Q13383j69506q98835q99405m82278n2036K23998K30580j03926n47386
39026D41894n84979N8901R20135J049274K8632j313239j549137j91436J613659
39017D73704K153217R14733p92173j103552L39345J737641J068508j276130k665841
$$ plain form
39081 319571 1460028 1278568 377615 58098 840519 1629817 828509 -1460418 -3102898
39072 -3102898 -2466583 -475852 896374 1380136 2112398 3141964 3255875 2356050 1880410
39063 1880410 2238565 1866355 -101690 -2119129 -2690201 -2873777 -4332069 -6071768 -5504990
39054 -5504990 -2357619 720696 1629726 1050000 801202 1575338 2908681 4072795 4258937
39045 4258937 2935949 791680 -495274 -120982 889258 1211300 991710 1295689 2327305
39036 2327305 3140688 2971182 2072347 1172942 690664 638628 862626 1093206 989280 441894
39026 441894 -143085 -84184 835951 1885225 1913857 600618 -948519 -1139955 473704
39017 473704 2626921 3541654 2749481 1645929 1985274 3722915 4791423 3515293 849452
39008H49452j552903M28528P93869l09871p14782J96040Q15350M18345M39633
38999A363661J577045J965663J28964k076762j914195r042O13697o98387j356649
38990d06005J09106J614253Q35830j194731j810986o95605Q9047m35501q85529
38981b780121o7348J037619Q94379j64830n23911K17782P81198L56943j41014
38972c89303L13911J035201N97152q62528j667687r62355K24816O57354M72204
38963e81235L98199M11226J80588J35347Q52522J692236J302958m11726j917184
38954B062931j995808j184291p13989p13799k94235Q36791J725613J423080L17190
38945A463483l54021j50134O1471n57276j545415j727130p46842N53032J139429
$$ plain form
39008 849452 -703451 -274923 518946 209075 -505707 -309667 505683 924028 1363661
38999 1363661 2940706 4906369 5035333 2958571 1044376 1035334 1649031 950644 -406005
38990 -406005 -296899 1317354 2153184 958453 -852533 -1548138 -1459091 -1894592 -2780121
38981 -2780121 -2847469 -1809850 -915471 -1080301 -1604212 -1386430 -605232 -248289 -389303
38972 -389303 -75392 959809 1556961 694433 -973254 -1935609 -1710793 -1053439 -581235
38963 -581235 -183036 228190 408778 544125 1396647 3088883 4391841 3980115 2062931
38954 2062931 67123 -1117168 -1831157 -2544956 -2839191 -2002400 -276787 1146293 1463483
38945 1463483 1109462 959328 1020799 463523 -1081892 -2809022 -3555864 -3002832 -1863403
38936a863403O78661l88341j123260o90526O77434J594602J138907J56008k4440
38927A55642L51032J27863m38835j8846J117435J099607k74571p86653M91980
38918A824654J321902J9088j434219o83735P23573j48088k236138j726905J587000
38909g52868L433460J419383j578480k090206q30550m43001j064679r92051j16897
38900c015889J91754j74123n223Q51581J269152R53122Q09419R94191M13203j245302
$$ plain form
38936 -1863403 -1184742 -1573083 -2696343 -3386869 -2709435 -1114833 24074 180082 155642
38927 155642 506674 634537 195702 176856 1294291 2393898 2119327 1332674 1824654
38918 1824654 3146556 3165644 1731425 1047690 1771263 1623175 -612963 -2339868 -752868
38909 -752868 2680592 4099975 2521495 431289 -399261 -842262 -1906941 -2898992 -3015889
38900 -3015889 -2824135 -2998258 -3003481 -2151900 -882748 70374 879793 1873984 2287187 1041885
$$ [...]
##END NTUPLES=NMR SPECTRUM
##END=
