##TITLE=31Pdec_LR-683B-C3TFA
 CDCl3, 124 sc
 23.7.2019
##JCAMPDX= 6.0         $$ Bruker NMR JCAMP-DX V2.0
##DATA TYPE= NMR SPECTRUM
##DATA CLASS= NTUPLES
##ORIGIN= UXNMR, Bruker Analytische Messtechnik GmbH
##OWNER= root
$$ XWIN-NMR		Version 3.5
$$ Tue Jul 23 14:37:00 2019 Russian Standard Time (UT+4h)  she@DPX200
##.OBSERVE FREQUENCY= 81.013821
##.OBSERVE NUCLEUS= ^31P
##.ACQUISITION MODE= SIMULTANEOUS
##.ACQUISITION SCHEME= undefined
##.AVERAGES= 124
##.DIGITISER RES= 17
##SPECTROMETER/DATA SYSTEM= spect
##.PULSE SEQUENCE= zgpg30
##.SOLVENT NAME= CDCl3
##.SHIFT REFERENCE= (INTERNAL, CDCl3, 0, 182.463)
##AUDIT TRAIL= $$ (NUMBER, WHEN, WHO, WHERE, WHAT)
$$ ##TITLE= Audit trail, XWIN-NMR		Version 3.5
$$ ##JCAMPDX= 5.01
$$ ##ORIGIN= Bruker BioSpin GmbH
$$ ##OWNER= she
$$ F:/spectra/data/she/nmr/P31/1/pdata/1/auditp.txt
$$ ##AUDIT TRAIL=  $$ (NUMBER, WHEN, WHO, WHERE, WHAT)
(   1,<2019-07-23 14:35:49.39 +0400>,<she>,<DPX200>,
      <continue with go, POWCHK disabled, PULCHK disabled
       configuration hash MD5:
       00 E9 B6 7A A2 85 ED C7 34 08 36 98 17 FE 4E 26
       data hash MD5: 32K
       9A CA 6A A0 54 44 48 4C C7 B9 57 48 34 A2 D7 4A>)
(   2,<2019-07-23 14:36:01.87 +0400>,<she>,<DPX200>,
      <Start of raw data processing
       efp BC_mod = 2 LB = 1 FT_mod = 6 PKNL = 1 PHC0 = -2561.439 PHC1 = 148.5992 SI = 64K 
       data hash MD5: 64K
       D9 F6 63 CB B0 D3 B7 DC 99 41 5A F9 58 BF BA 56>)
(   3,<2019-07-23 14:36:29.14 +0400>,<she>,<DPX200>,
      <pk PHC0 = 5.441452 PHC1 = -25.6 
       data hash MD5: 64K
       F4 0A F8 5C EE 94 B6 87 09 80 A1 0F 26 CE A6 0E>)
(   4,<2019-07-23 14:36:32.01 +0400>,<she>,<DPX200>,
      <abs ABSG = 5 
       data hash MD5: 64K
       ED BA 8C 69 A7 08 5E 98 69 F0 F7 6B 21 CD 53 4F>)
$$ ##END=
$$ 
$$ hash MD5
$$ B7 61 6A 2E 9C F9 C2 C7 57 BB 7A CC A6 7E CF 40
##$RELAX= 
##$RELAX= 
##$RELAX= 
##$RELAX= 
##$RELAX= 
##$RELAX= 
##$RELAX= 
##$RELAX= 
$$ Bruker specific parameters
$$ --------------------------
##$DU= <F:/spectra>
##$EXPNO= 1
##$NAME= <P31>
##$PROCNO= 1
##$TYPE= <nmr>
##$USER= <she>
##$AMP= (0..31)
100 100 100 100 100 100 100 100 100 100 100 100 100 100 100 100 100 100 
100 100 100 100 100 100 100 100 100 100 100 100 100 100 
##$AQSEQ= 0
##$AQ_mod= 1
##$AUNM= <au_zg>
##$AUTOPOS= <>
##$BF1= 81.014009
##$BF2= 200.13
##$BF3= 200.13
##$BF4= 200.13
##$BF5= 200.13
##$BF6= 200.13
##$BF7= 200.13
##$BF8= 200.13
##$BYTORDA= 1
##$CFDGTYP= 0
##$CFRGTYP= 5
##$CHEMSTR= <none>
##$CNST= (0..31)
1 1 145 1 1 1 1 1 1 1 1 1 1 1 1 1 1 1 1 1 1 1 1 1 1 1 1 1 1 1 1 1 
##$CPDPRG= <waltz16>
##$CPDPRG1= <>
##$CPDPRG2= <waltz16>
##$CPDPRG3= <>
##$CPDPRG4= <mlev>
##$CPDPRG5= <mlev>
##$CPDPRG6= <mlev>
##$CPDPRG7= <mlev>
##$CPDPRG8= <mlev>
##$CPDPRGB= <>
##$CPDPRGT= <>
##$D= (0..31)
0 1 0 0 0 0 0 0 0 0 0 0.03 2e-05 3e-06 0 0 0 0 0 0 0 0 0 0 0 0 0 0 0 0 
0 0 
##$DATE= 1563877971
##$DBL= (0..7)
120 120 120 11 120 120 24 19 
##$DBP= (0..7)
150 150 150 150 150 150 150 150 
##$DBP07= 0
##$DBPNAM0= <>
##$DBPNAM1= <>
$$ [...]
##$SUBNAM3= <"">
##$SUBNAM4= <"">
##$SUBNAM5= <"">
##$SUBNAM6= <"">
##$SUBNAM7= <"">
##$SUBNAM8= <"">
##$SUBNAM9= <"">
##$SW= 369.568048894756
##$SWIBOX= (0..15)
0 1 3 0 0 0 0 0 0 0 0 0 0 0 0 0 
##$SW_h= 29940.119760479
##$TD= 32768
##$TD0= 1
##$TE= 0
##$TE2= 300
##$TE3= 300
##$TEG= 300
##$TL= (0..7)
0 120 53 12 22 120 120 120 
##$TP= (0..7)
150 150 150 150 150 150 150 150 
##$TP07= 0
##$TPNAME0= <>
##$TPNAME1= <>
##$TPNAME2= <>
##$TPNAME3= <>
##$TPNAME4= <>
##$TPNAME5= <>
##$TPNAME6= <>
##$TPNAME7= <>
##$TPOAL= (0..7)
0.5 0.5 0.5 0.5 0.5 0.5 0.5 0.5 
##$TPOFFS= (0..7)
0 0 0 0 0 0 0 0 
##$TUNHIN= 0
##$TUNHOUT= 0
##$TUNXOUT= 0
##$USERA1= <user>
##$USERA2= <user>
##$USERA3= <user>
##$USERA4= <user>
##$USERA5= <user>
##$V9= 5
##$VALIST= <valist>
##$VCLIST= <CCCCCCCCCCCCCCC>
##$VD= 0
##$VDLIST= <DDDDDDDDDDDDDDD>
##$VPLIST= <PPPPPPPPPPPPPPP>
##$VTLIST= <TTTTTTTTTTTTTTT>
##$WBST= 1024
##$WBSW= 4
##$XGAIN= (0..3)
0 0 0 0 
##$XL= 0
##$YL= 0
##$YMAX_a= 26207
##$YMIN_a= -11229
##$ZGOPTNS= <>
##$ZL1= 120
##$ZL2= 120
##$ZL3= 120
##$ZL4= 120
##$ABSF1= 182.463
##$ABSF2= -187.1042
##$ABSG= 5
##$ABSL= 3
##$ALPHA= 0
##$AQORDER= 0
##$ASSFAC= 0
##$ASSFACI= 0
##$ASSFACX= 0
##$ASSWID= 0
##$AUNMP= <proc_1d>
##$AZFE= 0.1
##$AZFW= 0.5
##$BCFW= 0
##$BC_mod= 2
##$BYTORDP= 0
##$COROFFS= 0
##$CY= -3
##$DATMOD= 1
##$DC= 0
##$DFILT= <>
##$DTYPP= 0
##$F1P= 0
##$F2P= 0
##$FCOR= 1
##$FTSIZE= 65536
##$FT_mod= 6
##$GAMMA= 0
##$GB= 0
##$INTBC= 1
##$INTSCL= 5.30512e-09
##$ISEN= 30
##$LB= 1
##$LEV0= 0
##$LPBIN= 0
##$MAXI= 10000
##$MC2= 0
##$MEAN= 0
##$ME_mod= 0
##$MI= 50
##$NCOEF= 0
##$NC_proc= -5
##$NLEV= 6
##$NOISF1= 182.463
##$NOISF2= 159.3651
##$NSP= 0
##$NTH_PI= 0
##$NZP= 0
##$OFFSET= 182.463
##$PC= 4
##$PHC0= -2555.998
##$PHC1= 122.9992
##$PH_mod= 1
##$PKNL= yes
##$PPARMOD= 0
##$PSCAL= 0
##$PSIGN= 0
##$REVERSE= no
##$SF= 81.0140089999434
##$SI= 65536
##$SIGF1= 159.3651
##$SIGF2= -187.1042
##$SINO= 113.3802
##$SIOLD= 16384
##$SREGLST= <1H.CDCl3>
##$SSB= 0
##$STSI= 65536
##$STSR= 0
##$SW_p= 29940.119760479
##$SYMM= 0
##$S_DEV= 0
##$TDeff= 32768
##$TDoff= 0
##$TI= <>
##$TILT= no
##$TM1= 0
##$TM2= 0
##$TOPLEV= 0
##$USERP1= <user>
##$USERP2= <user>
##$USERP3= <user>
##$USERP4= <user>
##$USERP5= <user>
##$WDW= 1
##$XDIM= 65536
##$YMAX_p= 328165283
##$YMIN_p= -20502977
$$ End of Bruker specific parameters
$$ ---------------------------------
##NTUPLES= NMR SPECTRUM
##VAR_NAME=  FREQUENCY,     SPECTRUM/REAL,   SPECTRUM/IMAG
##SYMBOL=    X,             R,               I
##VAR_TYPE=  INDEPENDENT,   DEPENDENT,       DEPENDENT
##VAR_FORM=  AFFN,          ASDF,            ASDF
##VAR_DIM=   65536,         65536,           65536
##UNITS=     HZ,            ARBITRARY UNITS, ARBITRARY UNITS
##FACTOR=    0.456856943014862, 1,           1
##FIRST=     14782.0589164792, 0,            0
##LAST=      -15158.0608439998, 0,           0
##MIN=       -15158.0608439998, -20502977,   0
##MAX=       14782.0589164792, 328165283,    0
$$ Real data points
##PAGE= N=1
##DATA TABLE= (X++(R..R)), XYDATA
$$ [...]
##PAGE= N=2
##DATA TABLE= (X++(I..I)), XYDATA
$$ plain form
5475 1006709 1342755 1063440 1048744 1657394 2011398 1071405 -651059 -1500757 -925647 -142815
5465 -142815 -140584 -175758 973074 3142148 5064882 5936971 5882220 5268745 4317791 3191174
5455 3191174 1967051 734693 -95422 -180246 -247752 -1743811 -4642341 -6513233 -5164698
5446 -5164698 -1794547 126340 -731456 -1923992 -821727 1633325 2329767 430225 -1531755
5437 -1531755 -1273833 264746 659149 -506119 -1473955 -1145065 -328618 -11837 -21093 -47136
5427 -47136 -514267 -1332435 -1015983 1415269 4377901 5257573 3798865 2388264 2830418
5418 2830418 4309552 5001509 4448559 3590960 3272792 3468038 3594136 3163170 2353047
5409 2353047 1930999 2202778 2335033 1527660 529491 728959 1811376 1914501 509923
$$ packed form
5475A006709L36046k79315j4696O08650L54004r39993j722464q49698N75110P82832
5465a42815K231l5174J148832K169074J922734Q72089n4751o13475r50954j126617
5455C191174j224123j232358q30115q4824o7506j496059k898530j870892J348535
5446e164698L370151J920887q57796j192536J102265K455052O96442j899542j961980
5437a531755K57922J538579L94403j165268r67836L28890Q16447L16781r256k6043
5427d7136m67131q18168L16452K431252K962632Q79672j458708j410601M42154
5418B830418J479134O91957n52950q57599l18168J95246J26098m30966q10123
5409B353047m22048K71779J32255q07373r98169J99468J082417J03125j404578
$$ plain form
5400 509923 -557026 181838 1569287 1715739 939271 1017515 2108392 2368041 811238
5391 811238 -1060064 -1191329 454019 2069424 2269408 1425724 776366 779227 764729 96538
5381 96538 -912151 -1603414 -1978496 -2351099 -2344572 -1336110 97048 459491 -515645 -1247248
5371 -1247248 -558248 626985 856277 364541 343692 731752 336919 -1082317 -2422410
5362 -2422410 -3048412 -3597314 -4539224 -5136958 -4585413 -3403245 -2846484 -3246318 -3591575
5353 -3591575 -2770912 -883880 787998 1057209 34515 -1033756 -1127403 -397102 346303
5344 346303 673080 696909 499086 -101420 -1258624 -2908875 -4746882 -6071299 -5869551
5335 -5869551 -3620072 -122601 2877923 4186048 4173356 4116327 4583744 4853200 4218066
$$ packed form
5400E09923j066949P38864J387449J46452p76468P8244J090877K59649j556803
5391H11238j871302j31265J645348J615405J99984q43684o49358K861j4498o68191
5381I6538j008689o91263l75082l72603O527J008462J433158L62443r75136p31603
5371a247248O89000J185233K29292m91736k0849L88060l94833j419236j340093
5362b422410o26002n48902r41910n97734N51545J182168N56761l99834l45257
5353c591575Q20663J887032J671878K69211j022694j068271r3647P30301P43405
5344C46303L26777K3829j97823o00506j157204j650251j838007j324417K01748
5335e869551K249479L497471L000524J308125j2692n7029M67417K69456o35134
$$ plain form
5326 4218066 3452079 4047662 5917269 7081882 6344988 5006687 4642986 4428796 2711542
5317 2711542 392957 -37 1425196 1597516 -789223 -3125497 -2941994 -1436593 -899758
5308 -899758 -986991 -158753 1008538 900285 65176 415979 1944930 2973814 3149800
5299 3149800 3498899 3885696 3164065 1678639 911787 763404 18596 -522156 1375922
5290 1375922 5156739 7105824 5328305 2164586 309721 -643060 -2077873 -3371643
5282 -3371643 -3187683 -1872224 -615773 244157 551782 -293430 -1747394 -1793138 72524
5273 72524 1436160 450915 -1249630 -1328866 -482986 -736029 -1682457 -1487103 -433127 -246553
5263 -246553 -623811 237482 1850179 1466183 -1691190 -5067748 -6327741 -5854943 -5057094
$$ packed form
5326D218066p65987N95583J869607J164613p36894j338301l63701k14190j717254
5317B711542k318585l92994J425233J72320k386739k336274J83503J505401N36835
5308h99758q7233Q28238J167291j08253q35109L50803J528951J028884J75986
5299C149800L49099L86797p21631j485426p66852j48383p44808n40752J898078
5290A375922L780817J949085j777519l163719j854865r52781j434813j293770
5282c371643J83960J315459J256451Q59930L07625q45212j453964m5744J865662
5273G2524J363636r85245j700545p9236Q45880k53043r46428J95354J053976J86574
5263b46553l77258Q61293J612697l83996l157373l376558j259993M72798P97849
$$ plain form
5254 -5057094 -4406958 -3901214 -3496908 -2486058 -332377 1467389 549897 -2670012 -4808762
5245 -4808762 -3863496 -1508174 15424 908016 2144930 3019291 2460645 1193381 458456
5236 458456 -125269 -1313413 -2036828 -861328 1088137 1203089 -738137 -2093671 -1014127
5227 -1014127 1441190 3287175 3859231 3402799 2092057 454354 -451563 -278134 70060
5218 70060 -98384 -182476 524395 1546577 2150998 2674103 3621552 4088635 2679605 -115389
5208 -115389 -2022146 -1779752 -509281 221393 438002 1027308 2012776 2707858 2972491
5199 2972491 3176762 3263171 2919279 2466746 2501176 2712890 2119519 541457 -1130763 -2230460
5189 -2230460 -2893465 -3261723 -3236984 -3273097 -4223712 -5936559 -7073601 -6796427 -5544208
$$ packed form
5254e057094O50136N05744M04306J010850K153681J799766r17492l219909k138750
5245d808762R45266K355322J523598Q92592J236914Q74361n58646j267264p34925
5236D58456n83725j188144p23415J175500J949465J14952j941226j355534J079544
5227a014127K455317J845985N72056m56432j310742j637703r05917J73429L48194
5218G0060j68444q4092P06871J022182O04421N23105R47449M67083j409030k794994
5208a15389j906757K42394J270471P30674K16609N89306R85468O95082K64633
5199B972491K04271Q6409l43892m52533L4430K11714n93371j578062j672220j099697
5189b230460o63005l68258K4739l6113r50615j712847j137042K77174J252219
$$ plain form
5180 -5544208 -3782557 -1480154 477765 195010 -2408211 -4178985 -2217290 2039644
5172 2039644 4324106 2771507 -379746 -2253988 -2404898 -1926055 -1361609 -616700 75981
5163 75981 158983 -551373 -1585856 -2120717 -1712340 -1047837 -1459472 -3096698 -4298939 -3705145
5153 -3705145 -2125083 -978653 211376 2820438 6170884 7945717 7629254 7179102 7733792
5144 7733792 7919247 6421853 4276215 3291179 3656191 4275684 4260671 3164965 1033539
5135 1033539 -896866 -912614 823741 2001731 1173850 -396150 -827955 39435 1464220
5126 1464220 3139413 4320669 3461028 503223 -2067659 -2339011 -1583407 -1787333 -2303623
5117 -2303623 -1454549 81427 443067 11368 487009 1357485 748718 -571620 200534
$$ packed form
5180e544208J761651K302403J957919k82755k603221j770774J961695M256934
5172B039644K284462j552599l151253j874242j50910M78843N64446P44909O92681
5163G5981Q3002p10356j034483n34861M08377O64503m11635j637226j202241N93794
5153c705145J580062J146430J190029K609062L350446J774833l16463m50152N54690
5144G733792J85455j497394k145638r85036L65012O19493j5013j095706k131426
5135A033539j930405j5748J736355J177990q27881j570000m31805Q67390J424785
5126A464220J675193J181256q59641k957805k570882k71352P55604k03926n16290
5117b303623Q49074J535976L61640m31699M75641Q70476o08767j320338P72154
$$ plain form
5108 200534 2998320 4367319 2839803 1211889 1853878 3096089 2528120 1028624 722090
5099 722090 1092515 238422 -1349869 -1404542 254779 1323598 631766 -199039 658407
5090 658407 2700477 3944527 3281980 1327872 -502580 -1320161 -1316609 -1036330 -249865
5081 -249865 1731342 4418384 5932880 5247231 3697905 3161058 3483546 3078972 1601441
5072 1601441 499022 871787 2062323 2692868 2209623 1094021 153496 -214255 -428869
5063 -428869 -1275164 -2661775 -3283883 -2218495 -381768 558248 343031 22438 -99450
5054 -99450 -969401 -2937750 -4718721 -4885072 -3501183 -1619183 39343 1141580 1218184
5045 1218184 156440 -1031636 -965100 421320 1727648 1950851 1806047 2528392 3796120
$$ packed form
5108B00534K797786J368999j527516j627914O41989J242211n67969j499496l06534
5099G22090L70425q54093j588291n4673J659321J068819o91832q30805Q57446
5090F58407K042070J244050o62547j954108j830452q17581L552K80279P86465
5081b49865J981207K687042J514496o85649j549326n36847L22488m04574j477531
5072A601441j102419L72765J190536O30545m83245j115602r40525l67751k14614
5063d28869q46295j386611o22108J065388J836727R40016k15217l20593j21888
5054i9450q69951j968349j780971j66351J383889J882000J658526J102237P6604
5045A218184j061744j188076O6536J386420J306328K23203j44804P22345J267728
$$ plain form
5036 3796120 3902869 2193706 271492 -42219 796250 830353 -432900 -1322160 -496886
5027 -496886 1300779 2616656 3098791 3063851 2476335 1512013 1065895 1359804 1039600 -749213
5017 -749213 -2313933 -1468940 937342 1899391 597776 -628032 -152762 604186 -68900
5008 -68900 -1269202 -1118415 170947 757994 -184822 -1941748 -3684022 -4889443 -4870114
4999 -4870114 -3387029 -1427282 -119145 696013 1573411 1831483 526433 -1339927 -1614512
4990 -1614512 -144656 809733 -176340 -1888603 -2770939 -3247306 -4338103 -5289473 -4411025
4981 -4411025 -1783267 461160 559962 -1287302 -3695522 -5368677 -5499360 -4002633 -1869905
4972 -1869905 -605093 -761355 -1404582 -1386657 -724053 -201762 56531 796772 2232449
$$ packed form
5036C796120J06749j709163j922214l13711Q38469L4103j263253q89260Q25274
5027d96886J797665J315877M82135l4940n87516r64322m46118K93909l20204j788813
5017g49213j564720Q44993K406282R62049j301615j225808M75270P56948o73086
5008f8900j200302J50787J289362N87047r42816j756926j742274j205421J9329
4999d870114J483085J959747J308137Q15158Q77398K58072j305050j866360k74585
4990a614512J469856R54389r86073j712263q82336m76367j090797r51370Q78448
4981d411025K627758K244427R8802j847264k408220j673155j30683J496727K132728
4972a869905J264812j56262o43227J7925O62604N22291K58293P40241J435677
$$ plain form
4963 2232449 3212443 2549435 858959 36664 675794 1096411 -248948 -2330915 -2871766
4954 -2871766 -1637780 -674755 -1154625 -1867244 -1585893 -1089055 -1421280 -1685832 -559174
4945 -559174 992811 839042 -861475 -1775249 -1141576 -888525 -2173505 -3233985 -2288696
4936 -2288696 -642345 -761612 -2497620 -3545502 -3064019 -2499342 -2775917 -2826882 -1566894
4927 -1566894 294689 1296813 1052514 324652 23033 608943 1837300 2771548 2695674
4918 2695674 2137416 2196228 2809057 2712801 1308891 -542470 -1832383 -2299555 -1734411
4909 -1734411 157830 2636940 4188527 4679035 5645255 7443775 7977534 5880234 3231108
4900 3231108 2873444 4314100 4818584 3674067 2504378 1765386 116899 -2308919 -3096166
$$ packed form
4963B232449R79994o63008j690476q22295O39130M20617j345359k081967n40851
4954b871766J233986R63025m79870p12619K81351M96838l32225k64552J126658
4945e59174J551985j53769j700517r13774O33673K53051j284980j060480R45289
4936b288696J646351j19267j736008j047882M81483N64677k76575n0965J259988
4927a566894J861583J002124k44299p27862l01619N85910J228357R34248p5874
4918B695674n58258N8812O12829r6256j403910j851361j289913m67172N65144
4909a734411J892241K479110J551587M90508R66220J798520N33759k097300k649126
4900C231108l57664J440656N04484j144517j169689p38992j648487k425818p87247
$$ plain form
4891 -3096166 -1189581 1167175 1608016 661228 -2931 -452262 -1676584 -3229976 -3673505
4882 -3673505 -2644676 -947925 747728 2008153 2224122 1420157 727517 807401 642060
4873 642060 -795672 -2598159 -3173610 -2614852 -2175220 -2109672 -1826010 -1635011 -2470261 -4137983
4863 -4137983 -5541042 -6348535 -6819083 -6472205 -4857140 -3195128 -3041563 -3546482 -2481980
4854 -2481980 -42123 1028660 -401996 -2200508 -2395170 -1773600 -1791239 -2139275 -1941961
4845 -1941961 -1487573 -1206957 -611887 256466 24843 -1760053 -3256531 -2983655 -2231431
4836 -2231431 -2804544 -3864988 -3403614 -1783268 -1293882 -2681076 -4361418 -4864467 -4157099
4827 -4157099 -2744527 -1126022 56589 655909 1297347 1917912 1238423 -763422 -1514835
$$ packed form
4891c096166J906585K356756M40841r46788o64159m49331j224322j553392m43529
4882c673505J028829J696751J695653J260425K15969q03965o92640P9884j65341
4873F42060j437732j802487n75451N58758M39632O5548K83662J90999q35250j667722
4863d137983j403059q07493m70548L46878J615065J662012J53565n04919J064502
4854b481980K439857J070783j430656j798512j94662O21570j7639l48036J97314
4845a941961M54388K80616N95070Q68353k31623j784896j496478K72876P52224
4836b231431n73113j060444M61374J620346M89386j387194j680342n03049P07368
4827d157099J412572J618505J182611N99320O41438O20565o79489k001845p51413
$$ plain form
4818 -1514835 617844 2971586 1890892 -1652561 -3362571 -2082572 -980865 -1992501
4810 -1992501 -3214228 -3032626 -2935883 -4186893 -4978826 -3382215 -609820 1062399 1513264
4801 1513264 1647236 1094793 -485479 -1522824 -508946 1420238 2173352 1763391 1485764
4792 1485764 1293508 337326 -911445 -1354903 -1156541 -854066 218164 2323541 3495034
4783 3495034 2106317 161792 893061 3805725 5391747 4345039 2660674 1697398 792670
4774 792670 114229 1118288 3231790 3661040 1840075 659505 1645293 2365050 852386
4765 852386 -649731 698514 3601205 4793285 3981141 3208030 2722143 1112051 -1097235
4756 -1097235 -1569593 -84220 702693 -886115 -3315601 -4255010 -3315819 -1586540 -9212
$$ packed form
4818a514835K132679K353742j080694l543453j710010J279999J101707j011636
4810a992501j221727J81602R6743j251010p91933J596611K772395J672219M50865
4801A513264J33972n52443j580272j037345J013878J929184P53114m09961k77627
4792A485764j92256r56182j248771m43458J98362L02475J072230K105377J171493
4783C495034j388717j944525P31269K912664J586022j046708j684365r63276r04728
4774G92670o78441J004059K113502M29250j820965j180570R85788P19757j512664
4765H52386j502117J348245K902691J192080q12144p73111m85887j610092k209286
4756a097235m72358J485373P86913j588808k429486r39409R39191J729279J577328
$$ plain form
4747 -9212 946484 1123233 901319 939996 1489312 2470079 3841030 5053676 4867454 3045425
4737 3045425 1516828 2083411 3521968 3116975 817545 -613956 189799 1486739 1663080
4728 1663080 1526518 2010085 2048742 705592 -577685 -191490 643386 -354566 -2652415
4719 -2652415 -3445290 -1808016 200878 821156 673232 838277 853027 -102023 -1272290
4710 -1272290 -989345 1142082 3587370 4310083 2587483 -262007 -1830578 -774784 1828791
4701 1828791 3655546 3540242 2159174 665204 -265511 -94368 1475888 3580374 4551502
4692 4551502 3851850 2654321 1898183 947521 -896795 -2698588 -3019628 -1973932 -783819
4683 -783819 128678 1160939 2064352 2079467 1499656 1560216 2494130 3012011 2138097 513566
$$ packed form
4747i212R55696J76749k21914L8677N49316R80767J370951J212646j86222j822029
4737C045425j528597N66583J438557m04993k299430j431501Q03755J296940J76341
4728A663080j36562M83567L8657j343150j283277L86195Q34876r97952k297849
4719b652415p92875J637274K008894O20278j47924J65045J4750r55050j170267
4710a272290K82945K131427K445288P22713j722600k849490j568571J055794K603575
4701A828791J826755j15304j381068j493970r30715J71143J570256K104486R71128
4692D551502o99652j197529p56138r50662j844316j801793l21040J045696J190113
4683g83819R12497J032261R03413J5115n79811O0560R33914N17881q73914j624531
$$ plain form
4673 513566 -517780 -291166 867468 1869183 1480546 -259241 -1515648 -949452 -128601
4664 -128601 -1542718 -4254234 -4337668 -544174 3403512 3954970 2418032 1917704 2120165
4655 2120165 574556 -2210478 -3207046 -2088968 -1920778 -3935803 -5377842 -4063652 -1900569
4646 -1900569 -1722519 -3016207 -3132379 -1118677 1797557 4325837 5768375 5555605 3966196
4637 3966196 2611271 2666064 3292860 3100145 2221177 1514191 756391 -601026 -1736197
4628 -1736197 -1472421 -450414 -327330 -1094820 -1117899 182784 1474964 1505802 416825
4619 416825 -1071773 -2363516 -2767014 -1995751 -1047782 -1247448 -2276927 -2498077 -1355099
4610 -1355099 -74273 199939 -435168 -1558587 -3056665 -4473723 -5056250 -4809757 -4326556
$$ packed form
4673E13566j031346K26614J158634J001715l88637j739787j256407N66196Q20851
4664a28601j414117k711516q3434L793494L947686N51458j536938n00328K02461
4655B120165j545609k785034r96568J118078J68190k015025j442039J314190K163083
4646a900569J78050j293688j16172K013702K916234K528280J442538k12770j589409
4637C966196j354925N4793O26796j92715q78968p06986p57800j357417j135171
4628a736197K63776J022007J23084p67490k3079J300683J292180L0838j088977
4619D16825j488598j291743m03498P71263R47969j99666j029479k21150J142978
4610a355099J280826K74212o35107j123419j498078j417058n82527K46493M83201
$$ plain form
4601 -4326556 -3465195 -1665453 324740 874513 72582 -27640 1418098 2517912 1495001
4592 1495001 -583194 -1394987 -407796 1152558 2342750 3004315 2962040 2138676 1086849
4583 1086849 433575 228949 410808 1023367 1377013 296519 -1856170 -2868623 -1697663
4574 -1697663 -333278 -952806 -2596989 -2823399 -1571106 -806271 -867842 31122 2422889
4565 2422889 4247270 3725066 1645877 -140180 -1028788 -1593567 -2387988 -3549977 -4696470
4556 -4696470 -4823838 -3312232 -1261517 -638655 -1819375 -3246046 -3783896 -3889367 -3938218
4547 -3938218 -3087032 -818453 1721212 3068505 3122913 2545168 1577830 536837 408071
4538 408071 1638416 3079486 3347580 2575501 1690962 753979 -594032 -1675466 -1406768
$$ packed form
4601d326556Q61361J799742J990193N49773q01931j00222J445738J099814j022911
4592A495001k078195q11793R87191J560354J190192O61565m2275q23364j051827
4583A086849o53274k04626J81859O12559L53646j080494k152689j012453J170960
4574a697663J364385o19528j644183k26410J252293P64835o1571Q98964K391767
4565B422889J824381n22204k079189j786057q88608n64779p94421j161989j146493
4556d696470j27368J511606K050715O22862j180720j426671n37850j05471m8851
4547c938218Q51186K268579K539665J347293N4408n77745r67338j040993j28766
4538D08071J230345J441070K68094p72079q84539r36983j348011j081434K68698
$$ plain form
4529 -1406768 -130340 743066 895117 1392786 2624589 3412287 2736254 1192919 45895
4520 45895 -340433 -473207 -777209 -1268232 -1722623 -1691251 -710564 1120788 3058934 4382069
4510 4382069 4755852 3927222 1836688 -627473 -1833999 -1113663 257167 530492 -468151
4501 -468151 -1579951 -2192605 -2726041 -3242831 -2843669 -1031994 1222318 2539830 2632301
4492 2632301 2013777 858176 -816053 -2239553 -2472529 -1901223 -1854738 -2421176 -1988330
4483 -1988330 307951 2864789 3433755 1838151 -245505 -1488169 -1629343 -683698 951892
4474 951892 1914495 1132065 -334355 -454352 617685 587839 -1157592 -2008357 115870
4465 115870 3269339 3794592 1084436 -2063679 -3308816 -2915488 -2128238 -1366688 -523707
$$ packed form
4529a406768J276428Q73406J52051M97669J231803P87698o76033j543335j147024
4520D5895l86328j32774l04002m91023m54391L1372R80687J831352J938146J323135
4510D382069L73783q28630k090534k464161j206526P20336J370830K73325r98643
4501d68151j111800o12654n33436n16790L99162J811675K254312J317512R2471
4492B632301o18524j155601j674229j423500k32976N71306M6485n66438M32846
4483a988330K296281K556838N68966j595604k083656j242664j41174R45645J635590
4474I51892R62603p82430j466420j19997J072037k9846j745431q50765K124227
4465A15870L153469N25253k710156l148115j245137L93328P87250P61550Q42981
$$ plain form
4456 -523707 357271 1268080 2172551 2548153 1932812 960001 726687 1088221 893307 76454
4446 76454 -14030 1138488 2211454 2100318 1487523 1226103 588308 -1242275 -2978976
4437 -2978976 -2573088 -432301 675949 -754969 -3060298 -3743268 -2463021 -848734 -231021
4428 -231021 -536584 -1017323 -1208865 -1166150 -1198231 -1386573 -1245988 -147255 1689098 2971296
4418 2971296 2534342 605043 -1481275 -2677762 -2955394 -2780627 -2450957 -2148473 -2193723
4409 -2193723 -2787252 -3607375 -4056440 -3984500 -3892388 -4255205 -4832310 -4890036 -4080290 -2907404
4399 -2907404 -2254963 -2507277 -3147516 -3196748 -2106095 -284141 1293999 2025592 2143850
4390 2143850 2260382 2683646 3293770 3798299 3879335 3381825 2688650 2588576 3258911 3629145
$$ packed form
4456e23707Q80978R10809R04471L75602o15341r72811k33314L61534j94914q16853
4446G6454r0484J152518J072966j11136o12795k61420o37795j830583j736701
4437b978976M05888K140787J108250j430918k305329o82970J280247J614287O17713
4428b31021l05563m80739j91542M2715l2081j88342J40585J098733J836353J282198
4418B971296m36954j929299k086318j196487k77632J74767L29670L02484m5250
4409b193723n93529q20123m49065P1940R2112l62817n77105n7726Q09746J172886
4399b907404O52441k52314o40239m9232J090653J821954J578140P31593J18258
4390B143850J16532M23264O10124N04529Q1036m97510o93175j00074O70335L70234
$$ plain form
4380 3629145 2455863 -267 -2081695 -2644204 -2202413 -1959526 -2317704 -2651090 -2077070
4371 -2077070 -299356 1771187 2302543 478171 -1656043 -688494 3979174 8740710 9851655
4362 9851655 7791137 5884910 5467742 4775542 2624690 641182 697507 1965545 2161293
4353 2161293 781145 -441847 18609 1761318 3147193 2932211 1195313 -886490 -2177537
4344 -2177537 -2587390 -2644822 -2226128 -658919 1634660 2774295 1543007 -983030 -2807903
4335 -2807903 -3188733 -2473281 -798228 1520049 3006812 2355191 619453 248446 1721369
4326 1721369 2948439 2495874 1499320 1348906 1232488 -349289 -2772773 -3935891 -3266918
4317 -3266918 -2256265 -1927066 -1466201 21417 1693998 1926545 482777 -1186421 -1689400
$$ packed form
4380C629145j173282k456130k081428n62509M41791K42887l58178l33386N74020
4371b077070J777714K070543N31356j824372k134214R67549M667668M761536J110945
4362I851655k060518j906227m17168o92200k150852j983508N6325J268038J95748
4353B161293j380148j222992M60456J742709J385875k14982j736898k081803j291047
4344b177537m09853n7432M18694J567209K293579J139635j231288k526037j824873
4335b807903l80830P15452J675053K318277J486763o51621j735738l71007J472923
4326A721369J227070m52565r96554j50414j16418j581777k423484j163118O68973
4317c266918J010653L29199M60865J487618J672581K32547j443768j669198n02979
$$ plain form
4308 -1689400 -1115836 -657570 -1208959 -2517751 -3573732 -3664041 -2967160 -2146092 -1570168
4299 -1570168 -1159428 -887821 -1022319 -1626608 -2103370 -1713462 -644767 -132841 -1119580
4290 -1119580 -2989600 -4153617 -3901080 -3121681 -2994706 -3534213 -3839891 -3316636 -2152237
4281 -2152237 -1000421 -675482 -1591208 -2806605 -2322169 540803 3570516 3916200 1642285
4272 1642285 -636942 -1548551 -2169727 -2975170 -2274411 558602 2550567 571752 -3853355
4263 -3853355 -6090536 -4379365 -1400374 336708 1649634 4021113 6365817 6570305
4255 6570305 4762630 2873439 1673145 279753 -1543843 -2481968 -1588965 144726 979303
4246 979303 597826 333744 1287186 2762589 2999220 1376927 -738018 -1807313 -2147817
$$ packed form
4308a689400N73564M58266n51389j308792j055981r0309O96881Q21068N75924
4299a570168M10740K71607j34498o04289m76762L89908J068695N11926r86739
4290a119580j870020j164017K52537P79399J26975n39507l05678N23255J164399
4281b152237J151816L24939r15726j215397M84436K862972L029713L45684k273915
4272A642285k279227r11609o21176q05443P00759K833013J991965j978815m425107
4263c853355k237181J711171K978991J737082J312926K371479K344704K04488
4255F570305j807675j889191j200294j393392j823596r38125Q93003J733691Q34577
4246I79303l81477k64082R53442J475403K36631j622293k114945j069295l40504
$$ plain form
4237 -2147817 -3072510 -4312135 -3943229 -1440227 779585 181275 -2485703 -4130129 -3199021
4228 -3199021 -1117444 50577 -66262 -484435 -413410 103549 508806 374871 71808
4219 71808 618427 2227741 3334912 2181030 -697555 -2856158 -3024195 -2368661 -2135339
4210 -2135339 -1619220 278512 2686764 3655679 2891637 1998553 2110284 2724990 2995055
4201 2995055 2814343 2278407 1264241 48509 -665529 -836009 -1216210 -1889319 -1803862
4192 -1803862 -572985 408334 -146359 -1316751 -1275763 -105421 424628 -256658 -712333
4183 -712333 20934 838905 332923 -1152782 -2274635 -2547031 -2403128 -2163561 -1998300
4174 -1998300 -2308239 -3101084 -3493680 -2871035 -2074402 -2339225 -3446273 -4088354 -3740134
$$ packed form
4237b147817r24693j239625L68906K503002K219812n98310k666978j644426R31108
4228c199021K081577J168021j16839m18173P1025N16959M05257j33935l03063
4219G1808N46619J609314J107171j153882k878585k158603j68037O55534K33322
4210b135339N16119J897732K408252R68915p64042q93084J11731O14706K70065
4201B995055j80712n35936j014166j215732p14038j70480l80201o73109Q5457
4192a803862J230877R81319n54693j170392M0988J170342N30049o81286m55675
4183g12333P33267Q17971n05982j485705j121853k72396J43903K39567J65261
4174a998300l09939p92845l92596O22645P96633k64823j107048o42081L48220
$$ plain form
4165 -3740134 -2898547 -1721542 106396 2119851 3140592 2861715 2055066 987441 -854327
4156 -854327 -3002870 -3629710 -1875566 777713 2507144 3274793 3769182 3507058 1726623
4147 1726623 -554954 -1245832 127944 1886569 2400444 1582780 112137 -1561663 -3035209
4138 -3035209 -3715792 -3294544 -2064783 -701141 -83536 -971964 -3047723 -4525380 -3733596
4129 -3733596 -1099959 1329602 2311596 2351561 2257977 2024049 1540542 1257307 1433238 1562317
4119 1562317 1231940 848512 813027 626883 -339888 -1643618 -2249889 -2017091 -1759730 -1757580
4109 -1757580 -1168528 505902 2082397 1903575 322318 -300263 1185566 2649656 1406330
4100 1406330 -1616054 -2721986 -800723 748044 -1088714 -4450078 -5469363 -3898021
$$ packed form
4165c740134Q41587J177005J827938K013455J020741k78877q06649j067625j841768
4156h54327k148543o26840J754144K653279J729431P67649M94389k62124j780435
4147A726623k281577o90878J373776J758625N13875q17664j470643j673800j473546
4138c035209o80583M21248J229761J363642O17605q88428k075759j477657P91784
4129c733596K633637K429561R81994L9965r3584k33928m83507k83235J75931J29079
4119A562317l30377l83428l5485j86144r66771j303730o06271K32798K57361K150
4109a757580N89052J674430J576495j78822j581257o22581J485829J464090j243326
4100A406330l022384j105932J921263J548767j836758l361364j019285J571342
$$ plain form
4092 -3898021 -2659678 -2683083 -1900451 362736 1691861 545951 -1253804 -1780989 -1959392
4083 -1959392 -3061021 -3762284 -2505248 -898181 -1558551 -3675216 -3967679 -1661401 559737
4074 559737 690721 -299367 -831171 -897382 -1036648 -1166398 -1359642 -2087163 -2849626 -2155679
4064 -2155679 275296 2748487 3859204 4073095 4184285 3791089 2572787 1700577 2343353
4055 2343353 3608932 3578471 1967969 307817 -413400 -968279 -2443097 -4463865 -5496505
4046 -5496505 -4788547 -3583892 -3872855 -5729275 -6673485 -4639394 -982422 986228 262107
4037 262107 -942243 -800857 -177564 -345183 -582707 197872 1125503 818529 -30184 178139
4027 178139 991571 600367 -822186 -1017390 835783 2808973 3136311 2466587 2298605
$$ packed form
4092c898021J238343k3405P82632K263187J329125j145910j799755n27185j78403
4083a959392j101629p01263J257036J607067o60370k116665k92463K306278K221138
4074E59737J30984r90088n31804o6211j39266j29750j93244p27521p62463O93947
4064b155679K430975K473191J110717K13891J11190l93196j218302q72210O42776
4055B343353J265579l0461j610502j660152p21217n54879j474818k020768j032640
4046e496505P07958J204655k88963j856420r44210K034091L656972J968650p24121
4037B62107j204350J41386O23293j67619k37524P80579R27631l06974q48713K08323
4027A78139Q13432l91204j422553j95204J853173J973190L27338o69724j67982
$$ plain form
4018 2298605 2869804 3677111 4641841 5501242 5183328 3182901 873460 141582 982803
4009 982803 1456296 -18350 -2948775 -5302755 -5415677 -3492607 -1296717 -111595 690997
4000 690997 2329519 4239550 4448849 2521011 538869 404282 1562139 2409826 2625310
3991 2625310 2744926 2572073 1686736 786282 734605 696226 -935468 -3798557 -5552994
3982 -5552994 -4945022 -3295000 -2348549 -2038873 -1250198 234043 1578667 2167869 2164939
3973 2164939 1942604 1478027 396748 -1392334 -3053714 -3227247 -1598758 317685 791687
3964 791687 15570 -350760 411883 1371877 1728622 1926599 2503476 3036075 2944890 2425693
3954 2425693 1947285 1678845 1948626 3253025 5114324 5968153 5063857 3525889 2598484
$$ packed form
4018B298605N71199Q07307R64730Q59401l17914k000427k309441p31878Q41221
4009I82803M73493j474646k930425k353980j12922J923070K195890J185122Q02592
4000F90997J638522J910031K09299j927838j982142j34587J157857Q47687K15484
3991B625310J19616j72853q85337r00454n1677l8379j631694k863089j754437
3982e552994O07972J650022R46451L09676P88675J484241J344624N89202k930
3973B164939k22335m64577j081279j789082j661380j73533J628489J916443M74002
3964G91687p76117l66330P62643R59994L56745J97977N76877N32599r1185n19197
3954B425693m78408k68440K69781J304399J861299Q53829r04296j537968r27405
$$ plain form
3945 2598484 1880919 536671 -711681 -462179 927622 1449321 76079 -1988849 -2905547
3936 -2905547 -2120277 -600476 140480 -622225 -1829795 -1447585 871377 2636080 1382635
3927 1382635 -1892201 -3941713 -3665685 -3167873 -4078661 -5066026 -4181020 -1901948 -166609
3918 -166609 554598 1441613 2967200 3940722 3184770 1229504 -133341 256113 1658825
3909 1658825 2152478 738376 -1536564 -2945975 -3069817 -2562085 -1506499 438281 2353037
3900 2353037 2453989 749247 -529756 -90546 588896 -158975 -1534092 -1899366 -1494918
3891 -1494918 -1380241 -945261 914241 2870255 2331542 -396977 -1897485 -268601 2427546
3882 2427546 3356869 2424421 1254574 466489 -294715 -736923 -88948 1484233 2821597
$$ packed form
3945B598484p17565j344248j248352K49502J389801N21699j373242k064928r16698
3936b905547P85270J519801P40956p62705j207570L82210K318962J764703j253445
3927A382635l274836k049512K76028M97812r10788r87365Q85006K279072J735339
3918a66609P21207Q87015J525587R73522p55952j955266j362845L89454J402712
3909A658825M93653j414102k274940j409411j23842N07732J055586J944780J914756
3900B353037J00952j704742j279003M39210O79442p47871j375117l65274M04448
3891a494918J14677M34980J859502J956014n38713k728519j500508J628884K696147
3882B427546R29323r32448j169847p88085p61204m42208O47975J573181J337364
$$ plain form
3873 2821597 2998277 2116680 1308536 2109041 4839030 7339369 6734165 3090926 -286459
3864 -286459 -1199395 -1329829 -3036770 -5237202 -5087357 -2672281 -962955 -1268737 -1730849
3855 -1730849 -880096 115205 -89155 -746014 -810730 -981319 -2031098 -2708196 -1501092
3846 -1501092 556752 1121187 40714 -502737 855793 3303240 5465678 6357576 4781156
3837 4781156 220865 -5020364 -6936902 -4415922 -934148 -200470 -1657070 -2016970 35800
3828 35800 2728415 4011647 3484154 1891899 542514 967398 3361731 5502365 5053062
3819 5053062 2870019 1992450 3243245 4155233 2857288 615748 -646362 -1084532 -1530052
3810 -1530052 -1378197 -36657 1072495 434145 -664113 205277 2534449 3153190 707599
$$ packed form
3873B821597J76680q81597q08144Q00505K729989K500339o05204l643239l377385
3864b86459r12936j30434j706941k200432J49845K415076J709326l05782m62112
3855a730849Q50753R95301k04360o56859o4716j70589j049779o77098J207104
3846a501092K057844N64435j080473n43451J358530K447447K162438Q91898j576420
3837D781156m560291n241229j916538K520980L481774P33678j456600l59900K052770
3828C5800K692615J283232n27493j592255j349385M24884K394333K140634m49303
3819E053062k183043q77569J250795R11988j297945k241540j262110m38170m45520
3810a530052J51855J341540J109152o38350j098258Q69390K329172O18741k445591
$$ plain form
3801 707599 -2589169 -4216600 -4144547 -3517654 -2536917 -963420 641750 1505654 1647661
3792 1647661 1376423 591489 -621119 -1510775 -1553988 -1093746 -488104 450160 1474387
3783 1474387 1488880 192890 -809809 106702 2190284 3146986 2041624 73043 -1348242
3774 -1348242 -1935668 -1828242 -872814 801012 2281191 2586650 1621969 214958 -541050
3765 -541050 -27276 1359829 2381562 2118208 992819 226364 327911 669462 573953
3756 573953 154465 -197149 -583650 -1378358 -2500314 -3373090 -3586505 -3325989 -3086847 -3068708
3746 -3068708 -2893387 -1951091 -135125 1712975 2235418 716608 -1988758 -3789404 -3011676
3737 -3011676 -10123 3007778 4024868 3009593 1530480 926471 1323572 2146562 2766130
$$ packed form
3801G07599l296768j627431P2053O26893R80737J573497J605170Q63904J42007
3792A647661k71238p84934j212608q89656m3213M60242O05642R38264J024227
3783A474387J4493j295990j002699R16511K083582R56702j105362j968581j421285
3774a348242n87426J07426R55428J673826J480179L05459r64681j407011p56008
3765e41050N13774J387105J021733k63354j125389p66455J01547L41551r5509
3756E73953m19488l51614l86501p94708j121956q72776k13415K60516K39142J8139
3746c068708J75321R42296J815966J848100N22443j518810k705366j800646P77728
3737c011676L001553L017901J017090j015275j479113o04009L97101Q22990O19568
$$ plain form
3728 2766130 2589613 1406323 36978 -99466 1374172 3148441 3791601 3400706 2979728
3719 2979728 2722690 2001962 903303 511994 1227426 1818759 1066363 -232421 -84286
3710 -84286 1866543 3588143 3429891 2549228 3132436 4707792 4295169 812484 -2671600
3701 -2671600 -2689162 -1395 1656875 763707 -475609 154099 2058826 3498571 4013196
3692 4013196 4006237 3538074 2885415 3039872 4295021 5363914 5186606 4629132 4997024 5733981
3682 5733981 5176905 3094727 998231 150591 486149 1361296 2374849 3481983 4850099
3673 4850099 6321205 6880569 5652183 3700447 3252939 4410181 4605526 2622782 884536
3664 884536 1650843 3196781 2793083 1653910 3026794 6281249 7218817 4462880 1415308
$$ packed form
3728B766130j76517j183290j369345j36444J473638J774269O43160l90895m20978
3719B979728k57038p20728j098659l91309P15432N91333p52396j298784J48135
3710h4286J950829J721600j58252q80663N83208J575356m12623l482685l484084
3701b671600j7562K687767J658270q93168j239316O29708J904727J439745N14625
3692D013196o959m68163o52659J54457J255149J068893j77308n57474L67892P36957
3682E733981n57076k082178k096496q47640L35558Q75147J013553J107134J368116
3673D850099J471106N59364j228386j951736m47508J157242J95345j982744j738246
3664H84536P66307J545938m03698j139173J372884L254455R37568k755937l047572
$$ plain form
3655 1415308 891963 1612464 1549225 1283961 1914088 2481391 1868218 1082806 1450121 2355102
3645 2355102 2751169 3109374 3926374 4099498 2835695 1470975 1301009 1297892 195405
3636 195405 -863765 -223360 1341055 2222112 2980674 4737951 5942150 4286106 1106674
3627 1106674 136883 1932597 3155556 1836806 -132573 -681997 -482288 -798742 -1222819
3618 -1222819 -1169113 -1285915 -1753723 -1306484 406304 1529342 891509 247697 1501917
3609 1501917 3358842 3222412 1268364 -37639 67886 -220354 -2042765 -4124151 -4921734
3600 -4921734 -4701485 -4516508 -4381276 -3517852 -1737994 276178 1748556 2296899 1848143
3591 1848143 504803 -1493887 -3782833 -5771458 -6629207 -5766733 -3580249 -1532677 -1102184
$$ packed form
3655A415308n23345P20501o3239k65264O30127N67303o13173p85412L67315R04981
3645B355102L96067L58205Q17000J73124j263803j364720j69966l117j102487
3636A95405j059170O40405J564415Q81057P58562J757277J204199j656044l179432
3627A106674r69791J795714J222959j318750j969379n49424J99709l16454m24077
3618a222819N3706j16802m67808M47239J712788J123038o37833o43812J254220
3609A501917J856925j36430j954048j306003J05525k88240j822411k081386p97583
3600d921734K20249J84977J35232Q63424J779858K014172J472378N48343m48756
3591A848143j343340j998690k288946j988625q57749Q62474K186484K047572M30493
$$ plain form
3582 -1102184 -2379036 -3758052 -3389261 -1197015 809325 664705 -1279126 -2766665 -2274627
3573 -2274627 -545402 688785 794475 556165 866293 1690504 2242594 1844665 637515
3564 637515 -451110 -567122 228812 1180770 1776894 2036000 1934574 1218552 -9648
3555 -9648 -1116442 -1660374 -1782469 -1611189 -925308 123623 599596 -140499 -1314173 -1483891
3545 -1483891 -385846 746315 784470 -10532 -563043 -307573 480671 1309489 1818000
3536 1818000 1566220 167037 -1988109 -3583267 -3555634 -2254893 -864489 128727 1049230
3527 1049230 1701098 1205871 -296173 -1074771 -80960 1165121 467531 -1777747 -2893206
3518 -2893206 -1485005 907807 2097373 1769214 1080403 887113 1227016 1866036 2590844
$$ packed form
3582a102184j276852j379016L68791K192246K006340j44620j943831j487539M92038
3573b274627J729225J234187J05690k38310L10128Q24211N52090l97929j207150
3564F37515j088625j16012P95934R51958N96124K59106j01426p16022j228200
3555i648j106794n43932j22095J71280O85881J048931M75973p40095j173674j69718
3545a483891J098045J132161L8155p95002n52511K55470P88244Q28818N08511
3536A818000k51780j399183k155146j595158K7633J300741J390404R93216R20503
3527A049230O51868m95227j502044p78598R93811J246081o97590k245278j115459
3518b893206J408201K392812J189566l28159o88811j93290L39903O39020P24808
$$ plain form
3509 2590844 3225975 3643257 3495707 2189253 -131875 -1908270 -1744525 -602073 -843715
3500 -843715 -2781425 -3918002 -2442461 145157 1120246 -66350 -1845849 -2890100 -2863838
3491 -2863838 -1643438 486012 2156435 1963661 237656 -1306271 -1647677 -1296132 -1174258
3482 -1174258 -1530041 -1936241 -1793046 -1004425 -475089 -1318059 -3130595 -4000982 -2954314
3473 -2954314 -1309630 -633872 -597170 -228450 9450 -693213 -1414165 -832646 84138 -629676
3463 -629676 -2275151 -2062669 344469 1920879 957296 -233433 961185 3434647 4329469
3454 4329469 3267796 2105115 1527014 443661 -1550944 -3352390 -4146698 -4300822 -4157988
3445 -4157988 -3394194 -2038472 -1028949 -1186433 -2240046 -3153138 -2997084 -1544745 461262
$$ packed form
3509B590844O35131M17282j47550j306454k321128j776395J63745J142452k41642
3500h43715j937710j136577J475541K587618R75089j186596j779499j044251K6262
3491b863838J220400K129450J670423j92774j726005j543927l41406L51545J21874
3482a174258l55783m06200J43195P88621N29336q42970j812536q70387J046668
3473b954314J644684O75758L6702L68720K37900p02663p20952N81519R16784p13814
3463f29676j645475K12482K407138J576410r63583j190729J194618K473462Q94822
3454D329469j061673j162681n78101j083353j994605j801446p94308j54124J42834
3445d157988P63794J355722J009523j57484j053613r13092J56054J452339K006007
$$ plain form
3436 461262 1709360 1551138 769385 649581 1466427 2347600 2328239 1048332 -1108906
3427 -1108906 -2901318 -2840930 -879084 1023118 1138091 324911 736520 2488536 3396145
3418 3396145 2200772 184716 -1092128 -1858836 -2787495 -3156129 -1994652 -51596 1100627
3409 1100627 1314009 1561034 1834139 1188621 -160124 -629198 446520 1932925 2868875
3400 2868875 3785107 5230259 6386143 6267302 5216230 4091940 2983554 1931521 1873186
3391 1873186 3311645 4862586 4912024 4141393 4382604 5279997 4528458 1820733 55228
3382 55228 1341392 3771638 3919349 1265594 -1681603 -2918976 -2820897 -2715192 -3069587
3373 -3069587 -3281757 -2446716 -345856 1855442 2376225 909493 -717480 -774358 239032
$$ packed form
3436D61262J248098j58222p81753j19804Q16846Q81173j9361j279907k157238
3427a108906j792412O0388J961846J902202J14973q13180M11609J752016R07609
3418C396145j195373k016056j276844p66708r28659l68634J161477J943056J152223
3409A100627K13382K47025K73105o45518j348745m69074J075718J486405R35950
3400B868875R16232J445152J155884j18841j051072j124290j108386j052033n8335
3391A873186J438459J550941M9438p70631K41211Q97393p51539k707725j765505
3382E5228J286164K430246J47711k653755k947197j237373R8079J05705l54395
3373c069587k12170Q35041K100860K201298N20783j466732j626973n6878J013390
$$ plain form
3364 239032 700457 265174 -239434 -667126 -1569773 -2545398 -2295870 -592309 1215948
3355 1215948 1996082 1976682 1849353 1853198 2019642 2276088 2087160 1029449 -135413 -99888
3345 -99888 1101167 2040078 1951827 1562144 1567246 1668272 1600669 1735117 1969691 1320651
3335 1320651 -529148 -2348566 -2855757 -2200458 -1314611 -749265 -700517 -1071421 -963695
3326 -963695 564536 2596363 2829053 940564 -291607 1198823 3422852 2895715 -521497
3317 -521497 -3659067 -4438272 -3908454 -3751827 -3843999 -3093602 -1389081 191366 607610
3308 607610 -105484 -837098 -538813 515040 1164379 1209204 1662124 2578210 2206622 -317247
3298 -317247 -2848909 -2779364 -756948 320227 -565245 -1766760 -2048491 -1916483 -1630342
$$ packed form
3364B39032M61425m35283n04608m27692r02647r75625K49528J703561J808257
3355A215948P80134j9400j27329L845J66444K56446j88928j057711j164862L5525
3345i9888J201055R38911q8251l89683N102J01026o7603J34448K34574o49040
3335A320651j849799j819418n07191O55299Q85847N65346M8748l70904J07726
3326i63695J528231K031827K32690j888489j232171J490430K224029n27137l417212
3317e21497l137570p79205N29818J56627r2172P50397J704521J580447M16244
3308F07610p13094p31614K98285J053853O49339M4825M52920R16086l71588k523869
3298c17247k531662O9545K022416J077175q85472j201515k81731J32008K86141
$$ plain form
3289 -1630342 -381898 1705941 2852889 2028679 542227 218006 1262745 2752835 3972863
3280 3972863 4483536 4075633 3416286 3601107 4446728 4477348 3171995 1751508 1039054
3271 1039054 248451 -1029884 -1388760 247292 2372102 2597560 768597 -1194488 -1824564
3262 -1824564 -995217 913322 3031683 3754830 2262723 42693 -717009 -48037 119083
3253 119083 -931616 -1743955 -1138223 123442 821272 1018411 1405944 1943541 2127164
3244 2127164 1943764 1680844 1230131 396710 -320069 -5240 1515653 3258341 4055410
3235 4055410 3823502 3660307 4565145 6157119 6964254 6079155 4192023 2770034 2562216
3226 2562216 3223937 4065884 4735201 5361892 6352886 7755712 8573377 7314101 3879416
$$ packed form
3289a630342J248444K087839J146948q24210j486452l24221J044739J490090J220028
3280C972863N10673m07903o59347J84821Q45621L0620j305353j420487p12454
3271A039054p90603j278335l58876J636052K124810K25458j828963j963085o30076
3262a824564Q29347J908539K118361P23147j492107k220030p59702O68972J67120
3253A19083j050699q12339O05732J261665O97830J97139L87533N37597J83623
3244B127164j83400k62920m50713q33421p16779L14829J520893J742688P97069
3235D055410k31908j63195R04838J591974Q07135q85099j887132j421989k07818
3226B562216O61721Q41947O69317O26691R90994J402826Q17665j259276l434685
$$ plain form
3217 3879416 436146 -522621 1079509 2845507 2594230 445872 -1787597 -2592573 -1934183
3208 -1934183 -948277 -679800 -930880 -502144 1101156 2564586 2041653 -639945 -3774155
3199 -3774155 -5636274 -5691319 -4059146 -1031688 2374117 4451983 4368598 3230816 2790477
3190 2790477 3376835 3875679 3565785 3060363 3191191 3681912 3504174 2299012 936995
3181 936995 626063 1750260 3644231 5257509 5898907 5513796 4478823 3214924 2058363
3172 2058363 1507610 2189737 3982700 5342714 4567403 2152036 750790 1791185 3150541
3163 3150541 1816588 -1758677 -4057815 -3279636 -1438158 -936555 -1274064 -693121 644020
3154 644020 1146557 453256 -341979 -548930 -270613 548861 1767239 2156265 652058
$$ packed form
3217C879416l443270r58767J602130J765998k51277k148358k233469q04976O58390
3208a934183R85906K68477k51080M28736J603300J463430n22933k681598l134210
3199c774155j862119n5045J632173L027458L405805K077866q3385j137782m40339
3190B790477N86358M98844l09894n05422J30828M90721j77738j205162j362017
3181I36995l10932J124197J893971J613278O41398l85111j034973j263899j156561
3172B058363n50753O82127J792963J360014p75311k415367j401246J040395J359356
3163C150541j333953l575265k299138P78179J841478N01603l37509N80943J337141
3154F44020N02537o93301p95235k06951K78317Q19474J218378L89026j504207
$$ plain form
3145 652058 -1698714 -2723622 -1907752 -549730 587424 1796001 2646128 1968771 117617
3136 117617 -868207 -148951 793236 771717 620101 1105345 1106260 -398827 -2084348 -2003531
3126 -2003531 -553699 184740 -579136 -1749933 -2214971 -1690215 -106742 2222992 4028617
3117 4028617 4196984 3427675 3436500 4541705 5325275 4703073 3096014 1479371 417111
3108 417111 89460 178653 -245209 -1565877 -2462825 -1317522 1196578 2551100 1729276
3099 1729276 472460 472510 985164 426349 -963147 -1530296 -538783 1251365 2871793 3867874
3089 3867874 4085285 3748920 3464064 3311364 2430337 440300 -1349380 -1396350 -71418
3080 -71418 1132070 2086703 3793700 5706592 5665287 3331320 1452632 2140916 3703226
$$ packed form
3145F52058k350772j024908Q15870J358022J137154J208577Q50127o77357j851154
3136A17617r85824P19256R42187k1519j51616M85244R15j505087j685521Q0817
3126b003531J449832P38439p63876j170797m65038N24756J583473K329734J805625
3117D028617J68367p69309Q825J105205P83570o22202j607059j616643j062260
3108D17111l27651Q9193m23862j320668q96948J145303K514100J354522q21824
3099A729276j256816N0N12654n58815j389496n67149R91513J790148J620428R96081
3089C867874K17411l36365k84856j52700q81027j990037j789680m6970J324932
3080g1418J203488R54633J706997J912892m1305k333967j878688O88284J562310
$$ plain form
3071 3703226 3211100 806070 -1049983 -1695807 -2647067 -3965367 -3540154 -1019503 559525
3062 559525 -918010 -3041471 -2228674 869031 2385968 1042672 -294767 701459 2498680
3053 2498680 2483797 937009 257144 1308756 2483785 2219129 960595 214563 450815
3044 450815 604457 -302623 -1437494 -765724 2247128 5305072 5645568 3288907 708861
3035 708861 -430190 -659359 -882338 -1072911 -1328316 -2363716 -3966276 -4582796 -3647519
3026 -3647519 -2835212 -3622867 -5000356 -5176020 -4235092 -3298759 -2323922 -950257 -462001
3017 -462001 -2183295 -4391176 -3754122 -81260 3116120 3461589 2461168 2305030 2476801
3008 2476801 1402855 -414108 -1093282 -129628 1470121 3039238 4420561 4809211 3312622
$$ packed form
3071C703226m92126k405030j856053o45824r51260j318300M25213K520651J579028
3062E59525j477535k123461Q12797L097705J516937j343296j337439R96226J797221
3053B498680j4883j546788o79865J051612J175029k64656j258534p46032K36252
3044D50815J53642r07080j134871O71770L012852L057944L40496k356661k580046
3035G08861j139051k29169k22979j90573k55405j035400j602560o16520R35277
3026c647519Q12307p87655j377489j75664R40928R36333R74837J373665M88256
3017d62001j721294k207881O37054L672862L197380L45469j000421j56138J71771
3008B476801j073946j816963o79174R63654J599749J569117J381323L88650j496589
$$ plain form
2999 3312622 709539 -853562 -254105 1472087 2530764 2130905 851561 -9789 504964
2990 504964 1948922 2637223 1595043 50397 39062 1712447 3182718 3119688 2267441
2981 2267441 1928707 2051380 1646958 420000 -890391 -1465817 -1035354 176471 1491154
2972 1491154 1984192 1336115 409361 324346 943415 978140 -194212 -1539729 -1679720 -662906
2962 -662906 231624 179200 -387987 -554804 175407 1747503 3600101 4705774 4331381
2953 4331381 3115219 2705435 3847388 5434914 5988897 5420783 4613068 3912158 3084364
2944 3084364 2368827 2365640 2929876 3298784 3409015 3980810 5069376 5664481 5161727 4175261
2934 4175261 3345414 2427463 1347948 1089656 2323425 3882636 4001252 2774938 1998498
$$ packed form
2999C312622k603083j563101N99457J726192J058677l99859j279344q61350N14753
2990E04964J443958O88301j042180j544646j1335J673385J470271o3030q52247
2981B267441l38734J22673m04422j226958j310391n75426M30463J211825J314683
2972A491154M93038o48077r26754q5015O19069L4725j172352j345517j39991J016814
2962f62906Q94530n2424n67187j66817P30211J572096J852598J105673l74393
2953D331381j216162m09784J141953J587526N53983n68114q07715p00910q27794
2944C084364p15537l187N64236L68908J10231N71795J088566N95105n02754r86466
2934D175261q29847r17951j079515k58292J233769J559211J18616j226314p76440
$$ plain form
2925 1998498 2519421 3133499 2563536 1329922 792252 1133434 1354345 911609 285520
2916 285520 -98750 -492413 -984496 -926286 64240 1122213 1137453 458889 476549 1448770
2906 1448770 1979235 1141037 -56001 -211076 404984 495226 -226477 -957369 -1361117 -1817344
2896 -1817344 -2271094 -2198501 -1723131 -1421586 -962201 582433 2830899 4085456 3713503
2887 3713503 2939904 2596876 1848594 292022 -402072 1262483 3852869 4470980 2450140
2878 2450140 -143582 -1392890 -1266083 -586926 127788 576178 676188 913895 1724048
2869 1724048 2535312 2503706 2119430 2772852 4556841 5842237 5488375 4311832 3785820
2860 3785820 4263527 5079765 5519300 5054187 3457597 1428142 423601 1078206 2274102
$$ packed form
2925A998498N20923O14078n69963j233614n37670L41182K20911m42736o26089
2916B85520l84270l93663m92083N8210R90526J057973J5240o78564J7660R72221
2906A448770N30465q38198j197038j55075O16060R0242p21703p30892m03748m56227
2896a817344m53750P2593M75370L01545M59385J544634K248466J254557l71953
2887C713503p73599l43028p48282j556572o94094J664555K590386O18111k020840
2878B450140k593722j249308J26807O79157P14714M48390J00010K37707Q10153
2869A724048Q11264l1606l84276O53422J783989J285396l53862j176543n26012
2860C785820M77707Q16238M39535m65113j596590k029455j004541O54605J195896
$$ plain form
2851 2274102 2518667 1796592 1245372 1344425 1454871 1227317 1453814 2861224 4568031
2842 4568031 4676596 2600644 91034 -688472 278938 1095219 625782 -205851 -171503
2833 -171503 442690 707060 737291 1157941 1478375 576734 -1292167 -2431057 -1846905 -251115
2823 -251115 1274450 2372732 2890738 2575948 1837938 1640571 1981327 1575164 -160790
2814 -160790 -1821966 -1709704 -93376 1197123 967406 -361588 -1551593 -1620114 -519557
2805 -519557 631651 417143 -1220347 -2666994 -2488404 -974619 710906 2078855 3109124
2796 3109124 3277544 2087706 304566 -538686 56376 1067209 1299909 590479 -278828
2787 -278828 -346804 650719 1766173 1675387 502899 7404 1127889 2336298 1804039
$$ packed form
2851B274102K44565p22075n51220R9053J10446k27554K26497J407410J706807
2842D568031J08565k075952k509610p79506R67410Q16281m69437q31633L4348
2833a71503O14193K64370L0231M20650L20434r01641j868901j138890N84152J595790
2823b51115J525565J098282N18006l14790p38010j97367L40756m06163j735954
2814a60790j661176J12262J616328J290499k29717j328994j190005o8521J100557
2805e19557J151208k14508j637490j446647J78590J513785J685525J367949J030269
2796C109124J68420j189838j783140q43252N95062J010833K32700p09430q69307
2787b78828o7976R97523J115454r0786j172488m95495J120485J208409n32259
$$ plain form
2778 1804039 338209 203459 1391960 1395404 -887926 -3222550 -3084447 -916021 994976
2769 994976 1544355 1239158 617297 -107890 -337573 451567 1663855 2179165 1880571 1563821
2759 1563821 1502713 1227491 714049 668631 1400708 2319248 2810883 2863501 2610299 1984907
2749 1984907 1056415 50138 -1113182 -2578844 -3730711 -3496760 -1840173 -120893 483635
2740 483635 143895 -484816 -1316323 -2201961 -2144777 -440523 1758693 2339435 786668
2731 786668 -1209450 -1956571 -1623156 -1437429 -1788960 -1843590 -774638 1136242 2577296
2722 2577296 2220982 -71883 -2799873 -3824975 -2243979 675766 2580393 2117759 20972
2713 20972 -1702846 -1567014 272016 2427630 3574202 3252117 1741092 -241874 -1614262
$$ packed form
2778A804039j465830j34750J188501L444k283330k334624J38103K168426J910997
2769I94976N49379l05197o21861p25187k29683P89140J212288N15310k98594l16750
2759A563821o1108k75222n13442m5418P32077R18540M91635N2618k53202o25392
2749A984907r28492j006277j163320j465662j151867K33951J656587J719280O04528
2740D83635l39740o28711q31507q85638N7184J704254K199216N80742j552767
2731G86668j996118p47121L33415J85727l51531n4630J068952J910880J441054
2722B577296l56314k292865k727990j025102J580996K919745J904627m62634k096787
2713B0972j723818J35832J839030K155614J146572l22085j511025j982966j372388
$$ plain form
2704 -1614262 -1431528 72105 1332935 1008199 -508766 -1679389 -1675238 -986858 -425560
2695 -425560 -352178 -825576 -1636966 -2084978 -1484964 -31225 1488744 2714777 3574576
2686 3574576 3391902 1589239 -531726 -413109 2488070 5444469 5647336 3588828 1986401
2677 1986401 2194252 3143375 3371157 2656023 1677391 1126043 1210036 1394320 861246 -234840
2667 -234840 -556467 648420 2301208 2957473 2698314 2353366 1706590 144927 -1462993
2658 -1462993 -1465458 78936 1421636 1762363 2103078 3154913 4121345 4143570 3473894 2631261
2648 2631261 1753224 1263315 1704767 2390952 1863724 382059 116114 1801890 3136257
2639 3136257 2163289 550965 1206424 3694576 4669742 2702282 185323 -174289 1233504
$$ packed form
2704a614262J82734J503633J260830l24736j516965j170623M151O88380N61298
2695d25560P3382m73398q11390m48012O00014J453739J519969J226033Q59799
2686C574576j82674j802663k120965J18617K901179K956399K02867k058508j602427
2677A986401K07851R49123K27782p15134r78632n51348Q3993J84284n33074j096086
2667b34840l21627J204887J652788O56265k59159l44948o46776j561663j607920
2658a462993k465J544394J342700L40727L40715J051835R66432K2225o69676q42633
2648B631261q78037m89909M41452O86185n27228j481665k65945J685776J334367
2639C136257r72968j612324O55459K488152R75166j967460k516959l59612J407793
$$ plain form
2630 1233504 2094635 1340992 -171478 -1361873 -1948290 -1965334 -1427193 -765130 -788192 -1658810
2620 -1658810 -2366563 -1837019 -307056 1081406 1874277 2566640 3246089 3218414 2524212
2611 2524212 2543397 4024585 5584634 5564597 4527362 4254078 4889066 5005061 4191350
2602 4191350 3468532 3061093 1925465 -30188 -1303862 -1131604 -619859 -695553 -691551 16161
2592 16161 607946 211773 -679673 -1177691 -1039069 25623 2385323 4890843 5192038
2583 5192038 2975181 959217 1104291 1847197 1107059 35998 1066867 3610616 4691328
2574 4691328 3259784 1154856 29488 -167325 339142 1807994 3715690 4690122 4136093
2565 4136093 2638550 848425 -664454 -837900 896129 3265817 4460134 4497251 4545023
$$ packed form
2630A233504Q61131p53643j512470j190395n86417j7044N38141O62063k3062q70618
2620a658810p07753N29544J529963J388462P92871O92363O79449k7675o94202
2611B524212J9185J481188J560049k0037j037235k73284O34988J15995q13711
2602D191350p22818m07439j135628j955653j273674J72258N11745p5694M002P07712
2592A6161N91785l96173q91446m98018J38622J064692K359700K505520L01195
2583E192038k216857k015964J45074P42906p40138j071061J030869K543749J080712
2574D691328j431544k104928j125368j96813N06467J468852J907696R74432n54029
2565D136093j497543j790125j512879j73446J734029K369688J194317L7117M7772
$$ plain form
2556 4545023 4275622 2133656 -1624584 -4375198 -4302697 -2489530 -1191054 -1376675 -2540897
2547 -2540897 -3783227 -4490069 -4674827 -4860980 -5150391 -4811968 -3507534 -2163099 -1573916
2538 -1573916 -1063375 143759 1273568 1411651 1500207 2907505 4907898 5763708 5488720
2529 5488720 5254245 4927197 3698483 2271011 1739704 1297694 -28567 -751482 348845
2520 348845 623448 -2168345 -3178025 4952879 19774251 28522190 23309838 10827230
2512 10827230 2612823 1069488 711383 -1081435 -1665772 316624 2630704 3823512
2504 3823512 4835594 5764622 5264723 3799895 3746509 5431092 6359416 5327184 4304280
2495 4304280 5006401 6116248 5418570 2976758 861360 751559 2587819 4862092 5969370
$$ packed form
2556D545023k69401k141966l758240k750614P2501J813167J298476j85621j164222
2547b540897j242330p06842j84758j86153k89411L38423J304434J344435N89183
2538a573916N10541J207134J129809J38083Q8556J407298K000393Q55810k74988
2529E488720k34475l27048j228714j427472n31307m42010j326261p22915J100327
2520C48845K74603k791793j009680Q130904J4821372Q747939n212352j2482608
2512A0827230q214407j543335l58105j792818n84337J982396K314080J192808
2504C823512J012082R29028m99899j464828n3386J684583R28324j032232j022904
2495D304280P02121J109847o97678k441812k115398j09801J836260K274273J107278
$$ plain form
2486 5969370 5894847 6272299 7975097 9409688 8503286 5618875 2855558 1100969 -344639
2477 -344639 -1679777 -2238409 -2170204 -2534952 -3484795 -3963090 -3431534 -2507774 -1771795 -1188461
2467 -1188461 -690277 -186222 757311 2085700 2637736 1734855 716074 1216993 2602476
2458 2602476 3086173 2755738 3051752 3563194 2228116 -794992 -2231861 87822 4209570
2449 4209570 6646265 6365140 4767465 3025075 1130818 -960334 -2676266 -3409481 -3072147
2440 -3072147 -1989844 -559003 870337 1783544 1479155 -88569 -1480636 -922329 1276205
2431 1276205 2761277 2399934 1974815 3285197 5129395 5191302 3742380 3024320 3574966
2422 3574966 3729020 2734120 1997828 2787196 4469975 5451523 4567125 1635399 -1978276
$$ packed form
2486E969370p4523L77452J702798J434591r06402k884411k763317j754589j445608
2477c44639j335138n58632O8205l64748r49843m78295N31556R23760P35979N83334
2467a188461M98184N04055R43533J328389N52036r02881j018781N00919J385483
2458B602476M83697l30435K96014N11442j335078l023108j436869K319683M121748
2449D209570K436695k81125j597675j742390j894257k091152j715932p33215L37334
2440c072147J082303J430841J429340R13207l04389j567724j392067N58307K198534
2431A276205J485072l61343m25119J310382J844198O1907j448922p18060N50646
2422C574966J54054r94900p36292P89368J682779R81548q84398k931726l613675
$$ plain form
2413 -1978276 -3688326 -2205100 591218 1896769 1522699 1279456 1536011 915714 -752210
2404 -752210 -1747106 -1029020 613077 2126363 2922344 2199813 -224436 -2578055 -2982658
2395 -2982658 -2333227 -2690306 -3299016 -1622083 1714714 2977415 1110516 -477881 632651
2386 632651 2371783 2097441 612189 -100205 -166069 -293380 415983 2443245 3937223
2377 3937223 3541493 3079066 4609128 6630047 6207955 3516147 1289804 691497 486667
2368 486667 -262180 -1182933 -1949419 -2561240 -2527546 -1454823 -68372 739042 1247162 2047181
2358 2047181 2772522 3022137 3457782 4498798 5033060 4005687 2241298 1150005 723101
2349 723101 322998 192282 497989 166525 -1484857 -3120569 -3176489 -2054342 -776846
$$ packed form
2413a978276j710050J483226K796318J305551l74070k43243K56555o20297j667924
2404g52210r94896P18086J642097J513286P95981p22531k424249k353619m04603
2395b982658O49431l57079o08710J676933L336797J262701j866899j588397J110532
2386F32651J739132k74342j485252p12394o5864j27311P09363K027262J493978
2377C937223l95730m62427J530062K020919m22092k691808k226343n98307k04830
2368D86667p48847r20753p66486o11821L3694J072723J386451Q07414N08120Q00019
2358B047181P25341K49615M35645J041016N34262j027373j764389j091293m26904
2349G23101m00103j30716L05707l31464j651382j635712n5920J122147J277496
$$ plain form
2340 -776846 1041242 3762952 5766183 5420803 3868739 3276180 3327158 2125339 -241872
2331 -241872 -1812650 -1884273 -1416703 -829958 -42854 -153902 -2159009 -4295486 -3786316
2322 -3786316 -1319934 -567583 -2619656 -4074764 -2015722 1761243 3363684 1915281
2314 1915281 189687 1003908 4409063 8166637 10124760 10015028 9065611 8113100 6864541
2305 6864541 5191003 3838409 3079090 2069004 637952 112295 896538 1066446 -603853
2296 -603853 -2059774 -1023634 1049994 1275356 280324 1122105 3898416 5368071 4079125
2287 4079125 2226635 1876743 2634741 3599135 4384397 3674628 232526 -3862156 -4618980
2278 -4618980 -1965175 -470006 -2598412 -4985873 -3816902 -476460 1266377 990973
$$ packed form
2340g76846J818088K721710K003231l45380j552064n92559N0978j201819k367211
2331b41872j570778p1623M67570N86745P87104j11048k005107k136477N09170
2322c786316K466382P52351k052073j455108K059042L776965J602441j448403
2314A915281j725594Q14221L405155L757574J958123j09732r49417r52511j248559
2305F864541j673538j352594p59319j010086j431052n25657P84243J69908j670299
2296f03853j455921J036140K073628K25362r95032Q41781K776311J469655j288946
2287D079125j852490l49892P57998R64394P85262p09769l442102m094682p56824
2278d618980K653805J495169k128406k387461J168971L340442J742837k75404
$$ plain form
2270 990973 1027036 1929172 2083613 1005850 13593 -122330 141334 608799 1607499 2907305
2260 2907305 3900675 4641651 5478148 6036761 5672442 4470976 2921763 1296468 163174
2251 163174 456672 1937562 2689774 1522773 -89622 36920 1735112 2991716 2870636
2242 2870636 2179762 1529484 517770 -949376 -2001929 -1990172 -1320431 -561051 559684
2233 559684 2554388 4820474 5609927 3791303 412430 -2160778 -2822099 -2686164 -3111405
2224 -3111405 -3829311 -3920904 -3504584 -3007372 -1779542 615594 2493889 1849365 -204500
2215 -204500 -393408 2126992 4757515 5509588 5305197 5300896 4755480 3156564 1976348
2206 1976348 2280708 2572657 1172467 -825752 -1164395 181608 1289274 1089339 -13019
$$ packed form
2270I90973L6063R02136J54441j077763r92257j35923K63664M67465R98700J299806
2260B907305R93370P40976Q36497N58613l64319j201466j549213j625295j133294
2251A63174K93498J480890P52212j167001j612395J26542J698192J256604j21080
2242B870636o90874o50278j011714j467146j052553J1757O69741P59380J120735
2233E59684J994704K266086P89453j818624l378873k573208o61321J35935m25241
2224c111405p17906r1593M16320M97212J227830K395136J878295o44524k053865
2215b04500j88908K520400K630523P52073k04391m301n45416j598916j180216
2206A976348L04360K91949j400190j998219l38643J346003J107666j99935j102358
$$ plain form
2197 -13019 -1594330 -3442746 -4737984 -4583464 -3211413 -1623355 -390609 419575 797530
2188 797530 1058785 1773618 2695892 2703275 1544470 542335 723152 1426674 1691120 1773853
2178 1773853 2256819 2853315 3199288 3693314 4519651 4976450 4685652 4218777 3761264 2753000
2168 2753000 1677079 2171854 4128487 4890920 3076417 1039024 1376005 2977443 3122174
2159 3122174 1819304 1121918 1262795 549124 -1351904 -2769750 -2604586 -1333475 417376
2150 417376 2325702 3603553 3622038 3104356 3117105 3352768 3004366 2609615 3159689 4043580
2140 4043580 3862859 2733678 1798243 1005476 -522677 -2320857 -2875241 -1877042 -336313
2131 -336313 1198662 2687097 3314384 2160056 -131028 -2146553 -3735979 -5430035 -6492799
$$ packed form
2197a3019j581311j848416j295238J54520J372051J588058J232746Q10184L77955
2188G97530K61255P14833R22274P383j158805j002135J80817P03522K64446Q2733
2178A773853M82966N96496L45973M94026Q26337M56799k90798m66875m57513j008264
2168B753000j075921M94775J956633P62433j814503k037393L36981J601438J44731
2159C122174j302870o97386J40877p13671j901028j417846J65164J271111J750851
2150D17376J908326J277851J8485n17682J2749K35663l48402l94751N50074Q83891
2140D043580j80721j129181r35435p92767j528153j798180n54384R98199J540729
2131c36313J534975J488435O27287j154328k291084k015525j589426j694056j062764
$$ plain form
2122 -6492799 -5715372 -3732953 -2386641 -2039053 -1522964 -388458 827616 2138856 3806999
2113 3806999 4901197 4229376 2281266 333397 -1552135 -3495117 -3987984 -1958551 371535
2104 371535 -41690 -2403345 -3307707 -2078444 -1122939 -1232422 -672851 788081 1242482
2095 1242482 780312 1926514 4709433 5671586 3642845 2219628 3935389 5860870 4242512
2086 4242512 382320 -1649558 -922703 100253 -337450 -1811439 -3095126 -2702998 525946
2077 525946 5256741 7673495 5846780 2477775 1203141 2081702 3096177 3920505 5074547
2068 5074547 5207427 2936788 265183 367872 2541572 3151691 1502194 811578 2667883
2059 2667883 4335248 3194676 697193 -311547 162384 183759 -532217 -620719 46924
$$ packed form
2122f492799P77427J982419J346312L47588N16089J134506J216074J311240J668143
2113C806999J094198o71821j948110j947869j885532j942982m92867K029433K330086
2104C71535m13225k361655r04362J229263R55505j09483N59571J460932M54401
2095A242482m62170J146202K782919R62153k028741j423217J715761J925481j618358
2086D242512l860192k031878P26855J022956m37703j473989j283687L92128L228944
2077E25946M730795K416754j826715l369005j274634Q78561J014475Q24328J154042
2068E074547J32880k270639k671605J02689K173700O10119j649497o90616J856305
2059B667883J667365j140572k497483j008740M73931K1375p15976q8502O67643
$$ plain form
2050 46924 29626 -926413 -910849 1425390 4533453 5638491 4144271 2108985 1422012
2041 1422012 1751629 1735677 1144067 922002 1631524 2779527 3445122 2892352 980690
2032 980690 -1258625 -2010720 -686951 945346 865891 -428977 -737114 613611 2112227
2023 2112227 2610130 2585958 2501927 1818081 465886 -300665 407438 1680484 1968309 880021
2013 880021 -726023 -1680206 -1267817 58354 694959 -303157 -1588475 -1118559 802173
2004 802173 1899530 1327994 557717 606444 764057 758284 1733432 3852290 5077707 3823159
1994 3823159 1102855 -1238522 -2718368 -3381566 -2622450 -440414 1590211 2076301 1288354
1985 1288354 -147449 -2360629 -4809894 -5609843 -3940893 -1604607 -594990 -585500 -333253
$$ packed form
2050D6924j7298r56039J5564K336239L108063J105038j494220k035286o86973
2041A422012L29617j5952n91610k22065P09522J148003O65595n52770j911662
2032I80690k239315p52095J323769J632297p9455j294868l08137J350725J498616
2023B112227M97903k4172q4031o83846j352195p66551P08103J273046K87825j088288
2013H80021j606044r54183M12389J326171O36605r98116j285318M69916J920732
2004H02173J097357n71536p70277M8727J57613n773R75148K118858J225417j254548
1994C823159k720304k341377j479846o63198P59116K182036K030625M86090p87947
1985A288354j435803k213180k449265p99949J668950K336286J009617R490K52247
$$ plain form
1976 -333253 40972 -84063 -170727 447415 1125685 1141054 1090937 1556159 1841936 1604616
1966 1604616 2026775 3549174 4219549 2508156 185065 -21197 1685904 3056216 3378516
1957 3378516 3636771 4005186 3707613 2781045 1826648 702808 -588188 -771603 763067
1948 763067 2058006 1077032 -990812 -1574949 -825911 -892991 -1912632 -2010493 -968095
1939 -968095 -522627 -859903 -66231 2306321 4069259 3706256 2357413 1572267 1302047
1930 1302047 1037637 909190 733643 -186578 -1433663 -1359111 518614 2533698 3096177
1921 3096177 2482201 1712801 1112267 796643 1222517 2234864 2583470 1373991 -626126
1912 -626126 -1848113 -1644054 -669564 123215 521321 1085475 2079827 2571849 1379580
$$ packed form
1976c33253L74225j25035q6664O18142O78270J5369n0117M65222K85777k37320
1966A604616M22159J522399O70375j711393k323091k06262J707101J370312L22300
1957C378516K58255L68415k97573r26568r54397j123840j290996j83415J534670
1948G63067J294939r80974k067844n84137P49038o7080j019641r7861J042398
1939i68095M45468l37276P93672K372552J762938l63003j348843p85146k70220
1930A302047k64410j28447j75547r20221j247085P4552J877725K015084N62479
1921C096177o13976p69400o00534l15624M25874J012347L48606j209479k000117
1912f26126j221987K04059R74490P92779L98106N64154R94352M92022j192269
$$ plain form
1903 1379580 -1007061 -2676463 -2900954 -2937462 -3380106 -2630285 339508 3437649 3965650
1894 3965650 2469672 1608303 2056657 2233377 1649429 1658335 2660103 3174586 2401352 1561379
1884 1561379 1782331 2348705 2082667 1249703 1024455 1649158 1983917 989232 -616492
1875 -616492 -783462 1141979 2808103 1610866 -1286322 -2139165 -103555 1543004 768339
1866 768339 -77357 1341719 3162231 2677485 1086611 1203805 2603993 2938511 2346229
1857 2346229 2581999 3222778 2807140 2424645 3871474 5393127 3954758 975655 734648
1848 734648 3207394 3766826 740329 -1791895 -260160 3703182 6627946 7503047 6908258
1839 6908258 5231552 3663701 4147077 6568203 8276863 7619732 5759627 4223251 3086289
$$ packed form
1903A379580k386641j669402k24491l6508m42644P49821K969793L098141N28001
1894C965650j495978q61369M48354J76720n83948Q906J001768N14483p73234q39973
1884A561379K20952N66374k66038q32964k25248O24703L34759r94685j605724
1875f16492j66970J925441J666124j197237k897188q52843K035610J646559p74665
1866G68339q45696J419076J820512m84746j590874J17194J400188L34518n92282
1857B346229K35770O40779m15638l82495J446829J521653j438369k979103k41007
1848G34648K472746N59432l026497k532224J531735L963342K924764Q75101n94789
1839F908258j676706j567851M83376K421126J708660o57131j860105j536376j136962
$$ plain form
1830 3086289 2316176 2458617 3284619 3932885 4581651 5673711 5885769 3854269 1460074
1821 1460074 1787259 4007682 4297060 1971002 408785 1304022 2418957 2094299 1662547
1812 1662547 1999417 1840448 1132546 2042944 4783003 6170970 4344977 1561827 458557
1803 458557 664988 818109 944382 1274919 1389416 1632272 2776071 3911255 3672245
1794 3672245 3322019 4833426 6439444 4921042 2002938 2678002 6841347 9014396 7448708
1785 7448708 6583505 8456587 8864903 5304406 1988707 2863916 5504106 6167355 5520994
1776 5520994 5161305 3696096 652667 -656022 1495467 3696139 3254837 2675714 4204119
1767 4204119 5156348 3226280 1265411 1930535 2605036 649551 -1266387 -196300 1708058
$$ packed form
1830C086289p70113J42441Q26002O48266O48766J092060K12058k031500k394195
1821A460074L27185K220423K89378k326058j562217Q95237J114935l24658m31752
1812A662547L36870j58969p07902R10398K740059J387967j825993k783150j103270
1803D58557K06431J53121J26273L30537J14497K42856J143799J135184k39010
1794C672245l50226J511407J606018j518402k918104O75064M163345K173049j565688
1785G448708q65203J873082M08316l560497l315699Q75209K640190O63249o46361
1776E520994l59689j465209l043429j308689K151489K200672m41302n79123J528405
1767D204119R52229j930068j960869O65124O74501j955485j915938J070087J904358
$$ plain form
1758 1708058 2032915 3074707 6438493 8139115 5359543 2821277 5510309 9884802
1750 9884802 9683796 6208743 5172380 6922966 7459319 6205600 5430370 4519456 1774983
1741 1774983 -500561 803983 3819578 5023741 5315673 6942487 8005765 6214109
1733 6214109 4271342 5197153 6437455 5139600 4584207 8202741 12041092 10946850 7548240
1724 7548240 7092046 8248418 7431920 7140466 10940323 15061152 14262869 11244826 11121122
1715 11121122 12034792 10643257 10478292 14537849 16681096 11809717 7005708 10023718
1707 10023718 14950035 13242193 10092143 13925243 18920218 16067671 12317762 18415257
1699 18415257 26959827 25282497 20720374 27264149 36497864 31699470 22108456 28606848
$$ packed form
1758A708058L24857J041792L363786J700622k779572k538266K689032M374493
1750I884802k01006l475053j036363J750586N36353j253719p75230r10914k744473
1741A774983k275544J304544L015595J204163K91932J626814J063278j791656
1733F214109j942767R25811J240302j297855n55393L618534L838351j094242l398610
1724G548240m56194J156372q16498k91454L799857M120829p98283l018043j23704
1715A1121122R13670j391535j64965M059557K143247m871379m804009L018010
1707A0023718M926317j707842l150050L833100M994975k852547l749909O097495
1699A8415257Q544570j677330m562123O543775R233715m798394r591014O498392
$$ plain form
1691 28606848 42869148 41062697 32425262 46018676 71264018 71160733 61620196 103345282
1683 103345282 184067584 187317528 42633167 -150869491 -231334277 -171158664 -84931575
1676 -84931575 -59669330 -68175887 -58149785 -38246988 -37898893 -46154373 -38363331 -23678315
1668 -23678315 -23615396 -31038063 -26855439 -16216076 -15779475 -21886608 -20469485 -14862373
1660 -14862373 -17218714 -23553997 -21699758 -14746709 -14162441 -17635052 -14842334 -8412150
1652 -8412150 -8952311 -14545584 -14271473 -8282255 -6644350 -10855898 -12776443 -10175326 -8654023
1643 -8654023 -9466345 -8692495 -7120795 -8722224 -10977836 -8416672 -3912067 -4939954 -10344391
1634 -10344391 -12225708 -9548862 -8562303 -10589041 -10482073 -7063796 -4735787 -4483200 -2860919
$$ packed form
1691B8606848J4262300j806451q637435J3593414K5245342j03285r540537M1725086
1683A03345282Q0722302L249944j44684361j93502658q0464786O0175613Q6227089
1676h4931575K5262245q506557J0026102J9902797L48095q255480P791042J4685016
1668b3678315O2919p422667M182624J0639363M36601o107133J417123N607112
1660a4862373k356341o335283J854239O953049N84268l472611K792718O430184
1652h412150n40161n593273K74111N989218J637905m211548j920545K601117J521303
1643h654023q12322P73850J571700j601429k255612K561164M504605j027887n404437
1634a0344391j881317K676846R86559k026738J06968L418277K328009K52587J622281
$$ plain form
1625 -2860919 -140028 -355893 -3029739 -3540250 -1866733 -2482457 -5476595 -6250964 -4281363
1616 -4281363 -3772182 -5146651 -4265331 -940119 -13208 -2698594 -4667594 -4214994 -4760712
1607 -4760712 -7485051 -8780238 -7165787 -5971255 -6875051 -7069892 -5111383 -3612866 -3843256
1598 -3843256 -3338422 -1198812 -286928 -1714118 -2348861 -446318 1023577 -596454 -3525832
1589 -3525832 -5057252 -5450399 -5949831 -6257815 -6033862 -5929507 -5639748 -3925598 -1619067
1580 -1619067 -1329749 -3247806 -4693116 -4651296 -5011668 -6322759 -6236747 -3551159 -205907
1571 -205907 2086142 3802681 5070234 4646400 2674893 1183722 809221 227141 -565568
1562 -565568 -69708 1048653 204021 -2422565 -3821028 -3688455 -5117127 -8299114 -8918045
$$ packed form
1625b860919K720891k15865k673846n10511J673517o15724k994138p74369J969601
1616d281363N09181j374469Q81320L325212R26911k685386j969000M52600n45718
1607d760712k724339j295187J614451J194532r03796j94841J958509J498517k30390
1598c843256N04834K139610R11884j427190o34743J902543J469895j620031k929378
1589c525832j531420l93147m99432l07984K23953J04355K89759J714150K306531
1580a619067K89318j918057j445310M1820l60372j311091Q6012K685588L345252
1571b05907K292049J716539J267553m23834j971507j491171l74501n82080p92709
1562e65568M95860J118361q44632k626586j398463J32573j428672l181987o18931
$$ plain form
1553 -8918045 -5316302 -2028728 -2708932 -4264306 -2321769 1375871 1915224 -1161837 -4003745
1544 -4003745 -4518686 -3880885 -3031875 -1758502 -885311 -1893138 -4228621 -5634022 -5229814
1535 -5229814 -4169106 -3351505 -2431495 -1139098 -70087 -44998 -1490992 -4078161 -6395361
1526 -6395361 -6831633 -5403998 -3707732 -2649812 -1744233 -1116591 -2017432 -4184048 -4973482
1517 -4973482 -2964002 -483695 -373822 -1852151 -2079793 -648460 249512 -378244 -1036353
1508 -1036353 -469964 525935 698335 191455 32770 689916 1727591 2359652 2004875
1499 2004875 662924 -1039012 -2295667 -2624965 -2002578 -898919 -284413 -1074632 -3198140
1490 -3198140 -5438974 -6407609 -5608863 -3740405 -2205448 -2011582 -2756255 -3112386 -2676940
$$ packed form
1553h918045L601743L287574o80204j555374J942537L697640N39353l077061k841908
1544d003745n14941O37801Q49010J273373Q73191j007827k335483j405401M04208
1535e229814J060708Q17601R20010J292397J069011K5089j445994k587169k317200
1526f395361m36272J427635J696266J057920R05579O27642r00841k166616p89434
1517d973482K009480K480307J09873j478329k27642J431333Q97972o27756o58109
1508a036353N66389R95899J72400n06880j58685O57146J037675O32061l54777
1499B004875j341951j701936j256655l29298O22387J103659O14506p90219k123508
1490c198140k240834r68635P98746J868458J534957J93866p44673l56131M35446
$$ plain form
1481 -2676940 -2485909 -2965707 -2577271 -53037 2889770 3160863 423919 -2439834 -3198448
1472 -3198448 -2640728 -2545042 -3125057 -3525590 -3546697 -3660847 -3887198 -3533628 -2053696 -3913
1462 -3913 948370 -397754 -2881783 -3703909 -1810659 659559 1422465 1046225 1216320
1453 1216320 1561176 651617 -939016 -1372699 -736908 -693864 -1319982 -1162088 -254238 -116769
1443 -116769 -747694 -653292 -10997 -557862 -1908854 -1434580 1231208 2866290 1221015
1434 1221015 -2020037 -4298114 -5457037 -6353110 -6677784 -5895545 -4391663 -2428620 78697
1425 78697 1957274 1402308 -951722 -2339554 -2124050 -2553171 -4130138 -3995026 -912501
1416 -912501 1861234 1439568 -296871 -318554 536615 -222025 -1958143 -2233856 -1174850
$$ packed form
1481b676940J91031m79798L88436K524234K942807K71093k736944k863753p58614
1472c198448N57720R5686n80015m00533k1107j14150k26351L53570J479932K049783
1462c913R52283j346124k484029q22126J893250K470218P62906l76240J70095
1453A216320L44856r09559j590633m33683O35791M3044o26118J57894R07850J37469
1443a16769o30925R4402O42295n46865j350992M74274K665788J635082j645275
1434A221015l241052k278077j158923q96073l24674P82239J503882J963043K507317
1425G8697J878577n54966k354030j387832K15504m29121j576967J35112L082525
1416i12501K773735m21666j736439k1683Q55169p58640j736118k75713J059006
$$ plain form
1407 -1174850 -745727 -940784 -280727 841920 718138 -469653 -1149635 -1438618 -2602810
1398 -2602810 -3897400 -3048911 160911 3479070 5277437 5638402 4641338 2216054 -279526
1389 -279526 -874393 280037 1035227 280605 -1016513 -1821189 -2194487 -2362969 -2350044 -2602068
1379 -2602068 -3451100 -4021602 -3089130 -814750 1653775 3751976 5255925 5305764 3519879
1370 3519879 1470938 1127951 2244972 3034784 2837491 2267955 1411009 -7470 -1186995
1361 -1186995 -1190927 -917497 -1921506 -3602744 -3872677 -2462694 -1260613 -1324291 -1753041
1352 -1753041 -1639952 -1066809 -44090 1522490 2724932 2518623 1744476 2230208 3819782
1343 3819782 4476967 3537577 2617916 2879897 3550650 3716927 3552235 3106416 1800066
$$ packed form
1407a174850M29123j95057O60057J122647j23782j187791o79982k88983j164192
1398b602810j294590Q48489L209822L318159J798367L60965r97064k425284k495580
1389b79526n94867J154430P55190p54622j297118q04676l73298j68482J2925k52024
1379b602068q49032n70502R32472K274380K468525K098201J503949M9839j785885
1370C519879k048941l42987J117021P89812j97293n69536q56946j418479j179525
1361a186995l932K73430j004009j681238k69933J409983J202081o3678m28750
1352a753041J13089N73143J022719J566580J202442k06309p74147M85732J589574
1343C819782O57185r39390r19661K61981O70753J66277j64692m45819j306350
$$ plain form
1334 1800066 -103550 -1242877 -1192321 -1310003 -2816928 -5163253 -6740119 -6269973 -3622060
1325 -3622060 -482960 284225 -2234380 -4951032 -4117544 -517522 1359945 -401603 -2643694
1316 -2643694 -1929751 894359 2649545 2274795 1352765 1392661 2265166 2755475 1695658
1307 1695658 -894778 -3351871 -3852145 -2528994 -1078401 -356421 131371 425204 -204032
1298 -204032 -1410040 -1669150 -701000 -60660 -558623 -1065420 -816912 -873811 -1989811 -2852788
1288 -2852788 -2031110 -308082 421439 -449368 -2148363 -3820266 -4818115 -4633845 -3500345
1279 -3500345 -2281990 -1251393 -60601 794738 170810 -1455468 -1852349 -238380 1215211
1270 1215211 414900 -1812696 -3370368 -3759874 -3637165 -2984614 -1653256 -643336 -969766
$$ packed form
1334A800066j903616j139327N0556j17682j506925k346325j576866M70146K647913
1325c622060L139100P67185k518605k716652Q33488L600022J877467j761548k242091
1316b643694P13943K824110J755186l74750r22030L9896Q72505M90309j059817
1307A695658k590436k457093n00274J323151J450593P21980M87792K93833o29236
1298b04032j206008k59110R68150O40340m97963n06797K48508n6899j116000q62977
1288b852788Q21678J723028P29521q70807j698995j671903r97849J84270J133500
1279c500345J218355J030597J190792Q55339o23928j626278l96881J613969J453591
1270A215211q00311k227596j557672l89506J22709O52551J331358J009920l26430
$$ plain form
1261 -969766 -2031801 -2698781 -3129598 -3893449 -4241050 -3156279 -1472034 -990235 -1816082
1252 -1816082 -2356051 -1825545 -1108208 -1109473 -1750629 -2728396 -3898115 -4572476 -3602474 -787751
1242 -787751 2326085 3528116 1882275 -1222571 -3020364 -2007049 223102 621221 -1603173
1233 -1603173 -4068047 -4544081 -3799636 -4009628 -5474786 -6440152 -5587281 -3273858 -517261
1224 -517261 2038615 4081016 5374594 5725351 4990803 3377470 1727372 796528 172141
1215 172141 -1107775 -2746535 -3346423 -2688570 -2204598 -2500978 -2231900 -554668 1079220
1206 1079220 1097539 188910 -195617 -258643 -859279 -1471716 -1364024 -1663796 -3694251 -5988009
1196 -5988009 -5717616 -2939623 -758365 -984794 -2093081 -2126788 -1377669 -1110288 -1415124
$$ packed form
1261i69766j062035o66980m30817p63851l47601J084771J684245M81799q25847
1252a816082n39969N30506P17337j265o41156r77767j169719o74361R70002K814723
1242g87751L113836J202031j645841l104846j797793J013315K230151L98119k224394
1233a603173k464874m76034P44445k09992j465158r65366Q52871K313423K756597
1224e17261K555876K042401J293578L50757p34548j613333j650098r30844o24387
1215A72141j279916j638760n99888O57853M83972k96380K69078J677232J633888
1206A079220J8319r08629l84527o3026o00636o12437J07692k99772k030455k293758
1196e988009K70393K777993K181258k26429j108287l3707P49119K67381l04836
$$ plain form
1187 -1415124 -1629018 -1704638 -1956181 -2151760 -1808817 -1005986 -278750 77135 291527 819405
1177 819405 1694216 2070554 919109 -1410095 -3038263 -2737096 -1531518 -1104150 -1337470
1168 -1337470 -865481 355261 647107 -1107864 -4027171 -6223288 -6323392 -4139675 -869952
1159 -869952 1490121 1942925 1550347 1869231 2893177 3683680 4243859 5044348 5273749
1150 5273749 3714009 1231087 99634 542070 255463 -1890229 -3954661 -3948412 -2757281
1141 -2757281 -2409628 -2964392 -3014521 -2291170 -1806033 -1804820 -1363892 -143606 841372 645483
1131 645483 -280088 -699380 -168700 365655 -419420 -2627462 -4714927 -4982966 -3461496
1122 -3461496 -1869386 -1652684 -2556628 -3266386 -2942208 -1867173 -939498 -725209 -814390
$$ packed form
1187a415124k13894p5620k51543j95579L42943Q02831P27236L55885K14392N27878
1177H19405Q74811L76338j151445k329204j628168L01167J205578M27368k33320
1168a337470M71989J220742K91846j754971k919307k196117j00104K183717L269723
1159h69952K360073M52804l92578L18884J023946P90503N60179Q00489K29401
1150E273749j559740k482922j131453M42436k86607k145692k064432O249J191131
1141b757281L47653n54764n0129P23351M85137J213M40928J220286R84978j95889
1131F45483r25571m19292N30680N34355p85075k208042k087465k68039J521470
1122c461496J592110K16702r03944p09758L24178J075035R27675K14289q9181
$$ plain form
1113 -814390 -211663 1302502 2507861 2107931 516533 -636314 -716063 -679394 -1206598
1104 -1206598 -1433647 -311096 1585052 2565553 1868257 456917 -175590 454081 1496535
1095 1496535 1733465 812496 -460938 -1068581 -812047 -223492 214590 311682 -90637 -987396
1085 -987396 -1908408 -2347083 -2444806 -2671059 -2925537 -2700877 -2183477 -2351816 -3591226 -4811123
1075 -4811123 -4511244 -2556246 -471903 144730 -647083 -1293617 -760102 151918 180087
1066 180087 -240287 386300 1859992 2092163 413157 -949158 -228576 864716 -270738
1057 -270738 -2867230 -3855612 -2514786 -1107001 -925312 -739671 185034 438346 -812423
1048 -812423 -1866387 -1070533 364781 -9736 -2580894 -5602245 -7521462 -7923393 -6911218
$$ packed form
1113h14390O02727J514165J205359l99930j591398j152847p9749L6669n27204
1104a206598k27049J122551J896148R80501o97296j411340o32507O29671J042454
1095A496535K36930r20969j273434o07643K56534N88555M38082R7092m02319q96759
1085i87396r21012m38675r7723k26253k54478K24660N17400j68339j239410j219897
1075d811123K99879J954998K084343O16633p91813o46534N33515R12020K8169
1066A80087m20374O26587J473692K32171j679006j362315P20582J093292j135454
1057b70738k596492r88382J340826J407785J81689J85641R24705K53312j250769
1048h12423j053964P95854J435314l74517k571158l021351j919217m01931J012175
$$ plain form
1039 -6911218 -5005811 -3269782 -2387245 -1855045 -795358 890656 2736560 4344402 5162613
1030 5162613 4498536 2580662 817024 154151 -10755 -431409 -539672 396554 1490428
1021 1490428 1184273 -364007 -1339177 -716543 648159 1567326 1967221 2281627 2302760
1012 2302760 1442930 -136483 -1305476 -1059205 368221 1678278 1779215 695917 -765505
1003 -765505 -1830393 -2031089 -1234759 91044 1097389 1576201 2181005 2996909 2811824
994 2811824 969204 -970458 -1112615 -122703 -179952 -1390731 -1669894 -318733 936592
985 936592 1176811 1845185 3702950 4697731 2865715 -445957 -2339334 -2035384 -881393
976 -881393 130984 909085 1240432 1095211 1252517 2024031 2164829 671047 -1222761
$$ packed form
1039f911218J905407J736029Q82537N32200J059687J686014J845904J607842Q18211
1030E162613o64077j917874j763638o62873j64906m20654j08263R36226J093874
1021A490428l06155j548280r75170O22634J364702R19167L99895L14406K1133
1012B302760q59830j579413j168993K46271J427426J310057J00937j083298j461422
1003g65505j064888k00696P96330J325803J006345M78812O04804Q15904j85085
994B811824j842620j939662j42157R89912n7249j210779k79163J351161J255325
985I36592K40219O68374J857765R94781j832016l311672j893377L03950J153991
976h81393J012377P78101L31347j45221J57306P71514J40798j493782j893808
$$ plain form
967 -1222761 -1611902 -689547 -106851 -318409 -572789 -947616 -2173959 -3644253 -3781766
958 -3781766 -2579008 -1859472 -2619642 -3669242 -3334942 -1311632 1396883 3320983 3298591
949 3298591 1448965 -697217 -1897524 -2574990 -3547337 -4275691 -3887991 -3116020 -3289811
940 -3289811 -3945172 -3502912 -2009399 -1056443 -1110568 -1082059 -495525 156862 1207146 3433506
930 3433506 5638744 5344555 2646855 728585 1435447 2848402 2604633 1192045 241082
921 241082 -186704 -513086 217925 2681841 5069551 4932347 2444874 -170048 -1686199
912 -1686199 -2403218 -2433464 -1622616 -767986 -897837 -1566697 -1696220 -1749963 -2963120 -4540449
902 -4540449 -4041311 -1109645 1393114 1073410 -913636 -1794563 -847700 400440 791705
$$ packed form
967a222761l89141R22355N82696k11558k54380l74827j226343j470294j37513
958c781766J202758P19536p60170j049600L34300K023310K708515J924100k2392
949C298591j849626k146182j200307o77466r72347p28354L87700P71971j73791
940c289811o55361M42260J493513R52956n4125K8509N86534O52387J050284K226360
930C433506K205238k94189k697700j918270P06862J412955k43769j412588r50963
921B41082m27786l26382P31011K463916K387710j37204k487473k614922j516151
912a686199p17019l0246Q10848Q54630j29851o68860j29523n3743j213157j577329
902d540449M99138K931666K502759l19704j987046q80927R46863J248140L91265
$$ plain form
893 791705 660086 516177 86950 -905461 -1901698 -2017486 -1034468 479811 1804234 2509383
883 2509383 2427490 1562767 168146 -1246781 -2146624 -2245448 -1614532 -654274 66422 211426
873 211426 51019 191019 735559 976771 201331 -1410659 -2986076 -3802201 -3588050 -2349011
863 -2349011 -506817 955439 1179606 360779 -459282 -540513 -18217 525184 584150 -30813
853 -30813 -981919 -1599482 -1724330 -1948973 -2417020 -2039266 -2921 2456816 3270085 2323325
843 2323325 1401985 1317383 1022897 99707 -617 1496371 2662378 1313942 -1511739
834 -1511739 -2558252 -545843 2398822 3674055 3132363 2568420 3229200 4509300 4842248
825 4842248 3533942 1610650 664279 922262 1056761 97897 -1278380 -1918228 -1843225
$$ packed form
893G91705j31619j43909m29227r92411r96237j15788R83018J514279J324423P05149
883B509383q1893q64723j394621j414927q99843r8824O30916R60258P20696J45004
873B11426j60407J40000N44540K41212p75440j611990j575417q16125K14151J239039
863b349011J842194J462256K24167q18827q20061q1231N22296N43401N8966o14963
853c0813r51106o17563j24848k24643m68047L77754K036345K459737Q13269r46760
843B323325r21340q4602k94486r23190j00324J496988J166007j348436k825681
834a511739j046513K012409K944665J275233n41692n63943O60780J280100L32948
825D842248j308306j923292r46371K57983J34499r58864j376277o39848P5003
$$ plain form
816 -1843225 -1858267 -2093407 -2007020 -1585806 -1495980 -2019201 -2698145 -3148403 -3462214 -3590611
806 -3590611 -3001274 -1414740 407291 1069622 -62561 -1897468 -2324200 -275921 2975044
797 2975044 5064969 5101777 4392896 4502256 5314204 5427284 3918525 1294000 -942173
788 -942173 -1480150 -467194 339701 -632150 -2777226 -4010978 -3499276 -2423640 -1750012
779 -1750012 -830969 954630 2701495 3343609 3263279 3207820 2790200 1611405 795582 1575709
769 1575709 3105119 3555547 2835914 2282180 2063713 1063178 -642809 -1312982 -59211
760 -59211 1856614 2841372 2760246 2442986 2553854 3274205 4079412 3770661 1862331 -176347
750 -176347 -421586 897538 1817229 1467644 637591 -354411 -2033397 -3677214 -3346458
$$ packed form
816a843225j5042k35140Q6387M21214Q9826n23221o78944m50258l13811j28397
806c590611N89337J586534J822031O62331j132183j834907m26732K048279L250965
797B975044K089925L6808p08881J09360Q11948J13080j508759k624525k236173
788i42173n37977J012956Q06895r71851k145076j233752N11702J075636O73628
779a750012R19043J785599J746865O42114q0330n5459m17620j178795q15823P80127
769A575709J529410M50428p19633n53734k18467j000535j705987o70173J253771
760e9211J915825R84758q1126l17260J10868P20351Q05207l08751j908330k038678
750a76347k45239J319124R19691l49585q30053r92002j678986j643817L30756
$$ plain form
741 -3346458 -908337 1243029 1591364 1403696 1967984 2313560 1473106 727953 1242889
732 1242889 1421075 -494534 -2552716 -1109935 3706187 7613825 7530036 4760490 2361163
723 2361163 1659458 2284387 3702616 5401389 6578882 6643996 5589427 3674792 1390690
714 1390690 -395907 -1208801 -1704753 -2606239 -3268879 -2723975 -1783785 -2215157 -3776009
705 -3776009 -4154247 -2359576 -159143 680911 629144 743352 683209 -52383 -438783 634278
695 634278 2225284 2480405 1305328 257831 213475 639599 821557 378130 -1078315
686 -1078315 -3303108 -4728562 -3995932 -2068466 -1221605 -1908801 -2309896 -1225883 354041
677 354041 1175068 1505876 2002055 2190155 1379566 123954 -538598 -673533 -1053062 -1622790
$$ packed form
741c346458K438121K151366L48335j87668N64288L45576q40454p45153N14936
732A242889J78186j915609k058182J442781M816122L907638q3789k769546k399327
723B361163p01705O24929J418229J698773J177493O5114j054569j914635k284102
714A390690j786597q12894m95952r01486o62640N44904R40190m31372j560852
705c776009l78238J794671K200433Q40054n1767J14208o0143p35592l86400J073061
695F34278J591006K55121j175077j047497m4356M26124J81958m43427j456445
686a078315k224793j425454P32630J927466Q46861o87196m01095J084013J579924
677C54041Q21027L30808M96179J88100q10589j255612o62552j34935l79529n69728
$$ plain form
667 -1622790 -1601138 -933987 -509600 -835358 -1382289 -1374313 -522244 1058179 2868487 3831498
657 3831498 2940156 568913 -1471070 -1745708 -690625 228836 504438 980648 2258918
648 2258918 3516625 3472589 2152645 984168 1077210 1995894 2504572 2053495 1104233 373824
638 373824 335286 1192424 2573667 3245778 1972302 -929162 -3409956 -3571425 -1548365
629 -1548365 731445 1476179 577115 -512177 -287033 1215832 2310712 1431634 -1047511
620 -1047511 -3199354 -3698663 -2978679 -2172332 -1675560 -1164915 -479456 21306 -216748 -1372853
610 -1372853 -2712604 -2816132 -1053440 1293936 2340049 1975276 1733863 2236946 2379546
601 2379546 1521805 666947 475210 -116220 -1874297 -3491421 -3565673 -2918725 -2931487 -2878314
$$ packed form
667a622790K1652O67151M24387l25758n46931P976Q52069J580423J810308R63011
657C831498q91342k371243k039983k74638J055083R19461K75602M76210J278270
648B258918J257707m4036j319944j168477R3042R18684N08678m51077r49262p30409
638C73824l8538Q57138J381243O72111j273476k901464k480794j61469K023060
629a548365K279810P44734q99064j089292K25144J502865J094880q79078k479145
620a047511k151843m99309P19984Q06347M96772N10645O85459N00762k38054j156105
610a372853j339751j03528J762692K347376J046113l64773k41413N03083J42600
601B379546q57741q54858j91737n91430j758077j617124p4252O46948j2762N3173
$$ plain form
591 -2878314 -1290128 1067619 2256716 2503777 3556821 5018253 4485531 1649026 -842785
582 -842785 -1365470 -1240201 -1623400 -1364186 466418 2415576 2831055 2149544 1352743 212390
572 212390 -1160509 -1149408 832519 2488832 1641613 -477076 -1267663 -610807 -143476
563 -143476 -2092 882067 2064568 1980247 670968 -372619 -777384 -1371253 -2098516 -2233315
553 -2233315 -2285253 -3179540 -3867981 -2513912 28205 875702 -423425 -1086729 489263
544 489263 2401878 2538045 1577936 1105661 898375 -48417 -1350259 -1833377 -1271964 -226334
534 -226334 911129 1686416 1372742 -94017 -1804919 -3055401 -3817060 -3738778 -2148009
525 -2148009 431441 2328040 2935187 3316599 4038018 4248088 3694284 3605435 4433902 4732197
$$ packed form
591b878314J588186K357747J189097K47061J053044J461432n32722k836505k491811
582h42785n22685J25269l83199K59214J830604J949158M15479o81511p96801j140353
572B12390j372899J1101J981927J656313q47219k118689p90587O56856M67331
563a43476J41384Q84159J182501q4321j309279j043587m04765n93869p27263j34799
553b233315n1938q94287o88441J354069K542117Q47497j299127o63304J575992
544D89263J912615J36167r60109m72275k07286r46792j301842m83118N61413J045630
534b26334J137463P75287l13674j466759j710902j250482p61659P8282J590769
525b148009K579450J896599O07147L81412P21419K10070n53804q8849Q28467K98295
$$ plain form
515 4732197 3653152 2605785 2839025 3302596 2719150 1881624 1766251 1169718 -1216144
506 -1216144 -3807781 -4012976 -2158307 -749323 -477809 154349 1514388 2088613 1355663
497 1355663 783165 1274760 1793793 1315773 354542 -211778 -329706 -170185 298678 648617
487 648617 194176 -755885 -1123661 -802853 -782667 -1263903 -1224625 -372270 46926 -800789
477 -800789 -1900680 -1838636 -668219 555865 1310192 1835519 2352933 2680614 2428107 1497486
467 1497486 711175 1483055 3967234 6017757 5355996 2513352 58505 -886163 -1382782
458 -1382782 -1895501 -1268631 625714 1607185 179294 -2015845 -2556439 -1581912 -786509
449 -786509 -306296 999313 2734933 2909002 909016 -1460584 -2471242 -2408776 -2313848
$$ packed form
515D732197j079045j047367K33240M63571n83446q37526j15373n96533k385862
506a216144k591637k05195J854669J408984K71514O32158J360039N74225p32950
497A355663n72498M91595N19033m78020r61231n66320j17928J59521M68863L49939
487F48617m54441r50061l67776L20808K0186m81236L9278Q52355M19196q47715
477h00789j099891O2044J170417J224084P54327N25327N17414L27681k52507r30621
467A497486p86311P71880K484179K050523o61761k842644k454847r44668m96619
458a382782n12719O26870J894345R81471j427891k195139n40594R74527P95403
449g86509M80213J305609J735620J74069j999986k369600j010658O2466R4928
$$ plain form
440 -2313848 -2149264 -1284562 -10754 561239 -11157 -846777 -728097 560848 2023178
431 2023178 2488127 1735792 515857 -405641 -895253 -1137868 -1141147 -865968 -553785 -521495
421 -521495 -688023 -546978 377918 2065458 3836397 4678550 4021753 2301431 582986
412 582986 -378676 -570063 -444971 -594485 -1449560 -2747537 -3448290 -2840298 -1641370 -1270172
402 -1270172 -2077515 -3126310 -3689665 -3917943 -3842145 -2907424 -1073849 597803 1187699
393 1187699 1015994 848332 695212 93819 -1017130 -2381669 -3821110 -4870567 -4615152
384 -4615152 -2770008 -636747 -166889 -1987341 -4656118 -5821818 -4178345 -731335 1914172
375 1914172 2176326 1287655 1524808 2887255 3178754 1644157 435067 1325506 2878237
$$ packed form
440b313848J64584Q64702J273808N71993n72396q35620J18680J288945J462330
431B023178M64949p52335j219935r21498m89612k42615l279K75179L12183L2290
421e21495j66528J41045R24896J687540J770939Q42153o56797j720322j718445
412E82986r61662j91387J25092j49514q55075j297977p00753O07992J198928L71198
402a270172q07343j048795n63355k28278P5798R34721J833575J671652N89896
393A187699j71705j67662j53120o01393j110949j364539j439441j049457K55415
384d615152J845144K133261M69858j820452k668777j165700J643473L447010K645507
375A914172K62154q88671K37153J362447K91499j534597j209090Q90439J552731
$$ plain form
366 2878237 2680123 979101 -45315 253502 512424 -26504 -594654 -659256 -701741 -912261
356 -912261 -701082 81239 744693 914912 960179 1071283 965674 540306 -204080 -1602732
346 -1602732 -3365191 -3639068 -985018 2770481 3882019 1360978 -1803585 -2759416 -1886271
337 -1886271 -759973 541592 2243152 2956551 1382209 -1172671 -2235274 -1455674 -429009
328 -429009 155003 985212 1991052 1965471 627204 -774741 -1328735 -1350625 -1075687 -137531
318 -137531 1101856 1368438 463055 -65890 733655 1582645 975922 -364672 -659673 96561
308 96561 286580 -627024 -1357676 -993371 -343884 -444039 -954785 -938750 -381872 -11688
298 -11688 -104339 -294501 -258400 79849 701387 1208528 771758 -830356 -2404436 -2533931
$$ packed form
366B878237j98114j701022j024416K98817K58922n38928n68150o4602m2485k10520
356i12261K11179P82321O63454J70219M5267J11104j05609m25368p44386j398652
346a602732j762459k73877K654050L755499J111538k521041l164563r55831Q73145
337a886271J126298J301565J701560P13399j574342k554880j062603P79600J026665
328d29009N84012Q30209J005840k5581j338267j401945n53994k1890K74938R38156
318a37531J239387K66582r05383n28945P99545Q48990o06723j340594k95001P56234
308I6561J90019r13604p30652L64305O49487j00155n10746J6035N56878L70184
298a1688r2651j90162L6101L38249O21538N07141m36770j602114j574080j29495
$$ plain form
288 -2533931 -1485781 -900876 -1490003 -2154962 -1780646 -771569 -51592 516527 1618490
279 1618490 2933809 3279553 2239992 713436 -271781 -559043 -536115 -426052 -177044
270 -177044 265420 736228 798361 73584 -1183081 -2143947 -2318827 -1989423 -1413439 -287686
260 -287686 1300523 2096678 999193 -1166615 -2373906 -1814384 -522633 330492 589347
251 589347 516243 274904 236178 681341 1015208 441879 -452173 -216060 1073032 1563951
241 1563951 377613 -1090522 -1499533 -1442150 -1716103 -1443287 239386 1918069 1497307
232 1497307 -659315 -2252798 -2301336 -1880949 -1827405 -1716394 -1289259 -1081617 -1252740 -1269566
222 -1269566 -1037489 -957837 -707600 512792 2284651 3130565 2731439 2361600 2669159 2771653
$$ packed form
288b533931J048150N84905n89127o64959L74316J009077P19977N68119J101963
279A618490J315319L45744j039561j526556r85217k87262K2928J10063K49008
270a77044M42464M70808O2133p24777j256665r60866j74880L29404N75984J125753
260b87686J588209P96155j097485k165808j207291N59522J291751Q53125K58855
251E89347p3104k41339l8726M45163L33867n73329q94052K36113J289092M90919
241A563951j186338j468135m09011N7383k73953K72816J682673J678683m20762
232A497307k156622j593483m8538M20387N3544J11011M27135K07642j71123j6826
222a269566K32077P9652K50237J220392J771859Q45914l99126l69839L07559J02494
$$ plain form
212 2771653 2227404 2071750 2857176 3356866 2511498 1178710 527711 81246 -1014557
203 -1014557 -2001757 -1679546 -656926 -451055 -929399 -670238 437230 990503 481406
194 481406 -31121 86269 197626 17051 366543 1603497 2750784 2989586 2755174 2588869
184 2588869 2184979 1483877 1444904 2541628 3512809 2944698 1342123 270578 41353
175 41353 -257664 -759469 -461650 978580 2481942 3020343 2800632 2520170 2355942 2214807
165 2214807 2181011 2092466 1342621 -171928 -1391789 -1176216 181847 1241495 1152481 459541
155 459541 83510 91705 -157717 -898707 -1369136 -510501 1717952 3879008 4253402 2606039
145 2606039 397009 -981541 -1672817 -2548238 -3456338 -3296237 -1804956 -173922 524964
$$ packed form
212B771653n44249j55654P85426M99690q45368j332788o50999m46465j095803
203a014557r87200L22211J022620K05871m78344K59161J107468N53273n09097
194D81406n12527J17390J11357j80575L49492J236954J147287K38802k34412j66305
184B588869m03890p01102l8973J096724R71181n68111j602575j071545k29225
175D1353k99017n01805K97819J440230J503362N38401k19711k80462j64228j41135
165B214807l3796q8545p49845j514549j219861K15573J358063J059648q9014o92940
155D59541l76031Q195k49422p40990m70429Q58635K228453K161056L74394j647363
145B606039k209030j378550o91276q75421r08100J60101J491281J631034O98886
$$ plain form
136 524964 586086 714337 729124 243741 -1421 1151754 3327735 4669026 4101987 2436010
126 2436010 838254 -562879 -1789494 -1893770 -86585 2543181 3866146 3280450 2243392
117 2243392 2009585 1996315 1037377 -610328 -1494728 -928274 133951 300887 -720132
108 -720132 -2051961 -2763697 -2679274 -2165562 -1554094 -1026960 -803105 -962007 -1082177 -557648
98 -557648 512148 1181521 741182 -394511 -1233233 -1324313 -986881 -805428 -1330905 -2820879
88 -2820879 -4637769 -5314709 -4043760 -1852409 -453663 -162411 50180 621902 818798
79 818798 257074 -321843 -306480 -78570 23705 498905 1610501 2513609 2438176 1918327
69 1918327 1792058 1723912 933546 -157619 -310260 768472 2188442 3170718 3482697 2871243
$$ packed form
136E24964O1122J28251J4787m85383k45162J153175K175981J341291n67039j665977
126B436010j597756j401133j226615j04276J807185K629766J322965n85696j037058
117B243392k33807j3270r58938j647705q84400N66454J062225J66936j021019
108g20132j331829p11736Q4423N13712O11468N27134K23855j58902j20170N24529
98e57648J069796O69373m40339j135693q38722r1080L37432J81453n25477j489974
88b820879j816890o76940J270949K191351J398746K91252K12591N71722J96896
79H18798n61724n78917J5363K27910J02275M75200J111596R03108p5433n19849
69A918327j26269o8146p90366j091165j52641J078732J419970R82276L11979o11454
$$ plain form
59 2871243 1335017 -139594 -402955 252031 542224 292344 671654 2052270 3098784
50 3098784 2642940 1234194 63868 -574147 -924191 -873703 -391018 -70888 -268491 -337517
40 -337517 332521 1148852 1205128 792312 882259 1458287 1544569 769297 -232301 -1003233
30 -1003233 -1752980 -2421902 -2265774 -912250 786944 1474416 572616 -1350881 -3123674
21 -3123674 -3683816 -2687025 -780481 851546 1421188 1033620 353460 -36559 -16055 106016
11 106016 9315 -178624 -30936 469671 750167 464411 76859 174577 575893 708559
1 708559 554947
0 554947
$$ packed form
59B871243j536226j474611k63361O54986K90193k49880L79310J380616J046514
50C098784m55844j408746j170326o38015l50044N0488M82685L20130j97603o9026
40c37517O70038Q16331N6276m12816Q9947N76028Q6282p75272j001598p70932
30a003233p49747o68922J56128J353524J699194O87472r01800j923497j772793
21c123674n60142R96791J906544J632027N69642l87568o80160l90019K0504J22071
11A06016r6701j87939J47688N00607K80496k85756l87552R7718M01316J32666
1G08559j53612
0E54947
##END NTUPLES=NMR SPECTRUM
##END=
