##TITLE=31Pdec_LR-683A2-C1
 CDCl3, 24 sc
 23.7.2019
##JCAMPDX= 6.0         $$ Bruker NMR JCAMP-DX V2.0
##DATA TYPE= NMR SPECTRUM
##DATA CLASS= NTUPLES
##ORIGIN= UXNMR, Bruker Analytische Messtechnik GmbH
##OWNER= root
$$ XWIN-NMR		Version 3.5
$$ Tue Jul 23 14:18:33 2019 Russian Standard Time (UT+4h)  she@DPX200
##.OBSERVE FREQUENCY= 81.013821
##.OBSERVE NUCLEUS= ^31P
##.ACQUISITION MODE= SIMULTANEOUS
##.ACQUISITION SCHEME= undefined
##.AVERAGES= 24
##.DIGITISER RES= 17
##SPECTROMETER/DATA SYSTEM= spect
##.PULSE SEQUENCE= zgpg30
##.SOLVENT NAME= CDCl3
##.SHIFT REFERENCE= (INTERNAL, CDCl3, 0, 182.463)
##AUDIT TRAIL= $$ (NUMBER, WHEN, WHO, WHERE, WHAT)
$$ ##TITLE= Audit trail, XWIN-NMR		Version 3.5
$$ ##JCAMPDX= 5.01
$$ ##ORIGIN= Bruker BioSpin GmbH
$$ ##OWNER= she
$$ F:/spectra/data/she/nmr/P31/1/pdata/1/auditp.txt
$$ ##AUDIT TRAIL=  $$ (NUMBER, WHEN, WHO, WHERE, WHAT)
(   1,<2019-07-23 14:17:28.71 +0400>,<she>,<DPX200>,
      <created by zg, POWCHK disabled, PULCHK disabled
       configuration hash MD5:
       00 E9 B6 7A A2 85 ED C7 34 08 36 98 17 FE 4E 26
       data hash MD5: 32K
       60 AB 32 62 4D 7E CC BE 9C 41 55 5D AE F5 47 EC>)
(   2,<2019-07-23 14:17:32.12 +0400>,<she>,<DPX200>,
      <Start of raw data processing
       efp BC_mod = 2 LB = 1 FT_mod = 6 PKNL = 1 PHC0 = -2540.66 PHC1 = 81.79923 SI = 64K 
       data hash MD5: 64K
       88 01 DA 22 70 79 49 2B 23 58 28 37 6A 88 F7 13>)
(   3,<2019-07-23 14:17:57.21 +0400>,<she>,<DPX200>,
      <pk PHC0 = -20.77929 PHC1 = 66.8 
       data hash MD5: 64K
       33 3C 64 37 D8 1A EF BB DE 7B 81 FB 75 4D 6A C9>)
(   4,<2019-07-23 14:18:00.28 +0400>,<she>,<DPX200>,
      <abs ABSG = 5 
       data hash MD5: 64K
       98 B5 6C 23 41 03 7F 77 A0 F1 EC 83 A5 24 8C 5E>)
$$ ##END=
$$ 
$$ hash MD5
$$ 29 B2 A1 C3 98 6D E5 BB 3A E8 98 BE ED 2B C4 5B
##$RELAX= 
##$RELAX= 
##$RELAX= 
##$RELAX= 
##$RELAX= 
##$RELAX= 
##$RELAX= 
##$RELAX= 
$$ Bruker specific parameters
$$ --------------------------
##$DU= <F:/spectra>
##$EXPNO= 1
##$NAME= <P31>
##$PROCNO= 1
##$TYPE= <nmr>
##$USER= <she>
##$AMP= (0..31)
100 100 100 100 100 100 100 100 100 100 100 100 100 100 100 100 100 100 
100 100 100 100 100 100 100 100 100 100 100 100 100 100 
##$AQSEQ= 0
##$AQ_mod= 1
##$AUNM= <au_zg>
##$AUTOPOS= <>
##$BF1= 81.014009
##$BF2= 200.13
##$BF3= 200.13
##$BF4= 200.13
##$BF5= 200.13
##$BF6= 200.13
##$BF7= 200.13
##$BF8= 200.13
##$BYTORDA= 1
##$CFDGTYP= 0
##$CFRGTYP= 5
##$CHEMSTR= <none>
##$CNST= (0..31)
1 1 145 1 1 1 1 1 1 1 1 1 1 1 1 1 1 1 1 1 1 1 1 1 1 1 1 1 1 1 1 1 
##$CPDPRG= <waltz16>
##$CPDPRG1= <>
##$CPDPRG2= <waltz16>
##$CPDPRG3= <>
##$CPDPRG4= <mlev>
##$CPDPRG5= <mlev>
##$CPDPRG6= <mlev>
##$CPDPRG7= <mlev>
##$CPDPRG8= <mlev>
##$CPDPRGB= <>
##$CPDPRGT= <>
##$D= (0..31)
0 1 0 0 0 0 0 0 0 0 0 0.03 2e-05 3e-06 0 0 0 0 0 0 0 0 0 0 0 0 0 0 0 0 
0 0 
##$DATE= 1563877048
##$DBL= (0..7)
120 120 120 11 120 120 24 19 
##$DBP= (0..7)
150 150 150 150 150 150 150 150 
##$DBP07= 0
##$DBPNAM0= <>
##$DBPNAM1= <>
##$DBPNAM2= <>
$$ [...]
##$SUBNAM3= <"">
##$SUBNAM4= <"">
##$SUBNAM5= <"">
##$SUBNAM6= <"">
##$SUBNAM7= <"">
##$SUBNAM8= <"">
##$SUBNAM9= <"">
##$SW= 369.568048894756
##$SWIBOX= (0..15)
0 1 3 0 0 0 0 0 0 0 0 0 0 0 0 0 
##$SW_h= 29940.119760479
##$TD= 32768
##$TD0= 1
##$TE= 0
##$TE2= 300
##$TE3= 300
##$TEG= 300
##$TL= (0..7)
0 120 53 12 22 120 120 120 
##$TP= (0..7)
150 150 150 150 150 150 150 150 
##$TP07= 0
##$TPNAME0= <>
##$TPNAME1= <>
##$TPNAME2= <>
##$TPNAME3= <>
##$TPNAME4= <>
##$TPNAME5= <>
##$TPNAME6= <>
##$TPNAME7= <>
##$TPOAL= (0..7)
0.5 0.5 0.5 0.5 0.5 0.5 0.5 0.5 
##$TPOFFS= (0..7)
0 0 0 0 0 0 0 0 
##$TUNHIN= 0
##$TUNHOUT= 0
##$TUNXOUT= 0
##$USERA1= <user>
##$USERA2= <user>
##$USERA3= <user>
##$USERA4= <user>
##$USERA5= <user>
##$V9= 5
##$VALIST= <valist>
##$VCLIST= <CCCCCCCCCCCCCCC>
##$VD= 0
##$VDLIST= <DDDDDDDDDDDDDDD>
##$VPLIST= <PPPPPPPPPPPPPPP>
##$VTLIST= <TTTTTTTTTTTTTTT>
##$WBST= 1024
##$WBSW= 4
##$XGAIN= (0..3)
0 0 0 0 
##$XL= 0
##$YL= 0
##$YMAX_a= 15642
##$YMIN_a= -10029
##$ZGOPTNS= <>
##$ZL1= 120
##$ZL2= 120
##$ZL3= 120
##$ZL4= 120
##$ABSF1= 182.463
##$ABSF2= -187.1042
##$ABSG= 5
##$ABSL= 3
##$ALPHA= 0
##$AQORDER= 0
##$ASSFAC= 0
##$ASSFACI= 0
##$ASSFACX= 0
##$ASSWID= 0
##$AUNMP= <proc_1d>
##$AZFE= 0.1
##$AZFW= 0.5
##$BCFW= 0
##$BC_mod= 2
##$BYTORDP= 0
##$COROFFS= 0
##$CY= -3
##$DATMOD= 1
##$DC= 0
##$DFILT= <>
##$DTYPP= 0
##$F1P= 0
##$F2P= 0
##$FCOR= 1
##$FTSIZE= 65536
##$FT_mod= 6
##$GAMMA= 0
##$GB= 0
##$INTBC= 1
##$INTSCL= 5.30512e-09
##$ISEN= 30
##$LB= 1
##$LEV0= 0
##$LPBIN= 0
##$MAXI= 10000
##$MC2= 0
##$MEAN= 0
##$ME_mod= 0
##$MI= 50
##$NCOEF= 0
##$NC_proc= -6
##$NLEV= 6
##$NOISF1= 182.463
##$NOISF2= 159.3651
##$NSP= 0
##$NTH_PI= 0
##$NZP= 0
##$OFFSET= 182.463
##$PC= 4
##$PHC0= -2561.439
##$PHC1= 148.5992
##$PH_mod= 1
##$PKNL= yes
##$PPARMOD= 0
##$PSCAL= 0
##$PSIGN= 0
##$REVERSE= no
##$SF= 81.0140089999434
##$SI= 65536
##$SIGF1= 159.3651
##$SIGF2= -187.1042
##$SINO= 113.3802
##$SIOLD= 16384
##$SREGLST= <1H.CDCl3>
##$SSB= 0
##$STSI= 65536
##$STSR= 0
##$SW_p= 29940.119760479
##$SYMM= 0
##$S_DEV= 0
##$TDeff= 32768
##$TDoff= 0
##$TI= <>
##$TILT= no
##$TM1= 0
##$TM2= 0
##$TOPLEV= 0
##$USERP1= <user>
##$USERP2= <user>
##$USERP3= <user>
##$USERP4= <user>
##$USERP5= <user>
##$WDW= 1
##$XDIM= 65536
##$YMAX_p= 523382042
##$YMIN_p= -59003084
$$ End of Bruker specific parameters
$$ ---------------------------------
##NTUPLES= NMR SPECTRUM
##VAR_NAME=  FREQUENCY,     SPECTRUM/REAL,   SPECTRUM/IMAG
##SYMBOL=    X,             R,               I
##VAR_TYPE=  INDEPENDENT,   DEPENDENT,       DEPENDENT
##VAR_FORM=  AFFN,          ASDF,            ASDF
##VAR_DIM=   65536,         65536,           65536
##UNITS=     HZ,            ARBITRARY UNITS, ARBITRARY UNITS
##FACTOR=    0.456856943014862, 1,           1
##FIRST=     14782.0589164792, 0,            0
##LAST=      -15158.0608439998, 0,           0
##MIN=       -15158.0608439998, -59003084,   0
##MAX=       14782.0589164792, 523382042,    0
$$ Real data points
##PAGE= N=1
##DATA TABLE= (X++(R..R)), XYDATA
$$ [...]
45755d05401j232014j62649K243140K356069k72730k330188j764356l58821k48208
$$ -405401 -1637415 -1800064 443076 2799145 2526415 196227 -1568129 -1926950 -2175158
45746b175158n43811N12471J890099J084601j497616k405483n6242K724011K631534
$$ -2175158 -2718969 -2206498 -316399 768202 -729414 -3134897 -3191139 -467128 2164406
45737B164406M53334n41401L78280P93572n36361j620547n91011J210895J300377
$$ 2164406 2617740 2076339 2454619 3248191 2711830 1091283 500272 1711167 3011544
45728C011544l08756j498667j209411l08540K48207L66957R3351m79382o12952
$$ 3011544 2702788 1204121 -5290 -313830 -65623 301334 394685 -84697 -697649
45719f97649L01903J355705R73617p05197j778280j204631l0710M48732L18468
$$ -697649 -395746 959959 1933576 1228379 -549901 -1754532 -1785242 -1336510 -1018042
45710a018042J82729L5831j38792J78289R81553J128709r3345j568645j674575
$$ -1018042 -835313 -799482 -938274 -759985 221568 1350277 1256932 -311713 -1986288
45701a986288m40934P20759R85518O82779K53294j32838m2806Q72667J827977
$$ -1986288 -2427222 -1706463 -720945 -38166 215128 82290 39484 912151 2740128
45692B740128J367067o53757k470432k405327p81810P49666J172531O51390l27416
$$ 2740128 4107195 3453438 983006 -1422321 -2204131 -1454465 -281934 369456 42040
45683D2040j287767j393915J8863K133054K898767J384957q29790j552896p19536
$$ 42040 -1245727 -2639642 -2620779 -487725 2411042 3795999 2966209 1413313 693777
45674F93777q0200m90349r95867p61179l40010l58655l14422L03903Q23768N08768
$$ 693777 613577 123228 -872639 -1633818 -1973828 -2332483 -2646905 -2343002 -1519234 -1010466
45664a010466l2319J63160P66805Q55033N65373N77509N57022k00936j053706
$$ -1010466 -1042785 -879625 -112820 742213 1307586 1885095 2442117 2241181 1187475
45655A187475q20161l641j11492q47842l82314J261794J718135J08495j245308
$$ 1187475 367314 363673 252181 -595661 -977975 283819 2001954 2110449 865141
45646H65141n04377O91330J04045j193167n82046J596030K336669N57090j386016
$$ 865141 360764 1052094 1156139 -37028 -619074 976956 3313625 3870715 2484699
45637B484699j261711K01308R52109M12098m65831q60563p50817m17421j7124
$$ 2484699 1222988 1424296 2376405 2788503 2322672 1462109 711292 293871 276747
45628B76747M39211Q78068Q89447J2887j324771j749102o24927P20852N72002
$$ 276747 715958 1594026 2483473 2496360 1171589 -577513 -1202440 -481588 90414
45619I0414p28279j221381j51133J075593J023737M0421o01971l64786L29936
$$ 90414 -637865 -1859246 -2010379 -934786 88951 129372 -472599 -837385 -507449
45610e07449P76106M48816n44222j215050o43950O46015J165714N19720r6018
$$ -507449 268657 717473 173251 -1041799 -1685749 -1039734 125980 645700 549682
45601E49682J68979N95252K65221n07845j013520j328688j575726j009586P27416
$$ 549682 718661 1313913 1579134 1071289 57769 -1270919 -2846645 -3856231 -3128815
45592c128815K185057J646655k02857r26666K01289J142704J46923j708914k167868
$$ -3128815 -943758 702897 500040 -426626 -225337 917367 1064290 -644624 -2812492
45583b812492q67045O23141J189432J117995Q41029K48500m40808m36562L18363
$$ -2812492 -3679537 -3056396 -1866964 -748969 92060 340560 -100248 -536810 -218447
45574b18447O34052k63921j387594j357119m64583p6774l80589k75349M78947
$$ -218447 415605 151684 -1235910 -2593029 -3057612 -3134386 -3514975 -3790324 -3311377
45565c311377O98362j09576o55232J24377J275133J294071L63035k76964l67621
$$ -3311377 -2613015 -2722591 -3377823 -3253446 -1978313 -684242 -321207 -598171 -965792
45556i65792n08538n83789R486Q69265J016997O82082R02840J343614N07676j461003
$$ -965792 -1474330 -2058119 -2048633 -1179368 -162371 519711 1422551 2766165 3273841 1812838
45546A812838k284501q38938R27208P62191p10949j270450m48235K84139J21783
$$ 1812838 -471663 -1310601 -383393 378798 -332151 -1602601 -2050836 -1766697 -1644914
45537a644914j42367K22224Q32457J100410J074901J015747Q85591N20372j86790
$$ -1644914 -1787281 -1565057 -732600 367810 1442711 2458458 3344049 3864421 3677631
45528C677631j256772k299650k456233j340364J54434P38225K92991j74397j0305
$$ 3677631 2420859 121209 -2335024 -3675388 -3520954 -2782729 -2489738 -2664135 -2674440
45519b674440M62082P28159O41086J62336o25133j144063p77226J55955O93942
$$ -2674440 -2212358 -1484199 -843113 -680777 -1305910 -2449973 -3227199 -3071244 -2377302
45510b377302O90157J046778K074842K550469J228373j228730k744850k184927
$$ -2377302 -1687145 -640367 1434475 3984944 5213317 3984587 1239737 -945190
45502i45190n25014M75624K52463l03500l27946r7068l15044p62847n02488N72438
$$ -945190 -1470204 -994580 -742117 -1045617 -1373563 -1470631 -1785675 -2548522 -3051010 -2478572
45492b478572J383057J264348Q99657R10535N85299p20049j811569j110684N06407
$$ -2478572 -1095515 168833 1068490 1979025 2564324 1844275 32706 -1077978 -571571
45483e71571M63613j619537k926445j317102J620458K852240J868315O38827M66768
$$ -571571 -107958 -1727495 -4653940 -5971042 -4350584 -1498344 369971 1008798 1475566
45474A475566P52571O39458K02387k24012o55674j038070j041992n27877L10756
$$ 1475566 2228137 2867595 3069982 2845970 2190296 1152226 110234 -417643 -106887
45465a06887J184740J568356P49144j105641k355962j558737M64527J530310J000282
$$ -106887 1077853 2646209 3395353 2289712 -66250 -1624987 -1160460 369850 1370132
45456A370132L11040M46894N85791r2701q78861q86747n87323o92421o27746L74771
$$ 1370132 1681172 2128066 2713857 2621156 1742295 855548 268225 -424196 -1051942 -677171
45446f77171J504404J343053Q7161q44039j059449j310735j541328q04311O04821
$$ -677171 827233 2170286 2257447 1413408 353959 -956776 -2498104 -3302415 -2697594
45437b697594R51046k39160j101330j78075J357225J651247J001830R77560J620329
$$ -2697594 -1746548 -1985708 -3087038 -3265113 -1907888 -256641 745189 1722749 3343078
45428C343078J467126L045j670148k516244k349776j069568J154227K832199K197121
$$ 3343078 4810204 4813249 3143101 626857 -1722919 -2792487 -1638260 1193939 3391060
45419C391060j65161j515826o34755M26114n25903k506620k871658j087450R11481
$$ 3391060 3225899 1710073 1075318 1501432 975529 -1531091 -4402749 -5490199 -4578718
45410d578718J612796J341879R20609O23749O89802J393285K168897J858774L26198
$$ -4578718 -2965922 -1624043 -703434 -79685 610117 2003402 4172299 6031073 6357271
45401F357271j155032j566119j301791j231829j466404j553384j180589k69711
$$ 6357271 5202239 3636120 2334329 1102500 -363904 -1917288 -3097877 -3367588
45393c367588R19407J496840O78006q08814j160608J7400Q68087p3671j543712
$$ -3367588 -2448181 -951341 -273335 -1082149 -2242757 -2225357 -1357270 -1430941 -2974653
45384b974653j318069M98173J732715J370159O26908O13215P54425K77647k72721
$$ -2974653 -4292722 -3794549 -2061834 -691675 -64767 548448 1302873 1580520 1307799
45375A307799j55289L2933o78394j717969j448382M66330K337396K441937R72423
$$ 1307799 1152510 1185443 507049 -1210920 -2659302 -2192972 144424 2586361 3558784
45366C558784m33291o37104j3029L16676j30872p40692o82942j4474M40106K63112
$$ 3558784 3125493 2488389 2475360 2792036 2661164 1920472 1237530 1223056 1663162 1926274
45356A926274p3975j66924m33417j208919j640224o36342J168703J738560L73166
$$ 1926274 1852299 1685375 1251958 43039 -1597185 -2233527 -1064824 673736 1046902
45347A046902j115003q62942M51340Q19841J2521k85050O06918J197004L14985
$$ 1046902 -68101 -931043 -479703 340138 352659 67609 674527 1871531 2186516
45338B186516q22832l83584J239126J933912Q47808o69628j194996r56208r38240
$$ 2186516 1363684 980100 2219226 4153138 5000946 4331318 3136322 2180114 1241874
45329A241874j296054j423351j044862m92408n0367M28757J135686J753689J567113
$$ 1241874 -54180 -1477531 -2522393 -3014801 -3065168 -2636411 -1500725 252964 1820077
45320A820077L75252q12957o43269P43389J537080O14436p93480r55133l54004
$$ 1820077 2195329 1382372 739103 1482492 3019572 3634008 2840528 1885395 1531391
45311A531391p48437j907605j635697N27665K080643J242725l48961m28329L45652
$$ 1531391 782954 -1124651 -2760348 -2232683 -152040 1090685 741724 313395 659047
45302F59047L0687q57371k29003J568872J797461l24930k231993j889710n09769
$$ 659047 689734 -167637 -396640 1172232 2969693 2644763 412770 -1476940 -1986709
45293a986709j7769m5697O82882J643591J376238J41883l66865L56772J053336
$$ -1986709 -2004478 -2050175 -1367293 276298 1652536 1794419 1427554 1784326 2837662
45284B837662P05244l06196j164108j543881j369383o22224L07600P79192O51851
$$ 2837662 3542906 3236710 2072602 528721 -840662 -1462886 -1155286 -376094 275757
45275B75757M11466M81656Q09440J075075R41939K86614m32208l76955N62059
$$ 275757 687223 1168879 1978319 3053394 3995333 4281947 3849739 3472784 4034843
45266D034843J247775O08744q04756j401990n81692O35713J038794N26482j94972
$$ 4034843 5282618 5891362 5086606 3684616 3102924 3738637 4777431 5303913 5108941
45257E108941n86739o53114o86681q48448r35155o92264m07515p13021j517202
$$ 5108941 4522202 3869088 3182407 2333959 1398804 706540 299025 -413996 -1931198
45248a931198j780258r08319K97602Q46774J000472J449397J722342Q99452m17430
$$ -1931198 -3711456 -4619775 -4322173 -3475399 -2474927 -1025530 696812 1596264 1178834
45239A178834n87490M59712Q57940l05193j340506l69019J753115K392195N92131
$$ 1178834 591344 1051056 1908996 1603803 263297 -105722 1647393 4039588 4631719
45230D631719j744018k259760q41081N36117K95341r41860j322146k41916R38259
$$ 4631719 2887701 627941 -213140 322977 618318 -323542 -1645688 -1887604 -949345
45221i49345R44388L46246L15596N10294k40085j555722j702639l34831Q14694
$$ -949345 -4957 341289 656885 1167179 927094 -628628 -2331267 -2666098 -1851404
45212a851404N61044j41106q3206L42218L06496J35226L84929N02600j55743r18857
$$ -1851404 -1290360 -1431466 -1514672 -1172454 -865958 -730732 -345803 156797 1054 -917803
45202i17803q48695l61395l41380m15814K79982J221256J112234P7994m49254
$$ -917803 -1766498 -2127893 -2469273 -2885087 -2605105 -1383849 -271615 -193621 -642875
45193f42875K9956N19088L08932q9319n7205K39987L62423J60015k40765l72437
$$ -642875 -612919 -93831 215101 125782 68577 308564 670987 831002 590237 217800
45183B17800L03960J315163J116401p02540k068579j041620R88234J030082r18092
$$ 217800 521760 1836923 2953324 2250784 182205 -859415 128819 1158901 240809
45174B40809j730328L4949J968672J565497l02295j255465p80565O6331P73348
$$ 240809 -1489519 -1454570 514102 2079599 1777304 521839 -258726 -192395 580953
45165E80953J309700J121184J6579q30869m41238K42288j65738j122005j114799
$$ 580953 1890653 3011837 3028416 2197547 1756309 1998597 1832859 710854 -403945
45156d03945l27744k74606j061673j138762O1073J203769J264848R04704Q83754
$$ -403945 -731689 -1006295 -2067968 -3206730 -3145657 -1941888 -677040 227664 1111418
45147A111418O41504m62941j607164j457495j14962R89660R75630M16999K81495
$$ 1111418 1752922 1289981 -317183 -1774678 -1889640 -899980 75650 492649 774144
45138G74144O15174O47934n2624r86242j415228j282645r88969n05597M95765
$$ 774144 1389318 2037252 1984628 998386 -416842 -1699487 -2688456 -3194053 -2698288
45129b698288J566685J533626J51373j161964j021893J66366R83102Q78120L09807
$$ -2698288 -1131603 402023 553396 -608568 -1630461 -1464095 -480993 397127 706934
45120G06934l85002j073178j227602n69880l1906o39743j550937q40774J495866
$$ 706934 321932 -751246 -1978848 -2548728 -2580634 -3220377 -4771314 -5612088 -4116222
45111d116222L016779K051127k991o96615K33292R53147K49352j161998j919419
$$ -4116222 -1099443 951684 948693 252078 485370 1438517 1687869 525871 -1393548
45102a393548j540322m78361O02192J263382J352660R40217K33638m48737p24739
$$ -1393548 -2933870 -3412231 -2810039 -1546657 -193997 746220 979858 531121 -193618
45093a93618m17958J90110O27417P72114Q37897Q26188M10230m87240j340377
$$ -193618 -611576 -421466 205951 978065 1815962 2642150 3052380 2565140 1224763
45084A224763j459985o64326M86593J010221L16465r62132j312348r4357J398617
$$ 1224763 -235222 -899548 -412955 597266 913731 -48401 -1360749 -1455106 -56489
45075e6489J465256K93576l96472O8258N10114J8476o49291o30453n12340j003608
$$ -56489 1408767 1702343 1305871 1374129 1884243 1902719 1253428 622975 110635 -892973
45065h92973j176388J98676K161689K404348O47353p63426k54392P40800J48151
$$ -892973 -2069361 -1870685 291004 2695352 3342705 2579279 2324887 3065687 3213838
45056C213838j484856j815079k18364J323029J025861m90185j425217j118043
$$ 3213838 1728982 -86097 -304461 1018568 2044429 1554244 129027 -989016
45048i89016k99026K13889J44030m36412j018891p19776O49638J845332J534124
$$ -989016 -1288042 -1074153 -930123 -1366535 -2385426 -3105202 -2455564 -610232 923892
45039I23892J77553n94125l88581l76510j007098j109004n0506Q31514K42255
$$ 923892 1101445 507320 118739 -257771 -1264869 -2373873 -2424379 -1592865 -1350610
45030a350610r52615j163279n60097l50110m07553L05604J378949J247063p6869
$$ -1350610 -2303225 -3466504 -4026601 -4376711 -4784264 -4478660 -3099711 -1852648 -1929517
45021a929517p34459J8451O32989o8397q87534k18544J347400J893360Q83712
$$ -1929517 -2663976 -2645525 -2012536 -2080933 -2968467 -3187011 -1839611 53749 937461
45012I37461l49738m95479L74093J213150J134787J63947q99166j444739j646295
$$ 937461 587723 92244 466337 1679487 2814274 2978221 2079055 634316 -1011979
45003a011979j681473r88183O21282J698292P50004j091765j120919R03927K101113
$$ -1011979 -2693452 -3681635 -3060353 -1362061 -612057 -1703822 -2824741 -1920814 180299
44994A80299P34104j204393j159835L23708J036896N07090j71900n95937r41220
$$ 180299 914403 -289990 -1449825 -1126117 -89221 417869 245969 -349968 -1291188
44985a291188o37628O58129J620409R60739k18554m2743R22067O15349q78847
$$ -1291188 -1928816 -1270687 349722 1310461 1091907 1049164 1971231 2586580 1707733
44976A707733j428296m83810K32789m2889l7017P37179Q37174l11978j012957
$$ 1707733 279437 -204373 28416 -14473 -51490 685689 1522863 1210885 197928
44967A97928j58054P22716J2418j238736j033352M75184J503995J282029M36530
$$ 197928 39874 762590 775008 -463728 -1497080 -1021896 482099 1764128 2200658
44958B200658n20298j484446k015687j636882n62934P27714K005427K643444J604712
$$ 2200658 1680360 195914 -1819773 -3456655 -4019589 -3291875 -1286448 1356996 2961708
44949B961708p52189k036938o21562J812286K319390O53662p68779n39822K15962
$$ 2961708 2209519 172581 -448981 1363305 3682695 4336357 3567578 3027756 3243718
44940C243718J55319m49402q27263j003845j110023p03808K54794P64868J18456
$$ 3243718 3399037 2949635 2122372 1118527 8504 -695304 -440510 324358 442814
44931D42814q61181q66286J29934J009778J011004L02478n93761j166473r83947
$$ 442814 -418367 -1284653 -1154719 -144941 866063 1168541 574780 -591693 -1575640
44922a575640k24897Q7025o76274j404211l60172K106837L321155J629726j126640
$$ -1575640 -1800537 -1713512 -2389786 -3793997 -4154169 -2047332 1273823 2903549 1776909
44913A776909j868163l09554R90160M49767o47929o80130j79028m31508j007574
$$ 1776909 -91254 -400808 589352 1039119 391190 -288940 -467968 -899476 -1907050
44904a907050n56210O62505J022533J93139k98133M64178J318430P55784r87963
$$ -1907050 -2463260 -1800755 -778222 -585083 -883216 -419038 899392 1655176 667213
44895F67213k321839k073389l78362J550092K196244R94512q54907j497425n76562
$$ 667213 -1654626 -3728015 -4106377 -2556285 -360041 634471 -220436 -1717861 -2294423
44886b294423N11987P04641N64067J007725J754456J820913R00870m56856j559334
$$ -2294423 -1782436 -1077795 -513728 493997 2248453 4069366 4970236 4513380 2954046
44877B954046j922045j402552m70208P1665l9389l59216n48379o58917m98529
$$ 2954046 1032001 -370551 -840759 -769094 -808483 -1167699 -1716078 -2374995 -2873524
44868b873524L59172J594836K089966J304646p6985j191123j781325j673338o00581
$$ -2873524 -2514352 -919516 1170450 2475096 2398111 1206988 -574337 -2247675 -2848256
44859b848256R56087J843279J675993J159656O31698l32559j381400j176118L64627
$$ -2848256 -1892169 -48890 1627103 2786759 3418457 3085898 1704498 528380 893007
44850H93007J324688N30792o03251m38914L03226J42995m37544o1823Q27878O79600
$$ 893007 2217695 2748487 2145236 1706322 2009548 2152543 1714999 1653176 2481054 3160654
44840C160654l93167q54265m31302l59703j019832j362676q14121M664N65396
$$ 3160654 2767487 1913222 1481920 1122217 102385 -1260291 -2074412 -2069748 -1504352
44831a504352Q75375O66143k94496j159776q47865J74082M96784o6550n59097
$$ -1504352 -628977 37166 -257330 -1417106 -2264971 -2090889 -1594105 -1660655 -2219752
44822b219752p55832j046316p96562Q83322K789209K538639K11629j363479o34279
$$ -2219752 -2975584 -4021900 -4818462 -3935140 -1145931 1392708 1604337 240858 -393421
44813c93421P12271P24077j44927n83079o40359r05707j015458m41282L78656
$$ -393421 318850 1042927 898000 314921 -325438 -1231145 -2246603 -2687885 -2309229
44804b309229Q38974J045272J057652M92945l13634j37266J194436K023256J056379
$$ -2309229 -1470255 -424983 632669 1125614 811980 674714 1869150 3892406 4948785
44795D948785q44038k009786j963315j231693l48878J65505l215j74767O41958
$$ 4948785 4104747 2094961 131646 -1100047 -1448925 -1283420 -1286635 -1461402 -819444
44786h19444J868685J826301N14430j63844L69327L58906r67251j751097q23986
$$ -819444 1049241 2875542 3389972 3226128 3595455 3954361 2987110 1236013 412027
44777D12027K0714p23965j347735k5283J470527N52572j444818j152307J202260
$$ 412027 432741 -291224 -1638959 -1664242 -193715 358857 -1085961 -2238268 -1036008
44768a036008K053451K71713j165691k3339J942261J939671k6650j755825j784045
$$ -1036008 1017443 1289156 123465 100126 2042387 3982058 3955408 2199583 415538
44759D15538n69976L98874J24609p89443p87205L38448Q72366K9409k30551J684196
$$ 415538 -154438 244436 369045 -420398 -1207603 -869155 3211 32620 -197931 1486265
44749A486265L622491K408580j033344k712853j415415R2807o0766n03055n9527
$$ 1486265 5108756 7517336 6483992 3771139 2355724 2448531 2387765 1884710 1825183
44740A825183M1429r83784j500628k61095J320335J536538P96119m542j165641
$$ 1825183 1866612 882828 -617800 -878895 441440 1977978 2774097 2769555 1603914
44731A603914k413689j884399Q56163K939480J886569o41757j422220l73173K09614
$$ 1603914 -809775 -2694174 -1838011 1101469 2988038 2346281 924061 550888 760502
44722G60502j70148K094R01485R38463k72587j212108j035576n46637k31809N01914
$$ 760502 590354 592448 1493933 2432396 2159809 947701 -87875 -634512 -866321 -364407
44712c64407J565871J647757K52904j276121j607812j046968n80500l76594q613
$$ -364407 1201464 2849221 3102125 1826004 218192 -828776 -1409276 -1785870 -1794483
44703a794483N77713R83247Q51649K01077l96919j33252R58433J567527O25022
$$ -1794483 -1216770 -233523 618126 819203 422284 289032 1247465 2814992 3440014
44694C440014j041782j641302p92213K52510O37641P25966P36832J34590j022462
$$ 3440014 2398232 756930 -35283 217227 854868 1580834 2317666 2452256 1429794
44685A429794j523388p22315K80785K46432k89007K3511J010674J098996j68531
$$ 1429794 -93594 -815909 -535124 -288692 -577699 -554188 456486 1555482 1386951
44676A386951j162231m37861J016839J032796n55798j427337j0053K055874K015706
$$ 1386951 224720 -213141 803698 1836494 1280696 -146641 -156694 1899180 3914886
44667C914886r9185j455195m46850J107042P52102j123279k139243j363244j44827
$$ 3914886 3815701 2360506 1913656 3020698 3772800 2649521 510278 -852966 -997793
44658i97793K26762L5437L7121J78737L4976k82402k57435L35847J153232J489229
$$ -997793 -771031 -735594 -698473 -519736 -484760 -767162 -1024597 -688750 464482 1953711
44648A953711Q20022n35162j473364j267450m50735m2870j78881j65357L16387
$$ 1953711 2773733 2238571 765207 -502243 -952978 -995848 -1174729 -1340086 -1023699
44639a023699Q09942Q21733L25394l89610q29536m97214L84351O93643k06450
$$ -1023699 -213757 607976 933370 543760 -285776 -782990 -398639 295004 88554
44630H8554j211138o42548J416648L025177K700776Q69404j065851k061589j700480
$$ 88554 -1122584 -1765132 -348484 2676693 5377469 6246873 5181022 3119433 1418953
44621A418953k92175Q75720M57296j191542k096174j172025K34843K17456r75469
$$ 1418953 1126778 2002498 2459794 1268252 -827922 -1999947 -1765104 -1547648 -2523117
44612b523117j295872J79896J856618J629724l96877j979969j453180L48841J307679
$$ -2523117 -3818989 -3639093 -1782475 -152751 -549628 -2529597 -3982777 -3633936 -2326257
44603b326257O68923l23495l15959N90742J418311J549671R52537J0915l98055
$$ -2326257 -1657334 -1980829 -2296788 -1706046 -287735 1261936 2214473 2225388 1827333
44594A827333L77150J416153Q14140j540153l161968k209850j15084P07766L79589
$$ 1827333 2204483 3620636 4434776 2894623 -267345 -2477195 -2592279 -1884513 -1504924
44585a504924N77357J245009J048395L55768O38067J189521j04284k471950k490233
$$ -1504924 -927567 317442 1365837 1721605 2359672 3549193 3444909 972959 -1517274
44576a517274L39051K050595J90417k202521j364461J383457K018440m0748j813219
$$ -1517274 -1178223 872372 1062789 -1139732 -2504193 -1120736 897704 856956 -956263
44567i56263j609044n29298L63791J213572J747954J189844l8191o82935o88404
$$ -956263 -2565307 -3094605 -2730814 -1517242 230712 1420556 1382365 699430 11026
44558A1026q71309r15184J18831J604051J990633J355037R04828L34044j477020
$$ 11026 -860283 -1775467 -1656636 -52585 1938048 3293085 4197913 4531957 3054937
44549C054937l313509k543500L59304J700892O9149j487357m85920J108702N17836
$$ 3054937 -258572 -2802072 -2442768 -741876 -672727 -2160084 -2646004 -1537302 -1019466
44540a019466j157944j031620P23121J478070N58906j45683L38934P83726J41357
$$ -1019466 -2177410 -3209030 -2485909 -1007839 -448933 -594616 -255682 528044 669401
44531F69401r81580j596126j432903n89258N66392J186934R03880O84023J363153
$$ 669401 -312179 -1908305 -3341208 -3930466 -3364074 -2177140 -1273260 -589237 773916
44522G73916J852368N77019j669678k404719j017087M83836O46613L58299O79397
$$ 773916 2626284 3203303 1533625 -871094 -1888181 -1404345 -757732 -399433 279964
44513B79964R45022K89186n64910n39022n5340j39322n09102j21274Q32175R93479
$$ 279964 1224986 1514172 949262 410240 354900 215578 -293524 -414798 417377 1410856
44503A410856r0666j201484j070551L8696P81293L62612o14706q99037r9273P48126
$$ 1410856 1320190 118706 -951845 -913149 -131856 230756 -383950 -1282987 -1382260 -634134
44493f34134M33979p42560j190429q1622J497083J873702P58758n97074q48277
$$ -634134 -200155 -942715 -2133144 -2214766 -717683 1156019 1914777 1317703 469426
44484D69426K52994J781464K395636J481046j70786j143095j002521o18372p33106
$$ 469426 722420 2503884 4899520 6380566 6209780 5066685 4064164 3445792 2712686
44475B712686j012791r50036q43609j100961j243446n62051O42605J387626J300656
$$ 2712686 1699895 749859 -93750 -1194711 -2438157 -3000208 -2357603 -969977 330679
44466C30679P66358R3234n60423o92210O6028J021877R93111p1940r57857q53864
$$ 330679 1097037 1190271 629848 -62362 3666 1025543 2018654 1946714 988857 134993
44456A34993k96009j50837m38356n67129j70587O22662J311247J249331K42969
$$ 134993 -161016 -311853 -750209 -1317338 -1487925 -865263 445984 1695315 1938284
44447A938284r72718j375619q38781j24114K49193M00498L92945O6415l29929
$$ 1938284 965566 -410053 -1248834 -1372948 -1123755 -723257 -330312 -263897 -593826
44438e93826l37863l14510j106611k320690k225580j67289K094405K534779J418046
$$ -593826 -931689 -1246199 -2352810 -4673500 -6899080 -7066369 -4971964 -2437185 -1019139
44429a019139N07370M84758N47012J42285l28517n14199o09170o90888m96391
$$ -1019139 -511769 -27011 520001 662286 333769 -180430 -789600 -1480488 -1976879
44420a976879k0425M03452O83095R66216J104692Q24208L74077K78904M61504
$$ -1976879 -1997304 -1593852 -910757 55459 1160151 1984359 2358436 2637340 3098844
44411C098844L12823l66565j120841j470426j224933l92666N83751Q54743J99002
$$ 3098844 3411667 3045102 1924261 453835 -771098 -1163764 -580013 274730 473732
44402D73732m19506k57056j20948r48800j667154m04920K265075L487514K018693
$$ 473732 54226 -202830 -323778 -1272578 -2939732 -3344652 -1079577 2407937 4426630
44393D426630j31091q18013n13778o73540j220025j334398j240502j325268p47887
$$ 4426630 4295539 3477526 2963748 2290208 1070183 -264215 -1504717 -2829985 -3577872
44384c577872J003226K231479J099555j109332j444910J99935R06327m92060j454644
$$ -3577872 -2574646 -343167 756388 -352944 -1797854 -1597919 -691592 -1183652 -2638296
44375b638296J6252J836155R57104j716085k473781k96353J740868J091842p65419
$$ -2638296 -2622044 -785889 171215 -1544870 -4018651 -4315004 -2574136 -1482294 -2247713
44366b247713r26007O34302J466207N87483l33956m0436K38590r16618k288198
$$ -2247713 -3173720 -2539418 -1073211 -485728 -819684 -860120 -621530 -1538148 -3826346
44357c826346j529808J081831K624933J552560l06227o72164P7640K38373k03724
$$ -3826346 -5356154 -4274323 -1649390 -96830 -403057 -1075221 -997581 -759208 -962932
44348i62932O7237J013544J136915J06345n13047K52612J201877P74849p22529
$$ -962932 -895695 117849 1254764 1361109 848062 1100674 2302551 3077400 2354871
44339B354871j708396j374706k71648O31268P53262J72881l60328n0265R26362
$$ 2354871 646475 -728231 -999879 -368611 384651 557532 197204 146939 1073301
44330A073301J471383R36181j30595q90468j118588q06456K01953J460211J688955
$$ 1073301 2544684 3480865 3350270 2459802 1341214 534758 736711 2196922 3885877
44321C885877L19261j333432j508473k09364J033693J213965N63466m20318j353105
$$ 3885877 4205138 2871706 1363233 1153869 2187562 3401527 3964993 3544675 2191570
44312B191570j502900l72477J094433J278229K15682k41761P83385J689913P35198
$$ 2191570 688670 316193 1410626 2688855 2904537 2662776 3446161 5136074 5871272
44303E871272j335259k398970j875199r65213m15255K73437J311681J822039J108978
$$ 5871272 4536013 2137043 261844 -703369 -1118624 -845187 466494 2288533 3397511
44294C397511l03488j412795j744726j297259l11037N50869O35078K92581N72064
$$ 3397511 3094023 1681228 -63498 -1360757 -1671794 -1120925 -485847 -193266 378798
44285C78798J529359J878662R12099l61199q29894q63037j117047r22025M80695
$$ 378798 1908157 3786819 4698918 4337719 3507825 2644788 1527741 605716 1086411
44276A086411J919479J524020l32431j378362q03437j95005o69783j162358n43259
$$ 1086411 3005890 4529910 4197479 2819117 2015680 1820675 1150892 -11466 -554725
44267e54725L87582L67920k83306n40892m82711p22103q79486j67065J010639
$$ -554725 -167143 200777 -82529 -623421 -1106132 -1828235 -2707721 -2874786 -1864147
44258a864147J435204P59589k83618r80202r69614o4513J178746J385867J41998
$$ -1864147 -428943 330646 47028 -933174 -1902788 -1967301 -788555 597312 739310
44249G39310q46388R0665J860829J909599k2615j515050j055060K1741j05657
$$ 739310 -107078 -16413 1844416 3754015 3731400 2216350 1161290 1183031 1077374
44240A077374j172551j678234j064980M5489R78833J433373J285322O40005k10669
$$ 1077374 -95177 -1773411 -2838391 -2792902 -1814069 -380696 904626 1544631 1333962
44231A333962j070878j625873j127381P22966K607072K596166O39275j205516
$$ 1333962 263084 -1362789 -2490170 -1767204 839868 3436034 4075309 2869793
44223B869793j471282r01855p23312o76551R9033J192954J251961j51734j892093
$$ 2869793 1398511 496656 -226656 -903207 -804174 388780 1640741 1489007 -403086
44214d03086k441825j285551N44877J284655L27392q35896m56816R71608J488329
$$ -403086 -2844911 -4130462 -3585585 -2300930 -1973538 -2809434 -3266250 -2294642 -806313
44205h06313P81575M90894J046140O86174j185559k157554l76715K078589K030994
$$ -806313 -24738 466156 1512296 2198470 1012911 -1144643 -1521358 557231 2588225
44196B588225q433q61405K63628R09516l72399j913159j888379q87326k98565
$$ 2588225 2579792 1718387 1982015 2891531 2519132 605973 -1282406 -2169732 -2468297
44187b468297j06796K63026L98596k32336q23163j66066J369615K068111J065088
$$ -2468297 -2575093 -2312067 -1913471 -2145807 -2968970 -3135036 -1765421 302690 1367778
44178A367778n47584j003331J63091J595664J558565q8299j608722j403418M1183
$$ 1367778 820194 -183137 -20046 1575618 3134183 3045884 1437162 33744 74927
44169G4927Q78962L45393m84167m81205K7610Q9528l19648m24137k9180R3083
$$ 74927 953889 1299282 815115 333910 361520 451048 131400 -292737 -321917 -228834
44159b28834n96599j410472j202325K1533R59836P63715J85732K44773M55950
$$ -228834 -825433 -2235905 -3438230 -3416697 -2456861 -1693146 -1507414 -1262641 -806691
44150h06691k52582j228807o26562J411285K216054L85352j798264j509391N61453
$$ -806691 -1059273 -2288080 -2914642 -1503357 712697 1098049 -700215 -2209606 -1648153
44141a648153J483417M31138o65816m16767M55898R09746Q37163K44644r12102
$$ -1648153 -164736 266402 -399414 -816181 -360283 549463 1386626 1631270 719168
44132G19168j712042r24435Q46932J453302K33797r66787n67266O20966J009227
$$ 719168 -992874 -1917309 -1070377 382925 616722 -350065 -917331 -296365 712862
44123G12862N08045K9352j43409k98122l83415j60126K42785N55031O37084K38895
$$ 712862 1220907 1250259 1106850 808728 425313 265187 507972 1063003 1700087 1938982
44113A938982p36590j518152j036413M66924J469999J163095L08898j78690k41796
$$ 1938982 1202392 -315760 -1352173 -885249 584750 1747845 2056743 1878053 1636257
44104A636257P2978R05932J597627R44631q49155j983378j595458r02961r37209
$$ 1636257 1709235 2615167 4212794 5157425 4308270 2324892 729434 -173527 -1110736
44095a110736q90400N5307R65427P83056K46287M68339Q82758M18857l77521l10359
$$ -1110736 -2001136 -1945829 -980402 -197346 48941 517280 1400038 1818895 1441374 1131015
44085A131015K69388J60442n04284o71447l73237m23135o07427j10837O36137
$$ 1131015 1400403 1560845 1056561 385114 11877 -411258 -1018685 -1129522 -493385
44076d93385M90137l06675n46529l39760q01763j492169o13838J721949K839470
$$ -493385 -3248 -309923 -856452 -1196212 -1997975 -3490144 -4103982 -2382033 457437
44067D57437J209711j214005j820095q50922l35542o96372n16448O72130J415263
$$ 457437 1667148 453143 -1366952 -2217874 -2553416 -3249788 -3766236 -3094106 -1678843
44058a678843O71336l89439j5375J459552J901081L32416j625662j910303o53130
$$ -1678843 -1007507 -1396946 -1412321 47231 1948312 2280728 655066 -1255237 -1908367
44049a908367M36046O77882Q88025J359700J123292k46749j576287j679860q46119
$$ -1908367 -1472321 -794439 93586 1453286 2576578 2329829 753542 -926318 -1772437
44040a772437K3886O11922P72462J97392o48376n91009L12092M01174q75404j579188
$$ -1772437 -1748551 -1136629 -364167 -166775 -815151 -1406160 -1094068 -692894 -1568298 -3147486
44030c147486j78584J811761K029295O85528l23627m51539l74779j5402Q44711
$$ -3147486 -3326070 -1514309 514986 1200514 876887 425348 50569 35167 879878
44021H79878J021132l76152j670338q79028O73000K30698j596464j608593N60586
$$ 879878 1901010 1524858 -145480 -1024508 -351508 -120810 -1717274 -3325867 -2765281
44012b765281J716852L55302j151000p01862O40122J245314J247650R16700k31556
$$ -2765281 -1048429 -693127 -1844127 -2545989 -1905867 -660553 587097 1503797 1272241
44003A272241j329721l57432K048178K402365j56218j871938l14731J464147J07024
$$ 1272241 -57480 -414912 1633266 4035631 3879413 2007475 1692744 3156891 3263915
43994C263915k182518j326566J619646K106780n87848k596769j757139j82073
$$ 3263915 1081397 -245169 1374477 3481257 2893409 296640 -1460499 -1642572
43986a642572k9702n68909m79084J6946M01366P98245Q76419K6925q54949p8926
$$ -1642572 -1672274 -2241183 -2720267 -2703321 -2301955 -1503710 -627291 -600366 -1455315 -1534241
43976a534241J832691K277208M37726j402598j383065n36878m36357n63201K27436
$$ -1534241 298450 2575658 3013384 1610786 227721 -309157 -745514 -1308715 -1081279
43967a081279J313927J324538M75407Q7128L96507M48554j29112o35975o07657
$$ -1081279 232648 1557186 2032593 2119721 2516228 2964782 2835670 2199695 1592038
43958A592038n16573q46767j154910n66499R18291K045123J606069K1977r85853
$$ 1592038 1075465 228698 -926212 -1492711 -574420 1470703 3076772 3098749 2112896
43949B112896n19660M12645M07515n10955j297363j383998q88084l780Q29584
$$ 2112896 1593236 2005881 2413396 1902441 605078 -778920 -1667004 -1670784 -841200
43940h41200Q36529M8460k30113O69708J295782J09495j777732j900649o7342
$$ -841200 -4671 43789 -186324 483384 1779166 1888661 110929 -1789720 -1857062
43931a857062J423775J150589J02703l55233j47790K31777M04025k09945j737774
$$ -1857062 -433287 717302 820005 464772 316982 548759 952784 742839 -994935
43922i94935k758757j648958Q54937K367324K204168J792979J607132M59591j451829
$$ -994935 -3753692 -5402650 -4547713 -2180389 23779 1816758 3423890 3883481 2431652
43913B431652j783003K19891J916586J098974p26943j040309k03149j72813r52535
$$ 2431652 648649 868540 2785126 3884100 3157157 2116848 1913699 1740886 788351
43904G88351j004553j66305L61308K85875K66713K21513l79076j002906p36412
$$ 788351 -216202 -382507 -21199 264676 531389 752902 373826 -629080 -1365492
43895a365492m3J92443R0666M70142P19466k19145j506154j288727K82097J184620
$$ -1365492 -1365535 -1173092 -1082426 -612284 107182 -111963 -1618117 -2906844 -2624747 -1440127
43885a440127O73796O8144K20844M05724J07972j63124l42872j065454j873025
$$ -1440127 -766331 -698187 -477343 -71619 36353 -126771 -469643 -1535097 -3408122
43876c408122j237997Q17993K142903J547733N83159R11999J647462R91311p72814
$$ -3408122 -4646119 -3828126 -1685223 -137490 445669 1357668 3005130 3996441 3223627
43867C223627j764073j248497k33848L21306M65992M94923L62571L3967k53092
$$ 3223627 1459554 211057 -22791 298515 764507 1259430 1622001 1655968 1402876
43858A402876k58410m0548K667n01534j185066r45331N63738J851018J267568
$$ 1402876 1144466 1103918 1106585 605051 -580015 -1525346 -961608 889410 2156978
43849B156978m53549j010632M1983P27896L6413m49331M75340J328304M97307
$$ 2156978 1703429 692797 734780 1462676 1499089 1049758 1525098 2853402 3350709
43840C350709q61763q57675k18254q42925k104169j686679L50877J514854R64470
$$ 3350709 2488946 1631271 1413017 570092 -1534077 -3220756 -2869879 -1355025 -390555
43831c90555N47217J180495J268816j14985j274479p35769L34108L72212k4592
$$ -390555 156662 1337157 2605973 2490988 1216509 480740 814848 1187060 1162468
43822A162468K18497L42952o01461j458163q18703J91181k67646j212472k19620
$$ 1162468 1380965 1723917 1122456 -335707 -1154410 -963229 -1230875 -2443347 -2662967
43813b662967K202458K919781R91943r96684j059733k30713J70268P09926J670701
$$ -2662967 -460509 2459272 3451215 2454531 1394798 1164085 1334353 2044279 3714980
43804C714980J425290q17939k784868k106045P3801R25989J00137n23897k90476
$$ 3714980 5140270 4322331 1537463 -568582 -494781 431208 531345 7448 -283028
43795b83028k16926m38116O6369J145391J353955M54848k01298j49052m13227
$$ -283028 -499954 -938070 -871701 273690 1627645 2082493 1881195 1732143 1318916
43786A318916j129086r08506M86765J076394l48653k010035j543519P15320K391153
$$ 1318916 189830 -718676 -231911 844483 495830 -1514205 -3057724 -2342404 48749
43777D8749K032904J36577j857291k450058r73622J273000J820624Q8692j552758
$$ 48749 2081653 2218230 360939 -2089119 -3062741 -1789741 30883 119575 -1433183
43768a433183j040539M75303O88710k51421m21805N00257J030927O48631K94075
$$ -1433183 -2473722 -1998419 -1309709 -1561130 -1982935 -1482678 -451751 196880 490955
43759D90955J42465o60482j712977j233425R97299K717682K273690Q06893J89731
$$ 490955 633420 -27062 -1740039 -2973464 -1976165 741517 3015207 3822100 4011831
43750D011831L95605K80821l17877p11681o91861m89517r9793L62482L46672k47954
$$ 4011831 4407436 4688257 4370380 3658699 2966838 2477321 2377528 2740010 3086682 2838728
43740B838728o76908n94928o73101j138285r72089K61535J124868M11871o68662
$$ 2838728 2161820 1566892 893791 -244494 -1216583 -955048 169820 581691 -86971
43731h6971l29796Q13806R03879K13859N84457J668871R10839j957555l500610
$$ -86971 -416767 397039 1300918 1514777 2099234 3768105 4678944 2721389 -779221
43722g79221j433311J640644J814778n43329j676129l7364J987482K049124P69765
$$ -779221 -2212532 -571888 1242890 699561 -976568 -1013932 973550 3022674 3792439
43713C792439j96026q11014j837071k766818k282386k76033J840058K649781J779754
$$ 3792439 3596413 2785399 948328 -1818490 -4100876 -4376909 -2536851 112930 1892684
43704A892684j70473j910178k059624m42650J383788J750267Q56805K42329M92776
$$ 1892684 1722211 -187967 -2247591 -2690241 -1306453 443814 1300619 1542948 2035724
43695B035724O77026J54898l86366k38023J41242L5076l56942n40727p02775j053139
$$ 2035724 2712750 2867648 2481282 2243259 2384501 2419577 2062635 1521908 819133 -234006
43685b34006r56218L1074Q57900K45335j033864q63560J085019K684811K372818
$$ -234006 -1190224 -1159150 -301250 -55915 -1089779 -1953339 -868320 1816491 4189309
43676D189309J124126M11864j78840j676122l202740k802401m69070J595201J966142
$$ 4189309 5313435 5725299 5546459 3870337 667597 -2134804 -2603874 -1008673 957469
43667I57469J507443J328240Q91734o30397k257843k108659j70419J286264M94210
$$ 957469 2464912 3793152 4684886 4054489 1796646 -312013 -482432 803832 1298042
43658A298042j524916k156763l28584K196489K768984P46766j870460k657548
$$ 1298042 -226874 -2383637 -2712221 -515732 2253252 3000018 1129558 -1527990
43650a527990j254426O15676J301864P66495n9368o46298j015977j085989p54663
$$ -1527990 -2782416 -2166740 -864876 -98381 -157749 -804047 -1820024 -2906013 -3660676
43641c660676m54388o72499q61463J07492J996867K845685J491660m79059p02120
$$ -3660676 -4115064 -4787563 -5649026 -5541534 -3544667 -698982 792678 313619 -388501
43632c88501N86915R27073n76584j847138j055890O17676J028141M41894O81946
$$ -388501 198414 1125487 548903 -1298235 -2354125 -1736449 -708308 -266414 415532
43623D15532J628500J171265j084186k541512j207268J315122K027280M94748
$$ 415532 2044032 3215297 2131111 -410401 -1617669 -302547 1724733 2219481
43615B219481j108766j165022r1426J014799J543908J115801l38701j818779j786727
$$ 2219481 1110715 -54307 -145733 869066 2412974 3528775 3190074 1371295 -415432
43606d15432r5425J455535J139596o54759j951430j438364K15356J158104L14790
$$ -415432 -510857 944678 2084274 1429515 -521915 -1960279 -1744923 -586819 -272029
43597b72029j383374j910466n23809J204218J316637m3060j036600o94770J96117
$$ -272029 -1655403 -3565869 -4089678 -2885460 -1568823 -1611883 -2648483 -3343253 -3147136
43588c147136P39442R94744J036013M16356o84571j079931k94184M78888J90470
$$ -3147136 -2407694 -1412950 -376937 39419 -645152 -1725083 -2019267 -1540379 -1349909
43579a349909m04115j65188M10742J85405m13399l4578J143728J503667N10212
$$ -1349909 -1754024 -1919212 -1508470 -1323065 -1736464 -1771042 -627314 876353 1386565
43570A386565o14755r07767p09856m58423o4372J90203k00170n63772L45397J833997
$$ 1386565 771810 -135957 -845813 -1304236 -1368608 -1178405 -1378575 -1942347 -1596950 237047
43560B37047J535460q22477k249278p60308J366297R52714j211044j794880j56664
$$ 237047 1772507 950030 -1299248 -2059556 -693259 259455 -951589 -2746469 -2903133
43551b903133J132237P52135L06504R20031J227212J23411r69932l98826J003170
$$ -2903133 -1770896 -1018761 -712257 207774 1434986 1558397 588465 189639 1192809
43542A192809J407703Q53365O43729Q12608K32095j112442j824417j212515k66895
$$ 1192809 2600512 3453877 4097606 4910214 5142309 4029867 2205450 992935 726040
43533G26040j62655q10626j312615j204780q62969r11436j343398j274664M8703
$$ 726040 563385 -247241 -1559856 -2764636 -3627605 -4539041 -5882439 -7157103 -7108400
43524g108400J956756K818363K110704J093368Q19182N67983o55692k034248j889173
$$ -7108400 -5151644 -2333281 -222577 870791 1689973 2257956 1602264 -431984 -2321157
43515b321157k23916J277919J620539J325250R21553K48844m34798k32640Q52614
$$ -2321157 -2545073 -1267154 353385 1678635 2600188 2849032 2414234 2181594 3034208
43506C034208J460707O97454o48922j376963j299478p42890K10623J133117J101808
$$ 3034208 4494915 5192369 4543447 3166484 1867006 1124116 1334739 2467856 3569664
43497C569664K35876K13259J845425L212983K073770n92011j659988l30959Q32045
$$ 3569664 3805540 4018799 5864224 9077207 11150977 10558966 8898978 8568019 9400064
43488I400064j85275k173595l003965k579292j923747j030041L69860J140104
$$ 9400064 9214789 7041194 4037229 1457937 -465810 -1495851 -1125991 14113
43480A4113J88184j177251q53348M69717J86578j572907j450133J732259M260065
$$ 14113 202297 -974954 -1828302 -1358585 -1172007 -2744914 -4195047 -2462788 1797277
43471A797277K629600j149312k483744p30078P92796M51709J9393N56948M82870
$$ 1797277 4426877 3277565 793821 63743 856539 1308248 1327641 1884589 2367459
43462B367459r59186j666923j22093J752525J472346k74272j132211p46919m86910
$$ 2367459 1408273 -258650 -380743 1371782 2844128 2569856 1437645 690726 203816
43453B03816o41269l40379L76267N88803J80880l12395r77369j881285j891004
$$ 203816 -437453 -777832 -401565 187238 368118 55723 -921646 -2802931 -4693935
43444d693935j29997K008311K423365J367160P33624P98719K09791r79444j049451
$$ -4693935 -4823932 -2815621 -392256 974904 1708528 2507247 2717038 1737594 688143
43435F88143K72620J074140L10699p71991j038666r96993j019175k82171J319375
$$ 688143 960763 2034903 2345602 1573611 534945 -462048 -1481223 -1763394 -444019
43426d44019K188839J276940l26236j196431j398728j462148j146166l26900L66247
$$ -444019 1744820 3021760 2695524 1499093 100365 -1361783 -2507949 -2834849 -2468602
43417b468602P16040J188053J391281K45744j552609j639240K83371J431264K76921
$$ -2468602 -1752562 -564509 826772 1072516 -480093 -2119333 -1835962 -404698 -127777
43408a27777q47926K85870J908718J243908q16374j420829n40582m26482j266986
$$ -127777 -975703 -689833 1218885 2462793 1646419 225590 -314992 -741474 -2008460
43399b008460j049024N57767J580983J160152N99013O95748P01877L17201K62920
$$ -2008460 -3057484 -2499717 -918734 241418 840431 1536179 2238056 2555257 2818177
43390B818177M65388o6854j197059j612042j057550n48092k75849M54747J157988
$$ 2818177 3283565 3216711 2019652 407610 -649940 -1198032 -1473881 -1019134 138854
43381A38854N00743j048607j422273k18230P20321M43470L8060Q1786l16786j128974
$$ 138854 639597 -409010 -1831283 -2049513 -1329192 -885722 -847662 -765876 -1082662 -2211636
43371b211636q26080P34476J528249O89349n9353L53001M90991n06462q50983
$$ -2211636 -3037716 -2303240 -774991 -85642 -144995 208006 698997 192535 -658448
43362f58448O71066J995416R24811j176002j610503n01168J25306p7158j0388
$$ -658448 12618 2008034 2932845 1756843 146340 -354828 -229522 -306680 -317068
43353c17068J98710l28163r02104k11839J038505J116650L34738M12099J192775
$$ -317068 -118358 -446521 -1348625 -1560464 -521959 594691 929429 1341528 2534303
43344B534303Q70484o10592j278616n32077m3384o86533j169936n90415N3472
$$ 2534303 3404787 2794195 1515579 983502 940118 253585 -916351 -1506766 -1453294
43335a453294j9070O5488Q51650J103880r3857j389159j056055L15396Q11672
$$ -1453294 -1472364 -1406876 -555226 548654 454797 -934362 -1990417 -1675021 -863349
43326h63349J59407r6590P85950J546901P94754r22718j661053m60016J383773
$$ -863349 -703942 -800532 -14582 1532319 2327073 1404355 -256698 -716714 667059
43317F67059J758002L00170j111410p96302M76327O00933q39264j926487j073484
$$ 667059 2425061 2725231 1613821 817519 1293846 1894779 1055515 -870972 -1944456
43308a944456P72765J384960J54130j173697p42998J033265J911723O69011j161690
$$ -1944456 -1171691 213269 367399 -806298 -1549296 -516031 1395692 2064703 903013
43299I03013j162049P00973J930779Q82324j099154j752832q71628O5064K70423
$$ 903013 -259036 441937 2372716 3255040 2155886 403054 -468574 -403510 -133087
43290a33087J39332l0602k17632P7962J176872J972672R77836j268526k401367
$$ -133087 6245 -24357 -241989 -164027 1012845 2985517 3963353 2694827 293460
43281B93460j232663P45811J347546J51727j444923j822637n25482J272748J708486
$$ 293460 -939203 -193392 1154154 1305881 -139042 -1961679 -2487161 -1214413 494073
43272D94073L26290j108027q28538M75774Q17684l0149n15456j15835K6113m77824
$$ 494073 820363 -287664 -1116202 -640428 177256 147107 -368349 -484184 -458071 -935895
43262i35895m64992M63429R76278L85304P454Q68377J818013J444902L58869p1685
$$ -935895 -1400887 -937458 38820 424124 431578 1299955 3117968 4562870 4921739 4850054
43252D850054j7234n23802j488803j913625j500434o57468L68267J171963R26569
$$ 4850054 4832820 4309018 2820215 906590 -593844 -1251312 -883045 288918 1215487
43243A215487k71512q18647J72628J166859M66116r17812q34940L76265M23504
$$ 1215487 943975 125328 297956 1464815 1930931 1013119 178179 554444 977948
43234I77948j011845j596600o7360J804683J939595O77758l84320p35734q65361
$$ 977948 -33897 -1630497 -1697857 106826 2046421 2724179 2339859 1604125 738764
43225G38764r54339q47018o18646l23366J97010P06395N79397q7789l17501K32014
$$ 738764 -215575 -1062593 -1681239 -2004605 -1807595 -1101200 -521803 -609592 -927093 -695079
43215f95079O24569K05590k90687n8625M39389N14950O05573J278954J751939
$$ -695079 -70510 135080 -155607 -214232 225157 740107 1345680 2624634 4376573
43206D376573R31985o33227j421027j174598q54729n98350M07352J842844J986990
$$ 4376573 5308558 4675331 3254304 2079706 1224977 626627 1033979 2876823 4863813
43197D863813K64152j553585j683593n71059K59894L83228K25749l17377j439452
$$ 4863813 5127965 3574380 1890787 1319728 1579622 1962850 2188599 1871222 431770
43188D31770k187810j305249Q15413K360918K267478J036335m35065j522413j486400
$$ 431770 -1756040 -3061289 -2245876 115042 2382520 3418855 2983790 1461377 -25023
43179b5023J1452J751431J870473M51873l12392P09009J798690R46305j115977
$$ -25023 -13571 1737860 3608333 4060206 3747814 4456823 6255513 7201818 6085841
43170F085841j974899q14073R24469J687545J165532k19069j742739k320976j315968
$$ 6085841 4110942 3296869 4221338 5908883 7074415 6855346 5112607 2791631 1475663
43161A475663L99200J193649O45434j22561j20706M21507P69324O08238O3239
$$ 1475663 1874863 3068512 3713946 3591385 3470679 3892186 4661510 5269748 5332987
43152E332987n00017o00369j87702M1938m23926r58246p18067j98909n67526j545750
$$ 5332987 4832970 4232601 4044899 4086837 3662911 2704665 1986598 1787689 1220163 -325587
43142c25587j499966M9520J507247J435888M23816j00361J49714M43557L22021
$$ -325587 -1825553 -1776033 -268786 1167102 1590918 1490557 1640271 2083828 2405849
43133B405849j51126q32485j400915j276573k89977R32552J662468J690695J041587
$$ 2405849 2254723 1422238 21323 -1255250 -1545227 -612675 1049793 2740488 3782075
43124C782075j61184j191277j013674L03529J303456R61064j201l88190l06967
$$ 3782075 3620891 2429614 1415940 1719469 3022925 3983989 3982788 3594598 3287631
43115C287631o30782j274818j232188k18121P70826P72327N4588l55628k4671
$$ 3287631 2656849 1382031 149843 -68278 702548 1474875 1529463 1173835 1149164
43106A149164M00888J72382l79293k43034N84334P59128l42909j216234k34088
$$ 1149164 1550052 1722434 1343141 1100107 1684441 2443569 2100660 884426 650338
43097F50338J657664K061054O42365m86966j2767J027670J368422J148174P40436
$$ 650338 2308002 4369056 5011421 4524455 4511688 5539358 6907780 8055954 8796390
43088H796390p0221r09986p31178K38957M60732j55825K36317K051758L052266
$$ 8796390 8726169 7816183 7085005 7323962 7784694 7628869 7865186 9916944 12969210
43079A2969210K098597J383968K764185M536153M568783M131808N377209P239590
$$ 12969210 15067807 16451775 19215960 23752113 28320896 32452704 37829913 45069503
43071D5069503P612000P846246J0890213J6035582J9850845K1876571K5167804
$$ 45069503 52681503 60527749 71417962 87453544 107304389 129180960 154348764
43064A54348764L1231312L8505789M5949914N3795120N9980598N9783313M9926005
$$ 154348764 185580076 224085865 270035779 323830899 383811497 443594810 493520815
43057D93520815K9861227k94347l7459375p0567578q5095536p7034807n7940380
$$ 493520815 523382042 523087695 485628320 415060742 329965206 252930399 194990019
43050A94990019m2083713l2624007k4535423j6213065j1095607r945487q940476
$$ 194990019 152906306 120282299 95746876 79533811 68438204 58492717 49552241
43043D9552241o082279l824628l955950m509349l594387k502385k820685l414438
$$ 49552241 43469962 39645334 35689384 31180035 27585648 25083263 22262578 18848140
43035A8848140k605501j186332r62900j749116j932613j169970o38190r19190
$$ 18848140 16242639 15056307 14093407 12344291 10411678 9241708 8603518 7684328
43027G684328j162752n36537M76370P12885o4629p17361j96898Q43685P43133
$$ 7684328 6521576 5985039 6461409 7174294 7109665 6392304 6195406 7039091 7782224
43018G782224p53805j924853j515748m95661k80086m64859N492M34285o17924
$$ 7782224 7028419 5103566 3587818 3092157 2812071 2347212 2352704 2786989 2169065
43009B169065k306430j976513Q77451L319872K675598j18002k079265j878589
$$ 2169065 -137365 -2113878 -1236427 2083445 4759043 4641041 2561776 683187
43001F83187o11821L35583P17914Q16686N86092j00321q46192r47410l13250J81549
$$ 683187 71366 406949 1124863 1941549 2527641 2427320 1581128 633718 320468 502017
42991E02017k77827j160367j020573N41801K093120K064072N97445r32054j620126
$$ 502017 224190 -936177 -1956750 -1414949 678171 2742243 3339688 2407634 787508
42982G87508j492049q44220m7809L83239L79471O04600J390015J899564J275054
$$ 787508 -704541 -1548761 -1596570 -1213331 -833860 -229260 1160755 3060319 4335373
42973D335373R7063l60105P4208M87829L33085k32935j076005j993379k235737
$$ 4335373 4432436 4072331 4146539 4634368 4967453 4734518 3658513 1665134 -570603
42964e70603j340612j76266N9467l81521k61291O74012J503627J689163J492302
$$ -570603 -1911215 -2087481 -2028014 -2409535 -2670826 -1996814 -493187 1195976 2688278
42955B688278J059090M35842K10494O92183Q32980l48279j660727j112210P85663
$$ 2688278 3747368 4183210 4393704 5085887 5918867 5570588 3909861 2797651 3583314
42946C583314J440752J46533q72251j18184R04827L35244j197274j917144j494591
$$ 3583314 5024066 5170599 4298348 4180164 5084991 5420235 4222961 2305817 811226
42937H11226p43177j4367O15385N92371k88489j107178j007366l96654m4179J02604
$$ 811226 68049 53682 669067 1261438 972949 -134229 -1141595 -1538249 -1582428 -1479824
42927a479824K89447J55983m21169o40824J0687O95581L75580o77406j318331
$$ -1479824 -1190377 -1034394 -1455563 -2096387 -2085700 -1390119 -1014539 -1691945 -3010276
42918c010276p93971Q75737K796506L231530J233442j382187j637769L94000J368026
$$ -3010276 -3804247 -2928510 -132004 3099526 4332968 2950781 1313012 1707012 3075038
42909C075038k42434j675255m84329J280367N30255j612618j844310l53452j50089
$$ 3075038 2832604 1157349 673020 1953387 2483642 871024 -973286 -1326738 -1476827
42900a476827j398666r82275J841163L668233K216693l25319j106621o38892p44051
$$ -1476827 -2875493 -3857768 -2016605 1651628 3868321 3543002 2436381 1797489 1053438
42891A053438j066996l06853Q47598P05683n09186j077337n22864R4340K69619
$$ 1053438 -13558 -320411 527187 1232870 723684 -353653 -876517 -782177 -512558
42882e12558N89203J212665J371703O36693l70556p67464k68790P64028J636337
$$ -512558 76645 1289310 2661013 3297706 2927150 2159686 1890896 2654924 4291261
42873D291261J775536J220767M84650j49565o81569p51705R4279J266532J478814
$$ 4291261 6066797 7287564 7772214 7622649 6941080 6189375 6283654 7550186 9029000
42864I029000P79566Q56918K394421L595859K814925J339826J511444K912673
$$ 9029000 9808566 10665484 13059905 16655764 19470689 20810515 22321959 25234632
42856B5234632K905003Q28414r54542q82559n80980j893960l507811k847912l60293
$$ 25234632 28139635 28968049 28013507 27130948 26549968 24656008 21148197 18300285 17939992
42847A7939992P04887j056564l090637k509035j45631P34448r91125k936627k600936
$$ 17939992 18644879 17588315 14497678 11988643 11843012 12577460 11586335 8649708 6048772
42838F048772n13734Q82575M79098n53863p28358n7236L14595l07780j321595
$$ 6048772 5535038 6417613 6896711 6342848 5614490 5557254 5871849 5564069 4242474
42829D242474j511795n55364L77011O5584p85367j39157K249154L624675J600612
$$ 4242474 2730679 2175315 2552326 2617910 1832543 1693386 3942540 7567215 9167827
42820I167827k141733l537082j376255J283035J461334r2512q33260k36352K38867
$$ 9167827 7026094 3489012 2112757 3395792 4857126 4764614 3931354 3695002 3933869
42811C933869L5583J90301J162943J799863J099928j50846l46210Q80489K257808
$$ 3933869 3969452 4159753 5322696 7122559 8222487 8071641 7725431 8605920 10863728
42802A0863728K391980J232836j2500j46520J043365K941685M772591N841896
$$ 10863728 13255708 14488544 14476044 14329524 15372889 18314574 23087165 28929061
42794B8929061N585880M088534K425130J732812J859779J620123M48487r95456
$$ 28929061 34514941 38603475 41028605 42761417 44621196 46241319 46689806 45694350
42786D5694350k014033k758594l591054m382045m851103m909699m412950l352034
$$ 45694350 43680317 40921723 37330669 32948624 28097521 23187822 18774872 15422838
42778A5422838k391435k156236j937392o04785R79736N07799k031121l484766
$$ 15422838 13031403 10875167 8937775 8332990 9312726 9820525 7789404 4304638
42770D304638j966455J55271j1390j259756n27601J743570K304110N89706n36640
$$ 4304638 2338183 2493454 2482064 1222308 694707 2438277 4742387 5332093 4795453
42761D795453J06978K49202j219378j768310L40652K458116J488223r84884j076351
$$ 4795453 4902431 5151633 3932255 2163945 2504597 4962713 6450936 5466052 4389701
42752D389701J267973K199718k10563l331674l778767j441042J204706K110359
$$ 4389701 5657674 7857392 7646829 4315155 536388 -904654 300052 2410411
42744B410411J116323m53750r89508j02983Q51349M35041r09558j534719r45418
$$ 2410411 3526734 3072984 2083476 1980493 2831842 3266883 2357325 822606 -122812
42735a22812j94089k7649q5495r3221l96177q96047p92179M5222O08458K73874
$$ -122812 -316901 -344550 -430045 -523266 -919443 -1815490 -2607669 -2562447 -1953989 -1680115
42725a680115k65126k21645J42817L17436N30678J094462J549084J351240P87964
$$ -1680115 -1945241 -2166886 -2024069 -1706633 -1175955 -81493 1467591 2818831 3606795
42716C606795L51787k08521j256370k116793j642496Q8690J518995J324569p1398
$$ 3606795 3958582 3750061 2493691 376898 -1265598 -1176908 342087 1666656 1595258
42707A595258r63042k33904J359478J968772Q51115o65980j002008n70278r83488
$$ 1595258 632216 398312 1757790 3726562 4577677 3911697 2909689 2339411 1355923
42698A355923k227558k394310p47542P96821M95104n03436n1944J510186J949133
$$ 1355923 -871635 -3265945 -4013487 -3216666 -2721562 -3224998 -3276942 -1766756 182377
42689A82377P07849l83769p8218O94737P28220K07430l06131r65841j725565j688440
$$ 182377 890226 506457 428239 1122976 1851196 2058626 1752495 786654 -938911 -2627351
42679b627351n18724N70764M23983l55265m95517k8437J89040K67557J021459
$$ -2627351 -3146075 -2575311 -2151328 -2506593 -3002110 -3030547 -2841507 -2573950 -1552491
42670a552491K179729K452057J489627L42860l31916j102655k205768k522919
$$ -1552491 627238 3079295 4568922 4911782 4579866 3477211 1271443 -1251476
42662a251476j186076P39356J467320Q90613M41045P10118O54045m29329j448108
$$ -1251476 -2437552 -1698196 -230876 659737 1100782 1810900 2464945 2035616 587508
42653E87508j034014L08165Q46163J36304m42524J25167J055008J180873P15726
$$ 587508 -446506 -138341 707822 844126 401602 526769 1581777 2762650 3478376
42644C478376N27296M54811k51295j197892j153891j68198K42903m70636q80992
$$ 3478376 4005672 4460483 4209188 3011296 1857405 1689207 1932110 1461474 580482
42635E80482L3801J002881M72644o54228k91672J352788J802692L7650j880110
$$ 580482 614283 1617164 2089808 1435580 1143908 2496696 4299388 4337038 2456928
42626B456928j742913p5580J120034J194574R54112P81418K82773m54318p00499
$$ 2456928 714015 638435 1758469 2953043 3907155 4688573 4971346 4517028 3816529
42617C816529l01497N8388j390j02859p780n3141l65453m87550k21789q3408l98185
$$ 3816529 3515032 3573420 3572030 3469171 3461391 3408250 3042797 2555247 2333458 2250050 1851865
42606A851865o58439m17315j83539o05320j228263j029519k668P51158N76346
$$ 1851865 1193426 776111 592572 -12748 -1241011 -2270530 -2273198 -1522040 -945694
42597i45694N4192K6034N49470J121079J326622R73524J60593m74221j96102P40098
$$ -945694 -891502 -865468 -315998 805081 2131703 3105227 3265820 2791599 2595497 3335595
42587C335595J082572J79124j051130j412106j092022j129527j643819j672917
$$ 3335595 4418167 4597291 3546161 2134055 1042033 -87494 -1731313 -3404230
42579c404230o94630O59036J497181J510097Q91248J51441n5537L08305L00985
$$ -3404230 -4098860 -3439824 -1942643 -432546 458702 610143 554606 862911 1163896
42570A163896o27495j275642k04151J574519J483736o29646j764080k15679J617000
$$ 1163896 536401 -739241 -943392 631127 2114863 1485217 -278863 -494542 1122458
42561A122458R42676r75806j010947N58657N75321j481159k355732l65207J653351
$$ 1122458 2065134 1089328 78381 637038 1212359 -268800 -2624532 -2989739 -1336388
42552a336388Q01543j267682j035329J346032K392176N76583j718452j923590
$$ -1336388 -534845 -1802527 -2837856 -1491824 900352 1476935 -241517 -2165107
42544b165107n11903N15411O09286P06308J198406J343312O51954j94030k86923
$$ -2165107 -2677010 -2161599 -1552313 -846005 352401 1695713 2347667 2153637 1866714
42535A866714J59114J26536n45028p01284L04655J169604L45485j255697j176412
$$ 1866714 2025828 2152364 1607336 906052 1210707 2380311 2725796 1470099 293687
42526B93687P06332J449221o20253k958710k325497K97527J109053q21813k317223
$$ 293687 1000019 2449240 1828987 -1129723 -3455220 -3157693 -2048640 -2870453 -5187676
42517e187676r28486J760884K845560J928807O47235p7274n25977q08294o60693
$$ -5187676 -6116162 -4355278 -1509718 419089 1066324 989050 463073 -345221 -1005914
42508a005914k94097j95752k31160J37766Q69602J294238R26139j52005j446073
$$ -1005914 -1300011 -1495763 -1726923 -1589157 -719555 574683 1500822 1348817 -97256
42499i7256k195766j814020o68276M9812k32771o46111r8088J138535J762767
$$ -97256 -2293022 -4107042 -4775318 -4725506 -4958277 -5604388 -5702476 -4563941 -2801174
42490b801174J103000j62760q09024k49147Q49957J033524l37084j895758j590557
$$ -2801174 -1698174 -1860934 -2669958 -2919105 -2069148 -1035624 -1372708 -3268466 -4859023
42481d859023N61465K204327J683976N9025q15356q16288q09581o63976J53848
$$ -4859023 -4297558 -2093231 -409255 -350230 -1165586 -1981874 -2791455 -3455431 -3301583
42472c301583R03298N59172o0128O51145K117442K014393r0288j849515j568741
$$ -3301583 -2398285 -1839113 -1899241 -1248096 869346 2883739 2793451 943936 -624805
42463f24805l68539R3859N9488M02750N88134l37624j722769j953813o24026J166157
$$ -624805 -993344 -899485 -839997 -437247 150887 -186737 -1909506 -3863319 -4487345 -3321188
42453c321188K203339J903871L44936j398753j629957Q6391J926355J821019K2049
$$ -3321188 -1117849 786022 1130958 -267795 -1897752 -1811361 114994 1936013 1958062
42444A958062j441538j437581o75326k35075l22829m98128k93883L60893P97777
$$ 1958062 516524 -921057 -1596383 -1831458 -2154287 -2652415 -2946298 -2585405 -1787628
42435a787628R2458j484223k164781p69614J512814K505727J675812K76515n61471
$$ -1787628 -1695170 -3179393 -5344174 -6113788 -4600974 -2095247 -419435 -142920 -704391
42426g04391o07206P4734J076243J380045N56844k05966K25522Q32363p8990j805124
$$ -704391 -1311597 -1236863 -160620 1219425 1776269 1570303 1795825 2628188 2549198 744074
42416G44074k024717n33496M46250L0086q0048J006365J603860O10670k59887
$$ 744074 -1280643 -1814139 -1367889 -1337803 -1417851 -411486 1192374 1803044 1543157
42407A543157M91075J235734o7658k104169k099507k58638P60182J45637l50434
$$ 1543157 2034232 3269966 3202308 1098139 -1001368 -1260006 -499824 -354187 -704621
42398g04621J53023M91000Q0915M801P06512J001374L56914J1880O61063R83952
$$ -704621 -551598 -60598 20317 25118 731630 1733004 2089918 2101798 2762861 3746813
42388C746813j03060j402718j274750k11909J63057k52670k03586N90055R96661
$$ 3746813 3643753 2241035 966285 754376 917433 664763 461177 1051232 2047893
42379B047893L80780m69331o24581k06972J01587O5606j6522Q1220J39857k24863
$$ 2047893 2428673 1959342 1334761 1127789 1229376 1294982 1278460 1359680 1499537 1274674
42369A274674q92535j033987k3310J445475J824253N90378r86674j432843q33199
$$ 1274674 382139 -651848 -675158 770317 2594570 3184948 2198274 765431 -67768
42360f7768l73270n87445q58752n00115L60463J027558R63616K75448k94443n4987
$$ -67768 -441038 -1028483 -1887235 -2387350 -2026887 -999329 -35713 239735 -54708 -109695
42350a09695P24682R34514l898j269063j615434q67176J23243O88110Q03679N09495
$$ -109695 614987 1549501 1545603 276540 -1338894 -2206070 -2082827 -1394717 -591038 -81543
42340h1543k78943j187291j304487j60706J485841K225765J383898k83767j309126
$$ -81543 -360486 -1547777 -2852264 -3012970 -1527129 698636 2082534 1798767 489641
42331D89641r48571J24052O49260K12790m26618l96616L36974J186274J615354
$$ 489641 -458930 -334878 314382 527172 100554 -296062 40912 1227186 2842540
42322B842540J341828L65077p84978j221880o14398L38100P49861N62943K92186
$$ 2842540 4184368 4549445 3764467 2542587 1928189 2266289 3016150 3579093 3871279
42313C871279J37454n9798k63553l22566m36440q55124j204048q52652p646L26853
$$ 3871279 4008733 3948935 3685382 3362816 2926376 2071252 867204 14552 6906 333759
42303C33759k54442q65920m96049N68624J032854J85842j222722j783101q90166
$$ 333759 79317 -786603 -1282652 -714028 318826 504668 -718054 -2501155 -3391321
42294c391321O97397J650326J266978q1864j399243j732092p07471J059112K150965
$$ -3391321 -2693924 -1043598 223380 141516 -1257727 -2989819 -3697290 -2638178 -487213
42285d87213J562825j23565j304729j206560n21530o8478K41761O29581O45670
$$ -487213 1075612 952047 -352682 -1559242 -2080772 -2149250 -1907489 -1277908 -632238
42276f32238M2323l38594L30810J374207J396083K75575p60164q84607l65925
$$ -632238 -589915 -928509 -597699 776508 2172591 2448166 1688002 803395 437470
42267D37470L68336J129429J372216M82291j012020j644360q83170J57478L23863
$$ 437470 805806 1935235 3307451 3789742 2777722 1133362 250192 407670 731533
42258G31533j74237m59713k36707K10791N50597M36739l17356j185107j260391
$$ 731533 557296 97583 -139124 71667 622264 1059003 741647 -443460 -1703851
42249a703851n25999J4006j34349k44659K51082P03941M01251j14511J24600J022728
$$ -1703851 -2229850 -2215844 -2350193 -2594852 -2343770 -1639829 -1238578 -1353089 -1228489 -205761
42239b05761J706422J733680J157879K1740j282540j802165j199348n02995o12640
$$ -205761 1500661 3234341 4392220 4413960 3131420 1329255 129907 -373088 -985728
42230i85728q06057p1369Q57473N66277m61279m46873N88579O68440p20832j419627
$$ -985728 -1791785 -1863154 -1005681 -439404 -900683 -1347556 -758977 -90537 -811369 -2230996
42220b230996M9136J986590K030846N48853m07016l33451l15569n51304j27649
$$ -2230996 -2181860 -195270 1835576 2384429 1977413 1643962 1328393 777089 649440
42211F49440Q49591J052409J88513m10072p318M28546P1819m05234l01476k53035
$$ 649440 1499031 2551440 2739953 2329881 2322563 2751109 2822928 2417694 2116218 1863183
42201A863183q93097j383511p24737M46353R00446Q28533J122745J350204M51226
$$ 1863183 970086 -413425 -1138162 -691809 208637 1037170 2159915 3510119 3961345
42192C961345r04103r08187L26677O39626o58415j483606l46200J166156R64489
$$ 3961345 3057242 2149055 2475732 3115358 2456943 973337 627137 1793293 2757782
42183B757782k94361o12452N3751J99859m02764o33119k91391j78365j68952N29590
$$ 2757782 2463421 1850969 1904720 2104579 1701815 1068696 777305 598940 429988 959578
42173I59578J311767P73875m85543k56560J538422K176023L03636j799493j764699
$$ 959578 2271345 3045220 2559677 2303117 3841539 6017562 6321198 4521705 2757006
42164B757006o23083o31510j498625j309794J7520Q17652N84638L52728M05286
$$ 2757006 2133923 1502413 3788 -1306006 -1288486 -470834 113804 466532 871818
42155H71818j27571j266613j776044j104514r6030N42821R85583J230819Q26969
$$ 871818 744247 -522366 -2298410 -3402924 -3498954 -2956133 -1970550 -739731 87238
42146H7238N5339o0678N35007N61533n76291j604955j097885N17833J575391J237699
$$ 87238 142577 81899 616906 1178439 602148 -1002807 -2100692 -1582859 -7468 1230231
42136A230231J78569n12802n07672l18783m29504n15894O0265Q97751O13479j014225
$$ 1230231 1408800 895998 388326 69543 -359961 -875855 -815590 82161 695640 -318585
42126c18585j950751l60109K474060L445416J678209n50606j129895n11275k39400
$$ -318585 -2269336 -2629445 -155385 3290031 4968240 4417634 3287739 2776464 2537064
42117B537064p95836j746757k607082k667037j245579R58099J960256R13563o49181
$$ 2537064 1741228 -5529 -2612611 -5279648 -6525227 -5567128 -3606872 -2693309 -3342490
42108c342490r46893k34979J11995k15769m44422j71827L07855O56772O32484
$$ -3342490 -4289383 -4524362 -4412367 -4628136 -5072558 -5244385 -4936530 -4279758 -3647274
42099c647274J23494l35545J22556J271119J705596Q72185n2920j39661q2122
$$ -3647274 -3523780 -3859325 -3736769 -2465650 -760054 112131 59211 -80450 -162572
42090a62572m82431m32504N98203J134318M7525r86732J4003J619470R16997j494151
$$ -162572 -645003 -1077507 -479304 655014 702539 -284193 -270190 1349280 2266277 772126
42080G72126k002192L32956K206447J232457o55318p48452L42908M88989k63351
$$ 772126 -1230066 -897110 1309337 2541794 1886476 1138024 1480932 1969921 1706570
42071A706570m68952k85235r49443k064497k018569q15899q0138j75936L63134
$$ 1706570 1237618 952383 2940 -2061557 -4080126 -4896025 -4976163 -5152099 -4788965
42062d788965K012172K957394J677592p22602k018655j662340q10558k98045K5237
$$ -4788965 -2776793 180601 1858193 1135591 -883064 -2545404 -3355962 -3654007 -3628770
42053c628770K27640j1094m11985k3782J236213J930148R54130n86113o12507
$$ -3628770 -3401130 -3412224 -3824209 -3847991 -2611778 -681630 272500 -313613 -926120
42044i26120R83629K035706J083180o90140j324014p43986l26133n79154p27115
$$ -926120 57509 2093215 3176395 2486255 1162241 418255 92122 -487032 -1214147
42035a214147k93284L05868P31381J057092J097267N71625k2897O5077L97483
$$ -1214147 -1507431 -1201563 -470182 586910 1684177 2255802 2232905 2297982 2695465
42026B695465j78943j431894j706094m82252O56087M46727k08742K9434P47104
$$ 2695465 2516522 1084628 -621466 -1103718 -447631 -904 -209646 -180212 566892
42017E66892P35374O7076l43004m65539q25800r77392j2944J523956J833893K71674
$$ 566892 1302266 1369342 1026338 560799 -265001 -1242393 -1255337 268619 2102512 2374186
42007B374186j613798j880362l12590J530078J931519O25001r59291j267551n22431
$$ 2374186 760388 -1119974 -1432564 97514 2029033 2654034 1694743 427192 -95239
41998i5239l02218r99097j053740L85504J586528P32026r30524p64638J074872
$$ -95239 -397457 -1396554 -2450294 -2064790 -478262 253764 -676760 -1441398 -366526
41989c66526J814565M63256p51229j63117P32954L7062j316390j217882N3452
$$ -366526 1448039 1911295 1160066 996949 1729903 1766965 450575 -767307 -713855
41980g13855K94898j049529j985541r60591R25295J543651O05301j28936O72940
$$ -713855 -418957 -1468486 -3454027 -4414618 -3489323 -1945672 -1340371 -1469307 -796367
41971g96367K084343K107522L87751j185144j000709Q1515J27482r61573j520533
$$ -796367 1287976 3395498 3783249 2598105 1597396 1678911 1806393 844820 -675713
41962f75713r04278l14576m52240k74064R19447J866378J240096j63814p38107
$$ -675713 -1579991 -1894567 -2346807 -2620871 -1701424 164954 1405050 1241236 503129
41953E03129n11011n43871p09636m6229J067143J099897j91453j290730j173340
$$ 503129 -7882 -551753 -1261389 -1307618 -240475 859422 667969 -622761 -1796101
41944a796101m55263O5724M80589Q42846O20059j84315o12086k68583j14385q37318
$$ -1796101 -2251364 -2185640 -1705051 -862205 -242146 -426461 -1038547 -1307130 -1421515 -2258833
41934b258833j536902j152606k54101o2015l80130m5838Q94698J131555L55453
$$ -2258833 -3795735 -4948341 -5202442 -5264457 -5644587 -5690425 -4795727 -3664172 -3308719
41925c308719m1013Q14731J713427J125743m02072j011348l14914Q3038q92372
$$ -3308719 -3349732 -2535001 -821574 304169 -97903 -1109251 -1424165 -1341127 -2233499
41916b233499k069644j658012K32169J725464J518265J69380q61406o70710O04786
$$ -2233499 -4303143 -5961155 -5728986 -4003522 -2485257 -2315877 -3177283 -3847993 -3243207
41907c243207J998554K289022J078090n25714r76306k07768K79488n00435j714417
$$ -3243207 -1244653 1044369 2122459 1596745 620439 412671 692159 191724 -1522693
41898a522693j953207r93423K62554R34752O94264j72651o73531J44783J740260
$$ -1522693 -3475900 -4469323 -4206769 -3272017 -2577753 -2750404 -3423935 -3279152 -1538892
41889a538892K256591R20756p45721j080147n11771l27607l86804R4519M19697
$$ -1538892 717699 1638455 892734 -187413 -699184 -1026791 -1413595 -1319076 -899379
41880h99379o21966k119950j880283Q0552J432902J286096J310390K222843K035084
$$ -899379 -1521345 -3641295 -5521578 -5441026 -4008124 -2722028 -1411638 811205 2846289
41871B846289m18322k706715k064018L09623R96855n76314j680902o20679J178149
$$ 2846289 2427967 -278748 -2342766 -2033143 -1036288 -1612602 -3293504 -3914183 -2736034
41862b736034J842013J518351J216735Q91916l5541j166321j321841p5209J542153
$$ -2736034 -894021 624330 1841065 2732981 2697440 1531119 209278 134069 1676222
41853A676222J942560N55317j427738k124237j007967N24306R71033M80296J54206
$$ 1676222 3618782 4174099 2746361 622124 -385843 138463 1109496 1589792 1743998
41844A743998K71737J92977l59354r44357j137139p74239K35297J464104J735155
$$ 1743998 2015735 2208712 1849358 905001 -232138 -1006377 -771080 693024 2428179
41835B428179M25864j279769j601717m50416O52691P69642L93266J57239L1935
$$ 2428179 2854043 1574274 -27443 -477859 174832 944474 1337740 1494979 1526914
41826A526914n7886k8412j82983p94068j115795j65368J399729J689949K03268
$$ 1526914 1469028 1440616 1257633 463565 -652230 -817598 582131 2272080 2475348
41817B475348j423059j698076q59050K56864J282815J621555M37709j618499k310208
$$ 2475348 1052289 -645787 -1504837 -1247973 34842 1656397 2094106 475607 -1834601
41808a834601p45573J004412O94308r21795j387398r7730J249089J310627N80484
$$ -1834601 -2580174 -1575762 -881454 -1803249 -3190647 -3288377 -2039288 -728661 -148177
41799a48177K63013Q22848J644749J506856j87454k179156k291600l01284J371217
$$ -148177 114836 937684 2582433 4089289 3901835 1722679 -568921 -870205 501012
41790E01012Q72282o22780j112118q68325j235338j644104n28045J467415K053909
$$ 501012 1373294 750514 -361604 -1229929 -2465267 -4109371 -4637416 -3170001 -1116092
41781a116092R54638K13030O51088Q08255k3629m91176Q9514L01511o99431j411805
$$ -1116092 -161454 51576 702664 1510919 1487290 996114 1085628 1387139 687708 -724097
41771g24097m97735R68277J429197J125192P17402l97197k309027k991717j002017
$$ -724097 -1221832 -253555 1175642 2300834 3018236 2621039 312012 -2679705 -3681722
41762c681722J690896K299876J398675J445263K093377O91691k560046l868550
$$ -3681722 -1990826 309050 1707725 3152988 5246365 5938056 3378010 -490540
41754d90540j438525J572244J640365k61248q29182M84917J361423O18999m05400
$$ -490540 -1929065 -356821 1283544 1022296 193114 678031 2039454 2658453 2253053
41745B253053m41888j6223o2754l99333l48341Q3569L47990J82037j82507l99264
$$ 2253053 1811165 1794942 1732188 1332855 984514 1068083 1416073 1598110 1415603 1016339
41735A016339l43953j62576l2579J09501L99936O18513L73739j72377l68190j11223
$$ 1016339 672386 509810 477231 586732 986668 1605181 1978920 1806543 1438353 1327130
41725A327130q3633n13620n75275K14387Q62970L10775o57435l31151J314211
$$ 1327130 1243497 729877 154602 368989 1231959 1542734 885299 554148 1868359
41716A868359K359418J434385p47833k542691k923525j733227L17816J590318
$$ 1868359 4227777 5662162 4914329 2371638 -551887 -2285114 -1967298 -376980
41708c76980Q27763r51719j277089L98765J735309R65476m07166j21833J082232
$$ -376980 450783 -500936 -1778025 -1379260 356049 1321525 914359 792526 1874758
41699A874758O83960j329904k162564m63996J638232J729146K78695p10876o24815
$$ 1874758 2558718 1228814 -933750 -1397746 240486 1969632 2248327 1537451 912636
41690I12636k19462J64203O45032P20730j54232j143094p63799Q07373J548679
$$ 912636 693174 857377 1502409 2223139 2068907 925813 162014 969387 2518066
41681B518066J80429k085248k982613j694235O38031K356370K599566J499840
$$ 2518066 2698495 613247 -2369366 -4063601 -3425570 -1069200 1530366 3030206
41673C030206j53939j278924j060680L19685J564693J358925j41929j285704q10617
$$ 3030206 2876267 1597343 536663 856348 2421041 3779966 3638037 2352333 1541716
41664A541716N77912J157536M38092m87140p84572q49854j070161r13455q1961
$$ 1541716 2119628 3277164 3715256 3228116 2443544 1593690 523529 -389926 -471887
41655d71887N52015K87385p1215M25690R70824J58988j373453j407098N91345
$$ -471887 80128 367513 296298 721988 1692812 1851800 478347 -928751 -337406
41646c37406K454485K167981K71897j333155j719598j200838l10627M96155P97265
$$ -337406 2117079 4285060 4556957 3223802 1504204 303366 -7261 488894 1286159
41637A286159O40734N02101L79219k36499j052206q32115O04408J471413L58847
$$ 1286159 1926893 2428994 2808213 2571714 1519508 687393 1291801 2763214 3122061
41628C122061j516252j911430o69720M58411O25341O29492Q99349O67448l72779
$$ 3122061 1605809 -305621 -975341 -516930 108411 737903 1637252 2304700 1931921
41619A931921j241145j228998r17798q66583n78663K65926P53106J50800n62470
$$ 1931921 690776 -538222 -1456020 -2322603 -2901266 -2635340 -1882234 -1731434 -2293904
41610b293904k5051J271449J631769P71264J40273M71010O21009m07208j588495
$$ -2293904 -2318955 -1047506 584263 1355527 1495800 1966810 2587819 2180611 592116
41601E92116j197683O58206K044771J605181j9852j308431j596363j332351j127680
$$ 592116 -605567 52639 2097410 3702591 3682739 2374308 777945 -554406 -1682086
41592a682086j067688q38508k05561O62652J257670J183089N83966q226k90671
$$ -1682086 -2749774 -3588282 -3793843 -3131191 -1873521 -690432 -106466 -114692 -405363
41583d05363m33277o26022o81291l33018K91960Q07545J016640R26881N16420
$$ -405363 -838640 -1464662 -2145953 -2478971 -2187011 -1379466 -362826 564055 1080475
41574A080475j09992n11107l89372j57225l50050n46301J58912J381871J364443
$$ 1080475 970483 459376 70004 -87221 -437271 -983572 -824660 557211 1921654
41565A921654n42553k412944k081164j66348R37978O73284P44416J679987J460048
$$ 1921654 1379101 -1033843 -3115007 -3281355 -2343377 -1670093 -925677 754310 2214358
41556B214358j039319l361619k539298M24509J823605N15490r08041m72601N40065
$$ 2214358 1175039 -2186580 -4725878 -4301369 -2477764 -1962274 -2870315 -3342916 -2802851
41547b802851M33320j9906N60999J390758R27504k64477m89417J10889O5986m79379
$$ -2802851 -2369531 -2389437 -1828438 -437680 489824 225347 -264070 -153181 -87195 -566574
41537e66574k4954J152276R52808r29383k061622r62962P50852J233343J018854
$$ -566574 -591528 560748 1513556 584173 -1477449 -2440411 -1689559 -456216 562638
41528E62638J078309O11049r41677j698261J3484K225703J672620j210235k820173
$$ 562638 1640947 2251996 1310319 -387942 -374458 1851245 3523865 2313630 -506543
41519e06543j702073j33133n9763n68360l54416Q7774J21492M20083J173355R39621
$$ -506543 -2208616 -2341749 -2401512 -2969872 -3324288 -3236514 -3115022 -2694939 -1521584 -581963
41509e81963r05152k370751j514345N45777J390357Q97939P60495J173130N78969
$$ -581963 -1487115 -3857866 -5372211 -4826434 -3436077 -2538138 -1777643 -604513 -25544
41500b5544j272484k365136j237151R01626J803615R11789l61992m90082O60409
$$ -25544 -1298028 -3663164 -4900315 -3998689 -2195074 -1283285 -1645277 -2135359 -1474950
41491a474950J891250J917170O61305o90605j059693o22784k82814l72209m41756
$$ -1474950 416300 2333470 2994775 2304170 1244477 621693 338879 -33330 -475086
41482d75086j35434K90549L14857k79834j086394j235993k57609J128292J662940
$$ -475086 -610520 -319971 -5114 -284948 -1371342 -2607335 -2864944 -1736652 -73712
41473g3712J151520O26574O72144O54093J51480q7611M11915O25064l95483j621365
$$ -73712 1077808 1704382 2376526 3030619 3182099 3094488 3506403 4131467 3735984 2114619
41463B114619j347964J47756R35868K32777p31133p23771M6012P53920R96987
$$ 2114619 766655 914411 1850279 2083056 1351923 628152 674164 1428084 2425071
41454B425071O58484k64632j347194j958572j928896j424655m16742R23786J686941
$$ 2425071 3083555 2818923 1471729 -486843 -2415739 -3840394 -4257136 -3333350 -1646409
41445a646409J172750J05548k57671N7623J20444l4503M58802J353043J277677
$$ -1646409 -473659 -368111 -625782 -568159 -447715 -482218 -23416 1329627 2607304
41436B607304k872j020430q36827k80172k81584m58115j75863K91338N49121Q65153
$$ 2607304 2604432 1584002 747175 467003 185419 -272696 -448559 -157221 391900 1257053
41426A257053J299543J143587J19618q35539q46684k83413N9872L7468k50339
$$ 1257053 2556596 3700183 3819801 2984262 2137578 1854165 1914037 1951505 1701166
41417A701166q61140j307416o71327P17021J055252l43214j591244q50482P92043
$$ 1701166 840026 -467390 -1138717 -421696 633556 290342 -1300902 -2151384 -1359341
41408a359341R39816m48210j136975j07240J133953J067930J96281k09031p5067
$$ -1359341 -419525 -867735 -2004710 -2111950 -977997 89933 286214 77183 2116
41399B116k37940q88111j261970p59639K09928O60994J77745n20751l38970Q81608
$$ 2116 -235824 -1123935 -2385905 -3145544 -2935616 -2274622 -2096877 -2617628 -2956598 -2074990
41389b074990K101196K227845J209262j45960j096181j513934j697565j734471
$$ -2074990 26206 2254051 3463313 3317353 2221172 707238 -990327 -2724798
41381b724798j112849N51229K216653J894266o26838k611217j602267J013788
$$ -2724798 -3837647 -3286418 -1069765 824501 197663 -2413554 -4015821 -3002033
41373c002033J890139O30106o1717P75346P90529j253138k872630j798943L61164
$$ -3002033 -1111894 -481788 -543505 231841 1022370 -230768 -3103398 -4902341 -4541177
41364d541177J002178N88135Q75233J216689O2404j467293j146085L44925O43958
$$ -4541177 -3538999 -2950864 -2075631 -858942 -796538 -2263831 -3409916 -3064991 -2421033
41355b421033N8675P47675K105603J324435j286531k063165k2276J266337m45575
$$ -2421033 -2362358 -1614683 490920 1815355 528824 -1534341 -1556617 -290280 -735855
41346g35855k416021j516088R94716K097973J551345Q75164K25971p17241p77783
$$ -735855 -3151876 -4667964 -3673248 -1575275 -23930 851234 1077205 359964 -417819
41337d17819P76687K032774J153449l27135p8485P40791n34790k910689k751864
$$ -417819 358868 2391642 3545091 3217956 3139471 3880262 3345472 434783 -2317081
41328b317081J70625J866718J93744k073952j812868M7930Q30180L10085J37997
$$ -2317081 -2146456 -279738 -85994 -2159946 -3972814 -3924884 -3094704 -2784619 -2646622
41319b646622O89999R70114Q12498J008374J516227J309884J20064r42365q00259
$$ -2646622 -1956623 -986509 -174011 834363 2350590 3660474 3780538 2838173 2037914
41310B037914K79033J008139M29053j013336j722357p08863R09732J016721o72034
$$ 2037914 2316947 3325086 3754139 2740803 1018446 309583 1219315 2236036 1564002
41301A564002k016669j364362J17737K19658j083047j789604r33477K48814M93777
$$ 1564002 -452667 -1817029 -1699292 -1479634 -2562681 -4352285 -5285762 -5036948 -4543171
41292d543171L02577P44961J603024J822503J213007N69355K90419r0679q76356
$$ -4543171 -4240594 -3495633 -1892609 -70106 1142901 1712256 2002675 1911996 1035640
41283A035640j577420j660215j247847o49054J99491J214267J620599Q38591k81910
$$ 1035640 -541780 -2201995 -3449842 -4098896 -3899405 -2685138 -1064539 -225948 -507858
41274e07858j57359J361416K440169J432012j060411k931768k902071j452881
$$ -507858 -665217 696199 3136368 4568380 3507969 576201 -2325870 -3778751
41266c778751J18654P96849L00973o81272q21135M48462J899195J754600j5436
$$ -3778751 -3660097 -2863248 -2562275 -3243547 -4064682 -3616220 -1717025 37575 22139
41257B2139j631794j839264j117467k30799R80182K444047K862468J414918m00597
$$ 22139 -1609655 -3448919 -4566386 -4797185 -3817003 -1372956 1489512 2904430 2503833
41248B503833m51916Q61604J068474o26775k063782j343785M55537J069554K47930
$$ 2503833 2051917 2913521 3981995 3355220 1291438 -52347 403190 1472744 1720674
41239A720674l96417J0970P15558P74377Q8933r22567j636606j316886J02842
$$ 1720674 1324257 1335227 2050785 2825162 2914095 1991528 354922 -961964 -859122
41230h59122J407332J242615j48506j199091r37474K03372J260310J448269L05107
$$ -859122 548210 1790825 1642319 443228 -494246 -290874 969436 2417705 2722812
41221B722812j658493k688497j558217N19556J273128N48374K51741J033025J285640
$$ 2722812 1064319 -1624178 -3182395 -2662839 -1389711 -841337 -589596 443429 1729069
41212A729069J28177r23090n10859L78825L54161m9563K57825P77060N44244M1741
$$ 1729069 1857246 934156 423297 802122 1156283 1106720 1364545 2141605 2685849 2727590
41202B727590O5539J1648o79502p83897O09838J613815L5774k625649k928794
$$ 2727590 2793129 2804777 2125275 1341378 1951216 3565031 3600805 975156 -1953638
41193a953638p46759O69715p4808q06322L039Q01408J44432p26224l14158N99671
$$ -1953638 -2700397 -2030682 -2105490 -2911812 -2908773 -2107365 -1962933 -2689157 -3003315 -2403644
41183b403644P42852N49566O91383L48988j039396j980162r90981Q54996J498369
$$ -2403644 -1660792 -1111226 -419843 -70855 -1110251 -3090413 -4081394 -3226398 -1728029
41174a728029R30632O92843J208451J520483J108542L42263l96292p69716l42740
$$ -1728029 -797397 -104554 1103897 2624380 3732922 4075185 3678893 2909177 2566437
41165B566437M97924M48948p15000j321601m23230K42469j087892k904288k317270
$$ 2566437 3064361 3513309 2798309 1476708 1053478 1295947 208055 -2696233 -5013503
41156e013503N03236K455313J879345K72311n54116o43351o41926m43779M1931
$$ -5013503 -4510267 -2054954 -175609 96702 -457414 -1100765 -1742691 -2186470 -2144539
41147b144539L13868K47721L98866P76916N66047l65408r09642l73550L91462
$$ -2144539 -1830671 -1582950 -1184084 -407168 158879 -206529 -1116171 -1489721 -1098259
41138a098259L16602k94732m02426R2167K33116m84364j184907n99640J141427
$$ -1098259 -781657 -1076389 -1478815 -1386648 -1153532 -1637896 -2822803 -3422443 -2281016
41129b281016K279045J500621k02011p97513j45751r6787j349386k135036j088035
$$ -2281016 -1971 1498650 1296639 499126 353375 256588 -1092798 -3227834 -4315869
41120d315869M43660O15709Q190K51399J029248Q86785J67036N23499J862131
$$ -4315869 -3872209 -3256500 -3248310 -2996911 -1967663 -1080878 -913842 -390343 1471788
41111A471788K299595J152170l30546j227459j691374j455164j8474J518125J325979
$$ 1471788 3771383 4923553 4593007 3365548 1674174 219010 200536 1718661 3044640
41102C044640j00947l54648R42311J404806n4431j369618r12741j17220o24440
$$ 3044640 2943693 2589045 3531356 4936162 4881731 3512113 2599372 2482152 1857712
41093A857712j355685p53426K00317j47686q95539r0252J628023J811369J76233
$$ 1857712 502027 -251399 -51082 -198768 -1094307 -1184559 443464 2254833 2431066
41084B431066r80344m41045L12583k69216j510446j736248m95654J252229K342070
$$ 2431066 1450722 1009677 1322260 1053044 -457402 -2193650 -2689304 -1437075 904995
41075I04995K200122J016154m33083j401573j726486j596163j051988j50923O64449
$$ 904995 3105117 4121271 3688188 2286615 560129 -1036034 -2088022 -2238945 -1574496
41066a574496R10924O39087K66208M6905K3941J59349J64898l88816j391780k017916
$$ -1574496 -663572 -24485 241723 288628 312569 471918 636816 248000 -1143780 -3161696
41056c161696j621409m46813Q23771J731129J977268J357296K00027o62176p62648
$$ -3161696 -4783105 -5229918 -4406147 -2675018 -697750 659546 859573 197397 -565251
41047e65251l61013K35142R51249J325802O27387q85010j800097j346683m61277
$$ -565251 -926264 -691122 260127 1585929 2213316 1328306 -471791 -1818474 -2279751
41038b279751l13958o51029n13472J59760O69089P53876O99841O44850N92621
$$ -2279751 -2593709 -3244738 -3758210 -3598450 -2929361 -2175485 -1475644 -830794 -238173
41029b38173P40778J064095R58550R32j273264j937250j669594p50848M11515
$$ -238173 502605 1566700 2525250 2526182 1252918 -684332 -2353926 -3104774 -2693259
41020b693259J272295J246747L92180m65351p00708m87408j87523J40497L82463
$$ -2693259 -1420964 -174217 217963 -247388 -948096 -1435504 -1623027 -1482530 -1100067
41011a100067L67885M52233J095614J698480J181443j1125j79347P73997P19632
$$ -1100067 -732182 -279949 815665 2514145 3695588 3684463 3505116 4279113 4998745
41002D998745j327921l158153k378176J06186J590220J326111O66348L17024l34283
$$ 4998745 3670824 512671 -1865505 -1759319 -169099 1157012 1823360 2140384 1806101
40993A806101j449778k203981k042725j163447P5953J179259J448053R27425O80618
$$ 1806101 356323 -1847658 -3890383 -5053830 -4977877 -3798618 -2350565 -1423140 -742522
40984g42522J090859R90764k17501r66455R9392J462195Q15961j130175j616501
$$ -742522 348337 1339101 1121600 155145 254537 1716732 2532693 1402518 -213983
40975b13983j57307Q62086l097j431839j791820j150987j76719R99857K025480
$$ -213983 -371290 490796 487699 -944140 -2735960 -3886947 -4063666 -3063809 -1038329
40966a038329K041605R47014k40883p53018p57484n52820k01688L1174j1871J42811
$$ -1038329 1003276 1950290 1709407 956389 198905 -353915 -555603 -524429 -536300 -393489
40956c93489O71943N95125o72399j686484q64068O87273O15914q55468j277820
$$ -393489 278454 873579 201180 -1485304 -2349372 -1662099 -1046185 -1901653 -3179473
40947c179473m1035Q42215L56180j04441K72415K18514q85104j412604j86071
$$ -3179473 -3220508 -2378293 -2022113 -2126554 -1854139 -1635625 -2520729 -3933333 -4119404
40938d119404J419984J649069Q10099J40779q1947j1925N45068J208032R31981
$$ -4119404 -2699420 -1050351 -240252 -99473 -181420 -193345 351723 1559755 2491736
40929B491736j76390p18845m96710r44956k084241j687182R08468K843650J824475
$$ 2491736 2315346 1596501 1099791 154835 -1929406 -3616588 -2708120 135530 1960005
40920A960005k32376k81050J175784J463212J77810r29962j386653k026644k264001
$$ 1960005 1727629 1446579 2622363 4085575 4263385 3333423 1946770 -79874 -2343875
40911b343875p15468J515161J482648j055009k681581j077605J686561K191190
$$ -2343875 -3059343 -1544182 -61534 -1116543 -3798124 -4875729 -3189168 -997978
40903i97978K49519j382823r54232M37600R36734M92399N48264J645664K420128
$$ -997978 -748459 -2131282 -3085514 -2647914 -1711180 -1218781 -670517 975147 3395275
40894C395275J534264j90347q30535k75566m15092k036818l291480k304785R2436
$$ 3395275 4929539 4739192 3908657 3633091 3217999 1181181 -2110299 -4415084 -4322648
40885d322648J604797J427073N71278j476j83923j03967R6994Q9943k32283m77744
$$ -4322648 -2717851 -1290778 -719500 -720976 -904899 -1008866 -911872 -821929 -1054212 -1531956
40875a531956l79489j23216K93449J126555J938520J751933O32260j95320k86315
$$ -1531956 -1911445 -2034661 -1741212 -614657 1323863 3075796 3708056 3512736 3226421
40866C226421m49472p79483k65965Q15575N65030j144376j600195M05219J868611
$$ 3226421 2776949 1997466 1731501 2547076 3112106 1967730 367535 772754 2641365
40857B641365K6848k860499k699670J82786J886418J054795P5951L77934N31215
$$ 2641365 2668213 -192286 -2891956 -2709170 -822752 232043 307994 685928 1217143
40848A217143l30402p32273K85076J297821Q07451o37393j655590j690499q03130
$$ 1217143 886741 154468 439544 1737365 2544816 1907423 251833 -1438666 -2241796
40839b241796N99523J438674R21704n8238r6649L72181j17716j210208j117483
$$ -2241796 -1642273 -203599 718105 659867 563218 935399 817683 -392525 -1510008
40830a510008J71057P17372m3285m79820K09966P86376M88574K06969L30007l7100
$$ -1510008 -1338951 -621579 -664864 -1144684 -934718 -148342 340232 547201 877208 840108
40820H40108q19105n49359P49508R40167o59163j731243o19247R56855P50338
$$ 840108 21003 -528356 221152 1161319 502156 -1229087 -1848334 -891479 -141141
40811a41141o34673j252336q38352l09041J69528P35138Q74628N28612O36984
$$ -141141 -775814 -2028150 -2866502 -3175543 -3006015 -2270877 -1396249 -867637 -230653
40802b30653J155117M21291j830989k973926j185084J361996J614728K26600N6519
$$ -230653 924464 1345755 -485234 -3459160 -4644244 -3282248 -1667520 -1440920 -1384401
40793a384401J380273J892692R14613L20433J045632J479924J24248k173846l469806
$$ -1384401 -4128 1888564 2803177 3123610 4169242 5649166 5773414 3599568 129762
40784A29762k885580j032645P38047J310166P72537K87343M67029O02524K23159
$$ 129762 -2755818 -3788463 -3050416 -1740250 -967713 -680370 -213341 389183 612342
40775F12342K25975J184668J754895M91094j691679k711874k191488j276163l94780
$$ 612342 838317 2022985 3777880 4268974 2577295 -134579 -2326067 -3602230 -3997010
40766c997010P32700J521507J176393M44877N14678O85942m05055j719567r03341
$$ -3997010 -3264310 -1742803 -566410 -121533 393145 1079087 674032 -1045535 -1948876
40757a948876J572300K517847Q52478q26567n99664l6524q93073j838412r46451
$$ -1948876 -376576 2141271 2993749 2167182 1567518 1530994 637921 -1200491 -2146942
40748b146942P15000Q15066l62792o85015M0559K0786r78926j032115M26208J212421
$$ -2146942 -1431942 -616876 -979668 -1664683 -1624124 -1603338 -2582264 -3614379 -3188171 -1975750
40738a975750r3953j453586k53025K463924L127138P16795j712855j293558Q73836
$$ -1975750 -2069703 -3523289 -3776314 -1312390 1814748 2531543 818688 -474870 398966
40729C98966J681328M10051q57814p15105r8457j01849j59240M56619Q73058l9158
$$ 398966 2080294 2490345 1632531 917426 818969 717120 557880 1014499 1887557 1848399
40719A848399j465258j494255J62556J806490K046435J120652j28555j243810
$$ 1848399 383141 -1111114 -948558 857932 2904367 4025019 3896464 2652654
40711B652654j789589j275760j04754L80103m09726j283028q30637M87399R01228
$$ 2652654 863065 -412695 -517449 -137346 -547072 -1830100 -2660737 -2173338 -1272110
40702a272110r8753r16798j13863J411662J618399L20168m74438M28037J560679
$$ -1272110 -1370863 -2287661 -2401524 -989862 628537 948705 474267 902304 2462983
40693B462983J061979m44089r41459k37809L6930n30406m63768P26585J322011
$$ 2462983 3524962 3080873 2139414 1901605 1938535 1408129 944361 1670946 2992957
40684B992957J99531j161544j048354k34421m70413j492742j569768l10986R91450
$$ 2992957 3192488 2030944 982590 748169 277756 -1214986 -2784754 -3095740 -2104290
40675b104290J468373J421435J119474L44959p79246j599210j638199q88798K72531
$$ -2104290 -635917 785518 1904992 2249951 1470705 -128505 -1766704 -2655502 -2382971
40666b382971J009945O33211k08083q1699Q21928M78218j623960k839345r90024
$$ -2382971 -1373026 -739815 -947898 -1029597 -207669 270549 -1353411 -4192756 -5182780
40657e182780K057888K901216J409297K66699N65936Q46845K46310l30598m08414
$$ -5182780 -3124892 -223676 1185621 1452320 2018256 2865101 3111411 2780813 2372399
40648B372399p19174j367692j466172r58452p22836o34385L26172J792261K049491
$$ 2372399 1653225 285533 -1180639 -2139091 -2861927 -3496312 -3170140 -1377879 671612
40639F71612P17186o98099j226065j317093j117232j42144J035638J106407L57546
$$ 671612 1388798 690699 -535366 -1852459 -2969691 -3111835 -2076197 -969790 -612244
40630f12244L21208Q70889L50923j045477j038946Q46993K199797J560485L67096
$$ -612244 -291036 579853 930776 -114701 -1153647 -306654 1893143 3453628 3820724
40621C820724j10865o80256j638263j468170O9751O41335p95218j865079q39197
$$ 3820724 3709859 3029603 1391340 -76830 -7079 634256 -160962 -2026041 -2865238
40612b865238K48079o95553j931147r66079J010640J336724M57535O20532J645812
$$ -2865238 -2617159 -3312712 -5243859 -6209938 -5199298 -3862574 -3405039 -2784507 -1138695
40603a138695J692466R21598P48906N81012j000486k733202k165939j2056Q32924
$$ -1138695 553771 1475369 2224275 2805287 1804801 -928401 -3094340 -3106396 -2273472
40594b273472K01593N74351K136985K105796l44442k386894j956518m50055L06824
$$ -2273472 -2071879 -1497528 639457 2745253 2400811 13917 -1942601 -2392656 -2085832
40585b085832O62186J203247J067709q4013p94354j72011N57743L59974J47245
$$ -2085832 -1423646 -220399 847310 763297 -31057 -203068 354675 714649 861894
40576H61894O24634M59698j378861l090539k120872J079304L339910K530565l41857
$$ 861894 1486528 1946226 567365 -2523174 -4644046 -3564742 -224832 2305733 1963876
40567A963876k630597k672536r86653N76824Q51370M32126M26374O72432K05656
$$ 1963876 -666721 -3339257 -4325910 -3749086 -2897716 -2465590 -2039216 -1366784 -1161128
40558a161128r06294j558672j313357p36999j24922O79262J265055R73531K03438
$$ -1161128 -2067422 -3626094 -4939451 -5676450 -5801372 -5122110 -3857055 -2883524 -2680086
40549b680086q7471n371k41622l73137L74256J083842L01533j006394m92246J460508
$$ -2680086 -2767557 -2772928 -3014550 -3387687 -3013431 -1929589 -1628056 -2634450 -3126696 -1666188
40539a666188J817561k86872k035496j322864M62395J410550J711365J654087
$$ -1666188 151373 -135499 -2170995 -3493859 -3031464 -1620914 90451 1744538
40531A744538K33042k119514k553519j60015J645151J27142k155201j342785J498067
$$ 1744538 1977580 -141934 -2695453 -2855468 -1210317 -1083175 -3238376 -4581161 -3083094
40522c083094K341713P59976l3367R86572J297050l85120j950929j526048n8551
$$ -3083094 -741381 18595 -14772 971800 2268850 1883730 -67199 -1593247 -1651798
40513a651798Q51566J112727J050449L54806q28201j480973j156600m17400M09108
$$ -1651798 -800232 312495 1362944 1717750 889549 -591424 -1748024 -2165424 -1756316
40504a756316J322485J548780L28632j155378q53378R19067J648218M31872q24664
$$ -1756316 -433831 1114949 1443581 288203 -565175 353892 2002110 2433982 1609318
40495A609318p04373k61686o37895j052808n79194J12800K72468N20625J287132
$$ 1609318 904945 643259 5364 -1047444 -1626638 -1513838 -1241370 -720745 566387
40486E66387J505137M64846n93359m20721J33420k70575j042944p80453K29993
$$ 566387 2071524 2536370 1943011 1522290 1655710 1385135 342191 -438262 -208269
40477b08269O07224K29817P1364K27753j8438n13860m10958J48378K08659k06138
$$ -208269 398955 628772 700136 927889 909451 395591 -15367 133011 341670 135532
40467A35532q9972O85700J039031M25860m47598r39100j235758j456614j150161
$$ 135532 45560 731260 1770291 2196151 1748553 809453 -426305 -1882919 -3033080
40458c033080j64370Q74294J340296J169325N18250l36842p55999l54549J31739
$$ -3033080 -3197450 -2323156 -982860 186465 704715 367873 -388126 -742675 -610936
40449f10936k55782r09635k45329J574773K230099N04531j626594j667086j55805
$$ -610936 -866718 -1776353 -2021682 -446909 1783190 2287721 661127 -1005959 -1161764
40440a161764L42042q57044j784121j010634M21184R71591Q41402J062079J502302
$$ -1161764 -819722 -1676766 -3460887 -4471521 -4050337 -3078746 -2237344 -1175265 327037
40431C27037J210957J95219n17405m88451l62017n87632o61809o6545P66560R65267
$$ 327037 1537994 1733213 1215808 727357 365340 -222292 -884101 -950646 -184086 781181
40421G81181K78484p80060j529432j513759o01096Q73719K139077K451390J610002
$$ 781181 1059665 279605 -1249827 -2763586 -3364682 -2490963 -351886 2099504 3709506
40412C709506P0900j304268j750469j202233l29486L60857J155288K203645K387448
$$ 3709506 3780406 2476138 725669 -476564 -806050 -445193 710095 2913740 5301188
40403E301188M81652k460100l586149j923712O0313n2631j114355m71862J534433
$$ 5301188 5782840 3322740 -263409 -2187121 -2126808 -2179439 -3293794 -3765656 -2231223
40394b231223J934807q1396j647786m56464J916418K505268R67536p41385j407560
$$ -2231223 -296416 -377812 -2025598 -2482062 -565644 1939624 2907160 2165775 758215
40385G58215j278320n51207P84415J821961J323522l64387j447470j009210N1345
$$ 758215 -520105 -1071312 -286897 1535064 2858586 2494199 1046729 37519 88864
40376H8864O49312P96311Q17766N18854j43763n15932k10212Q3261l83920j087702
$$ 88864 738176 1534487 2352253 2871107 2727344 2211412 2001200 2084461 1700541 612839
40366F12839q48846M25840J492279J341245L42335m28878n13028l25579l27339
$$ 612839 -236007 189833 1682112 3023357 3365692 2936814 2423786 2098207 1770868
40357A770868l93120j41337L52069M84685j46966j147763j665508j319839o05288
$$ 1770868 1377748 1236411 1588480 2073165 1926199 778436 -887072 -2206911 -2812199
40348b812199k46742k38090K00947J469637K601000K107051Q5244j322145m82852
$$ -2812199 -3058941 -3297031 -3096084 -1626447 974553 3081604 3166848 1844703 1361851
$$ [...]
##END NTUPLES=NMR SPECTRUM
##END=
