##TITLE=31Pdec_LR-683A-H
 D2O, 24 sc
 18.9.2019
##JCAMPDX= 6.0         $$ Bruker NMR JCAMP-DX V2.0
##DATA TYPE= NMR SPECTRUM
##DATA CLASS= NTUPLES
##ORIGIN= UXNMR, Bruker Analytische Messtechnik GmbH
##OWNER= root
$$ XWIN-NMR		Version 3.5
$$ Wed Sep 18 14:26:28 2019 Russian Standard Time (UT+4h)  she@DPX200
##.OBSERVE FREQUENCY= 81.013821
##.OBSERVE NUCLEUS= ^31P
##.ACQUISITION MODE= SIMULTANEOUS
##.ACQUISITION SCHEME= undefined
##.AVERAGES= 24
##.DIGITISER RES= 17
##SPECTROMETER/DATA SYSTEM= spect
##.PULSE SEQUENCE= zgpg30
##.SOLVENT NAME= CDCl3
##.SHIFT REFERENCE= (INTERNAL, CDCl3, 0, 182.463)
##AUDIT TRAIL= $$ (NUMBER, WHEN, WHO, WHERE, WHAT)
$$ ##TITLE= Audit trail, XWIN-NMR		Version 3.5
$$ ##JCAMPDX= 5.01
$$ ##ORIGIN= Bruker BioSpin GmbH
$$ ##OWNER= she
$$ F:/spectra/data/she/nmr/P31/1/pdata/1/auditp.txt
$$ ##AUDIT TRAIL=  $$ (NUMBER, WHEN, WHO, WHERE, WHAT)
(   1,<2019-09-18 14:24:58.79 +0400>,<she>,<DPX200>,
      <created by zg, POWCHK disabled, PULCHK disabled
       configuration hash MD5:
       00 E9 B6 7A A2 85 ED C7 34 08 36 98 17 FE 4E 26
       data hash MD5: 32K
       55 0C 9E 9E D4 36 CD B1 16 BB A4 74 E0 80 60 69>)
(   2,<2019-09-18 14:25:01.35 +0400>,<she>,<DPX200>,
      <Start of raw data processing
       efp BC_mod = 2 LB = 1 FT_mod = 6 PKNL = 1 PHC0 = -417.0976 PHC1 = 103.8003 SI = 64K 
       data hash MD5: 64K
       0B 00 07 B7 DF 00 09 3C 49 ED B5 F7 B5 1E 87 8F>)
(   3,<2019-09-18 14:25:15.39 +0400>,<she>,<DPX200>,
      <pk PHC0 = 0.07536657 PHC1 = 0 
       data hash MD5: 64K
       C5 0C D4 69 FF EB 92 2D F4 98 90 BE 68 3F 4E 9F>)
(   4,<2019-09-18 14:25:19.17 +0400>,<she>,<DPX200>,
      <abs ABSG = 5 
       data hash MD5: 64K
       4B DC 78 BA EF 8B B5 8F 5C FF 71 52 89 C1 F6 09>)
$$ ##END=
$$ 
$$ hash MD5
$$ B4 E6 93 CC FE AF 95 CB DC 28 1F 90 C9 55 6B FE
##$RELAX= 
##$RELAX= 
##$RELAX= 
##$RELAX= 
##$RELAX= 
##$RELAX= 
##$RELAX= 
##$RELAX= 
$$ Bruker specific parameters
$$ --------------------------
##$DU= <F:/spectra>
##$EXPNO= 1
##$NAME= <P31>
##$PROCNO= 1
##$TYPE= <nmr>
##$USER= <she>
##$AMP= (0..31)
100 100 100 100 100 100 100 100 100 100 100 100 100 100 100 100 100 100 
100 100 100 100 100 100 100 100 100 100 100 100 100 100 
##$AQSEQ= 0
##$AQ_mod= 1
##$AUNM= <au_zg>
##$AUTOPOS= <>
##$BF1= 81.014009
##$BF2= 200.13
##$BF3= 200.13
##$BF4= 200.13
##$BF5= 200.13
##$BF6= 200.13
##$BF7= 200.13
##$BF8= 200.13
##$BYTORDA= 1
##$CFDGTYP= 0
##$CFRGTYP= 5
##$CHEMSTR= <none>
##$CNST= (0..31)
1 1 145 1 1 1 1 1 1 1 1 1 1 1 1 1 1 1 1 1 1 1 1 1 1 1 1 1 1 1 1 1 
##$CPDPRG= <waltz16>
##$CPDPRG1= <>
##$CPDPRG2= <waltz16>
##$CPDPRG3= <>
##$CPDPRG4= <mlev>
##$CPDPRG5= <mlev>
##$CPDPRG6= <mlev>
##$CPDPRG7= <mlev>
##$CPDPRG8= <mlev>
##$CPDPRGB= <>
##$CPDPRGT= <>
##$D= (0..31)
0 1 0 0 0 0 0 0 0 0 0 0.03 2e-05 3e-06 0 0 0 0 0 0 0 0 0 0 0 0 0 0 0 0 
0 0 
##$DATE= 1568802298
##$DBL= (0..7)
120 120 120 11 120 120 24 19 
##$DBP= (0..7)
150 150 150 150 150 150 150 150 
##$DBP07= 0
##$DBPNAM0= <>
##$DBPNAM1= <>
##$DBPNAM2= <>
$$ [...]
##$SUBNAM3= <"">
##$SUBNAM4= <"">
##$SUBNAM5= <"">
##$SUBNAM6= <"">
##$SUBNAM7= <"">
##$SUBNAM8= <"">
##$SUBNAM9= <"">
##$SW= 369.568048894756
##$SWIBOX= (0..15)
0 1 3 0 0 0 0 0 0 0 0 0 0 0 0 0 
##$SW_h= 29940.119760479
##$TD= 32768
##$TD0= 1
##$TE= 0
##$TE2= 300
##$TE3= 300
##$TEG= 300
##$TL= (0..7)
0 120 53 12 22 120 120 120 
##$TP= (0..7)
150 150 150 150 150 150 150 150 
##$TP07= 0
##$TPNAME0= <>
##$TPNAME1= <>
##$TPNAME2= <>
##$TPNAME3= <>
##$TPNAME4= <>
##$TPNAME5= <>
##$TPNAME6= <>
##$TPNAME7= <>
##$TPOAL= (0..7)
0.5 0.5 0.5 0.5 0.5 0.5 0.5 0.5 
##$TPOFFS= (0..7)
0 0 0 0 0 0 0 0 
##$TUNHIN= 0
##$TUNHOUT= 0
##$TUNXOUT= 0
##$USERA1= <user>
##$USERA2= <user>
##$USERA3= <user>
##$USERA4= <user>
##$USERA5= <user>
##$V9= 5
##$VALIST= <valist>
##$VCLIST= <CCCCCCCCCCCCCCC>
##$VD= 0
##$VDLIST= <DDDDDDDDDDDDDDD>
##$VPLIST= <PPPPPPPPPPPPPPP>
##$VTLIST= <TTTTTTTTTTTTTTT>
##$WBST= 1024
##$WBSW= 4
##$XGAIN= (0..3)
0 0 0 0 
##$XL= 0
##$YL= 0
##$YMAX_a= 12858
##$YMIN_a= -13182
##$ZGOPTNS= <>
##$ZL1= 120
##$ZL2= 120
##$ZL3= 120
##$ZL4= 120
##$ABSF1= 182.463
##$ABSF2= -187.1042
##$ABSG= 5
##$ABSL= 3
##$ALPHA= 0
##$AQORDER= 0
##$ASSFAC= 0
##$ASSFACI= 0
##$ASSFACX= 0
##$ASSWID= 0
##$AUNMP= <proc_1d>
##$AZFE= 0.1
##$AZFW= 0.5
##$BCFW= 0
##$BC_mod= 2
##$BYTORDP= 0
##$COROFFS= 0
##$CY= -3
##$DATMOD= 1
##$DC= 0
##$DFILT= <>
##$DTYPP= 0
##$F1P= 0
##$F2P= 0
##$FCOR= 1
##$FTSIZE= 65536
##$FT_mod= 6
##$GAMMA= 0
##$GB= 0
##$INTBC= 1
##$INTSCL= 5.30512e-09
##$ISEN= 30
##$LB= 1
##$LEV0= 0
##$LPBIN= 0
##$MAXI= 10000
##$MC2= 0
##$MEAN= 0
##$ME_mod= 0
##$MI= 50
##$NCOEF= 0
##$NC_proc= -6
##$NLEV= 6
##$NOISF1= 182.463
##$NOISF2= 159.3651
##$NSP= 0
##$NTH_PI= 0
##$NZP= 0
##$OFFSET= 182.463
##$PC= 4
##$PHC0= -417.0222
##$PHC1= 103.8003
##$PH_mod= 1
##$PKNL= yes
##$PPARMOD= 0
##$PSCAL= 0
##$PSIGN= 0
##$REVERSE= no
##$SF= 81.0140089999434
##$SI= 65536
##$SIGF1= 159.3651
##$SIGF2= -187.1042
##$SINO= 113.3802
##$SIOLD= 16384
##$SREGLST= <1H.CDCl3>
##$SSB= 0
##$STSI= 65536
##$STSR= 0
##$SW_p= 29940.119760479
##$SYMM= 0
##$S_DEV= 0
##$TDeff= 32768
##$TDoff= 0
##$TI= <>
##$TILT= no
##$TM1= 0
##$TM2= 0
##$TOPLEV= 0
##$USERP1= <user>
##$USERP2= <user>
##$USERP3= <user>
##$USERP4= <user>
##$USERP5= <user>
##$WDW= 1
##$XDIM= 65536
##$YMAX_p= 504197614
##$YMIN_p= -51510878
$$ End of Bruker specific parameters
$$ ---------------------------------
##NTUPLES= NMR SPECTRUM
##VAR_NAME=  FREQUENCY,     SPECTRUM/REAL,   SPECTRUM/IMAG
##SYMBOL=    X,             R,               I
##VAR_TYPE=  INDEPENDENT,   DEPENDENT,       DEPENDENT
##VAR_FORM=  AFFN,          ASDF,            ASDF
##VAR_DIM=   65536,         65536,           65536
##UNITS=     HZ,            ARBITRARY UNITS, ARBITRARY UNITS
##FACTOR=    0.456856943014862, 1,           1
##FIRST=     14782.0589164792, 0,            0
##LAST=      -15158.0608439998, 0,           0
##MIN=       -15158.0608439998, -51510878,   0
##MAX=       14782.0589164792, 504197614,    0
$$ Real data points
##PAGE= N=1
##DATA TABLE= (X++(R..R)), XYDATA
$$ [...]
$$ plain form
42860 1167467 900082 1890494 3800267 4825097 3594820 1362043 910061 2727005 3900639
42851 3900639 2140771 -607033 -659992 2235154 4761538 4762797 3385210 2170802 919797
42842 919797 -357719 -90675 2156029 3681376 1946063 -1360496 -2276210 -47122 2069984
42833 2069984 1593640 -244521 -1233495 -1558934 -2719215 -4405656 -4506977 -2102843 1034246
42824 1034246 2409369 1511391 7992 -405746 265109 822799 535238 -305179 -1272044
42815 -1272044 -2395944 -3560896 -4075772 -3534364 -2661128 -2521226 -3030571 -2924489 -1241982
42806 -1241982 1612392 4274529 5541678 5190047 4010159 2948345 2090634 877489
42798 877489 -530056 -910857 323076 1824466 1778953 325657 -601815 253934 2211212
$$ packed form
42860A167467k67385R90412J909773J024830j230277k232777m51982J816944J173634
42851C900639j759868k747804n2959K895146K526384J259j377587j214408j251005
42842I19797j277516K67044K246704J525347j735313l306559r15714K229088K117106
42833B069984m76344j838161r88974l25439j160281j686441j01321K404134L137089
42824A034246J375123q97978j503399m13738O70855N57690k87561q40417r66865
42815a272044j123900j164952n14876N41408Q73236J39902n09345J06082J682507
42806a241982K854374K662137J267149l51631j179888j061814q57711j213145
42798H77489j407545l80801J233933J501390m5513j453296r27472Q55749J957278
$$ plain form
42789 2211212 3843544 4371000 3752032 2493608 1698663 2304185 3805314 4558434 3764019
42780 3764019 2308712 1223421 332574 -803637 -1543303 -922807 688864 1840271 1810627
42771 1810627 1201313 659983 -6472 -1005904 -1579404 -662035 1547599 3327996 3125853
42762 3125853 1295185 -257969 -152354 1191777 2449124 2920868 2705936 1964590 881787
42753 881787 59671 -17224 197942 209 -175309 698013 2192355 2496349 1179722
42744 1179722 313215 1598814 3672347 3941731 2270224 870602 838380 905208 35122
42735 35122 -706358 -2482 1332703 1283798 -581178 -2493016 -2603332 -879878 1206573
42726 1206573 2278101 2118111 1476103 1059676 769261 -18145 -1500444 -3069192 -3920758
$$ packed form
42789B211212J632332N27456o18968j258424p94945O05522J501129P53120p94415
42780C764019j455307j085291q90847j136211p39666O20496J611671J151407k9644
42771A810627o09314n41330o66455r99432n73500R17369K209634J780397k02143
42762C125853j830668j553154J05615J344131J257347M71744k14932p41346j082803
42753H81787q22116p6895K15166j97733j75518Q73322J494342L03994j316627
42744A179722q66507J285599K073533K69384j671507j399622l2222O6828q70086
42735C5122p41480P03876J335185m8905j864976j911838j10316J723454K086451
42726A206573J071528j59990o42008m16427k90415p87406j482299j568748q51566
$$ plain form
42717 -3920758 -3752658 -2788153 -1482625 -370685 168078 254666 346850 521226 251270
42708 251270 -817486 -2190577 -2985605 -2858797 -2176701 -1525511 -1384452 -1965126 -2847944
42699 -2847944 -2952911 -1494476 944349 2752151 2865100 1708695 502121 -29276 -105087
42690 -105087 -362844 -1122412 -2055790 -2440250 -1783846 -251572 1504266 2786665 3079215
42681 3079215 2220110 785636 65613 994096 2980197 4313550 3948216 2509997 1390656
42672 1390656 1273640 1746694 1918572 1159754 -331649 -1432107 -1049647 502182 1655131
42663 1655131 1516622 930353 943753 1038140 68800 -1556567 -2182729 -1382952 -535074 -473397
42653 -473397 -108507 1665429 3941649 4941563 4297107 2837236 843549 -1750836 -3706105
$$ packed form
42717c920758J68100R64505J305528J111940N38763Q6588R2184J74376k69956
42708B51270j068756j373091p95028J26808O82096O51190J41059n80674q82818
42699b847944j04967J458435K438825J807802J12949j156405j206574n31397p5811
42690a05087k57757p59568r33378l84460O56404J532274J755838J282399K92550
42681C079215q59105j434474p20023R28483J986101J333353l65334j438219j119341
42672A390656j17016M73054J71878p58818j491403j100458L82460J551829J152949
42663A655131j38509n86269J3400R4387r69340j625367o26162P99777Q47878O1677
42653d73397L64890J773936K276220R99914o44456j459871j993687k594385j955269
$$ plain form
42644 -3706105 -3034494 187283 3131369 3356983 1620940 567441 1443928 3249043 4539102
42635 4539102 4720483 3691515 1587159 -697560 -1766724 -1241071 -488468 -1179490 -3361752
42626 -3361752 -5469909 -6046679 -4932732 -2850587 -467150 1801136 3432949 3845804
42618 3845804 2998117 1690866 927981 946372 1147717 1089494 1185924 2064073 3459518 4306178
42608 4306178 3961484 2849725 1769748 1097532 949183 1582641 3061975 4741162 5574340
42599 5574340 4917426 2867734 159646 -1978682 -2387003 -1046668 677407 1455862 1344700
42590 1344700 1129125 910451 416698 262742 1362782 3044028 3377862 1881929 372538
42581 372538 369129 1088318 1007526 45152 -1061702 -2266848 -3573009 -3964309 -2712779
$$ packed form
42644c706105O71611L221777K944086K25614j736043j053499Q76487J805115J290059
42635D539102J81381j028968k104356k284719j069164N25653P52603o91022k182262
42626c361752k108157n76770J113947K082145K383437K268286J631813M12855
42618C845804q47687j307251p62885J8391K01345n8223R6430Q78149J395445Q46660
42608D306178l44694j111759j079977o72216j48349O33458J479334J679187Q33178
42599E574340o56914k049692k708088k138328m08321J340335J724075P78455j11162
42590A344700k15575k18674m93753j53956J100040J681246L33834j495933j509391
42581C72538l409P19189q0792r62374j106854j205146j306161l91300J251530
$$ plain form
42572 -2712779 -929626 -71718 289769 1292697 2247963 1708793 509919 836259 2210253
42563 2210253 1541855 -2006420 -5201519 -5206960 -3179935 -1578178 -372407 1589995 3351305
42554 3351305 2896212 550537 -1256939 -1324092 -761806 -997207 -2319923 -4052515 -4760290
42545 -4760290 -2958076 842016 3544503 2662001 -582292 -3046739 -3679965 -3708733 -3724752
42536 -3724752 -3142155 -2174389 -1785946 -1729755 -1001143 -113341 -405638 -1209083 -535193 1304228
42526 1304228 1864247 768263 371853 1334447 1111249 -1513360 -3824693 -3346596 -1539202
42517 -1539202 -759788 -418702 790891 1463547 -57458 -1811758 -838522 1660185 1925105
42508 1925105 -314645 -1682751 -985261 -811590 -2438955 -3266048 -1168626 1907549 2976244
$$ packed form
42572b712779J783153Q57908L61487J002928R55266n39170j198874L26340J373994
42563B210253o68398l548275l195099n441K027025J601757J205771J962402J761310
42554C351305m55093k345675j807476o7153N62286k35401j322716j732592p07775
42545d760290J802214L800092K702487q82502l244293k464447o33226k8768j6019
42536c724752N82597R67766L88443N6191P28612Q87802k92297q03445O73890J839421
42526A304228N60019j095984l96410R62594k23198k624609k311333M78097J807394
42517a539202P79414L41086J209593O72656j521005j754300R73236K498707K64920
42508A925105k239750j368106O97490J73671j627365q27093K097422L076175J068695
$$ plain form
42499 2976244 2109841 1180921 524105 -623144 -1684930 -1285953 320449 1450155 1459539
42490 1459539 1344846 1828883 2256156 1739542 470024 -544721 -593280 152709 977998
42481 977998 1407675 1566676 1690552 1590607 1046843 488037 636012 1570588 2766280 3891140
42471 3891140 4858153 5308001 4905253 3954654 2830502 1173213 -1158389 -2796672 -2239289
42462 -2239289 -396776 195535 -1028218 -1921987 -1047159 371296 914746 1166752 1912997
42453 1912997 2188808 1095235 -145170 -174104 -62251 -1338397 -2640816 -1342584 2005337
42444 2005337 3984217 3185121 1762620 1521649 1460726 493167 -133889 859680 2128493
42435 2128493 1658951 35217 -571980 146281 482934 -341549 -1262581 -1518143 -1770792
$$ packed form
42499B976244q66403r28920o56816j147249j061786L98977J606402J129706R384
42490A459539j14693M84037M27273n16614j269518j014745m8559P45989Q25289
42481I77998M29677J59001J23876r9945n43764n58806J47975R34576J195692J124860
42471C891140R67013M49848m02748r50599j124152j657289k331602j638283N57383
42462b239289J842513N92311j223753q93769Q74828J418455N43450K52006P46245
42453A912997K75811j093573j240405k8934J11853j276146j302419J298232L347921
42444B005337J978880p99096j422501k40971o0923r67559o27056R93569J268813
42435B128493m69542j623734o07197P18261L36653q24483r21032k55562k52649
$$ plain form
42426 -1770792 -2591137 -3410317 -3659159 -3673672 -3744848 -3360523 -2180510 -846563 -27865
42417 -27865 488139 931026 733379 -241524 -485030 1492810 4545026 5683373 3801083
42408 3801083 1048002 -117956 241310 663069 827760 1350686 1858878 1252449 -139970
42399 -139970 -497427 839487 2139647 1643811 48680 -580941 248877 944396 204195
42390 204195 -1220715 -1582310 -291875 1542683 2519399 2400307 2025562 2017631 1985965 1259363
42380 1259363 117801 -321967 382184 1155960 600033 -1207598 -2712242 -2801933 -2207465
42371 -2207465 -2528280 -4073243 -5352798 -5017670 -3688550 -3047595 -3386162 -3272357 -1992483
42362 -1992483 -991455 -1789162 -3422951 -3553426 -1769459 -127964 -282864 -1668338 -2976112
$$ packed form
42426a770792q20345q19180k48842j4513p1176L84325J180013J333947Q18698
42417b7865N16004M42887j97647r74903k43506J977840L052216J138347j882290
42408C801083k753081j165958L59266M21759J64691N22926N08192o06429j392419
42399a39970l57457J336914J300160m95836j595131o29621Q29818O95519p40201
42390B04195j424910l61595J290435J834558R76716j19092l74745p931l1666p26602
42380A259363j141562m39768P04151P73776n55927j807631j504644q9691N94468
42371b207465l20815j544963j279555L35128J329120O40955l38567J13805J279874
42362a992483J001028p97707j633789j30475J783967J641495j54900j385474j307774
$$ plain form
42353 -2976112 -3874753 -4419560 -4134210 -2908227 -1864479 -2021256 -2649936 -2170191 -344541
42344 -344541 1497814 2227135 1947367 1362273 919945 599809 67231 -775554 -1144073
42335 -1144073 -705 2102472 2797087 634140 -2734765 -4485572 -4124607 -3472334 -3596825
42326 -3596825 -3730194 -3315466 -3095897 -3497560 -3631114 -2826307 -1795987 -1351736 -1205844
42317 -1205844 -992498 -1209889 -2001153 -2208404 -1053824 263399 288571 -178986 778462
42308 778462 2947738 3981417 2853403 1342587 1354959 2447677 3104089 3146462 3463848
42299 3463848 4096729 4048059 2836668 1154719 -24326 -209508 619930 1949751 2675048
42290 2675048 1978775 423649 -598607 -691727 -904301 -2014279 -3234616 -3295821 -2157897
$$ packed form
42353b976112q98641n44807K85350J225983J043748j56777o28680M79745J825650
42344c44541J842355P29321k79768n85094m42328l20136n32578q42785l68519
42335a144073J143368K103177O94615k162947l368905j750807L60965O52273j24491
42326c596825j33369M14728K19569m01663j33554Q04807J030320M44251J45892
42317a205844K13346k17391p91264k07251J154580J317223K5172m67557R57448
42308G78462K169276J033679j128014j510816J2372J092718O56412M2373L17386
42299C463848O32881m8670j211391j681949j179045j85182Q29438J329821P25297
42290B675048o96273j555126j022256r3120k12574j109978j220337o1205J137924
$$ plain form
42281 -2157897 -826492 56945 487882 251225 -1035481 -2847569 -3747632 -2999494 -1532589
42272 -1532589 -740853 -808485 -829900 -275902 313704 99182 -1000292 -2097309 -2101610 -854544
42262 -854544 461582 461366 -684168 -1166141 284917 2617698 3631182 2676236 1210210
42253 1210210 532943 38916 -1534491 -3797603 -4798375 -3489682 -1146735 185681
42245 185681 -26465 -832471 -1542111 -2179825 -2227731 -543021 2558867 4459320 3047361
42236 3047361 -314036 -2348817 -2031969 -1231582 -1202487 -841568 676087 1801159 870897
42227 870897 -1165501 -2253648 -2278090 -2482412 -2741013 -1859434 -318881 -223046 -2095715
42218 -2095715 -3854707 -3723075 -2429131 -1674630 -1919516 -2613095 -3332352 -3705745 -3274052
$$ packed form
42281b157897J331405Q83437M30937k36657j286706j812088r00063P48138J466905
42272a532589P91736o7632k1415N53998N89606k14522j099474j097017m301J247066
42262h54544J316126k16j145534m81973J451058K332781J013484r54946j466026
42253A210210o77267m94027j573407k263112j000772J308693K342947J332416
42245A85681k12146q06006p09640o37714m7906J684710L101888J900453j411959
42236C047361l361397k034781L16848Q00387K9095L60919J517655J125072r30262
42227H70897k036398j088147k4442k04322k58601Q81579J540553R5835j872669
42218b095715j758992J31632J293944P54501k44886o93579p19257l73393M31693
$$ plain form
42209 -3274052 -2371674 -2221600 -3284740 -4403902 -4435050 -3807312 -3510754 -3429701 -2826094
42200 -2826094 -1792400 -1011593 -513890 181858 966848 1231755 894236 429007 41186
42191 41186 -321123 -315503 478165 1634244 2229937 2251150 2765032 4345305 6006398 6193833
42181 6193833 4498926 2022434 211749 -395411 -349153 -460976 -950920 -1386617 -1246164
42172 -1246164 -385821 816646 1526192 1013660 -347546 -1059903 -295770 663491 23303
42163 23303 -1617350 -1625746 933943 3692470 4187059 3106680 2715702 3272074 3143882
42154 3143882 1959801 1377049 2443594 4071974 4794103 4558379 3959931 2899133 1096820
42145 1096820 -771147 -1558619 -1084834 -319685 -129444 -359176 -281984 378712 1150042
$$ packed form
42209c274052R02378J50074j063140j119162l1148O27738K96558Q1053O03607
42200b826094J033694P80807M97703O95748P84990K64907l37519m65229l87821
42191D1186l62309N620P93668J156079N95693K1213N13882J580273J661093J87435
42181F193833j694907k476492j810685o07160M6258j11823m89944m35697J40453
42172a246164Q60343J202467P09546n12532j361206p12357P64133R59261o40188
42163B3303j640653q396K559689K758527M94589j080379l90978N56372j28192
42154C143882j184081n82752J066545J628380P22129k35724n98448j060798j802313
42145A096820j867967p87472M73785P65149J90241k29732P7192O60696P71330
$$ plain form
42136 1150042 1479495 1365153 1024271 218607 -1380377 -3087134 -3364577 -1654486 617107
42127 617107 1575374 978659 108261 58477 887855 2047769 2815578 2593806 1577975
42118 1577975 897748 1391788 2520767 3129529 2859510 2128417 1287681 609939 454089
42109 454089 545557 -70161 -1278179 -1235642 899090 2702379 1271394 -2384244 -4429684
42100 -4429684 -3552617 -2329100 -2825149 -3855497 -3788437 -3309992 -3633962 -4190266 -4040823
42091 -4040823 -3767872 -3972578 -3506449 -1309889 1288486 2202599 1441527 367241 -752462
42082 -752462 -2258984 -3152913 -2060399 359786 2166599 2845264 3205919 3216113 2300913
42073 2300913 1297998 1479348 1870300 381552 -2332621 -3231350 -1658215 -578601 -1854739
$$ packed form
42136A150042L29453j14342l40882q05664j598984j706757k77443J710091K271593
42127F17107R58267n96715q70398m9784Q29378J159914P67809k21772j015831
42118A577975o80227M94040J128979O08762k70019p31093q40736o77742j55850
42109D54089R1468o15718j208018M2537K134732J803289j430985l655638k045440
42100d429684Q77067J223517m96049j030348O7060M78445l23970n56304J49443
42091d040823K72951k04706M66129K196560K598375R14113p61072j074286j119703
42082g52462j506522q93929J092514K420185J806813O78665L60655J0194r15200
42073B300913j002915J81350L90952j488748k714173q98729J573135J079614j276138
$$ plain form
42064 -1854739 -3309181 -2343947 81877 1345288 1026152 485360 103632 -581854 -983504
42055 -983504 -64846 1691222 2838607 2964096 2433545 940733 -1674477 -3788359 -3460938
42046 -3460938 -1389419 -247178 -1000862 -1945793 -1648791 -763677 -328198 -162422 174622
42037 174622 434343 606947 1386880 2727959 3197606 1872483 -129020 -1085987 -835501
42028 -835501 -504713 -807924 -1587133 -2460273 -3022842 -2891878 -2304960 -2131006 -2579342 -2570838
42018 -2570838 -1237453 612556 1514412 1283954 870307 705994 392995 -110132 -110396 845998
42008 845998 2359221 3626837 4027888 3437832 2495535 2281433 3165426 4310172 4831393
41999 4831393 4868669 4829910 4370099 3185363 2106602 2059785 2461864 2101028 1159293 736362
$$ packed form
42064a854739j454442R65234K425824J263411l19136n40792l81728o85486m01650
42055i83504R18658J756068J147385J25489n30551j492812k615210k113882L27421
42046c460938K071519J142241p53684r44931K97002Q85114M35479J65776L37044
42037A74622K59721J72604P79933J341079M69647j325123k001503r56967K50486
42028h35501L30788l03211p79209q73140n62569J30964N86918J73954m48336Q504
42018b570838J333385J850009R01856k30458m13647j64313l12999n03127k64R56394
42008H45998J513223J267616M01051n90056r42297k14102Q83993J144746N21221
41999D831393L7276l8759m59811j184736j078761m6817M02079l60836r41735m22931
$$ plain form
41989 736362 756991 281072 -284800 457806 2080975 2278762 430959 -1100925 -490153
41980 -490153 866283 807005 -290217 -621431 62545 684716 1023552 1600277 2096901
41971 2096901 1804799 1102148 769471 503631 -130246 -118714 1490532 3215661 2771289
41962 2771289 719206 -164832 851514 1657593 1158972 981628 2276611 3568890 3360968
41953 3360968 2548780 2429649 2334378 1303351 418586 1162538 2691452 3099661 2558393
41944 2558393 2826411 4068686 4486197 3172545 1335675 351951 261624 604719 1309982
41935 1309982 2194803 2663612 2433060 1857332 1345005 1134971 1599784 2906567 4388685
41926 4388685 5139846 5226147 5428904 5862537 5869503 5303105 4824886 4748937 4603097 4079273
$$ packed form
41989G36362K0629m75919n65872P42606J623169J97787j847803j531884O10772
41980d90153J356436n9278j097222l31214O83976O22171L38836N76725M96624
41971B096901k92102p02651l32677k65840o33877J1532J609246J725129m44372
41962B771289k052083q84038J016346Q06079m98621j77344J294983J292279k07922
41953C360968q12188j19131r5271j031027q84765P43952J528914M08209n41268
41944B558393K68018J242275M17511j313652j836870r83724r0327L43095P05263
41935A309982Q84821M68809k30552n75728n12327k10034M64813J306783J482118
41926D388685P51161Q6301K02757M33633O966n66398m78219p5949j45840n23824
$$ plain form
41916 4079273 3486110 3017244 2462895 1858470 1512087 1213643 429481 -496711 -505976 380664
41906 380664 639102 -640712 -2245294 -2401478 -1126763 -38542 -254671 -1357618 -2231674
41897 -2231674 -2250054 -1695750 -1365681 -1653220 -2028793 -1895983 -1820061 -2867939 -4504669
41888 -4504669 -4497714 -1799189 1557259 2634158 963513 -1406573 -2584266 -2233825 -832790
41879 -832790 847275 1568978 508143 -1354994 -2017613 -1049200 -202780 -913353 -2407274
41870 -2407274 -3115904 -2891880 -2696075 -2818836 -2688554 -2127963 -1587745 -1143250 -343371
41861 -343371 732939 1234575 799256 318243 839077 2140144 2975345 2517217 1097260
41852 1097260 -317315 -935597 -529979 530613 1565465 2161680 2443555 2555089 2138655
$$ packed form
41916D079273n93163m68866n54349o04425l46383k98444p84162r26192r265Q86640
41906C80664K58438j279814j604582j56184J274715J088221k16129j102947q74056
41897b231674j8380N54304L30069k87539l75573J32810P5922j047878j636730
41888d504669O955K698525L356448J076899j670645k370086j177693L50441J401035
41879h32790J680065P21703j060835j863137o62619R68413Q46420p10573j493921
41870b407274p08630K24024J95805j22761J30282N60591N40218M44495P99879
41861c43371J076310N01636m35319m81013N20834J301067Q35201m58128j419957
41852A097260j414575o18282M05618J060592J034852N96215K81875J11534m16434
$$ plain form
41843 2138655 889351 -476115 -638525 572776 1543939 666582 -1633498 -3404281 -3491906
41834 -3491906 -2509955 -1476412 -491454 684183 1500873 1060922 -422252 -1477087 -1022740
41825 -1022740 360185 1272290 1287889 1253451 1780302 2211964 1671335 645622 557354 1729591
41815 1729591 2809010 2689755 2053613 2111088 2609936 2435326 1776502 2000391 3171119
41806 3171119 3481999 2044256 669676 1372649 3184203 3378083 1445570 -228140 38068
41797 38068 851831 -67017 -2740707 -5246230 -6273293 -6021212 -5056756 -3691023 -2464205
41788 -2464205 -2040206 -2334240 -2590327 -2524796 -2558885 -2693206 -2140921 -675818 467531
41779 467531 -74451 -1970628 -3555790 -3848501 -3395130 -3036282 -2602969 -1305877 897550
$$ packed form
41843B138655j249304j365466j62410J211301R71163q77357k300080j770783q7625
41834c491906R81951J033543R84958J175637Q16690m39951j483174j054835M54347
41825a022740J382925R12105J5599l4438N26851M31662n40629j025713q8268J172237
41815A729591J079419j19255o36142N7475M98848j74610o58824K23889J170728
41806C171119L10880j437743j374580P02973J811554J93880j932513j673710K66208
41797C8068Q13763r18848k673690k505523j027063K52081R64456J365733J226818
41788b464205M23999k94034k56087O5531l4089j34321N52285J465103J143349
41779D67531n41982j896177j585162k92711M53371L58848M33313J297092K203427
$$ plain form
41770 897550 2845789 3311414 2508307 2058046 3018312 4197514 3334273 179625 -2677536
41761 -2677536 -2871090 -1202677 -234397 -607085 -588889 713752 1767397 1153018 14674
41752 14674 413476 2195529 3195222 2228992 346108 -961110 -1423782 -1494084 -1324220
41743 -1324220 -942382 -724022 -934394 -1145738 -734424 193511 914906 1140466 1459083
41734 1459083 2457457 3696152 4050609 3109361 1738233 959769 738430 421261 -18532
41725 -18532 -13977 496845 972839 1282378 1750308 2055750 1361457 -14049 -444350 655095
41715 655095 1653819 1028141 -371374 -821700 -400866 -340964 -483186 499366 2548391
41706 2548391 3933721 3725865 2823619 2253825 2049983 2062442 2236344 1782240 -198058
$$ packed form
41770H97550J948239M65625q03107m50261R60266J179202q63241l154648k857161
41761b677536j93554J668413R68280l72688J8196J302641J053645o14379j138344
41752A4674L98802J782053R99693r66230j882884j307218m62672p0302J69864
41743a324220L81838K18360k10372k11344M11314R27935P21395K25560L18617
41734A459083R98374J238695L54457r41248j371128p78464k21339l17169m39793
41725a8532M555N10822M75994L09539M67930L05442o94293j375506m30301J099445
41715F55095R98724o25678j399515m50326M20834N9902j42222R82552K049025
41706B548391J385330k07856r02246n69794k03842J2459J73902m54104j980298
$$ plain form
41697 -198058 -2824964 -3970142 -3233945 -2489766 -2698075 -2317020 -198771 1993634 2194452
41688 2194452 1174646 1109685 1932394 1550371 -614147 -2563692 -2525685 -1119765 -192635
41679 -192635 -635748 -1823703 -2458112 -1691988 79482 1529082 1848781 1554635 1439806
41670 1439806 1415659 1121682 888108 988422 603768 -1085963 -3157420 -3750914 -2546071
41661 -2546071 -1088822 -597149 -716580 -609903 -24500 1060567 2709688 4440311 5222860
41652 5222860 4582781 3139829 1817765 1112715 1218812 2071967 3007661 3099282 2200054
41643 2200054 1151843 741604 911107 1121634 1005922 501652 -277378 -1178677 -2163237
41634 -2163237 -3097340 -3244963 -1651470 1353703 3730144 3777464 2157800 863230 628804
$$ packed form
41697a98058k626906j145178P36197P44179k08309L81055K118249K192405K00818
41688B194452j019806o4961Q22709l82023k164518j949545L8007J405920R27130
41679a92635m43113j187955o34409P66124J771470J449600L19699k94146j14829
41670A439806k4147k93977k33574J00314l84654j689731k071457n93494J204843
41661b546071J457249M91673j19431J06677N85403J085067J649121J730623P82549
41652E222860o40079j442952j322064p05050J06097Q53155R35694R1621q99228
41643B200054j048211m10239J69503K10527j15712n04270p79030r01299r84560
41634b163237r34103j47623J593493L005173K376441M7320j619664j294570k34426
$$ plain form
41625 628804 591367 185485 -70132 269514 912702 1518048 1995849 2057096 1505406 961942
41615 961942 1186716 1730123 1458494 341630 -598794 -1008064 -1346700 -1412525 -546104 532763
41605 532763 146036 -1543325 -2223931 -827654 738487 439975 -1098522 -2037706 -1944705
41596 -1944705 -1463442 -836367 -381747 -1095110 -2995827 -4063526 -2725669 -373069 621531
41587 621531 444384 1058013 2485031 2542133 458255 -1660499 -1716806 -106286 1514885
41578 1514885 2382663 2584680 2128462 1184962 537163 820281 1659572 2187150 2152234 2065553
41568 2065553 2394064 2899053 2786933 1574072 -164301 -1240946 -1227965 -850412 -675680
41559 -675680 -186355 1110418 2407176 2537954 1718054 1136784 1107909 906319 323092
$$ packed form
41625F28804l7437m05882k55617L39646O43188O05346M77801O1247n51690n43464
41615I61942K24774N43407k71629j116864r40424m09270l38636o5825Q66421J078867
41605E32763l86727j689361o80606J396277J566141k98512j538497r39184R3001
41596a944705M81263O27075M54620p13363j900717j067699J337857K352600R94600
41587F21531j77147O13629J427018N7102k083878k118754n6307J610520J621171
41578A514885Q67778K02017m56218r43500o47799K83118Q39291N27578l4916q6681
41568B065553L28511N04989j12120j212861j738373j076645J2981L77553J74732
41559f75680M89325J296773J296758J30778q19900n81270k8875k01590n83227
$$ plain form
41550 323092 7260 95077 -187393 -1122179 -1791693 -1321557 -2990 1310983 2228752
41541 2228752 2817541 3209062 3593154 4061573 4181574 3310030 1616325 209649 -79913
41532 -79913 444662 966380 1104047 944796 625691 302462 267009 733848 1515748 1992498
41522 1992498 1500467 61404 -1233281 -1169258 -53790 354713 -830514 -2259013 -2294215
41513 -2294215 -1425996 -1218925 -1485681 -506655 1920381 3695529 3292524 1663032 356564
41504 356564 -716381 -2373473 -4131081 -4552180 -3168678 -953629 884597 1794398 1823614
41495 1823614 1361772 850494 405617 -73546 -353552 4589 788932 1124322 651134
41486 651134 36306 -28139 385609 987130 1753896 2399316 2235263 1221237 404005 634682
$$ packed form
41550C23092l15832Q7817k82470r34786o69514M70136J318567J313973R17769
41541B228752N88789L91521L84092M68419J20001q71544j693705j406676k89562
41532g9913N24575N21718J37667j59251l19105l23229l5453M66839P81900M76750
41522A992498m92031j439063j294685O4023J115468M08503j185227j428499l5202
41513b294215Q68219K07071k66756R79026K427036J775148m03005j629492j306468
41504C56564j072945j657092j757608m21099J383502K215049J838226R09801K9216
41495A823614m61842n11278m44877m79163k80006L58141P84343L35390m73188
41486F51134o14828o4445M13748O01521P66766O45420j64053j014026q17232K30677
$$ plain form
41476 634682 1513976 2240159 2768698 3371958 3702056 3147890 1719868 -45344 -1611002
41467 -1611002 -2428973 -2132169 -1322324 -1334304 -2455867 -3217148 -2362606 -718476 -10779
41458 -10779 -526155 -1169020 -1301211 -1203972 -1012618 -480777 243059 640415 584200 275820
41448 275820 -312765 -1107672 -1472792 -1048233 -554085 -645678 -558820 669268 2134961 2035251
41438 2035251 570473 -63001 1152576 2806660 3559931 3973099 4812328 5240212 4173912
41429 4173912 2269948 1020323 635758 256046 -301902 -456699 -239486 -378172 -992895
41420 -992895 -1385763 -1302090 -1393301 -2126478 -3049713 -3492795 -3336069 -2721758 -1611648 -152354
41410 -152354 909130 775572 -467481 -1831360 -2366065 -1903423 -887607 224916 1218255
$$ packed form
41476F34682Q79294P26183N28539O03260L30098n54166j428022j765212j565658
41467a611002q17971K96804Q09845j1980j121563p61281Q54542J644130P07697
41458a0779n15376o42865j32191R7239J91354N31841P23836L97356n6215l08380
41448B75820n88585p94907l65120M24559M94148r1593Q6858J228088J465693r9710
41438B035251j464778o33474J215577J654084P53271M13168Q39229M27884j066300
41429D173912j903964j249625l84565l79712n57948j54797K17213j38686o14723
41420i92895l92868Q3673r1211p33177r23235m43082J56726O14311J110110J459294
41410a52354J061484j33558j243053j363879n34705M62642J015816J112523R93339
$$ plain form
41401 1218255 1962679 2338117 2403557 2444708 2678696 2974253 2982140 2499600 1643718 763851
41391 763851 255879 314921 741436 1112288 1238946 1278627 1301815 1056550 401667 -313124
41381 -313124 -634033 -552602 -342647 -109068 73426 -179217 -1151809 -2298764 -2511632 -1364735
41371 -1364735 200001 684261 -428956 -1903636 -1678407 976462 4214968 5263510
41363 5263510 3609732 1631460 1416417 2075581 1508924 -107338 -620506 512296 1199833
41354 1199833 -25719 -1682571 -1586795 -31649 868184 199727 -955742 -1397430 -1050506
41345 -1050506 -363015 355787 829568 972801 1335209 2578941 4281685 4994616 3860321
41336 3860321 1660306 -92759 -731119 -804464 -1188576 -2155679 -3196139 -3507724 -2672663
$$ packed form
41401A218255P44424L75438O5440M1151K33988K95557P887m82540q55882q79867
41391G63851n07972N9042M26515L70852J26658L9681K3188k45265o54883p14791
41381c13124l20909Q1431K09955K33579J82494k52643r72592j146955k12868J146897
41371a364735J564736M84260j113217j474680K25229K654869L238506J048542
41363E263510j653778j978272k15043O59164n66657j616262n13168J132802O87537
41354A199833j225552j656852R5776J555146Q99833o68457j155469m41688L46924
41345a050506O87491P18802M73781J43233L62408J243732J702744P12931j134295
41336C860321k200015j753065o38360p3345l84112r67103j040460l11585Q35061
$$ plain form
41327 -2672663 -985500 818377 2108932 2653520 2552562 2077649 1539250 1138346 833302
41318 833302 319556 -786096 -2499584 -4066470 -4318267 -2857392 -727489 606085 850649
41309 850649 861853 1113093 1076866 366770 -451191 -778953 -946855 -1495445 -2096439 -2025353
41299 -2025353 -1227531 -33396 1685496 3906892 5296969 4144501 774485 -2243984
41291 -2243984 -2933235 -1927822 -933138 -244996 901035 2139389 1866440 -347098 -2594495
41282 -2594495 -2748279 -966179 810595 1331551 975719 501785 119152 3665 497749
41273 497749 1151439 647539 -1289972 -2742916 -1710875 1056406 2841116 2488021 1508814
41264 1508814 1298842 999786 -737807 -3124492 -3928912 -2358453 53836 1359110 1023033
$$ packed form
41327b672663J687163J803877J290555N44588j00958m74913n38399m00904l05044
41318H33302n13746j105652j713488j566886k51797J460875K129903J333574K44564
41309H50649J1204K51240l6227p10096q17961l27762j67902n48590o00994P1086
41299b025353P97822J194135J718892K221396J390077j152468l370016l018469
41291b243984o89251J005413R94684O88142J146031J238354k72949k213538k247397
41282b594495j53784J782100J776774N20956l55832m73934l82633j15487M94084
41273D97749O53690n03900j937511j452944J032041K767281J784710l53095r79207
41264A508814k09972k99056j737593k386685q04420J570459K412289J305274l36077
$$ plain form
41255 1023033 -119430 -889540 -641875 268039 804685 448412 -32499 534722 2180829
41246 2180829 3594244 3429577 1534525 -939960 -2407556 -2160596 -1085829 -624483 -820978
41237 -820978 -223431 1815088 3834099 4257803 3697003 3849974 4847048 5417097 5297185
41228 5297185 5506111 6133164 5849403 4207077 2658779 2385524 2570442 1849561 246196
41219 246196 -1375614 -2628401 -3217109 -2308135 320360 3216491 4699097 4863439 4922096
41210 4922096 5077786 4439695 2745101 760044 -919205 -2120524 -2235009 -662247 1566150
41201 1566150 2141974 272958 -2015108 -2353152 -983037 -93555 -654270 -1235994 -251439
41192 -251439 1645917 2262790 728019 -1222238 -1285474 556485 2047042 1513514 -230119
$$ packed form
41255A023033j142463p70110K47665R09914N36646l56273m80911N67221J646107
41246B180829J413415j64667j895052k474485j467596K46960J074767M61346j96495
41237h20978N97547K038519K019011M23704n60800J52971R97074N70049j19912
41228E297185K08926O27053k83761j642326j548298k73255J84918p20881j603365
41219B46196j621810j252787n88708R08974K628495K896131J482606J64342N8657
41210D922096J55690o38091j694594j985057j679249j201319j14485J572762K228397
41201A566150N75824j869016k288066l38044J370115Q89482n60715n81724R84555
41192b51439J897356O16873j534771j950257o3236J841959J490557n33528j743633
$$ plain form
41183 -230119 -1325667 -1322422 -1171399 -1292415 -1018777 -96668 537138 139633 -530367 -161261
41173 -161261 1262538 2415239 2394120 1806880 1791450 2377109 2387033 1073865 -623186 -1019393
41163 -1019393 207143 1574033 1725065 1025270 619404 675353 630969 656103 1414176 2429107
41153 2429107 2286295 912244 139947 1115840 2440647 2121871 390240 -884308 -940518
41144 -940518 -694943 -814169 -816918 -256711 595911 1581867 2876826 3928483 3486594 1523566
41134 1523566 57582 981100 3733059 6143696 7056308 7001777 6613644 5682924 4016657
41125 4016657 2242662 1226726 1143422 1453441 1524449 1137320 636704 592355 1023185 1085940
41115 1085940 29303 -1589823 -2270758 -1312085 372817 1441617 1606638 1567488 1893030
$$ packed form
41183b30119j095548L245J51023j21016K73638R22109O33806l97505o70000L69106
41173a61261J423799J152701k1119n87240j5430N85659R924j313168j697051l96207
41163a019393J226536J366890J51032o99795m05866N5949m4384K5134P58073J014931
41153B429107j42812j374051p72297R75893J324807l18776j731631j274548n6210
41144i40518K45575j19226k749N60207Q52622R85956J294959J051657m41889j963028
41134A523566j465984R23518K751959K410637R12612n4531l88133r30720j666267
41125D016657j773995j015936q3304L10019P1008l87129n00616m4349M30830O2755
41115A085940j056637j619126o80935R58673J684902J068800J65021l9150L25542
$$ plain form
41106 1893030 2455856 2778114 2544460 1860130 1241251 1210655 1694818 1980392 1456257 235300
41096 235300 -1076018 -1945701 -2100697 -1543161 -721146 -370811 -798059 -1543506 -2081729
41087 -2081729 -2514758 -3132308 -3668092 -3659468 -3300385 -3133153 -2955473 -1947218 -118434
41078 -118434 1228531 1008724 -265862 -1167949 -941517 171246 1710839 3269651 4186369
41069 4186369 3937160 3033122 2708374 3280765 3525935 2385568 803452 854885 3061407
41060 3061407 5563357 6349452 5466757 4332917 3536750 2386762 440649 -1614545 -2830090
41051 -2830090 -2909098 -1998739 -400994 1114928 1533951 751376 -104498 -94548 403675 616009
41041 616009 672010 1043255 1294770 618283 -636726 -1168748 -468665 677643 1439833
$$ packed form
41106A893030N62826L22258k33654o84330o18879l0596M84163K85574n24135j220957
41096B35300j311318q69683j54996N57536Q22015L50335m27248p45447n38223
41087b081729m33029o17550n35784Q624L59083J67232J77680J008255J828784
41078a18434J346965k19807j274586r02087K26432J112763J539593J558812R16718
41069D186369k49209r04038l24748N72391K45170j140367j582116N1433K206522
41060C061407K501950P86095q82695j133840p96167j149988j946113k055194j215545
41051b830090p9008R10359J597745J515922M19023p82575q55874R950M98223K12334
41041F16009N6001L71245K51515o76487j255009n32022P00083J146308P62190
$$ plain form
41032 1439833 1647933 1222190 95339 -1041739 -1085898 -39280 891574 1165864 1699813
41023 1699813 3086266 4182453 3550303 1509564 -356582 -1181040 -1223132 -783777 42225
41014 42225 647896 141106 -1408721 -2742605 -2815485 -1996573 -1582923 -2303250 -3438155
41005 -3438155 -3446947 -1633550 818765 1866267 786852 -1105786 -2097774 -1862984 -1340500
40996 -1340500 -1443579 -2310206 -3313687 -3435424 -2152915 -239283 981945 1368463 1954693
40987 1954693 2922895 3004550 1717168 681970 1349561 2725673 3072556 2740882 3196170
40978 3196170 4021543 3371080 1217815 -353401 -413624 -377660 -1208022 -1661489 -540349
40969 -540349 1101015 1494104 697636 195590 721628 1643540 2042120 1609658 842615
$$ packed form
41032A439833K08100m25743j126851j137078m4159J046618R30854K74290N33949
41023A699813J386453J096187o32150k040739j866146q24458m2092M39355Q26002
41014D2225O05671n06790j549827j333884p2880Q18912M13650p20327j134905
41005c438155q792J813397K452315J047502j079415j892638r91988K34790N22484
40996a340500j03079q66627j003481j21737J282509J913632J221228L86518N86230
40987A954693R68202Q1655j287382j035198O67591J376112L46883l31674M55288
40978C196170Q25373o50463k153265j571216o0223L5964q30362m53467J121140
40969e40349J641364L93089p96468n02046N26038R21912L98580m32462p67043
$$ plain form
40960 842615 683226 1426834 2029703 1507573 832904 1774891 3747874 4037431 1939549
40951 1939549 235217 930470 1793137 -364755 -4461907 -6166766 -3696356 102196
40943 102196 1723227 827371 -581962 -1098945 -1013764 -1305168 -2288044 -3144634 -2870660
40934 -2870660 -1793962 -1383788 -2023145 -2103621 -444603 1526192 1627521 66714 -1176136
40925 -1176136 -1431563 -1615639 -1785984 -898871 797429 1556053 973242 837122 2223528
40916 2223528 3761878 3941220 3309516 2988426 2573574 1126424 -876983 -2150107 -2368986
40907 -2368986 -2051782 -1415988 -563263 -81580 -262947 -352403 318388 1118438 1131677 628467
40897 628467 312922 -90154 -1015372 -1519962 -381901 1542829 1970737 413839 -988809
$$ packed form
40960H42615j59389P43608O02869n22130o74669R41987J972983K89557k097882
40951A939549j704332O95253Q62667k157892m097152j704859K470410L798552
40943A02196J621031q95856j409333n16983Q5181k91404r82876q56590K73974
40934b870660J076698M10174o39357q0476J659018J970795J01329j560807j242850
40925a176136k55427j84076j70345Q87113J696300P58624n82811j36120J386406
40916B223528J538350J79342o31704l21090m14852j447150k003407j273124k18879
40907b368986L17204O35794Q52725M81683j81367q9456O70791Q00050J3239n03210
40897F28467l15545m03076r25218n04590J138061J924730M27908j556898j402648
$$ plain form
40888 -988809 -447571 1140054 1691335 667107 -725501 -1366427 -1220413 -767975 -330948
40879 -330948 -79672 -151640 -459669 -564742 -27987 1006508 1744104 1496336 423767
40870 423767 -784641 -1809664 -2660376 -2792585 -1310995 1432373 3413471 3079257 1311454
40861 1311454 208736 356498 512403 -195154 -1123711 -1428207 -1315479 -1387606 -1590531
40852 -1590531 -1550277 -1436923 -1733441 -2282041 -2160147 -700579 1578139 3306968 3639310
40843 3639310 3101690 2723919 2495018 1479960 -340555 -1435986 -755951 506250 410895
40834 410895 -1077389 -2416510 -3099964 -4091888 -5435415 -5392412 -2983920 94605 1474708
40825 1474708 1100400 803165 1471473 2148270 1887573 1148332 876496 1042521 713041
$$ packed form
40888i88809N41238J587625N51281j024228j392608o40926J46014M52438M37027
40879c30948K51276p1968l08029j05073N36755J034495P37596k47768j072569
40870D23767j208408j025023q50712j32209J481590K743368J981098l34214j767803
40861A311454j102718J47762J55905p07557r28557l04496J12728p2127k02925
40852a590531M0254J13354k96518n48600J21894J459568K278718J728829L32342
40843C639310n37620l77771k28901j015058j820515j095431O80035J262201r5355
40834D10895j488284j339121o83454r91924j343527M3003K408492L078525J380103
40825A474708l74308k97235O68308O76797k60697p39241k71836J66025l29480
$$ plain form
40816 713041 -673499 -2436825 -3078119 -1667763 1044882 3097115 3154006 1751446 502039
40807 502039 333522 860141 1248590 1199727 1076092 1392489 2187827 2751625 2216411 717092
40797 717092 -369804 111310 1564867 2209868 1186557 -506498 -1282115 -557238 1116047
40788 1116047 2816257 3698758 3305637 2165917 1712502 2732563 4028989 3599774 1329314
40779 1329314 -517275 -72447 1720340 2377930 967782 -1189405 -2579951 -2938912 -2573794
40770 -2573794 -1649941 -672989 -447157 -752624 -155475 1835133 3415832 2669479 387209
40761 387209 -929368 -576334 -371441 -1694952 -3553569 -4276390 -3681460 -2562775 -1152735
40752 -1152735 685333 2417398 3215352 3131315 2966850 3108933 3259918 3214043 3173975 3267147
$$ packed form
40816G13041j386540j763326o41294J410356K712645K052233N6891j402560j249407
40807E02039j68517N26619L88449m8863j23635L16397P95338N63798n35214j499319
40797G17092j086896M81114J453557O45001j023311j693055p75617P24877J673285
40788A116047J700210Q82501l93121j139720m53415J020061J296426m29215k270460
40779A329314j846589M44828J792787O57590j410148k157187j390546l58961L65118
40770b573794R23853R76952K25832l05467N97149J990608J580699p46353k282270
40761C87209j316577L53034K04893j323511j858617p22821N94930J118685J410040
40752a152735J838068J732065P97954q4037j64465J42083J50985m5875m0068R3172
$$ plain form
40742 3267147 3326065 3233177 3062947 2822607 2385013 1735697 1051251 485072 -8101 -621723
40732 -621723 -1424549 -2013255 -1629406 -35795 1860643 2898088 3149102 3655527 4476548
40723 4476548 4126793 1743731 -1088453 -1886709 -284096 1652000 2076391 1283961 737238
40714 737238 1098114 1809030 2145578 2036221 1840508 1714871 1488174 1160750 1199976 1974025
40704 1974025 3026655 3443599 2995746 2353754 2026953 1765573 1339611 1187055 1682545
40695 1682545 2272606 2010337 698412 -940488 -1931188 -1604104 -22190 1780515 2607948
40686 2607948 2545462 2817645 3750664 3976772 2538545 632875 -66117 156619 -25793
40677 -25793 -362927 601320 2692974 3758431 2582674 391883 -1159327 -1899142 -2270867
$$ packed form
40742C267147N8918r2888j70230k40340m37594o49316o84446n66179m93173o13622
40732f21723q02826n88706L83849J593611J896438J037445K51014N06425Q21021
40723D476548l49755k383062k832184p98256J602613J936096M24391p92430n46723
40714G37238L60876P10916L36548j09357j95713j25637k26697l27424L9226P74049
40704A974025J052630M16944m47853o41992l26801k61380m25962j52556M95490
40695A682545N90061k62269j311925j638900r90700L27084J581914J802705Q27433
40686B607948o2486K72183R33019K26108j438227j905670o98992K22736j82412
40677b5793l37134R64247K091654J065457j175757k190791j551210p39815l71725
$$ plain form
40668 -2270867 -2062090 -1110589 -188675 -13447 -65792 586084 1751028 2279285 1527302
40659 1527302 62109 -949500 -787762 120440 491323 -390584 -1609090 -1616659 -172542
40650 -172542 1548479 2612677 2996906 2717458 1677590 513688 131520 174629 -443930
40641 -443930 -1244755 -462772 1728637 2625032 961106 -788741 -17391 2085442 2619334
40632 2619334 1374870 310855 -266171 -1809540 -4161198 -5239855 -4465009 -3672759 -3864550
40623 -3864550 -3589232 -1682630 540475 1177559 171649 -1333762 -2580117 -3029036 -2136342
40614 -2136342 -573696 -290477 -1921935 -3331023 -2301393 268425 1512730 274232
40606 274232 -2021599 -3773372 -4815588 -5582851 -6063857 -5973327 -5172270 -3775084 -2383059
$$ packed form
40668b270867K08777R51501R21914J75228n2345O51876J164944N28257p51983
40659A527302j465193j011609J61738R08202L70883q81907j218506p569J444117
40650a72542J721021J064198L84229k79448j039868j163902l82168M3109o18559
40641d43930q00825P81983K191409Q96395j663926j749847P71350K102833N33892
40632B619334j244464j064015n77026j543369k351658j078657P74846P92250j91791
40623c864550K75318J906602K223105O37084j005910j505411j246355m48919Q92694
40614b136342J562646K83219j631458j409088J029630K569818J244305j238498
40606B74232k295831j751773j042216p67263m81006R0530Q01057J397186J392025
$$ plain form
40597 -2383059 -1961367 -2722300 -3393792 -2495793 -200297 1931083 2862603 2771873 2037493
40588 2037493 825169 -147614 225074 1833315 2892542 1964001 -152219 -1370635 -798904
40579 -798904 538118 1275952 1195262 983831 1142628 1513314 1631578 1231391 465013 -198495
40569 -198495 -340127 6411 360941 339016 127905 209101 612721 755028 177811 -817335
40559 -817335 -1529877 -1645642 -1362150 -938519 -531429 -348103 -482097 -625434 -418191 -71171
40549 -71171 -98293 -396570 -259649 482821 1037402 781587 217759 197118 629054 657535
40539 657535 -89162 -1082417 -1677447 -1749632 -1501926 -1125952 -811145 -734760 -805211 -559504
40529 -559504 483296 2285545 4085785 4840564 4094291 2437119 912470 4905 -518907
$$ packed form
40597b383059M21692p60933o71492Q97999K295496K131380R31520r0730p34380
40588B037493j212324r72783L72688J608241J059227r28541k116220j218416N71731
40579g98904J337022P37834q0690k11431J58797L70686J18264m00187p66378o63508
40569a98495j41632L46538L54530k1925k11111Q1196M03620J42307n77217r95146
40559h17335p12542j15765K83492M23631M07090J83326j33994j43337K07243L47020
40549g1171k7122k98277J36921P42470N54581k55815n63828k0641M31936K8481
40539F57535p46697r93255n95030p2185K47706L75974L14807P6385p0451K45707
40529e59504J042800J802249J800240P54779p46273j657172j524649r07565n23812
$$ plain form
40520 -518907 -879946 -936027 -670491 -475747 -665274 -1138721 -1778712 -2679068 -3647005 -3997179
40510 -3997179 -3306581 -1994281 -762875 125724 672479 781296 509080 67173 -908516
40501 -908516 -3234749 -6440019 -7965100 -5550490 -270040 4102254 4930771 3001384
40493 3001384 972423 629196 1887232 3461787 4009847 3263523 2365695 2551506 3466713
40484 3466713 3616207 2587025 1758762 2319594 3505272 3554012 1860431 -436769 -1621827
40475 -1621827 -746246 1715239 4110543 4886215 3941254 2407386 1121149 33954 -837873
40466 -837873 -991217 -413476 91021 212878 722072 1886303 2401250 1164135 -710842
40457 -710842 -1156461 14157 1065002 955444 448255 439979 654605 526198 224032 137727
$$ packed form
40520e18907l61039n6081K65536J94744j89527m73447o39991r00356r67937l50174
40510c997179O90598J312300J231406Q88599N46755J08817k72216m41907r75689
40501i08516k326233l205270j525081K414610N280450M372294Q28517j929387
40493C001384k028961l43227J258036J574555N48060p46324q97828J85811R15207
40484C466713J49494j029182q28263N60832J185678M8740j693581k297200j185058
40475a621827Q75581K461485K395304P75672r44961j533868j286237j087195q71827
40466h37873j53344N77741N04497J21857N09194J164231N14947j237115j874977
40457g10842m45619J170618J050845j09558n07189q276K14626j28407l02166q6305
$$ plain form
40447 137727 195073 309545 800970 1759671 2563626 2631198 2230658 2014739 2117093 2225000
40437 2225000 2259626 2445450 2798178 2948695 2513298 1492775 370328 -140251 359285
40428 359285 1539954 2595349 2914819 2401558 1316285 171215 -326536 278412 1683656
40419 1683656 3057559 3753991 3544738 2428695 806807 -343135 -285054 426572 522522
40410 522522 -215496 -655664 -98305 591475 261320 -876294 -1656278 -1524220 -911121
40401 -911121 -360919 4771 305628 724505 1365761 1920318 1788540 979351 506129 1274285
40391 1274285 2790059 3562808 2718305 817226 -765375 -923681 452699 2400633 3671554
40382 3671554 3830271 3312516 2389341 861338 -862502 -1369007 186951 2748892 4477739
$$ packed form
40447A37727N7346J14472M91425R58701Q03955O7572m00540k15919J02354J07907
40437B225000L4626J85824L52728J50517m35397j020523j122447n10579M99536
40428C59285J180669J055395L19470n13261j085273j145070m97751O04948J405244
40419A683656J373903O96432k09253j116043j621888j149942N8081P11626R5950
40410E22522p38018m40168N57359O89780l30155j137614p79984J32058O13099
40401i11121N50202L65690L00857M18877O41256N54557j31778q09189m73222P68156
40391A274285J515774P72749q44503j901079j582601j58306J376380J947934J270921
40382C671554J58717n17755r23175j528003j723840n06505J555958K561941J728847
$$ plain form
40373 4477739 4660672 3710669 2066711 282892 -457121 601963 2515122 3766629 4320454
40364 4320454 5084853 5762186 5135071 3435255 2364514 2429534 2298993 1375800 884381
40355 884381 1488743 1965669 1564455 1637122 3154009 4405358 3380665 1101139 180452
40346 180452 932594 1369460 638707 27810 506374 1432402 1985361 2042976 1414939 35291
40336 35291 -837142 431239 3199623 4783933 4068879 2989076 3370925 4134013 3180307
40327 3180307 713655 -1086702 -957152 458379 2060292 3270206 3647737 2787346 938231
40318 938231 -873933 -1566522 -745713 969151 2200415 1906902 519138 -536018 -635134
40309 -635134 -524800 -828231 -1036330 -624303 -136530 -192916 -253439 475969 1495942 1597551
$$ packed form
40373D477739J82933r50003j643958j783819p40013J059084J913159J251507N53825
40364D320454P64399O77333o27115j699816j070741O5020j30541r23193m91419
40355H84381O04362M76926m01214P2667J516887J251349j024693k279526r20687
40346A80452P52142M36866p30753o10897M78564R26028N52959N7615o28037j379648
40336C5291q72433J268381K768384J584310p15054j079803L81849P63088r53706
40327C180307k466652j800357J29550J415531J601913J209914L77531q60391j849115
40318I38231j812164o92589Q20809J714864J231264k93513j387764j055156r9116
40309f35134J10334l03431k08099M12027M87773n6386o0523P29408J019973J01609
$$ plain form
40299 1597551 687418 -110117 -55497 511246 1066102 1593920 2260619 3040041 3770873 4211732
40289 4211732 4199245 4082050 4555139 5548013 5839854 4560668 2625872 1784785 2541006
40280 2541006 3876287 4761475 5034810 4956117 4755918 4552424 4073471 2757714 809569
40271 809569 -350108 400995 2384799 4093534 5060568 5579082 5276247 3675948 1825086
40262 1825086 1454662 2483439 3180622 2939465 2910387 3540515 3708114 3146402 3521885
40253 3521885 5711337 7911191 8194155 7374745 7334338 7744635 6796334 4555131 3187204
40244 3187204 3763749 4892804 5022358 4463292 4399062 5110016 6013527 6680767 7043419
40235 7043419 7011216 6493485 5703613 5164682 5390683 6474706 7864900 8732886 8741034 8214841
$$ packed form
40299A597551r10133p97535N4620N66743N54856N27818O66699P79422P30832M40859
40289D211732j2487j17195M73089R92874K91841j279186j934796q41087P56221
40280B541006J335281Q85188K73335p8693k00199k03494m78953j315757j948145
40271H09569j159677P51103J983804J708735R67034N18514l02835j600299j850862
40262A825086l70424J028777O97183k41157k9078O30128J67599n61712L75483
40253C521885K189452K199854K82964q19410m0407M10297r48301k241203j367927
40244C187204N76545J129055J29554n59066o4230P10954R03511O67240L62652
40235G043419l2203n17731p89872n38931K26001J084023J390194Q67986Q148n26193
$$ plain form
40225 8214841 7494417 6652411 6040376 6289590 7225355 7647255 7060802 6816238 8285965
40216 8285965 10468570 10935567 9071889 6861402 6161258 6585186 6726780 6324108 6220318
40207 6220318 6795742 7427527 7427242 6909212 6617241 7108317 8168476 9059308 9374925 9442484
40197 9442484 9689140 9960321 9895134 9661107 9689801 9849864 9587744 8917537 8645260 9455777
40187 9455777 11182963 13015095 14077660 13941236 13006632 12307376 12579493 13726146 15432114
40178 15432114 17675169 20072503 21565402 21816261 22205183 24020392 26191544 26638156
40170 26638156 25757535 26495527 30399464 35494811 39114743 41340671 44391175 49683290
40162 49683290 56748216 64337510 71552687 78415882 86081574 95911302 107889692 120934054
$$ packed form
40225H214841p20424q42006o12035K49214R35765M21900n86453k44564J469727
40216H285965K182605M66997j863678k210487p00144M23928J41594m02672j03790
40207F220318N75424O31785k85n18030k91971M91076J060159Q90832L15617O7559
40197I442484K46656K71181o5187k34027K8694J60063k62120o70207k72277Q10517
40187I455777J727186J832132J062565j36424r34604o99256K72117J146653J705968
40178A5432114K243055K397334J492899K50859L88922J815209K171152M46612
40170B6638156q80621P37992L903937N095347L619932K225928L050504N292115
40162D9683290P064926P589294P215177O863195P665692R829728J1978390J3044362
$$ plain form
40154 120934054 135308786 153374502 176952434 205277575 236846963 271972312 311769739
40147 311769739 355527808 400650466 443930565 480560852 502961593 504197614 483753883
40140 483753883 448121762 405148611 359613625 314433031 272979798 237844411 208696138
40133 208696138 183472696 161187721 142259477 126832864 114300975 104107950 95708472
40126 95708472 88009909 80126797 72596873 66683885 62410867 58320705 53355742 48013387
40118 48013387 43293771 39346557 35784372 32838590 31370169 31533146 31884095 30443612
40110 30443612 26883643 23197654 21580316 21885830 22046828 20935138 19565958 19029063
40102 19029063 18584542 16946920 14521519 12911401 12630428 12745264 12686112 12996103 14001822
$$ packed form
40154A20934054J4374732J8065716K3577932K8325141L1569388L5125349L9797427
40147C11769739M3758069M5122658M3280099L6630287K2400741J236021k0443731
40140D83753883l5632121m2973151m5534986m5180594m1453233l5135387k9148273
40133B08696138k5223442k2284975j8928244j5426613j2531889j0193025q399478
40126I5708472p698563p883112p529924n912988m273018m090162m964963n342355
40118D8013387m719616l947214l562185k945782j468421J62977L50949j440483
40110C0443612l559969l685989j617338L05514J60998j111690j369180n36895
40102A9029063m44521j637622k425401j610118k80973J14836n9152L09991J005719
$$ plain form
40093 14001822 14903268 14679367 13139126 10766954 8223634 6230144 5274826 5239904 5832866
40084 5832866 7179909 9123908 10288921 9324088 7129296 6105098 6712149 6669541 4551385
40075 4551385 2223045 2043758 3329307 3825343 3476640 4028613 5430793 5620975 4216886
40066 4216886 3578952 5095578 6801048 6297191 4222776 2987264 3376944 4332518 5197505
40057 5197505 6213972 7175777 7369279 6822143 6215068 5630664 4701080 3873892 4081666
40048 4081666 5072142 5520679 5097636 5019797 6027779 7107830 6980718 5843324 4846509
40039 4846509 4666788 5297818 6426996 7259310 6807660 5267026 4316029 4974073 5870881
40030 5870881 5000433 2705650 1261782 1518873 1760680 509509 -1176604 -1415238 -312623
$$ packed form
40093A4001822R01446k23901j540241k372172k543320j993490r55318l4922N92962
40084E832866J347043J943999J165013r64833k194792j024198O07051m2608k118156
40075D551385k328340j79287J285549M96036l48703N51973J402180J90182j404089
40066D216886o37934J516626J705470n03857k074415j235512L89680R55574Q64987
40057E197505J016467R61805J93502n47136o07075n84404r29584q27188K07774
40048D081666R90476M48537m23043p7839J007982J080051j27112j137394r96815
40039D846509j79721O31030J129178Q32314m51650j540634r50997O58044Q96808
40030E870881q70448k294783j443868K57091K41807j251171j686113k38634J102615
$$ plain form
40021 -312623 545403 808309 1740143 3775721 5420549 5358454 4359234 4003079 4443179
40012 4443179 4721097 4642474 4775827 4824615 3746709 1816660 886910 1774313 2846684
40003 2846684 2408031 1285786 1475406 2995752 3895166 3150944 1820241 1127923 1003235
39994 1003235 1029998 1451336 2358132 2835331 1892569 -174295 -2001115 -2489933 -1617991
39985 -1617991 -269247 514423 465932 377216 1088585 2314095 3039569 2891993 2343583
39976 2343583 1782993 1378730 1636284 2782562 3669961 2865442 994804 212668 878355
39967 878355 784737 -1321247 -3465204 -3217675 -1044918 891420 1807350 2143421 1635200
39958 1635200 -22505 -1343067 -426452 2015365 3289852 2388847 892976 158159 -141371
$$ packed form
40021c12623Q58026K62906R31834K035578J644828o2095r99220l56155M40100
40012D443179K77918p8623J33353M8788j077906j930049r29750Q87403J072371
40003B846684m38653j122245J89620J520346Q99414p44222j330703o92318j24688
39994A003235K6763M21338R06796M77199r42762k066864j826820m88818Q71942
39985a617991J348744P83670m8491q8716P11369J225510P25474j47576n48410
39976B343583n60590m04263K57554J146278Q87399q04519j870638p82136O65687
39967H78355r3618k105984k143957K47529K172757J936338R15930L36071n08221
39958A635200j657705j320562R16615K441817J274487r01005j495871p34817k99530
$$ plain form
39949 -141371 -283465 404313 1835261 2475606 1523928 362416 730296 2473263 3945994
39940 3945994 3787009 1785389 -1015486 -2683711 -2022752 -231738 266136 -1044479 -2247076
39931 -2247076 -1896831 -623129 763600 2613278 4648161 4904492 2357439 -888017
39923 -888017 -2045176 -1184581 -354891 -171104 450210 1695369 2347458 1929422 1359878
39914 1359878 1206696 1013832 698852 983043 1906269 2365883 1802506 1109420 1126504 1326955
39904 1326955 916914 392907 872470 2195050 2753177 1477529 -623855 -1471212 -404619
39895 -404619 920284 604863 -941823 -1461452 176811 2636873 4142580 4573538 4704536
39886 4704536 4554866 3766787 2763933 2143280 1552031 544436 -102995 472062 1321550
$$ packed form
39949a41371j42094O87778J430948O40345r51678j161512L67880J742967J472731
39940C945994j58985k001620k800875j668225O60959J791014M97874j310615j202597
39931b247076L50245J273702J386729J849678K034883K56331k547053l245456
39923h88017j157159Q60595Q29690J83787O21314J245159O52089m18036n69544
39914A359878j53182j92864l14980K84191R23226M59614n63377o93086J7084K00451
39904A326955m10041n24007M79563J322580N58127j275648k101384q47357J066593
39895d04619J324903l15421j546686n19629J638263K460062J505707M30958J30998
39886D704536j49670p88079j002854o20653n91249j007595o47431N75057Q49488
$$ plain form
39877 1321550 797799 -698544 -1089441 202951 1512174 1726226 1717850 2193539 2122596
39868 2122596 565606 -1520873 -2696569 -3012071 -3244067 -3319446 -2974175 -2995758 -4139679
39859 -4139679 -5430569 -5210586 -3578348 -2230573 -1992993 -2039978 -1702238 -1524113 -1935600
39850 -1935600 -2091849 -1007481 733367 1336021 -104912 -2348851 -3110761 -1433745 1171981
39841 1171981 2235106 984167 -958415 -1742229 -1472908 -1572809 -2501449 -3213963 -2899330
39832 -2899330 -2179369 -2112268 -2804590 -3693647 -4629096 -5738614 -6422323 -5603374 -3409756
39823 -3409756 -1716899 -2096338 -3616974 -3772513 -1674507 736007 1117550 -558644 -2449315
39814 -2449315 -3188053 -2761938 -1609392 -181846 638849 -54203 -1976879 -3658936 -3972830
$$ packed form
39877A321550n23751j496343l90897J292392J309223K14052q376M75689p0943
39868B122596j556990k086479j175696l15502k31996p5379L45271k1583j143921
39859d139679j290890K19983J632238J347775K37580m6985L37740J78125m11487
39850a935600j56249J084368J740848O02654j440933k243939p61910J677016K605726
39841A171981J063125j250939j942582p83814K69321r9901r28640p12514L14633
39832b899330P19961O7101o92322q89057r35449j109518o83709Q18949K193618
39823c409756J692857l79439j520636j55539K098006K410514L81543j676194j890671
39814b449315p38738M26115J152546J427546Q20695o93052j922676j682057l13894
$$ plain form
39805 -3972830 -3018466 -1396458 543807 2461890 3866332 4657626 5266934 5923086 6267533
39796 6267533 5882300 4705934 2914550 1031696 67295 647782 1971107 2584745 2249863
39787 2249863 1970940 2164556 2123834 1461268 602251 -418157 -1924983 -2929650 -1573560
39778 -1573560 1770510 3947588 3039675 987192 454615 1086338 1181993 1207196 2556981
39769 2556981 4064095 3269965 798358 -69498 1520188 2756758 1892234 901538 1815883
39760 1815883 3297909 3128098 1919439 1773117 2653981 2756761 1822148 1613605 3039852
39751 3039852 4764915 5120496 4035683 2607205 1761286 1806603 2578908 3506311 3880392
39742 3880392 3448426 2661384 2170551 2084201 1864400 1157025 593142 1116571 2268182
$$ packed form
39805c972830R54364J622008J940265J918083J404442P91294O09308O56152L44447
39796F267533l85233j176366j791384j882854r64401N80487J323325O13638l34882
39787B249863k78923J93616m0722o62566q59017j020408j506826j004667J356090
39778a573560L344070K177078r07913k052483n32577O31723R5655K5203J349785
39769B556981J507114p94130k471607q67856J589686J236570q64524r90696R14345
39760A815883J482026j69811j208659j46322Q80864J02780r34613k08543J426247
39751C039852J725063L55581j084813j428478q45919M5317P72305R27403L74081
39742C880392m31966p87042m90833q6350k19801p07375n63883N23429J151611
$$ plain form
39733 2268182 2119004 -156100 -2513506 -2353701 -63719 1643484 1765260 2076969 3653445
39724 3653445 4765805 3633090 1280429 -171346 -561039 -1024287 -1437535 -791994 476109
39715 476109 800755 97445 65065 1572714 3414173 4156812 3861482 3365267 2928040
39706 2928040 2264010 1262002 192796 -439260 -165755 904938 1927473 2190414 1892167
39697 1892167 1500572 845369 -258767 -951455 -103764 1967301 3691292 4126133 3614962
39688 3614962 2703141 1641496 981145 1308354 2109378 2140142 1271580 730962 1058468
39679 1058468 1114039 -136369 -1926213 -2667987 -1844554 -131580 1655989 2895088 2977272
39670 2977272 1706601 -243675 -1754168 -2051484 -1069414 438103 1088369 8340 -1903936
$$ packed form
39733B268182j49178k275104k357406J59805K289982J707203J21776L11709J576476
39724C653445J112360j132715k352661j451775l89693m63248m13248O45541J268103
39715D76109L24646p03310l2380J507649J841459P42639k95330m96215m37227
39706B928040o64030j002008j069206o32056K73505J070693J022535K62941k98247
39697A892167l91595o55203j104136o92688Q47691K071065J723991M34841n11171
39688C614962r11821j061645o60351L27209Q01024L0764q68562n40618L27506
39679A058468N5571j250408j789844p41774Q23433J712974J787569J239099Q2184
39670B977272j270671j950276j510493k97316R82070J507517O50266j080029j912276
$$ plain form
39661 -1903936 -2678123 -1634232 -203738 74594 -579223 -1021812 -935827 -705460 -191746
39652 -191746 1154367 3078144 4348175 3957899 2093068 -66488 -1327984 -1501683 -1463161
39643 -1463161 -1754993 -1375628 911389 4037158 5134180 3438457 1958778 3610168
39635 3610168 6950287 7898874 5108297 1382621 -271201 121475 761983 727612 326803
39626 326803 15277 11610 335060 552406 81241 -809963 -1042194 -270529 358491 -372855
39616 -372855 -2161459 -3622571 -3843445 -2951671 -1588619 -404263 218220 415896 659322
39607 659322 1142777 1758368 2775279 4796234 7605142 9787718 10206860 9373631 8653857
39598 8653857 8520965 8361932 7728940 6935172 6427508 6258900 6265111 6239463 5863755 4908868
$$ packed form
39661a903936p74187J043891J430494K78332o53817m42589Q5985K30367N13714
39652a91746J346113J923777J270031l90276j864831k159556j261496j73699L8522
39643a463161k91832L79365K287017L125769J097022j695723j479679J651390
39635C610168L340119R48587k790577l725676j653822L92676O40508l4371m00809
39626C26803l11526l667L23450K17346m71165q91204k32231P71665O29020p31346
39616c72855j788604j461112k20874Q91774J363052J184356O22483J97676K43426
39607F59322M83455O15591J016911K020955K808908K182576M19142q33229p19774
39598H653857j32892j59033o32992p93768n07664j68608O211k5648l75708r54887
$$ plain form
39588 4908868 3579520 2347403 1489811 1101989 1372715 2333963 3410449 3784106 3284760
39579 3284760 2456264 1705916 953041 276891 266173 1228056 2418807 2663789 1711508
39570 1711508 496890 -90479 -336108 -1234110 -2984612 -4421114 -4240599 -2552594 -735657
39561 -735657 185290 442860 692868 998243 1147565 1383626 2006579 2571509 2392909 1756920
39551 1756920 1658817 2205826 2311514 1396855 390656 290020 584289 197950 -535681
39542 -535681 -183838 1509385 2926241 2615211 1080267 -121570 -381854 -331709 -508145
39533 -508145 -624371 -251628 421129 835912 787044 597164 626669 808821 782651 423830
39523 423830 26375 -146289 -215546 -303657 -118803 473244 657715 -603123 -2818265 -3926133
$$ packed form
39588D908868j329348j232117q57592l87822K70726R61248J076486L73657m99346
39579C284760q28496p50348p52875o76150j0718R61883J190751K44982r52281
39570A711508j214618n87369k45629q98002j750502j436502J80515J688005J816937
39561g35657R20947K57570K50008L05375J49322K36061O22953N64930j78600o35989
39551A756920r8103N47009J05688r14659j006199j00636K94269l86339p33631
39542e35681L51843J693223J416856l11030j534944j201837k60284N0145j76436
39533e08145j16226L72743O72757M14783m8868j89880K9505J82152k6170l58821
39523D23830l97455j72664o9257q8111J84854N92047J84471j260838k215142j107868
$$ plain form
39513 -3926133 -2655218 -162728 1474762 1699471 1377989 901439 -163206 -1634702 -2410191
39504 -2410191 -1962290 -998297 -239285 381808 899571 866358 339092 193512 694141 851599
39494 851599 107777 -500348 -77988 320315 -759234 -2581011 -3045496 -1745220 -269583
39485 -269583 506940 1397352 2710576 3067699 1460380 -974898 -2439997 -2662858 -2442314
39476 -2442314 -1923768 -677093 987773 2048410 2039752 1433167 833438 500799 577415
39467 577415 1134010 1929471 2495952 2468998 1743382 592875 -289596 -392718 -193310 -701941
39457 -701941 -1942571 -2685016 -2130460 -1023047 -485582 -574388 -700531 -671990 -516270 -85228
39447 -85228 297457 -296422 -1853685 -2723768 -1764028 -215903 139748 -218288 422289
$$ packed form
39513c926133J270915K492490J637490K24709l21482m76550j064645j471496p75489
39504b410191M47901R63993P59012O21093N17763l3213n27266j45580N00629J57458
39494H51599p43822o08125M22360L98303j079549j821777m64485J300276J475637
39485b69583P76523Q90412J313224L57123j607319k435278j465099k22861K20544
39476b442314N18546J246675J664866J060637q658o06585n99729l32639P6616
39467E77415N56595P95461N66481k6954p25616j150507q82471j03122J99408n08631
39457g01941j240630p42445N54556J107413N37465q8806j26143K8541J55720M31042
39447h5228L82685n93879j557263q70083R59740J548125L55651l58036O40577
$$ plain form
39438 422289 1851992 2168102 991596 11451 44732 -25668 -731848 -808924 429993 1605203
39428 1605203 1428498 511434 -224921 -1042763 -1872068 -1321436 937448 2653509 2046461
39419 2046461 684951 829585 1520131 429107 -1553781 -1327949 1080162 2070198 78760
39410 78760 -1981620 -1388686 434708 705056 -525578 -1350429 -1224579 -674755 680868
39401 680868 3087985 4604930 2962386 -762380 -2935083 -2052905 -306357 94922 -92840
39392 -92840 939122 2833746 3495270 2114043 300255 62235 1462392 2662953 2082487
39383 2082487 145810 -1388651 -1666244 -1565178 -2003038 -2363952 -1575737 -112883 426416
39374 426416 -362413 -1096993 -585767 685641 1455374 1201964 315899 -554922 -930130
$$ packed form
39438D22289J429703L16110j176506r80145L3281p0400p06180p7076J238917J175210
39428A605203j76705r17064p36355q17842q29305N50632K258884J716061o07048
39419B046461j361510J44634O90546j091024j982888K25832K408111R90036j991438
39410G8760k060380N92934J823394K70348j230634q24851J25850N49824J355623
39401F80868K407117J516945j642544l724766k172703Q82178J746548M01279j87762
39392i2840J031962J894624O61524j381227j813788k38020J400157J200561n80466
39383B082487j936677j534461k77593J01066m37860l60914P88215J462854N39299
39374D26416p88829p34580N11226J271408P69733k53410q86065q70821l75208
$$ plain form
39365 -930130 -804474 -779258 -1383748 -2203853 -2309921 -1517734 -438798 624688 1779637
39356 1779637 2555302 2148202 904222 140832 78476 -449030 -1552155 -1443856 650423
39347 650423 2533440 1954685 160538 153060 2135405 3256595 1851165 -485456 -1527085
39338 -1527085 -1023271 61704 1067623 1435314 579761 -880983 -1052786 835148 2924868
39329 2924868 2860806 755857 -1089336 -961903 720082 2272940 2356182 999267 -425722
39320 -425722 -620550 -38228 -378699 -2022812 -3133220 -2197813 -318290 366773 -358050
39311 -358050 -993894 -852053 -494324 146660 2040778 4975716 6945829 6543213 4729298
39302 4729298 3306106 2670386 2144487 1687693 1924970 2758615 3219377 2909584 2665395
$$ packed form
39365i30130J25656K5216o04490q20105j06068P92187J078936J063486J154949
39356A779637P75665m07100j243980p63390o2356n27506j103125J08299K094279
39347F50423J883017n78755j794147p478J982345J121190j405430k336621j041629
39338a527085N03814J084975J005919L67691q55553j460744j71803J887934K089720
39329B924868o4062k104949j845193J27433J681985J552858Q3242j356915j424989
39320d25722j94828N82322l40471j644113j110408R35407J879523O85063p24823
39311c58050o35844J41841L57729O40984J894118K934938J970113m02616j813915
39302D729298j423192o35720n25899m56794K37277Q33645M60762l09793k44189
$$ plain form
39293 2665395 3326448 4446364 4827194 4070048 2932641 2086176 1216680 -144799 -1452704
39284 -1452704 -1738245 -1223408 -1207569 -2027645 -2280020 -829429 1379922 2557683 2356345
39275 2356345 1742723 1216189 573481 53769 139205 329972 -253791 -977658 -170802 2117718
39265 2117718 3677383 3220524 2133244 2023064 2229297 1408575 222777 362655 1622336
39256 1622336 2108134 1252794 645850 1493766 2898145 3353620 2743574 2031690 1762286
39247 1762286 1653765 1309565 803226 668673 1408943 2813619 3929047 4102542 3749360
39238 3749360 3450804 2711662 726704 -1726671 -2558536 -1006193 1155898 1778019 783340
39229 783340 -367071 -792397 -643661 13075 1401774 3083815 3949490 3580478 2864469
$$ packed form
39293B665395O61053J119916L80830p57146j137407q46465q69496j361479j307905
39284a452704k85541N14837J5839q20076k52375J450591K209351J177761k01338
39275B356345o13622n26534o42708n19712Q5436J90767n83763p23867Q06856K288520
39265B117718J559665m56859j087280j10180K06233q20722j185798J39878J259681
39256A622336M85798q55340o06944Q47916J404379M55475o10046p11884k69404
39247A762286j08521l44200n06339j34553P40270J404676J115428J73495l53182
39238C749360k98556p39142j984958k453375q31865J552343K162091O22121r94679
39229G83340j150411m25326J48736O56736J388699J682041Q65675l69012p16009
$$ plain form
39220 2864469 2771379 3032594 2554999 876020 -1239158 -2527978 -2234738 -537194 1614511
39211 1614511 3073610 3297191 2746181 2292523 2188659 1957487 1393741 1090101 1447066
39202 1447066 1642460 548581 -1350202 -2064238 -655457 1216209 1238450 -579280 -1986478
39193 -1986478 -1413288 374418 1849422 2795745 3872031 4779238 4246061 2108240 284078
39184 284078 683157 2542017 3055120 989742 -1406607 -1054240 2062405 4945461 5365154
39175 5365154 4131641 3240500 3221577 3286745 3012381 2612642 2154059 1642712 1417298 1405119
39165 1405119 588063 -1492635 -3250019 -2722206 -504865 830391 401223 117674 1444850
39156 1444850 2990380 2651257 747848 -609863 -454936 325656 810368 1089121 1429384
$$ packed form
39220B864469r3090K61215m77595j678979k115178j288820K93240J697544K151705
39211A614511J459099K23581n51010m53658j03864k31172n63746l03640L56965
39202A447066J95394j093879j898783p14036J408781J871666K2241j817730j407198
39193a986478N73190J787706J475004R46323J076286R07207n33177k137821j824162
39184B84078L99079J858860N13103k065378k396349L52367L116645K883056M19693
39175E365154j233513q91141j8923O5168k74364l99739m58583n11347k25414j2179
39165A405119q17056k080698j757384N27813K217341J335256m29168k83549J327176
39156A444850J545530l39123j903409j357711J54927P80592M84712K78753L40263
$$ plain form
39147 1429384 1490619 682952 -1133314 -3238562 -4127659 -2647705 304642 1963868 627547
39138 627547 -2070552 -2994711 -1315465 809086 1260655 211090 -956778 -1536082 -1492892
39129 -1492892 -650513 1015985 2766239 3720432 3879779 3794130 3437979 2259661 396851
39120 396851 -963935 -850382 329641 1325721 1494940 1263210 1241207 1379048 1147283
39111 1147283 202200 -1332599 -2958205 -3982459 -3979826 -3370691 -3124872 -3459894 -3358867
39102 -3358867 -2100188 -721460 -795489 -2031768 -2619869 -2096893 -2059688 -3217486 -3570335
39093 -3570335 -1181989 2501423 4201473 3101350 1448231 970350 954895 437928 114943
39084 114943 731229 1193386 80559 -1840533 -2456384 -1387310 -481454 -987322 -1813836
$$ packed form
39147A429384O1235q07667j816266k105248q89097J479954K952347J659226j336321
39138F27547k698099r24159J679246K124551M51569j049565j167868n79304M3190
39129a492892Q42379J666498J750254R54193J59347q5649l56151j178318j862810
39120C96851j360786J13553J180023R96080J69219k31730k2003J37841k31765
39111A147283r45083j534799j625606j024254K633O09135K45819l35022J01027
39102c358867J258679J378728p4029j236279n88101N22976L7205j157798l52849
39093c570335K388346L683412J700050j100123j653119m77881j5455n16967l22985
39084A14943O16286M62157j112827j921092o15851J069074R05856n05868q26514
$$ plain form
39075 -1813836 -1411219 -205642 76859 -1041241 -2260721 -2547000 -2430640 -2717927 -2936892
39066 -2936892 -2086219 -371281 973146 1414806 1502461 1464330 734476 -666885 -1526133
39057 -1526133 -1054409 -155092 -109658 -774217 -1119787 -907896 -710716 -789386 -1056333 -1608781
39047 -1608781 -2113219 -1315642 1289058 3816613 3924058 2211929 1573320 2908478 3828264
39038 3828264 2530356 695750 833445 2423413 2832638 1185112 -785777 -1489388 -1189819
39029 -1189819 -708711 23593 1336258 2566283 2322936 39640 -3044644 -4776260 -4228011
39020 -4228011 -2725720 -2205975 -2832637 -3226297 -2896360 -2881532 -3552795 -3575320 -2226522
39011 -2226522 -1182857 -2274328 -4530127 -5390633 -4242786 -2827176 -2462037 -2772694 -3061068
$$ packed form
39075a813836M02617J205577K82501j118100j219480k86279J16360k87287k18965
39066b936892Q50673J714938J344427M41660Q7655l8131p29854j401361q59248
39057a526133M71724Q99317M5434o64559l45570K11891J97180p8670k66947n52448
39047a608781n04438P97577K604700K527555J07445j712129o38609J335158R19786
39038C828264j297908j834606J37695J589968M09225j647526j970889p03611K99569
39029a189819M81108P32304J312665J230025k43347k283296l084284j731616N48249
39020d228011J502291N19745o26662l93660L29937J4828o71263k2525J348798
39011b226522J043665j091471k255799q60506J147847J415610L65139l10657k88374
$$ plain form
39002 -3061068 -3006952 -1928933 624784 3131782 2958976 -188755 -3410027 -4156291 -3017632
38993 -3017632 -1871081 -987662 300243 1367188 904018 -728285 -1712816 -1285344 -316459
38984 -316459 701255 2424104 4778008 5938181 4467712 1575319 -124141 221816
38976 221816 1004211 648611 -393793 -700613 -10316 682694 782963 727116 824151 512456
38966 512456 -606229 -1738161 -1784115 -884479 -201555 -332765 -814405 -1147566 -1360499
38957 -1360499 -1407392 -1009602 -513267 -981860 -2742794 -4522346 -4836821 -3821966 -2890984
38948 -2890984 -2848644 -3159401 -3027963 -2441765 -1933927 -1786966 -1697026 -1039071 493407 2275375
38938 2275375 2990073 1974301 229827 -534065 30506 480292 -414055 -1885435 -2155469
$$ packed form
39002c061068N4116J078019K553717K506998j72806l147731l221272p46264J138659
38993c017632J146551Q83419J287905J066945m63170j632303r84531M27472R68885
38984c16459J017714J722849K353904J160173j470469k892393j699460L45957
38976B21816P82395l55600j042404l06820O90297O93010J00269n5847R7035l11695
38966E12456j118685j131932m5954Q99636O82924j31210m81640l33161k12933
38957a360499m6893L97790M96335m68593j760934j779552l14475J014855R30982
38948b890984M2340l10757J31438N86198N07838J46961Q9940O57955J532478J781968
38938B275375P14698j015772j744474p63892N64571M49786q94347j471380k70034
$$ plain form
38929 -2155469 -904610 208394 -278240 -1756440 -2449206 -1660052 -354291 254605 -143691
38920 -143691 -1194167 -2367768 -2978723 -2561832 -1672522 -1566816 -2569872 -3511733 -3407806
38911 -3407806 -2862736 -2893834 -3141145 -2491164 -980215 280268 789596 865737 362827
38902 362827 -1180003 -2936262 -2996557 -766117 2135553 3870719 4030896 2971003 1158510
38893 1158510 -136122 682063 3166351 4531582 3136733 787461 -50615 188187 -445064
38884 -445064 -1680026 -1391498 685799 2262403 1798195 284006 -735431 -927664 -405912
38875 -405912 905112 2375909 2791657 2094598 1449369 989229 -591448 -3255862 -4518058
38866 -4518058 -2727554 239881 1512799 1119631 1190774 2242045 2730617 1988551 1111481
$$ packed form
38929b155469J250859J113004m86634j478200o92766P89154J305761O08896l98296
38920a43691j050476j173601o10955M16891Q89310J05706j003056r41861J03927
38911c407806N45070l1098k47311O49981J510949J260483N09328P6141n02910
38902C62827j542830j756259o0295K230440K901670J735166J60177j059893j812493
38893A158510j294632Q18185K484288J365231j394849k349272q38076K38802o33251
38884d45064j234962K88528K077297J576604m64208j514189j019437j92233N21752
38875d05912J311024J470797M15748o97059o45229m60140j580677k664414j262196
38866d518058J790504K967435J272918l93168P1143J051271M88572p42066q77070
$$ plain form
38857 1111481 617930 -489656 -2442525 -3373905 -1662542 1529398 3456913 2968883 1325887
38848 1325887 142957 -383046 -1046434 -2193055 -3158017 -3038248 -1891444 -1025772 -1780205
38839 -1780205 -3909893 -5579220 -5296465 -3556886 -2104032 -1783691 -1839003 -1441520 -1070264
38830 -1070264 -1623853 -2614311 -2376705 -327048 1967442 2663328 1900933 1283976 1552198
38821 1552198 1887070 1427325 333812 -819523 -1654752 -1726793 -753501 487798 670582
38812 670582 -73604 65965 1866568 3449543 2801030 876124 347631 1785563 3039666
38803 3039666 2388620 434948 -1432826 -2678179 -3082384 -2214912 -466970 600768 58138
38794 58138 -1084658 -1323797 -655203 -164692 -317318 -703604 -995231 -1114006 -767363 217129
$$ packed form
38857A111481m93551j107586j952869r31380J711363L191940J927515m88030j642996
38848A325887j182930n26003o63388j146621r64962J19769J146804Q65672p54433
38839a780205k129688j669327K82755J739579J452854L20341n5312L97483L71256
38830a070264n53589r90458K37606K049657K294490O95886p62395o16957K68222
38821A552198L34872m59745j093513j153335q35229p2041R73292J241299J82784
38812F70582p44186J39569J800603J582975o48513j924906n28493J437932J254103
38803C039666o51046j953672j867774j245353m04205Q67472J747942J067738n42630
38794E8138j142796k39139O68594M90511j52626l86286k91627j18775L46643R84492
$$ plain form
38784 217129 1286133 1744123 1779733 2099073 2667361 2641564 1567600 -32136 -1264420
38775 -1264420 -1500091 -571138 964340 1867906 1315843 -22808 -703826 -294978 318547
38766 318547 419483 309574 429949 568837 457136 385938 577503 519604 -328094 -1490333
38756 -1490333 -1839485 -909588 615967 1590748 1206326 -597926 -2938186 -4320024 -3799654
38747 -3799654 -1947077 -279679 273463 -45962 -674195 -1460316 -2303292 -2710961 -2326402
38738 -2326402 -1588146 -1244957 -1317883 -1165191 -625324 -398547 -919642 -1417872 -774858 879555
38728 879555 2119596 1877197 604912 -456483 -753152 -775283 -1120103 -1597563 -1444480
38719 -1444480 -409254 562843 154176 -1576887 -2777564 -1819605 568132 2152329 2096568
$$ packed form
38784B17129J069004M57990L5610L19340N68288k5797j073964j599736j232284
38775a264420k35671R28953J535478R03566n52063j338651o81018M08848O13525
38766C18547J00936j09909J20375J38888j11701p1198J91565n7899q47698j162239
38756a490333l49152R29897J525555R74781l84422j804252k340260j381838N20370
38747c799654J852577J667398N53142l19425o28233p86121q42976m07669L84559
38738b326402P38256L43189p2926J52692N39867K26777n21095m98230O43014J654413
38728H79555J240041k42399j272285j061395k96669k2131l44820m77460J53083
38719a444480J035226R72097m08667j731063j200677R57959K387737J584197n5761
$$ plain form
38710 2096568 1744658 2195469 2597161 1843778 642607 334166 540292 -135669 -1467378
38701 -1467378 -1701409 -407944 761425 680760 180150 -6397 -791832 -2775673 -4337855
38692 -4337855 -3627676 -1439383 -65329 96755 612448 1868871 2204123 750790 -882291
38683 -882291 -899682 183080 644241 125781 -316860 -138767 158660 319080 923941 2382790
38673 2382790 4133946 5239929 5308088 4546609 3332120 2097645 1379800 1462952 1877666
38664 1877666 1641771 380270 -921756 -798114 892244 2538065 2576406 1290179 160640
38655 160640 -244145 -762602 -1948908 -2919259 -2469427 -713488 1052119 1813805 1663753
38646 1663753 1366863 1506293 1936208 1889920 862749 -549450 -1182843 -840093 -610070
$$ packed form
38710B096568l51910M50811M01692p53383j201171l08441K06126o75961j331709
38701a467378k34031J293465J169369q0665n00610j86547p85435j983841j562182
38692d337855P10179K188293J374054J62084N15693J256423L35252j453333j633081
38683h82291j7391J082762M61161n18460m42641J78093K97427J60420O04861J458849
38673B382790J751156J105983O8159p61479j214489j234475p17845Q3152M14714
38664A877666k35895j261501j302026J23642J690358J645821L8341j286227j129539
38655A60640m04785n18457j186306r70351M49832J755939J765607P61686j50052
38646A663753k96890J39430M29915m6288j027171j412199o33393L42750K30023
$$ plain form
38637 -610070 -1246265 -1959038 -1538177 -106552 1119897 1444732 1157632 674308 223254
38628 223254 283420 1254161 2541289 2955962 2302757 1670858 1804845 2108780 1797200 1177842
38618 1177842 1037962 1386344 1637253 1638680 1696537 1799698 1589869 1040524 517578 162699
38608 162699 -214179 -577252 -524704 123225 940654 1272398 854597 59523 -389078 -117880
38598 -117880 342937 29184 -1182928 -2211955 -2129146 -1383939 -949573 -703610 222181
38589 222181 1594359 1943505 731340 -558858 -367700 805097 1306048 760734 294936
38580 294936 513588 647472 56947 -608333 -519775 -131486 -533021 -1680885 -2291039 -1608332
38570 -1608332 -470809 -204121 -972945 -1752628 -1685179 -923305 -158641 181569 76028
$$ packed form
38637f10070o36195p12773M20861J431625J226449L24835k87100m83324m51054
38628B23254O0166R70741J287128M14673o53205o31899J33987L03935l11580o19358
38618A177842j39880L48382K50909J427N7857J03161k09829n49345n22946l54879
38608A62699l76878l63073N2548O47929Q17429L31744m17801p95074m48601K71198
38598a17880M60817l13753j212112j029027Q2809P45207M34366K45963R25791
38589B22181J372178L49146j212165j290198J91158J172797N00951n45314m65798
38580B94936K18652J33884n90525o65280Q8558L88289m01535j147864o10154O82707
38570a608332J137523K66688p68824p79683O7449P61874P64664L40210j05541
$$ plain form
38561 76028 -395350 -1171400 -2106089 -2916754 -3223611 -2710117 -1517330 -474455 -449292 -1212265
38551 -1212265 -1427627 -219688 1671900 2839980 2841755 2120456 818756 -1050540 -2369997
38542 -2369997 -1444948 1653690 4581681 5393022 4606827 3696159 2779495 1265298 -235471
38533 -235471 -615002 -481479 -1574852 -3770522 -4636777 -2721134 317022 1867936 1488224
38524 1488224 813521 1226536 2615185 3877537 3900875 2561758 1256029 1679910 3594052
38515 3594052 4838497 4299180 3643983 4947056 7712134 9842254 10758874 11658143 12951058
38506 12951058 13397387 12119602 9950084 8234652 7389328 7049177 6695212 5803854 4220350
38497 4220350 2585616 1585513 812797 -560334 -2026453 -2067500 -511279 902219 892050
$$ packed form
38561G6028m71378p76050r34689q10665l06857N13494J192787J042875K5163p62973
38551a212265k15362J207939J891588J168080J775p21299j301700j869296j319457
38542b369997R25049L098638K927991Q11341p86195r10668r16664j514197j500769
38533b35471l79531J33523j093373k195670q66255J915643L038156J550914l79712
38524A488224o74703M13015J388649J262352K3338j339117j305729M23881J914142
38515C594052J244445n39317o55197J303073K765078K130120R16620Q99269J292915
38506A2951058M46329j277785k169518j715432q45324l40151l53965q91358j583504
38497D220350j634734j000103p72716j373131j466119m1047J556221J413498j0169
$$ plain form
38488 892050 199637 14416 172875 -7608 -214875 250522 1073177 1332027 837957 62231
38478 62231 -783363 -1604938 -1830960 -1022298 219469 942109 1205698 1793612 2726778 3045445
38468 3045445 2113935 366435 -1295229 -2204642 -2042566 -884691 741547 2205890 3154887
38459 3154887 3393572 2807699 1752019 983512 695942 172573 -1003842 -2023927 -1899226
38450 -1899226 -836345 298210 1265982 2201374 2710146 2488686 2347539 3165690 4123926
38441 4123926 3574397 1622186 169237 144315 355319 -357079 -1419009 -1860147 -1984858
38432 -1984858 -2523370 -3051112 -2524516 -955606 475983 815435 160332 -702017 -951429
38423 -951429 -268655 767308 960963 -362829 -2467730 -3670255 -2815936 -417654 1683382
$$ packed form
38488H92050o92413j85221J58459j80483k07267M65397Q22655K58850m94070p75726
38478F2231q45594q21575k26022Q08662J241767P22640K63589N87914R33166L18667
38468C045445r31510j747500j661664r09413J62076J157875J626238J464343R48997
38459C154887K38685n85873j055680p68507k87570n23369j176415j020085J24701
38450a899226J062881J134555R67772R35392N08772k21460j41147Q18151R58236
38441D123926n49529j952211j452949k4922K11004p12398j061930m41138j24711
38432a984858n38512n27742N26596J568910J431589L39452o55103q62349k49412
38423i51429O82774J035963J93655j323792k104901j202525Q54319K398282K101036
$$ plain form
38414 1683382 2153921 1757996 2426613 4438187 5673769 4641764 2978905 3158601 4623948
38405 4623948 4623003 2615005 1059742 1313322 1561298 146698 -1543639 -1426176 -34248
38396 -34248 631069 146142 -526592 -1128072 -1896202 -2175765 -1332228 -366859 -612334 -1463404
38386 -1463404 -1452607 -923932 -1321817 -2282891 -2032280 -652951 -295338 -1665360 -2812019
38377 -2812019 -2244739 -998441 -539059 -650209 -631931 -780282 -1311770 -1412925 -776657
38368 -776657 -633143 -1768869 -2881286 -2535285 -1518286 -1408983 -1832330 -1226079 293203
38359 293203 1018265 450164 -31814 518257 1456476 2050535 2407306 2368101 1191425 -781118
38349 -781118 -1703692 -730995 293652 -785566 -3177942 -4017370 -2218307 296126 1422784
$$ packed form
38414A683382M70539l95925O68617K011574J235582j032005j662859J79696J465347
38405D623948r45k007998j555263K53580K47976j414600j690337J17463J391928
38396c4248O65317m84927o72734o01480p68130k79563Q43537R65369k45475q51070
38386a463404J0797N28675l97885r61074K50611J379329L57613j370022j146659
38377b812019N67280J246298M59382j11150J8278j48351n31488j01155O36268
38368g76657J43514j135726j112417L46001J016999J09303m23347O06251J519282
38359B93203P25062n68101m81978N50071R38219N94059L56771l9205j176676j972543
38349g81118r22574R72697J024647j079218k392376q39428J799063K514433J126658
$$ plain form
38340 1422784 1227134 742632 -16415 -1454910 -2785920 -2730945 -1553920 -777308 -762409
38331 -762409 -185089 1576407 3141962 3234966 2692423 2897536 3256794 2141797 -120984
38322 -120984 -1286756 -447448 633019 161234 -1254421 -1851255 -1230483 -408842 -52739
38313 -52739 161157 703897 1590717 2460247 2670666 1617224 -472634 -2405424 -3284920
38304 -3284920 -3549618 -4070618 -4579194 -3935757 -1972528 -164486 -23849 -1297954 -2290998
38295 -2290998 -1918119 -979594 -1009954 -2029891 -2249428 -543414 1511319 1273863 -1479201
38286 -1479201 -4117199 -4477608 -3171641 -1870812 -765476 921699 2878009 3781089
38278 3781089 3084850 1396611 -670869 -2755124 -4073213 -3906694 -2843866 -2265114 -2410203
$$ packed form
38340A422784j95650m84502p59047j438495j331010N4975J177025P76612J4899
38331g62409N77320J761496J565555R3004n42543K05113L59258j114997k262781
38322a20984j165772Q39308J080467m71785j415655n96834O20772Q21641L56103
38313e2739K13896N42740Q86820Q69530K10419j053442k089858j932790q79496
38304c284920k64698n21000n08576O43437J963229J808042J40637j274105r93044
38295b290998L72879R38525l0360j019937k19537J706014K054733k37456k753064
38286a479201k637998l60409J305967J300829J105336J687175J956310R03080
38278C781089o96239j688239k067480k084255j318089J66519J062828N78752j45089
$$ plain form
38269 -2410203 -2190868 -1159009 -283969 -209724 -60610 1073504 2478832 2798670 2048634
38260 2048634 1482433 1735280 2201958 2268879 2194788 2470103 2972038 3144704 2625808 1389422
38250 1389422 -387118 -2186579 -3072246 -2309151 -306994 1389466 1504838 417867 -251921
38241 -251921 472672 1904848 2766242 2704138 2191678 1424206 251762 -921959 -1240828
38232 -1240828 -686906 -334846 -784918 -1165920 -476263 741889 1105725 429784 -90192
38223 -90192 258694 808596 809966 534117 403582 -23819 -1152680 -2062685 -1449430 275327
38213 275327 1138233 148231 -1442292 -1922018 -1169827 -249345 161381 108958 -121067 56030
38203 56030 1336845 3269201 3982541 2543929 886572 1601915 4167276 5481703 4274895
$$ packed form
38269b410203K19335J031859Q75040P4245J49114J134114J405328L19838p50036
38260B048634n66201K52847M66678O6921p4091K75315N01935J72666n18896j236386
38250A389422j776540j799461q85667P63095K002157J696460J15372j086971o69788
38241b51921P24593J432176Q61394o2104n12460p67472j172444j173721l18869
38232a240828N53922L52060m50072l81002O89657J218152L63836o75941n19976
38223i0192L48886N49902J370k75849j30535m27401j128861r10005O13255J724757
38213B75327Q62906r90002j590523m79726P52191R20482M10726n2423k30025J77097
38203E6030J280815J932356P13340j438612j657357P15343K565361J314427j206808
$$ plain form
38194 4274895 2654638 2515977 2755084 1581528 -323140 -1018730 -413614 19521 -100424
38185 -100424 165237 976173 1439609 1446874 1867965 2634179 2430450 914520 -291895 299837
38175 299837 2055531 3171618 2832387 1670154 639117 109405 -138791 -365621 -309311
38166 -309311 552914 1853723 2068228 290317 -2219899 -3436699 -3118355 -2533026 -1983371
38157 -1983371 -528715 1674112 2903721 2566805 2403279 3701500 4930356 3829038
38149 3829038 793740 -1539521 -1532761 83729 1675438 2218002 1597891 590410 465739
38140 465739 1709520 3243743 3607051 2604088 1134149 -73528 -684033 -290183 1116078
38131 1116078 2454829 2443843 1165836 -58122 -254529 432240 1261024 1405529 294306
$$ packed form
38194D274895j620257j38661K39107j173556j904668o95590O05116M33135j19945
38185a00424K65661Q10936M63436P265M21091P66214k03729j515930j206415N91732
38175B99837J755694J116087l39231j162233j031037n29712k48196k26830N6310
38166c09311Q62225J300809K14505j777911k510216j216800L18344N85329N49655
38157a983371J454656K202827J229609l36916j63526J298221J228856j101318
38149C829038l035298k333261O760J616490J591709N42564o20111j007481j24671
38140D65739J243781J534223L63308j002963j469939j207677o10505L93850J406261
38131A116078J338751j0986j278007j223958j96407O86769Q28784J44505j111223
$$ plain form
38122 294306 -1671514 -3043583 -2868273 -1975258 -1806147 -2417015 -2792602 -2688115 -2695239 -2710944
38112 -2710944 -2017600 -998538 -1036464 -2214543 -2766756 -1650171 -233215 -341971 -1773931
38103 -1773931 -2965529 -3233236 -3020768 -2534094 -1578716 -577809 -406988 -986381 -1070627
38094 -1070627 129814 1826148 2618438 2116655 1122026 484233 307186 248386 97619
38085 97619 -163988 -500315 -634612 -39164 1276841 2130117 1188021 -1202079 -3154395
38076 -3154395 -3625473 -3578205 -4014183 -4061675 -2442054 45772 1362872 1175697 982273
38067 982273 1311888 980978 -347880 -1111263 -516721 -278110 -1949423 -4008004 -3660983
38058 -3660983 -738922 2191443 3166717 2415722 818722 -1294709 -3497074 -4995568
$$ packed form
38122B94306j965820j372069J75310Q93015J69111o10868l75587J04487p124j5705
38112b710944O93344J019062l7926j178079n52213J116585J416956j08756j431960
38103a773931j191598k67707K12468M86674R55378J000907J70821n79393q4246
38094a070627J200441J696334P92290n01783r94629o37793j77047n8800j50767
38085I7619k61607l36327j34297N95448J316005Q53276r42096k390100j952316
38076c154395m71078M7268m35978m7492J619621K487826J317100j87175j93424
38067I82273L29615l30910j328858p63383N94542K38611j671313k058581L47021
38058c660983K922061K930365R75274p50995j597000k113431k202365j498494
$$ plain form
38050 -4995568 -5582299 -5774399 -5688327 -4841635 -3330713 -2041862 -1308407 -507957 533477
38041 533477 946626 334302 -253792 188458 1094390 1359365 1094506 1049110 853234 -587606
38031 -587606 -2971051 -4404718 -3844202 -2529538 -2180376 -2608635 -2184627 -324590 1572013
38022 1572013 1844443 440088 -1358242 -2528564 -2990280 -2904913 -2104713 -569590 1028043
38013 1028043 1847014 1818591 1545895 1297577 735705 -123172 -344113 831077 2550489
38004 2550489 2802587 605167 -2635431 -4313536 -3111861 -157290 2197736 2533481
37996 2533481 1296992 -125245 -851910 -892506 -538557 -9920 313886 54013 -424561
37987 -424561 -108709 1198927 2115572 1334739 -336217 -852384 154029 761512 -445694
$$ packed form
38050d995568n86731j92100Q6072Q46692J510922J288851P33455Q00450J041434
38041E33477M13149o12324n88094M42250R05932K64975k64859m5396j95876j440840
38031e87606k383445j433667N60516J314664L49162m28259M24008J860037J896603
38022A572013K72430j404355j798330j170322m61716Q5367Q00200J535123J597633
38013A028043Q18971k8423k72696k48318n61872q58877k20941J175190J719412
38004B550489K52098k197420l240598j678105J201675K954571K355026L35745
37996B533481j236489j422237p26665m0596L53949N28637L23806k59873m78574
37987d24561L15852J307636R16645p80833j670956n16167J006413O07483j207206
$$ plain form
37978 -445694 -2366138 -3151551 -2816424 -2682353 -3021497 -2926410 -2178014 -1477064 -760804 906037
37968 906037 3271069 4448979 3452338 1693968 810460 343110 -881743 -2179545 -1833539
37959 -1833539 -26163 1171878 919018 760286 1987273 3521347 3589069 2335418 1389860
37950 1389860 1457677 1708329 1390693 810757 445655 59353 -719846 -1519983 -1657804 -1306163
37940 -1306163 -1493772 -2621074 -3495798 -2540715 104179 2407828 2646940 1193906 -265791
37931 -265791 -683176 -212432 601165 1319328 1588405 1496991 1778894 2804528 3594389 2880685
37921 2880685 1022829 -367102 -753640 -1206667 -2259218 -2802396 -1960546 -694761 -363204
37912 -363204 -760040 -890495 -800636 -1147692 -1597027 -1290357 -603771 -774156 -1761672 -2089084
$$ packed form
37978d45694j920444p85413L35127J34071l39144R5087P48396P00950P16260J666841
37968I06037K365032J177910r96641j758370q83508m67350j224853j297802L46006
37959a833539J807376J198041k52860j58732J226987J534074O7722j253651r45558
37950A389860O7817K50652l17636n79936l65102l86302p79199q00137j37821L51641
37940a306163j87609j127302q74724R55083K644894K303649K39112j453034j459697
37931b65791m17385M70744Q13597P18163K69077r1414K81903J025634P89861p13704
37921B880685j857856j389931l86538m53027j052551n43178Q41850J265785L31557
37912c63204l96836j30455Q9859l47056m49335L06670O86586j70385r87516l27412
$$ plain form
37902 -2089084 -1103582 76514 345479 -56692 -639768 -1668828 -3016612 -3246131 -1401842
37893 -1401842 921874 1039021 -1243563 -3053655 -2072975 489086 1608856 429627
37885 429627 -868680 -228904 1616954 2470951 1764191 981710 1172204 1516988 973139
37876 973139 147839 400536 1710186 2684793 2494045 1608554 579291 -703945 -2158705
37867 -2158705 -3028671 -2978391 -2844826 -3392381 -3837907 -2646623 285827 3134135 4062463
37858 4062463 3073531 1656267 1008671 1044481 1052337 873796 1058297 1871809 2590780 2223545
37848 2223545 818950 -483512 -847121 -660516 -737773 -1085543 -1075955 -606397 -329692 -587896
37838 -587896 -758116 -99492 1091259 1702671 1176114 251171 162081 1257543 2583092
$$ packed form
37902b089084R85502J180096K68965m02171n83076j029060j347784k29519J844289
37893a401842K323716J17147k282584j810092R80680K562061J119770j179229
37885D29627j298307O39776J845858Q53997p06760p82481J90494L44784n43849
37876I73139q25300K52697J309650R74607j90748q85491j029263j283236j454760
37867b158705q69966N0280J33565n47555m45526J191284K932450K848308R28328
37858D062463r88932j417264o47596L5810P856j78541J84501Q13512P18971l67235
37848B223545j404595j302462l63609J86605p7257l47770R588M69558K76705k58204
37838e87896j70220O58624J190751O11412n26557r24943q9090J095462J325549
$$ plain form
37829 2583092 2799280 1458281 -552851 -1756088 -1350030 100541 1189068 954181 -285890
37820 -285890 -1358852 -1479280 -1059730 -1276706 -2758089 -4675333 -5366193 -4138433 -2240188
37811 -2240188 -1443478 -1684920 -1050616 1393468 3756814 3490664 850855 -1322342 -1276552
37802 -1276552 -205643 25064 -589668 -981707 -1023484 -1277937 -1544714 -1293800 -1209708 -2635867
37792 -2635867 -5308244 -7080709 -6446900 -4330437 -2835437 -3015143 -4387240 -5924300
37784 -5924300 -6823565 -6680059 -5558053 -3932313 -2359683 -1202484 -551155 -162291 416230
37775 416230 1350122 2285553 2878666 3213926 3301428 2722791 1508428 764150 1295335 2038973
37765 2038973 1320163 -459695 -1078449 275910 1797515 1848708 1275243 1685422 2792276
$$ packed form
37829B583092K16188j340999k011132j203237M06058J450571J088527k34887j240071
37820b85890j072962j20428M19550k16976j481383j917244o90860J227760J898245
37811b240188P96710k41442O34304K444084K363346k66150k639809k173197M5790
37802a276552J070909K30707o14732l92039m1777k54453k66777K50914Q4092j426159
37792b635867k672377j772465O33809K116463J495000j79706j372097j537060
37784e924300q99265J43506J122006J625740J572630J157199O51329L88864N78521
37775D16230R33892R35431N93113L35260Q7502n78637j214363p44278N31185P43638
37765B038973p18810j779858o18754J354359J521605N1193n73465M10179J106854
$$ plain form
37756 2792276 3133951 2607245 2479822 3110567 3294482 2141074 402142 -509072 -50984
37747 -50984 1219068 2350140 2638663 2010578 1054262 481572 470581 679660 848933 1185674
37737 1185674 2124729 3684028 4981319 4707915 2615108 288591 -446150 116788 -97161
37728 -97161 -1993997 -3987475 -4260975 -3077383 -1856000 -1114937 -607122 -534871 -1131377
37719 -1131377 -1706618 -1602080 -1518617 -2341068 -3218470 -2664636 -1238372 -1044800 -2493491
37710 -2493491 -3684675 -3484979 -3087810 -3571273 -3838945 -2447915 -118324 1166345 777176
37701 777176 -172305 -519862 -59647 676845 752536 -539554 -2538028 -3317332 -1856821
37692 -1856821 458899 1487029 928979 182294 59205 -8883 -587450 -1365647 -1911803
$$ packed form
37756B792276L41675n26706j27423O30745J83915j153408j738932r11214M58088
37747e0984J270052J131072K88523o28085r56316n72690j0991K09079J69273L36741
37737A185674R39055J559299J297291k73404k092807k326517p34741N62938k13949
37728i7161j896836j993478k73500J183592J221383P41063N07815P2251n96506
37719a131377n75241J04538Q3463q22451q77402N53834J426264J93572j448691
37710b493491j191184J99696L97169m83463k67672J391030K329591J284669l89169
37701G77176r49481l47557M60215P36492P5691j292090j998474p79304J460511
37692a856821K315720J028130n58050p46685j23089o8088n78567p78197n46156
$$ plain form
37683 -1911803 -2219536 -2078964 -815573 1652514 3983342 4369486 2375570 -517851 -2361789
37674 -2361789 -2635104 -2478970 -2984939 -3717511 -3521176 -2434424 -1677371 -1599778 -991215
37665 -991215 827634 2490015 2425351 1272237 835823 1210853 867567 -436088 -931952
37656 -931952 243628 1245393 1002 -2698434 -4197240 -3506659 -2267992 -2193223 -2895473
37647 -2895473 -2751788 -1077900 1167413 2471943 2113879 572327 -1065682 -2006834 -2110279
37638 -2110279 -1567257 -669072 -48322 -557139 -2253819 -3814455 -3768223 -2275134 -838201
37629 -838201 -191491 454234 1645654 2388320 1692593 558041 904834 2782300 4165936
37620 4165936 3686695 2098157 605765 -717410 -1937984 -2111622 -602884 1322595
$$ packed form
37683a911803l07733J40572J263391K468087K330828L86144j993916k893421j843938
37674b361789k73315J56134n05969p32572J96335J086752P57053P7593O08563
37665i91215J818849J662381o4664j153114m36414L75030l43286j303655m95864
37656i31952J175580J001765j244391k699436j498806O90581J238667P4769p02250
37647b895473J43685J673888K245313J304530l58064j541552j638009r41152j03445
37638b110279N43022Q98185O20750n08817j696680j560636M6232J493089J436933
37629h38201O46710O45725J191420P42666o95727j134552L46793J877466J383636
37620D165936m79241j588538j492392j323175j220574j73638J508738J925479
$$ plain form
37612 1322595 1838044 1049413 608863 1102568 1487972 1168558 861639 927962 533156 -604008
37602 -604008 -1063442 377200 2650376 3593228 2719203 1523189 1280215 1751204 2115124
37593 2115124 2117085 1920904 1517635 790329 -41257 -391009 88518 813020 515968 -1253295
37583 -1253295 -3057683 -2930782 -986696 427460 -232816 -1631722 -1521118 127996 1338457
37574 1338457 968414 -170683 -995765 -1544526 -2335505 -3413104 -4514897 -5435431 -5810614
37565 -5810614 -5156731 -3526688 -1695817 -411308 211993 437983 463080 362434 149338
37556 149338 -199148 -549371 -554682 -98949 407101 567889 586437 823454 1058885 792788
37546 792788 72435 -555513 -688372 -156642 1074597 2397650 2514271 886496 -1193708
$$ packed form
37612A322595N15449p88631m40550M93705L85404l19414l06919O6323l94806j137164
37602f04008m59434J440642K273176R42852q74025j196014k42974M70989L63920
37593B115124J961j96181m03269p27306q31586l49752M79527P24502k97052j769263
37583a253295j804388J26901J944086J414156o60276j398906J10604J649114J210461
37574A338457l70043j139097q25082n48761p90979j077599j101793r20534l75183
37565e810614O53883J630043J830871J284509O23301K25990K5097j00646k13096
37556A49338l48486l50223n311M55733N06050J60788J8548K37017K35431k66097
37546G92788p20353o27948j32859N31730J231239J323053J16621j627775k080204
$$ plain form
37537 -1193708 -2061121 -1760200 -1430595 -1146019 -113277 1146284 884752 -1125828 -2804177
37528 -2804177 -2547567 -1223306 -436612 -284706 2610 396854 313256 -302316 -1104097
37519 -1104097 -1758347 -1526380 375581 3081807 4102095 2340532 -142405 -875958 -291835
37510 -291835 -484461 -1704687 -2332288 -1824739 -1324207 -1281007 -705458 703181 1614151
37501 1614151 1081839 17375 -233616 359322 962233 1080536 547232 -831323 -2790334
37492 -2790334 -4331180 -4626703 -3890800 -2990407 -2565705 -2719344 -3082080 -3019174 -2273784
37483 -2273784 -1487017 -1529457 -2329619 -3019069 -3143912 -2885264 -2172987 -710977 962656
37474 962656 1659695 1208722 805442 1164118 1485833 1043717 664425 1466781 2875625
$$ packed form
37537a193708q67413L00921L29605K84576J032742J259561k61532k010580j678349
37528b804177K56610J324261P86694J51906K87316L94244q3598o15572q01781
37519a104097o54250K31967J901961K706226J020288j761563k482937p33553N84123
37510b91835j92626j220226o27601N07549N00532M3200N75549J408639R10970
37501A614151n32312j064464k50991N92938O02911J18303n33304j378555j959011
37492b790334j540846k95523P35903R00393M24702j53639l62736O2906P45390
37483b273784P86767m2440q00162o89450j24843K58648P12277J462010J673633
37474I62656O97039m50973m03280L58676L21715m42116l79292Q02356J408844
$$ plain form
37465 2875625 3195653 1885956 131243 -848873 -1125458 -1486749 -2219456 -2859681 -2916599
37456 -2916599 -2531170 -2279597 -2329246 -2081337 -988666 499841 1349210 1171111 433539
37447 433539 -432817 -1333958 -1948737 -1858546 -1462664 -1779053 -2926081 -3688335 -3059214 -1418729
37437 -1418729 210045 1178798 1092016 -229112 -1991221 -2670530 -1810722 -655370 -258459
37428 -258459 -97217 486667 755237 -85102 -1074981 -779080 330541 620949 22718
$$ packed form
37465B875625L20028j309697j754713r80116k76585l61291p32707o40225n6918
37456b916599L85429K51573m9649K47909J092671J488507Q49369j78099p37572
37447D33539q66356r01141o14779R0191L95882l16389j147028p62254O29121J640485
37437a418729J628774R68753q6782j321128j762109o79309Q59808J155352L96911
37428b58459J61242N83884K68570q40339r89879K95901J109621K90408n98231
$$ [...]
##END NTUPLES=NMR SPECTRUM
##END=
