##TITLE=31Pdec_LR-683A-AK
 D2O, 8 sc
 24.9.2019
##JCAMPDX= 6.0         $$ Bruker NMR JCAMP-DX V2.0
##DATA TYPE= NMR SPECTRUM
##DATA CLASS= NTUPLES
##ORIGIN= UXNMR, Bruker Analytische Messtechnik GmbH
##OWNER= root
$$ XWIN-NMR		Version 3.5
$$ Tue Sep 24 14:07:33 2019 Russian Standard Time (UT+4h)  she@DPX200
##.OBSERVE FREQUENCY= 81.013821
##.OBSERVE NUCLEUS= ^31P
##.ACQUISITION MODE= SIMULTANEOUS
##.ACQUISITION SCHEME= undefined
##.AVERAGES= 24
##.DIGITISER RES= 17
##SPECTROMETER/DATA SYSTEM= spect
##.PULSE SEQUENCE= zgpg30
##.SOLVENT NAME= D2O
##.SHIFT REFERENCE= (INTERNAL, D2O, 0, 182.463)
##AUDIT TRAIL= $$ (NUMBER, WHEN, WHO, WHERE, WHAT)
$$ ##TITLE= Audit trail, XWIN-NMR		Version 3.5
$$ ##JCAMPDX= 5.01
$$ ##ORIGIN= Bruker BioSpin GmbH
$$ ##OWNER= she
$$ F:/spectra/data/she/nmr/P31/1/pdata/1/auditp.txt
$$ ##AUDIT TRAIL=  $$ (NUMBER, WHEN, WHO, WHERE, WHAT)
(   1,<2019-09-24 14:06:02.73 +0400>,<she>,<DPX200>,
      <created by zg, POWCHK disabled, PULCHK disabled
       configuration hash MD5:
       00 E9 B6 7A A2 85 ED C7 34 08 36 98 17 FE 4E 26
       data hash MD5: 32K
       CE 9D BC 9C 24 0A 08 0D 7E 94 A2 89 EA EC 78 DD>)
(   2,<2019-09-24 14:06:05.04 +0400>,<she>,<DPX200>,
      <Start of raw data processing
       efp BC_mod = 2 LB = 1 FT_mod = 6 PKNL = 1 PHC0 = -153.6774 PHC1 = -583.1997 SI = 64K 
       data hash MD5: 64K
       D8 C5 9D 40 4B B9 3D 90 8A C3 75 56 00 6F 03 FA>)
(   3,<2019-09-24 14:06:24.92 +0400>,<she>,<DPX200>,
      <pk PHC0 = -6.770842 PHC1 = 75.2 
       data hash MD5: 64K
       E3 12 24 A7 52 44 D8 22 28 E7 69 CD E0 D3 CA 8D>)
(   4,<2019-09-24 14:06:28.17 +0400>,<she>,<DPX200>,
      <abs ABSG = 5 
       data hash MD5: 64K
       55 B6 CA D3 68 74 31 14 B4 F2 92 1E 92 F1 F3 34>)
(   5,<2019-09-24 14:07:05.65 +0400>,<she>,<DPX200>,
      <pk PHC0 = -103.0821 PHC1 = 250.4001 
       data hash MD5: 64K
       21 2F 71 15 E1 C4 23 30 EA 1D CB 94 DE DB 04 A5>)
(   6,<2019-09-24 14:07:09.39 +0400>,<she>,<DPX200>,
      <abs ABSG = 5 
       data hash MD5: 64K
       FB 56 F4 4C 67 1A 25 F1 9B 76 1A C1 DC 65 2F D0>)
$$ ##END=
$$ 
$$ hash MD5
$$ 22 52 BE 7C 82 26 6A BE 4F EA 40 68 3A B4 2C 1B
##$RELAX= 
##$RELAX= 
##$RELAX= 
##$RELAX= 
##$RELAX= 
##$RELAX= 
##$RELAX= 
##$RELAX= 
$$ Bruker specific parameters
$$ --------------------------
##$DU= <F:/spectra>
##$EXPNO= 1
##$NAME= <P31>
##$PROCNO= 1
##$TYPE= <nmr>
##$USER= <she>
##$AMP= (0..31)
100 100 100 100 100 100 100 100 100 100 100 100 100 100 100 100 100 100 
100 100 100 100 100 100 100 100 100 100 100 100 100 100 
##$AQSEQ= 0
##$AQ_mod= 1
##$AUNM= <au_zg>
##$AUTOPOS= <>
##$BF1= 81.014009
##$BF2= 200.13
##$BF3= 200.13
##$BF4= 200.13
##$BF5= 200.13
##$BF6= 200.13
##$BF7= 200.13
##$BF8= 200.13
##$BYTORDA= 1
##$CFDGTYP= 0
##$CFRGTYP= 5
##$CHEMSTR= <none>
##$CNST= (0..31)
1 1 145 1 1 1 1 1 1 1 1 1 1 1 1 1 1 1 1 1 1 1 1 1 1 1 1 1 1 1 1 1 
##$CPDPRG= <waltz16>
##$CPDPRG1= <>
##$CPDPRG2= <waltz16>
##$CPDPRG3= <>
##$CPDPRG4= <mlev>
##$CPDPRG5= <mlev>
##$CPDPRG6= <mlev>
$$ [...]
##$SUBNAM3= <"">
##$SUBNAM4= <"">
##$SUBNAM5= <"">
##$SUBNAM6= <"">
##$SUBNAM7= <"">
##$SUBNAM8= <"">
##$SUBNAM9= <"">
##$SW= 369.568048894756
##$SWIBOX= (0..15)
0 1 3 0 0 0 0 0 0 0 0 0 0 0 0 0 
##$SW_h= 29940.119760479
##$TD= 32768
##$TD0= 1
##$TE= 0
##$TE2= 300
##$TE3= 300
##$TEG= 300
##$TL= (0..7)
0 120 53 12 22 120 120 120 
##$TP= (0..7)
150 150 150 150 150 150 150 150 
##$TP07= 0
##$TPNAME0= <>
##$TPNAME1= <>
##$TPNAME2= <>
##$TPNAME3= <>
##$TPNAME4= <>
##$TPNAME5= <>
##$TPNAME6= <>
##$TPNAME7= <>
##$TPOAL= (0..7)
0.5 0.5 0.5 0.5 0.5 0.5 0.5 0.5 
##$TPOFFS= (0..7)
0 0 0 0 0 0 0 0 
##$TUNHIN= 0
##$TUNHOUT= 0
##$TUNXOUT= 0
##$USERA1= <user>
##$USERA2= <user>
##$USERA3= <user>
##$USERA4= <user>
##$USERA5= <user>
##$V9= 5
##$VALIST= <valist>
##$VCLIST= <CCCCCCCCCCCCCCC>
##$VD= 0
##$VDLIST= <DDDDDDDDDDDDDDD>
##$VPLIST= <PPPPPPPPPPPPPPP>
##$VTLIST= <TTTTTTTTTTTTTTT>
##$WBST= 1024
##$WBSW= 4
##$XGAIN= (0..3)
0 0 0 0 
##$XL= 0
##$YL= 0
##$YMAX_a= 14990
##$YMIN_a= -17788
##$ZGOPTNS= <>
##$ZL1= 120
##$ZL2= 120
##$ZL3= 120
##$ZL4= 120
##$ABSF1= 182.463
##$ABSF2= -187.1042
##$ABSG= 5
##$ABSL= 3
##$ALPHA= 0
##$AQORDER= 0
##$ASSFAC= 0
##$ASSFACI= 0
##$ASSFACX= 0
##$ASSWID= 0
##$AUNMP= <proc_1d>
##$AZFE= 0.1
##$AZFW= 0.5
##$BCFW= 0
##$BC_mod= 2
##$BYTORDP= 0
##$COROFFS= 0
##$CY= -3
##$DATMOD= 1
##$DC= 0
##$DFILT= <>
##$DTYPP= 0
##$F1P= 0
##$F2P= 0
##$FCOR= 1
##$FTSIZE= 65536
##$FT_mod= 6
##$GAMMA= 0
##$GB= 0
##$INTBC= 1
##$INTSCL= 5.30512e-09
##$ISEN= 30
##$LB= 1
##$LEV0= 0
##$LPBIN= 0
##$MAXI= 10000
##$MC2= 0
##$MEAN= 0
##$ME_mod= 0
##$MI= 50
##$NCOEF= 0
##$NC_proc= -5
##$NLEV= 6
##$NOISF1= 182.463
##$NOISF2= 159.3651
##$NSP= 0
##$NTH_PI= 0
##$NZP= 0
##$OFFSET= 182.463
##$PC= 4
##$PHC0= -263.5303
##$PHC1= -257.5996
##$PH_mod= 1
##$PKNL= yes
##$PPARMOD= 0
##$PSCAL= 0
##$PSIGN= 0
##$REVERSE= no
##$SF= 81.0140089999434
##$SI= 65536
##$SIGF1= 159.3651
##$SIGF2= -187.1042
##$SINO= 113.3802
##$SIOLD= 16384
##$SREGLST= <1H.CDCl3>
##$SSB= 0
##$STSI= 65536
##$STSR= 0
##$SW_p= 29940.119760479
##$SYMM= 0
##$S_DEV= 0
##$TDeff= 32768
##$TDoff= 0
##$TI= <>
##$TILT= no
##$TM1= 0
##$TM2= 0
##$TOPLEV= 0
##$USERP1= <user>
##$USERP2= <user>
##$USERP3= <user>
##$USERP4= <user>
##$USERP5= <user>
##$WDW= 1
##$XDIM= 65536
##$YMAX_p= 290344338
##$YMIN_p= -13923874
$$ End of Bruker specific parameters
$$ ---------------------------------
##NTUPLES= NMR SPECTRUM
##VAR_NAME=  FREQUENCY,     SPECTRUM/REAL,   SPECTRUM/IMAG
##SYMBOL=    X,             R,               I
##VAR_TYPE=  INDEPENDENT,   DEPENDENT,       DEPENDENT
##VAR_FORM=  AFFN,          ASDF,            ASDF
##VAR_DIM=   65536,         65536,           65536
##UNITS=     HZ,            ARBITRARY UNITS, ARBITRARY UNITS
##FACTOR=    0.456856943014862, 1,           1
##FIRST=     14782.0589164792, 0,            0
##LAST=      -15158.0608439998, 0,           0
##MIN=       -15158.0608439998, -13923874,   0
##MAX=       14782.0589164792, 290344338,    0
$$ Real data points
##PAGE= N=1
##DATA TABLE= (X++(R..R)), XYDATA
$$ [...]
$$ plain form
42409 1133470 55698 -358466 -82641 -22774 -308288 -186117 383935 556598 190859
42400 190859 48872 105710 -657490 -2192852 -2827975 -1710886 -273021 -58698 -455012
42391 -455012 -38298 908197 924847 -191913 -1161756 -1223367 -892703 -690717 -433309 -68024
42381 -68024 -141151 -953772 -1945382 -2352886 -2083369 -1668081 -1621037 -1967912 -2216996 -1813353
42371 -1813353 -794847 149618 482829 436400 540791 832436 938910 736094 477682
42362 477682 385528 466792 619708 642969 342308 -91868 -97716 515832 1145462 1135351 650280
42351 650280 326214 334184 385620 483647 983998 1867307 2524359 2435240 1694488 762650
42341 762650 19416 -342024 -260741 181855 764302 1161497 1025260 258970 -705039 -1194924
$$ packed form
42409A133470j077772m14164K75825N9867k85514J22171N70052J72663l65739
42400A90859j41987N6838p63200j535362o35123J117089J437865K14323l96314
42391d55012M16714R46495J6650j116760r69843o1611L30664K01986K57408L65285
42381f8024p3127q12621r91610m07504K69517M15288M7044l46875k49084M03643
42371a813353J018506R44465L33211m6429J04391K91645J06474k02816k58412
42362D77682r2154Q1264J52916K3261l00661m34176n848O13548O29630j0111m85071
42351F50280l24066P970N1436R8027N00351Q83309O57052q9119p40752r31838
42341G62650p43234l61440Q1283M42596N82447L97195j36237p66290r64009m89885
$$ plain form
42331 -1194924 -1037234 -726130 -716956 -945012 -1241194 -1694033 -2218217 -2314400 -1836662 -1534666
42321 -1534666 -2107471 -3033143 -3139679 -2204814 -1204858 -959263 -1242232 -1369557 -1064257
42312 -1064257 -534332 -123369 -54993 -247918 -365610 -282522 -332228 -758408 -1192739 -1173197
42302 -1173197 -908818 -896916 -999184 -643386 177931 912688 1403308 1953950 2372265 1904189
42292 1904189 446073 -1000967 -1497115 -1111693 -379458 433268 1079316 1113566 559120
42283 559120 207505 608543 1242716 1333494 1018248 977305 1247611 1223788 713235 233742
42273 233742 209133 476183 717247 902194 1121443 1309002 1304799 1022801 497686 -100427
42263 -100427 -503288 -537734 -301528 -100064 -221545 -688680 -1075607 -731844 427611 1452550
$$ packed form
42331a194924J57690L11104R174k28056k96182m52839n24184r6183M77738L01996
42321a534666n72805r25672j06536R34865R99956K45595k82969j27325L05300
42312a064257N29925M10963O8376j92925j17692Q3088m9706m26180m34331J9542
42302a173197K64379J1902j02268L55798Q21317P34757M90620N50642M18315m68076
42292A904189j458116j447040m96148L85422P32235Q12726O46048L4250n54446
42283E59120l51615M01038O34173R0778l15246m0943K70306k3823n10553m79493
42273B33742k4609K67050K41064J84947K19249J87559m203k81998n25115n98113
42263a00427m02861l4446K36206K01464j21481m67135l86927L43763J159455J024939
$$ plain form
42253 1452550 1257336 62773 -737719 -397935 240017 93252 -614581 -899618 -542464
42244 -542464 -143248 31012 291557 694720 844034 611400 321228 97043 -325771 -1015084
42234 -1015084 -1663973 -2089675 -2330198 -2200526 -1423981 -321446 322993 273988 67927
42225 67927 64955 30809 -89148 185172 1008934 1749669 1891652 1698168 1458493 883047
42215 883047 -52140 -481883 164885 1015262 876253 -10256 -529510 -580767 -997870 -1781529
42205 -1781529 -1978058 -1465808 -1271905 -1654799 -1459495 -201428 693644 -53538 -1466876
42196 -1466876 -1722146 -817399 -257856 -616905 -1084658 -1234836 -1533476 -1943899 -1661245
42187 -1661245 -702216 -283501 -914370 -1406460 -654612 729126 1573470 1931505 2481198
$$ packed form
42253A452550j95214j194563q00492L39784O37952j46765p07833k85037L57154
42244e42464L99216J74260K60545M03163J49314k32634k90172k24185m22814o89313
42234a015084o48889m25702k40523J29672P76545J102535O44439m9005k06061
42225F7927k972l4146j19957K74320Q23762P40735J41983j93484k39675n75446
42215H83047r35187m29743O46768Q50377j39009q86509n19254n1257m17103p83659
42205a781529j96529N12250J93903l82894J95304J258067Q95072p47182j413338
42196a466876k55270R04747N59543l59049m67753j50178k98640m10423K82654
42187a661245R59029M18715o30869m92090P51848J383738Q44344L58035N49693
$$ plain form
42178 2481198 2922464 2394927 1101853 128840 -234398 -688990 -1406962 -1616447 -1005243
42169 -1005243 -367447 -355202 -568189 -439594 -122660 158428 777935 1870388 2522928
42160 2522928 1863740 573173 211138 1108569 1946048 1615849 624666 233044 840944
42151 840944 1761596 2235930 2132824 1730227 1226119 623634 -28584 -462516 -415458 -43171
42141 -43171 139018 -65874 -144623 475176 1506635 1995580 1465209 447487 -216234 -182544
42131 -182544 405203 1223712 1765299 1502405 551038 -116768 347412 1612444 2572889
42122 2572889 2706655 2496252 2509051 2657186 2562123 2138248 1505236 734932 48995 -103608
42112 -103608 343456 632221 -47252 -1343395 -1866666 -753679 1262665 2625726 2573232
$$ packed form
42178B481198M41266n27537j293074r73013l63238m54592p17972k09485O11204
42169a005243O37796J2245k12987J28595L16934K81088O19507J092453O52540
42160B522928o59188j290567l62035Q97431Q37479l30199r91183l91622O07900
42151H40944R20652M74334j03106m02597n04108o02485o52218m33932M7058L72287
42141d3171J82189k04892p8749O19799J031459M88945n30371j017722o63721L3690
42131a82544N87747Q18509N41587k62894r51367o67806M64180J265032R60445
42122B572889J33766k10403J2799J48135r5063m23875o33012p70304o85937j52603
42112a03608M47064K88765o79473j296143n23271J112987K016344J363061n2494
$$ plain form
42103 2573232 1715628 1145768 1286224 1661472 1598167 973756 257486 -82966 -64428 -37236
42093 -37236 -208527 -465879 -569496 -338777 239495 839508 860263 74204 -781838 -564841
42083 -564841 913016 2514415 3065333 2587136 1829651 1039986 -63869 -1282413 -1797814
42074 -1797814 -1289805 -481376 -139857 -71362 331258 932724 995468 412933 53573 576596
42064 576596 1437628 1578072 854708 213834 411894 1085564 1367911 1035301 579443 344384
42054 344384 184806 27286 141521 523340 540271 -234536 -1152326 -1154842 -251043 384347
42044 384347 -35741 -903843 -1149598 -676702 -311248 -564565 -1038907 -1085757 -595349 38308
42034 38308 445951 549430 432933 188001 -54259 -75429 257081 736133 935868 747745
$$ packed form
42103B573232q57604n69860J40456L75248o3305o24411p16270l40452J8538K7192
42093c7236j71291k57352j03617K30719N78272O00013K0755p86059q56042K16997
42083e64841J477857J601399N50918m78197p57485p89665j103855j218544n15401
42074a797814N08009Q08429L41519O8495M02620O01466O2744n82535l59360N23023
42064E76596Q61032J40444p23364o40874J98060O73670K82347l32610m55858k35059
42054C44384j59578j57520J14235L81819J6931p74807r17790k516R03799O35390
42044C84347m20088q68102k45755M72896L65454k53317m74342m6850M90408O33657
42034C8308M07643J03479j16497k44932k42260k1170L32510M79052J99735j88123
$$ plain form
42024 747745 597854 836208 1094950 757782 41332 -53226 863579 1844888 1790291 873799
42014 873799 136876 1896 -11213 -237303 -442230 -579958 -1098768 -2082704 -2790922 -2613016
42004 -2613016 -1965485 -1620265 -1537379 -1075295 -151757 553478 582049 256402 117836 301909
41994 301909 620583 812886 546525 -374183 -1545050 -2094181 -1593066 -569550 131302
41985 131302 211499 -82819 -454253 -676317 -539262 -124322 85086 -193621 -546324 -472789
41975 -472789 -274603 -655155 -1482323 -1727231 -874406 261644 527247 -226673 -1189942
41966 -1189942 -1599630 -1275979 -465905 346769 601167 76968 -794791 -1267215 -964890
41957 -964890 -189158 366382 206493 -464199 -872108 -598903 -234672 -560838 -1203771 -1031366
$$ packed form
42024G47745j49891K38354K58742l37168p16450r4558R16805R81309n4597r16492
42014H73799p36923j34980j3109k26090k04927j37728n18810r83936p08218J77906
42004b613016O47531L45220Q2886M62084R23538P05235K8571l25647j38566J84073
41994C01909L18674J92303k66361r20708j170867n49131N01115J023516P00852
41985A31302Q0197k94318l71434k22064J37055M14940K09408k78707l52703P3535
41975d72789J98186l80552q27168k44908Q52825J136050K65603p53920r63269
41966a189942m09688L23651Q10074Q12674K54398n24199q71759m72424L02325
41957i64890P75732N55540j59889o70692m07909K73205L64231l26166o42933J72405
$$ plain form
41947 -1031366 -88354 32311 -1519734 -3254739 -3203787 -1611996 -348920 -87433 281585
41938 281585 1437761 2536736 2801026 2723672 2909973 2935231 2294792 1515483 1291382 1278120
41928 1278120 825992 317918 612853 1490780 1788781 1004597 -208272 -1143798 -1737358
41919 -1737358 -2053756 -1921742 -1361598 -779283 -477139 -401500 -494614 -827063 -1240937 -1325523
41909 -1325523 -973239 -630242 -786864 -1408422 -1954171 -1823077 -860571 361996 921330
41900 921330 492450 -241627 -465324 -263353 -284505 -612451 -675464 -253400 164014 202381
41890 202381 147386 384487 813389 1126707 1241112 1158916 806571 341131 264962 845965
41880 845965 1631673 1880104 1378892 619479 237158 409109 735259 672210 148272 -361016
$$ packed form
41947a031366R43012J20665j552045j735005N0952J591791J263076K61487L69018
41938B81585J156176J098975K64290p7354J86301K5258o40439p79309k24101j3262
41928A278120m52128n08074K94935Q77927K98001p84184j212869r35526n93560
41919a737358l16398J32014N60144N82315L02144P5639r3114l32449m13874q4586
41909a325523L52284L42997j56622o21558n45749J31094R62506J222567N59334
41900I21330m28880p34077k23697K01971k1152l27946o3013M22064M17414L8367
41890B02381n4995K37101M28902L13318J14405q2196l52345m65440p6169N81003
41880H45965P85708K48431n01212p59413l82321J71951L26150o3049n23938n09288
$$ plain form
41870 -361016 -513405 -580873 -871076 -975224 -276114 916683 1585524 1454852 1297162 1476848
41860 1476848 1211833 -10327 -1173186 -950187 343564 1190638 1062335 968096 1674577
41851 1674577 2511299 2463955 1600447 712865 114741 -418397 -799445 -537872 435110 1464950
41841 1464950 1942433 1993319 2143836 2556074 2870785 2670013 1858073 687780 -346712
41832 -346712 -729771 -359333 204012 224510 -367735 -893775 -807599 -349768 -104311 -222723
41822 -222723 -444754 -658250 -983102 -1368171 -1532826 -1364052 -1069402 -894921 -913915 -1052313
41812 -1052313 -1091538 -757529 -88317 450609 578134 718309 1406487 2338008 2645772 2086175
41802 2086175 1265661 643151 64415 -525147 -696589 -264085 248220 303646 -16246 -442996
$$ packed form
41870c61016j52389o7468k90203j04148O99110J192797O68841j30672j57690J79686
41860A476848k65015j222160j162859K22999J293751Q47074j28303r4239P06481
41851A674577Q36722m7344q63508q87582n98124n33138l81048K61573R72982J029840
41841A464950M77483N0886J50517M12238L14711k00772q11940j170293j034492
41832c46712l83059L70438N63345K0498n92245n26040Q6176M57831K45457j18412
41822b22723k22031k13496l24852l85069j64655J68774K94650J74481j8994j38398
41812a052313l9225L34009O69212N38926J27525J40175O88178R31521L07764n59597
41802B086175q20514o22510n78736n89562j71442M32504N12305N5426l19892m26750
$$ plain form
41792 -442996 -975234 -1459512 -1355798 -516246 326387 462850 127921 -87723 -216379 -549998
41782 -549998 -762873 -317521 480892 720233 112224 -749990 -1295073 -1426846 -1146050 -465858
41772 -465858 249583 514033 365744 272211 425378 641917 833204 997384 920789 536224
41762 536224 356744 786295 1226011 784665 -279838 -860779 -658681 -388780 -340120 -63685
41752 -63685 306183 -86283 -1114174 -1340440 -262922 531712 -337667 -1806914 -1915894
41743 -1915894 -723339 -3063 -489984 -1112406 -926458 -307007 41431 31075 -219494
41734 -219494 -760364 -1385173 -1593560 -1300376 -978960 -932795 -1016282 -1112551 -1185935 -842823
41724 -842823 320690 1794256 2425878 1856474 892740 238993 -252447 -749694 -838879
$$ packed form
41792d42996n32238m84278J03714Q39552Q42633J36463l34929k15644j28656l33619
41782e49998k12875M45352P98413K39341o08009q62214n45083j31773K80796O80192
41772d65858P15441K64450j48289r3533J53167K16539J91287J64180p6595l84565
41762E36224j79480M29551M39716m41346j064503n80941K02098K69901M8660K76435
41752f3685L69868l92466j027891k26266J077518P94634q69379j469247j08980
41743a915894J192555P20276m86921o22422J85948O19451L48438j0356k50569
41734b19494n40870o24809k08387K93184L21416M6165q3487r6269p3384L43112
41724h42823J163513J473566O31622n69404r63734o53747m91440m97247q9185
$$ plain form
41715 -838879 -326093 188557 208102 110729 337812 476380 -43746 -875409 -1248766 -1162762
41705 -1162762 -1217049 -1508888 -1552892 -1187666 -787297 -600503 -547115 -625791 -883640 -1040982
41695 -1040982 -805742 -507147 -708504 -1208167 -1214353 -600821 -137569 -216658 -210551 418407
41685 418407 1128933 1114274 572686 373740 731213 999941 767000 437676 540291 963478
41675 963478 1189095 982089 560875 258435 280259 698031 1386663 1931590 1873114 1225478
41665 1225478 583756 478385 734344 759492 371271 -94226 -489515 -1058718 -1682501 -1588746
41655 -1588746 -412562 944842 1302906 781089 541520 1052095 1531674 1266729 592677
41646 592677 207974 242149 436295 649786 760113 589332 321797 454385 938972 968629
$$ packed form
41715h38879N12786N14650J9545r7373K27083J38568n20126q31663l73357Q6004
41705a162762n4287k91839m4004L65226M00369J86794N3388p8676k57849j57342
41695a040982K35240K98595k01357m99663o186O13532M63252p9089O107O28958
41685D18407P10526j4659n41588j98946L57473K68728k32941l29324J02615M23187
41675I63478K25617k07006m21214l02440K1824M17772O88632N44927n8476o47636
41665A225478o41722j05371K55959K5148l88221m65497l95289n69203o23783R3755
41655a588746J176184J357404L58064n21817k39569N10575M79579k64945o74052
41646E92677l84703L4175J94146K13491J10327j70781k67535J32588M84587K9657
$$ plain form
41636 968629 87235 -1083775 -1749364 -1942583 -2013685 -1811573 -1197963 -742376 -863709 -761172
41626 -761172 559669 2398412 2826107 1219464 -816564 -1432764 -518068 699267 1203508
41617 1203508 861484 203664 24945 728221 1724480 1943087 1160114 264568 -14470
41608 -14470 15882 -264860 -860169 -1398509 -1730040 -1800147 -1427778 -692913 -111307 18744
41598 18744 33016 290887 627905 801523 924995 998001 624946 -191965 -585184 68315
41588 68315 1034732 1082578 134221 -819452 -1231108 -1474201 -1837051 -1980723 -1631922 -1085995
41578 -1085995 -699184 -401182 -11406 344145 407830 158091 -160792 -247658 23486 435223
41568 435223 567421 261900 -198103 -519680 -748198 -974958 -1055111 -944077 -942328 -1196788
$$ packed form
41636I68629q81394j171010o65589j93219p1102K02112O13610M55587j21333J02537
41626g61172J320841J838743M27695j606643k036028o16200R14696J217335N04241
41617A203508l42024o57820j78719P03276R96259K18607p82973q95546k79038
41608a4470L0352k80742n95309n38340l31531p0107L72369P34865N81606J30051
41598A8744J4272K57871L37018J73618J23472P3006l73055q16911l93219O53499
41588F8315R66417M7846r48357r53673m11656k43093l62850j43672L48801N45927
41578a085995L86811K98002L89776L55551O3685k49739l18883q6866K71144M11737
41568D35223J32198l05521m60003l21577k28518k26760q0153J11034J749k54460
$$ plain form
41558 -1196788 -1343863 -1134265 -1006385 -1430832 -2042986 -2112962 -1578739 -898785 -195782 613975
41548 613975 1104901 745594 -68521 -386724 -142418 -217267 -922594 -1441827 -1118816 -387776
41538 -387776 4178 -79328 -422186 -886982 -1155899 -761975 126817 588232 110749 -667558
41528 -667558 -820225 -190676 789610 1706409 2130371 1653029 571586 -12198 557206
41519 557206 1545534 1737278 928598 -44385 -420190 -102746 544614 952241 651154 -198365
41509 -198365 -842935 -887520 -841438 -1278500 -1886796 -1930749 -1321790 -629392 -265901 -192237
41499 -192237 -196822 28726 813618 1972414 2611667 2056920 800510 -4238 150610 780474
41489 780474 1160611 941643 206864 -576258 -764164 -107133 962095 1823108 2190111
$$ packed form
41558a196788j47075K09598J27880m24447o12154o9976N34223O79954P03003Q09757
41548F13975M90926l59307q14115l18203K44306p4849p05327n19233L23011P31040
41538c87776L91954q3506l42858m64796k68917L93924Q88792M61415m77483p78307
41528f67558j52667O29549R80286R16799M23962m77342j081443n83784N69404
41519E57206R88328J91744q08680r72983l75805L17444O47360M07627l01087q49519
41509a98365o44570m4585M6082m37062o08296m3953O08959O92398L63491P3664
41499a92237m585K25548P84892J158796O39253n54747j256410q04748J54848O29864
41489G80474L80137k18968p34779p83122j87906O57031J069228Q61013L67003
$$ plain form
41480 2190111 1968326 1095231 -108801 -934359 -1057268 -844790 -569473 -40143 547155
41471 547155 366548 -641946 -1127089 -183801 1044940 998864 158086 191536 1151877 1433291
41461 1433291 446375 -582868 -752563 -622332 -722665 -622446 -170647 -111727 -648188
41452 -648188 -823612 -210086 215477 -111174 -96744 1132305 2405187 2152398 901848
41443 901848 421129 1030301 1516139 1347958 1225847 1475482 1540398 1289338 1376393 1910102
41433 1910102 2015008 1208330 160860 -418438 -721279 -1130652 -1420090 -1278720 -956906
41424 -956906 -762123 -435642 382916 1474182 2323825 2730498 2701322 2143621 1165286 362200
41414 362200 274092 738017 1202440 1459318 1619078 1593550 1173440 543603 157587 39101
$$ packed form
41480B190111k21785q73095j204032q25558j22909K12478K75317N29330N87298
41471E47155j80607j008494m85143R43288J228741m6076q40778L3450R60341K81414
41461A433291r86916j029243j69695J30231j00333J00219M51799N8920n36461
41452f48188j75424O13526M25563l26651J4430J229049J272882k52789j250550
41443I01848m80719O09172M85838j68181j22111K49635O4916k51060Q7055N33709
41433A910102J04906q06678j047470n79298l02841m09373k89438J41370L21814
41424i56906J94783L26481Q18558J091266Q49643M06673k9176n57701r78335q03086
41414C62200q8108M63925M64423K56878J59760k5528m20110o29837l86016j18486
$$ plain form
41404 39101 -279847 -953934 -1404824 -1006216 92191 1124639 1510376 1226679 563807
41395 563807 -126835 -495002 -391384 -97226 -40028 -155817 125510 1019896 1842785 1736985
41385 1736985 771940 -158063 -492550 -540552 -717097 -749255 -55573 1289987 2380485
41376 2380485 2340320 1237566 75148 -174217 421759 831532 310835 -612750 -764239
41367 -764239 202058 1466902 2184144 2329523 2235521 1955622 1525962 1315667 1546281 1819139
41357 1819139 1665312 1272600 1122695 1169832 963340 389706 -281977 -902986 -1381186 -1314209
41347 -1314209 -442347 577657 642007 -422786 -1629399 -2113748 -1957002 -1542144 -864471
41338 -864471 107988 1012578 1504153 1619726 1363546 482402 -875479 -1821304 -1652003
$$ packed form
41404C9101l18948o74087m50890L98608J098407J032448L85737k83697o62872
41395E63807o90642l68167J03618K94158N7198j15789K81327Q94386Q22889j05800
41385A736985r65045r30003l34487m8002j76545l2158O93682J345560J090498
41376B380485m0165j102754j162418k49365N95976M09773n20697r23585j51489
41367g64239R66297J264844P17242J45379r4002k79899m29660k10295K30614K72858
41357A819139j53827l92712j49905M7137k06492n73634o71683o21009m78200O6977
41347a314209Q71862J020004O4350j064793j206613m84349J56746M14858O77673
41338h64471R72459R04590M91575J15573k56180q81144j357881r45825J69301
$$ plain form
41329 -1652003 -720315 178093 846263 1450781 1691700 1120948 110754 -430782 -351080
41320 -351080 -402559 -956215 -1412276 -1204389 -623828 -200787 71644 352438 349317 -243035
41310 -243035 -1057500 -1443044 -1320086 -1095162 -941170 -761685 -713724 -1086648 -1639970 -1694387
41300 -1694387 -1053074 -343092 -242514 -745188 -1343754 -1588617 -1333300 -776017 -391536
41291 -391536 -489551 -745668 -547133 108250 515988 217865 -443660 -929953 -1105067 -914379
41281 -914379 -95615 1222838 2132263 1872088 884722 274338 398872 669164 618018 431714
41271 431714 380556 408713 458626 635642 854729 814383 517038 361236 512514 620006
41261 620006 397342 76295 -7666 70814 68587 70063 352283 832981 990295 469524 -330551
$$ packed form
41329a652003R31688Q98408O68170O04518K40919n70752j010194n41536P9702
41320c51080n1479n53656m56061K07887N80561M23041K72431K80794l121n92352
41310b43035q14465l85544J22958K24924J53992J79485M7961l72924n53322n4417
41300a694387O41313P09982J00578n02674n98566k44863K55317N57283L84481
41291c91536r8015k56117J98535O55383M07738k98123o61525m86293j75114J90688
41281i14379Q18764J318453R09425k60175r87366o10384J24534K70292n1146j86304
41271D31714n1158K8157M9913J77016K19087m0346k97345j55802J51278J07492
41261F20006k22664l21047q3961P8480k227J476K82220M80698J57314n20771q00075
$$ plain form
41250 -330551 -488105 409155 1529198 1522338 167896 -1181709 -1194147 -118622 816783
41241 816783 1078264 1039344 865264 300580 -435467 -677378 -498245 -815611 -1890715 -2707512
41231 -2707512 -2439837 -1670037 -1426934 -1722461 -1836330 -1522696 -1148285 -993089 -1087727 -1437083
41221 -1437083 -1820621 -1683066 -777254 359885 1024644 1108772 863699 372679 -282670
41212 -282670 -823136 -1227101 -1851971 -2603082 -2640660 -1573266 -278525 262115 318484 688772
41202 688772 1209606 1081244 308476 -275044 -234537 135148 468001 452404 -330875 -1713181
41192 -1713181 -2476764 -1719909 -354567 -23282 -805911 -1339702 -1000437 -454228 -87172
41183 -87172 469388 1022606 669878 -540319 -1292395 -962906 -525747 -846322 -1424744 -1597962
$$ packed form
41250c30551j57554Q97260J120043o860j354442j349605j2438J075525R35405
41241H16783K61481l8920j74080n64684p36047k41911J79133l17366j075104q16797
41231b707512K67675P69800K43103k95527j13869L13634L74411J55196r4638l49356
41221a437083l83538J37555R05812J137139O64759Q4128k45073m91020o55349
41212b82670n40466m03965o24870p51111l7578J067394J294741N40640N6369L70288
41202F88772N20834j28362p72768n83520M0507L69685L32853j5597p83279j382306
41192a713181p63583P56855J365342L31285p82629n33791L39265N46209L67056
41183h7172N56560N53218l52728j210197p52076L29489M37159l20575n78422j73218
$$ plain form
41173 -1597962 -1657105 -1845840 -1511114 -364619 489203 5521 -1160078 -1638139 -1261923
41164 -1261923 -864025 -811089 -918944 -1297473 -2064696 -2554002 -1957355 -614099 297427
41155 297427 256866 -176394 -270199 228808 1117285 1789269 1565284 531057 -339366 -391988
41145 -391988 -29725 296056 944165 2065382 2675719 2005366 1017923 1117328 1904265 1856408
41135 1856408 884900 386778 770371 835808 22288 -531573 41000 828113 622638 -274502
41125 -274502 -816329 -849731 -898957 -1025402 -1008530 -1159412 -1862783 -2602717 -2486915 -1650313
41115 -1650313 -1176161 -1514184 -1820973 -1183237 145254 1169038 1400574 1175248 898226
41106 898226 538428 5436 -434597 -507829 -429195 -543949 -609054 -88833 779477 1002951
$$ packed form
41173a597962n9143j88735L34726J146495Q53822m83682j165599m78061L76216
41164a261923L97898N2936j07855l78529p67223m89306N96647J343256R11526
41155B97427m0561m33260r3805M99007Q88477O71984k23985j034227q70423n2622
41145c91988L62263L25781O48109J121217O10337o70353r87443R9405P86937m7857
41135A856408r71508m98122L83593O5437q13520n53861N72573P87113k05475q97140
41125b74502n41827l3402m9226j26445J6872j50882p03371p39934J15802Q36602
41115a650313M74152l38023l06789O37736J328491J023784K31536k25326k77022
41106H98226l59798n32992m40033p3232P8634j14754o5105N20221Q68310K23474
$$ plain form
41096 1002951 249208 -532812 -470043 -2650 24901 -156140 267579 1141149 1493133 1109853
41086 1109853 769293 822934 687383 19824 -639448 -812008 -792901 -956144 -1058479 -659964
41076 -659964 314158 1654877 2906625 3272877 2348567 1080368 967401 2016107 2607120
41067 2607120 1827649 692693 353171 386751 -59366 -572508 -314931 274460 170490
41058 170490 -355406 -154513 703364 901816 111784 -303757 631950 2010389 2410734
41049 2410734 1826342 1318844 1370652 1528665 1434052 1346003 1533293 1727715 1490168 884717
41039 884717 471742 581228 822758 588271 -44046 -352371 -47406 228519 -116666 -633400
41029 -633400 -485785 207772 510569 84723 -386327 -374723 -292144 -670182 -1210678 -1254399
$$ packed form
41096A002951p53743p82020O2769M67393K7551j81041M23719Q73570L51984l83280
41086A109853l40560N3641j35551o67559o59272j72560J9107j63243j02335L98515
41076f59964R74122J340719J251748L66252r24310j268199j12967J048706N91013
41067B607120p79471j134956l39522L3580m46117n13142K57577N89391j03970
41058A70490n25896K00893Q57877J98452p90032m15541R35707J378439M00345
41049B410734n84392n07498N1808J58013r4613q8049J87290J94422k37547o05451
41039H84717m12975J09486K41530k34487o32317l08325L04965K75925l45185n16734
41029f33400J47615O93557L02797m25846m71050J1604Q2579l78038n40496m3721
$$ plain form
41019 -1254399 -794151 -392677 -282404 -142351 229428 524607 369101 -156697 -637248
41010 -637248 -793925 -676257 -474732 -302324 -172898 -95769 -107584 -195098 -228827 -32268
41000 -32268 456340 1102515 1667608 1975708 1982755 1713651 1223745 695788 482354 826926
40990 826926 1475390 1787932 1421919 745435 361170 379503 444913 343053 209623 192276
40980 192276 298991 582998 1075413 1499139 1468102 1031923 592196 242184 -263165 -783675
40970 -783675 -730119 -26357 545696 434843 135422 315062 686182 507249 -186509 -684901
40960 -684901 -710160 -601183 -495739 -141134 449084 886683 1051738 1186696 1271609 990864
40950 990864 449428 208673 384033 400765 -48343 -485945 -493817 -408264 -615701 -730235
$$ packed form
41019a254399M60248M01474J10273J40053L71779K95179j55506n25798m80551
41010f37248j56677J17668K01525J72408J29426P7129j1815q7514l3729J96559
41000c2268M88608O46175N65093L08100P047k69104m89906n27957k13434L44572
40990H26926O48464L12542l66013o76484l84265J8333O5410j01860j33430j7347
40980A92276J06715K84007M92415M23726l1037m36179m39727l50012n05349n20510
40970g83675N3556P03762N72053j10853k99421J79640L71120j78933o93758m98392
40960f84901k5259J08977J05444L54605N90218M37599J65055J34958Q4913k80745
40950I90864n41436k40755J75360J6732m49108m37602p872Q5553k07437j14534
$$ plain form
40940 -730235 -208119 567568 612721 -319583 -1405396 -1823233 -1584015 -1119153 -563825 165650
40930 165650 849449 968540 293432 -770470 -1568228 -1822157 -1709919 -1371784 -646016
40921 -646016 506566 1548638 1735710 955609 -121505 -797922 -945075 -756940 -302370
40912 -302370 375984 976779 1148040 920889 625708 377745 -62571 -816195 -1486450 -1435484
40902 -1435484 -460191 886603 1704655 1534092 780542 329819 695208 1560569 2175656
40893 2175656 2114560 1557088 918351 432998 180809 285184 789413 1369790 1509605 1127771
40883 1127771 786633 1006691 1537194 1645872 1074004 342666 77866 378170 933565
40874 933565 1410582 1550906 1213859 571753 70212 25800 420202 1098327 1827871 2144704
$$ packed form
40940g30235N22116P75687M5153r32304j085813m17837K39218M64862N55328P29475
40930A65650O83799J19091o75108j063902p97758k53929J12238L38135P25768
40921f46016J152582J042072J87072p80101j077114o76417j47153J88135M54570
40912c02370O78354O00795J71261k27151k95181k47963m40316p53624o70255N0966
40902a435484R75293J346794Q18052j70563p53550m50723L65389Q65361O15087
40893B175656o1096n57472o38737m85353k52189J04375N04229N80377J39815l81834
40883A127771l41138K20058N30503J08678n71868p31338k64800L00304N55395
40874I33565M77017J40324l37047o42106n01541m4412L94402O78125P29544L16833
$$ plain form
40864 2144704 1686990 887015 723329 1406129 1929030 1483290 701395 689343 1302619 1413577
40854 1413577 694438 39975 128514 590080 903402 1192434 1644223 1885608 1535516 860232
40844 860232 347404 53312 -154686 -154266 69603 -21066 -942450 -2300893 -3043086 -2599127
40834 -2599127 -1392291 -259234 257092 64006 -608025 -1328325 -1693246 -1611009 -1325146
40825 -1325146 -1109823 -955882 -570786 259430 1265061 1783225 1440004 641012 124255
40816 124255 110600 230203 212299 170152 140259 -135719 -727554 -1231993 -1255709 -863768
40806 -863768 -333040 163192 383147 235 -810381 -1147519 -310527 1210416 2165992
40797 2165992 1907436 914402 54452 -215685 125151 954962 2028266 2883254 3015160
$$ packed form
40864B144704m57714p99975j63686O82800N22901m45740p81895j2052O13276J10958
40854A413577p19139o54463Q8539M61566L13322K89032M51789K41385l50092o75284
40844H60232n12828k94092k07998M20K23869r0669r21384j358443p42193M43959
40834b599127J206836J133057N16326j93086o72031p20300l64921Q2237K85863
40825a325146K15323J53941L85096Q30216J005631N18164l43221p98992n16757
40816A24255j3655J19603j7904m2147k9893k75978n91835n04439k3716L91941
40806h63768N30728M96232K19955l82912q10616l37138Q36992J520943R55576
40797B165992k58556r93034q59950k70137L40836Q29811J073304Q54988J31906
$$ plain form
40788 3015160 2262123 1030733 64469 -165310 105829 206519 -238270 -955439 -1388040
40779 -1388040 -1240342 -664688 -104808 47349 -154317 -195631 273663 900663 1077582 830768
40769 830768 751273 1042671 1250701 1091418 930159 1151286 1589287 1887745 1903584 1473207
40759 1473207 404511 -881060 -1338276 -513695 736583 1326030 1232629 1086949 1011134
40750 1011134 701736 283823 158775 181547 -137740 -687612 -835752 -446344 -23044 209966
40740 209966 573247 1128143 1366884 990969 384739 -841 -240074 -603324 -1037678 -1274033
40730 -1274033 -1181910 -806801 -244976 408667 1102062 1747373 1990075 1384559 138496
40721 138496 -725080 -531661 70134 39438 -472331 -454435 193668 435905 -144058 -581354
$$ packed form
40788C015160p53037j231390r66264k29779K71139J00690m44789p17169m32601
40779a388040J47698N75654N59880J52157k01666m1314M69294O27000J76919k46814
40769H30768p9495K91398K08030j59283j61259K21127M38001K98458J5839m30377
40759A473207j068696j285571m57216Q24581J250278N89447r3401j45680p5815
40750A011134l09398m17913j25048K2772l19287n49872j48140L89408M23300K33010
40740B09966L63281N54896K38741l75915o06230l85580k39233l63250m34354k36355
40730a274033R2123L75109N61825O53643O93395O45311K42702o05516j246063
40721A38496q63576J93419O01795l0696n11769J7896O48103K42237n79963m37296
$$ plain form
40711 -581354 -105210 565833 345456 -551980 -1000711 -563146 198289 753226 1101275 1298862
40701 1298862 1227505 951683 781472 832714 887093 785753 654118 625246 577640 299305
40691 299305 -179708 -523125 -389710 185108 768105 976572 866240 730550 651950 517599
40681 517599 358095 291916 182333 -215599 -746801 -963659 -825387 -793173 -1060678 -1194272
40671 -1194272 -819120 -230099 23580 -150745 -386046 -298430 273172 1146414 1706828 1323961
40661 1323961 154271 -797952 -731820 98381 811051 849699 258314 -612529 -1305528 -1436572
40651 -1436572 -1030345 -505431 -125737 263494 789982 1248067 1490912 1692150 1886218
40642 1886218 1702845 992730 297418 165339 318667 60854 -695077 -1323740 -1274052 -535554
$$ packed form
40711e81354M76144O71043k20377q97436m48731M37565P61435N54937L48049J97587
40701A298862p1357k75822j70211N1242N4379j01340j31635k8872m7606k78335
40691B99305m79013l43417J33415N74818N82997K08467j10332j35690p8600j34351
40681E17599j59504o6179j09583l97932n31202k16858J38272L2214k67505j33594
40671a194272L75152N89021K53679j74325k35301Q7616N71602Q73242N60414l82867
40661A323961j169690r52223O6132Q30201P12670L8648n91385q70843o92999j31044
40651a436572M06227N24914L79694L89231N26488M58085K42845K01238J94068
40642A886218j83373p10115o95312j32079J53328k57813p55931o28663M9688P38498
$$ plain form
40632 -535554 508514 1290825 1329726 725409 214354 332459 729740 708902 174216 -418840
40622 -418840 -775348 -874576 -625898 -43413 398294 241502 -198085 -198300 278902 537944
40612 537944 244152 -120590 -87721 137837 166245 87436 264705 759609 1297946 1654821
40602 1654821 1835157 1930955 1916043 1597245 867109 79555 -74858 644610 1563688 1806549
40592 1806549 1358843 982978 1122576 1383001 1203482 617506 122973 52690 279680 440472
40582 440472 348148 198744 303007 579280 530252 -106235 -907394 -1211059 -832147 -123353
40572 -123353 439325 498436 -35357 -736901 -880315 -291380 316686 281384 -72350 55140
40562 55140 798000 1559713 1803938 1328501 85999 -1538333 -2522216 -2105127 -813385
$$ packed form
40632e35554J044068P82311L8901o04317n11055J18105L97281k0838n34686n93056
40622d18840l56508r9228K48678N82485M41707j56792m39587k15M77202K59042
40612E37944k93792l64742L2869K25558K8408p8809J77269M94904N38337L56875
40602A654821J80336R5798j4912l18798p30136p87554j54413P19468R19078K42861
40592A806549m47706l75865J39598K60425j79519n85976m94533p0283K26990J60792
40582D40472r2324j49404J04263K76273m9028o36487q01159l03665L78912P08794
40572a23353N62678N9111n33793p01544j43414N88935O08066l5302l53734J27490
40562E5140P42860P61713K44225m75437j242502j624332r83883M17089J291742
$$ plain form
40553 -813385 123044 251074 77710 -289 -42800 42337 466290 903057 846726 674722
40543 674722 1296267 2584682 3283466 2800989 2005857 1790368 1904737 1776932 1457707
40534 1457707 1056018 200614 -1095157 -1855057 -1358488 -318400 38044 -461876 -1120194
40525 -1120194 -1591813 -1986642 -2112045 -1564823 -471903 563240 1142837 1205494 790565
40516 790565 242581 283714 1202529 2239711 2415043 1697752 764115 -32982 -714562 -1016475
40506 -1016475 -562262 351394 854965 432185 -704487 -1979852 -2709245 -2309229 -930288
40497 -930288 331432 509831 -129986 -650279 -756072 -800212 -833453 -641272 -575776 -1277821
40487 -1277821 -2468992 -3002138 -2369756 -1333342 -780930 -729117 -768432 -756159 -642454 -216104
$$ packed form
40553h13385R36429J28030j73364p7999m2511Q5137M23953M36767n6331j72004
40543F74722O21545J288415O98784m82477p95132k15489J14369j27805l19225
40534A457707m01689q55404j295771p59900M96569J040088L56444m99920o58318
40525a120194m71619l94829j25403N47222J092920J035143N79597O2657m14929
40516G90565n47984M1133R18815J037182J75332p17291r33637p97097o81580l01913
40506a016475M54213R13656N03571m22780j136672j275365p29393M00016J378941
40497i30288J261720J78399o39817n20293j05793m4140l3241J92181O5496p02045
40487a277821j191171n33146O32382J036414N52412N1813l9315J2273J13705M26350
$$ plain form
40477 -216104 500550 1026995 1010115 747446 822748 1425827 2194116 2524013 1999638 780066
40467 780066 -426751 -1012601 -987218 -614828 108031 1089569 1635373 1144025 188348 19347
40457 19347 937816 1989842 2369882 2239268 1968108 1525537 1021518 976726 1497637 1879067
40447 1879067 1580909 997753 723820 631118 261448 -360417 -898018 -1278537 -1539847 -1466642
40437 -1466642 -919990 -231261 197339 370808 365776 -67697 -1037896 -2009794 -2373368 -2262086
40427 -2262086 -2234472 -2358104 -2205371 -1625818 -932306 -345929 216677 745791 962220 669502
40417 669502 30288 -571604 -790477 -484283 202961 935328 1424414 1508972 1088807 296709
40407 296709 -291521 -122152 508149 638962 -26551 -529220 122270 1580273 2611828
$$ packed form
40477b16104P16654N26445j6880k62669P5302O03079P68289L29897n24375j219572
40467G80066j206817n85850K5383L72390P22859R81538N45804m91348r55677j69001
40457A9347R18469J052026L80040j30614k71160m42571n04019m4792N20911L81430
40447A879067k98158n83156k73933r2702l69670o21865n37601l80519k61310P3205
40437a466642N46652O88729M28600J73469n032m33473r70199r71898l63574J11282
40427b262086K7614j23632J52733N79553O93512N86377N62606N29114K16429k92718
40417F69502o39214o01892k18873L06194O87244P32367M89086Q4558m20165p92098
40407B96709n88230J69369O30301J30813o65513n02669O51490J458003J031555
$$ plain form
40398 2611828 2622689 2081235 1573811 1120665 536981 -53567 -361623 -391556 -519999 -1038010
40388 -1038010 -1648324 -1653639 -886303 -180106 -371885 -998130 -802416 380413 1225681 801921
40378 801921 -133542 -424585 -221533 -436526 -1168964 -1793373 -2186657 -2685608 -3017247 -2455198
40368 -2455198 -1102591 18065 336779 320565 515201 843933 1082930 1243224 1204575
40359 1204575 690206 -100810 -498489 -281062 49756 171566 413567 966482 1335840
40350 1335840 1123082 790171 1035680 1789549 2406741 2598210 2617808 2659052 2574246 2244107
40340 2244107 1913089 2023861 2751347 3694537 4120363 3673492 2739643 1889013 1181751
40331 1181751 440460 -41402 211291 871727 958611 249021 -225995 411807 1607048
$$ packed form
40398B611828J0861n41454n07424m53146n83684n90548l08056k9933j28443n18011
40388a038010o10314n315P67336P06197j91779o26245J95714J182829Q45268m23760
40378H01921r35463k91043K03052k14993p32438o24409l93284m98951l31639N62049
40368b455198J352607J120656L18714j6214J94636L28732K38997J60294l8649
40359A204575n14369p91016l97679K17427L30818J21810K42001N52915L69358
40350A335840k12758l32911K45509P53869O17192J91469J9598M1244q4806l30139
40340B244107l31018J10772P27486R43190M25826m46871r33849q50630p07262
40331A181751p41291m81862K52693O60436Q6884p09590m75016O37802J195241
$$ plain form
40322 1607048 2109645 1561931 720346 388627 753606 1605279 2582178 3184718 3067299
40313 3067299 2463305 1999260 1976245 2074536 1870600 1444309 1283283 1605756 1957589 1694832
40303 1694832 873872 329513 605781 1113068 834905 -287106 -1283216 -1483372 -1270027
40294 -1270027 -1311251 -1634514 -1799688 -1547437 -937399 -195987 286860 144474 -518643 -1144939
40284 -1144939 -1322595 -1010590 -164855 1214116 2496282 2682182 1686130 642821 393529
40275 393529 381539 -259504 -1230238 -1615226 -1389547 -1311251 -1583248 -1685884 -1453966 -1295007
40265 -1295007 -1278836 -987096 -457658 -364657 -929251 -1437084 -1249872 -662761 -345750 -458868
40255 -458868 -701346 -778728 -483471 240354 980467 1049109 354060 -327126 -309227 145602
$$ packed form
40322A607048N02597n47714q41585l31719L64979Q51673R76899O02540j17419
40313C067299o03994m64045k3015R8291k03936m26291j61026L22473L51833k62757
40303A694832q20960n44359K76268N07287k78163j122011r96110k00156K13345
40294a270027m1224l23263j65174K52251O10038P41412M82847j42386o63117o26296
40284a144939j77656L12005Q45735J378971J282166J85900r96052j043309k49292
40275C93529j1990o41043r70734l84988K25679P8296k71997j02636K31918J58959
40265a295007J6171K91740N29438R3001n64594n07833J87212N87111L17011j13118
40255d58868k42478p7382K95257P23825P40113O8642o95049o81186J7899M54829
$$ plain form
40245 145602 308626 -54413 -618629 -1056061 -1199293 -926369 -349330 100170 207961 363162
40235 363162 944954 1606628 1782803 1688499 2018217 2668747 2675067 1725057 880301 1167011
40225 1167011 2098799 2425698 1941614 1557736 1667442 1498819 420939 -985885 -1740967
40216 -1740967 -1709695 -1399463 -1037373 -624301 -528271 -1106917 -1869563 -1935771 -1371402 -1149923
40206 -1149923 -1599586 -1859764 -1311288 -617041 -630226 -1005593 -793414 50353 688698 721496
40196 721496 593107 703394 884892 882154 739173 554394 312709 67808 -80148 -196983
40186 -196983 -337610 -247670 292456 910394 979836 496339 30778 -216846 -650772 -1391757
40176 -1391757 -1817384 -1369996 -363984 410020 590621 442949 390490 618243 983759
$$ packed form
40245A45602J63024l63039n64216m37432j43232K72924N77039M49500J07791J55201
40235C63162N81792O61674J76175r4304L29718O50530O320r50010q44756K86710
40225A167011R31788L26899m84084l83878J09706j68623j077880j406824p55082
40216a740967L1272L10232L62090M13072R6030n78646p62646o6208N64369K21479
40206a149923m49663k60178N48476O94247j3185l75367K12179Q43767O38345L2798
40196G21496j28389J10287J81498k738j42981j84779k41685k44901j47956j16835
40186a96983j40627Q9940N40126O17938O9442m83497m65561k47624m33926p40985
40176a391757m25627M47388J006012P74004J80601j47672n2459K27753L65516
$$ plain form
40167 983759 1159681 996214 760722 795781 991881 953268 652868 457270 460240 331017
40157 331017 -15074 -149571 168987 508985 374594 -40572 -111643 394208 1048143 1200198
40147 1200198 571077 -407040 -827314 -216578 783736 1090316 550708 42654 94663
40138 94663 183842 -229707 -757390 -789491 -497905 -375639 -287581 158483 655193 553352
40128 553352 11877 -149737 256769 564002 448951 433271 846651 1153889 896482 622090
40118 622090 1088952 1917809 1894024 608686 -918093 -1488173 -1081127 -584071 -501319 -466398
40108 -466398 -39460 510263 559637 56333 -344530 -151641 278331 184421 -598184 -1368532
40098 -1368532 -1361536 -629483 71708 229415 122086 236532 416810 102930 -595477 -742736
$$ packed form
40167I83759J75922j63467k35492L5059J96100l8613l00400j95598K970j29223
40157C31017l46091j34497L18558L39998j34391m15166p1071N05851O53935J52055
40147A200198o29121r78117m20274O10736J000314L06580n39608n08054N2009
40138I4663Q9179m13549n27683l2101K91586J22266Q8058M46064M96710j01841
40128E53352n41475j61614M06506L07233j15051j5680M13380L07238k57407k74392
40118F22090M66862Q28857k3785j285338j526779n70080M07046M97056Q2752L4921
40108d66398M26938N49723M9374n03304m00863J92889M29972r3910p82605p70348
40098a368532O996P32053P01191J57707j07329J14446J80278l13880o98407j47259
$$ plain form
40088 -742736 121664 1097368 1002237 -12202 -710241 -485019 37847 174247 94231 256610
40078 256610 651166 1021358 1300635 1443644 1279880 850519 452623 134452 -305749 -627199
40068 -627199 -194597 916807 1656107 1387033 808827 841274 1310646 1531903 1535347 1770602
40058 1770602 2092707 2027883 1683112 1455631 1200839 660660 328053 745229 1229886 600312
40048 600312 -894543 -1707570 -1206764 -447917 -400002 -680427 -641732 -565705 -937613 -1364883
40038 -1364883 -1108725 -194471 719285 1200796 1225175 886383 452484 377541 793061 1253914
40028 1253914 1331421 1148417 1039398 1061293 1156897 1405651 1735861 1711698 991120 -175149
40018 -175149 -1102291 -1162138 -155205 1396229 2357705 1971627 818751 180422 372251
$$ packed form
40088g42736Q64400R75704r5131j014439o98039K25222N22866J36400q0016J62379
40078B56610L94556L70192K79277J43009j63764m29361l97896l18171m40201l21450
40068f27199M32602J111404P39300k69074n78206L2447M69372K21257L444K35255
40058A770602L22105o4824l44771k27481k54792n40179l32607M17176M84657o29574
40048F00312j494855q13027N00806P58847M7915k80425L8695P6027l71908m27270
40038a364883K56158R14254R13756M81511K4379l38792m33899p4943M15520M60853
40028A253914P7507j83004j09019K1895R5604K48754L30210k4163p20578j166269
40018a75149r27142n9847J006933J551434R61476l86078j152876o38329J91829
$$ plain form
40009 372251 467415 -171445 -1008097 -1381240 -1544680 -2037035 -2707327 -3009540 -2723569 -1879450
39999 -1879450 -588659 558440 695248 -69618 -380848 583542 1802672 1831448 852734
39990 852734 181528 226071 221601 -218834 -558697 -420525 -131027 46266 363212 1003698
39980 1003698 1688953 2056894 1954815 1343231 401507 -354364 -586495 -633501 -965860 -1385867
39970 -1385867 -1391589 -1039012 -704914 -317993 288071 567051 -108755 -1167469 -1371046 -640534
39960 -640534 -130141 -332296 -396358 284937 1059601 1193073 970950 906093 787642 315847
39950 315847 -112353 -83032 32005 -219784 -435302 7277 794002 1012320 410231 -385902
39940 -385902 -730348 -464241 202113 753936 547088 -519462 -1661352 -2004834 -1549029
$$ packed form
40009C72251R5164o38860q36652l73143j63440m92355o70292l02213K85971Q44119
39999a879450J290791J147099J36808p64866l11230R64390J219130K8776r78714
39990H52734o71206M4543m470m40435l39863J38172K89498J77293L16946O40486
39980A003698O85255L67941j02079o11584r41724p55871k32131m7006l32359m20007
39970a385867n722L52577L34098L86921O06064K78980o75806j058714k03577P30512
39960f40534N10393k02155o4062O81295P74664J33472k22123o4857j18451m71795
39950C15847m28200K9321J15037k51789k15518M42579P86725K18318o02089p96133
39940c85902l44446K66107O66354N51823k06848j066550j141890l43482M55805
$$ plain form
39931 -1549029 -934232 -521683 -192151 148326 367525 334233 19468 -477669 -778190 -423734
39921 -423734 457197 1057105 857273 326990 234463 631856 992259 984826 601502 -125594
39911 -125594 -976458 -1449066 -1380254 -1311425 -1635710 -1793227 -1083724 51511 459872 -159188
39901 -159188 -1003910 -1433061 -1589334 -1690554 -1572256 -1174495 -768543 -452140 -36950 373902
39891 373902 344506 -130778 -469038 -390174 -341698 -673385 -975289 -714670 -84719 299601
39881 299601 272191 204889 361416 557366 485232 178155 68184 523539 1305617 1733478
39871 1733478 1594446 1531419 2082110 2728969 2653357 2166178 2359931 3294605 3661345 2664270
39861 2664270 1225599 659297 955508 1158009 824677 287132 -106925 -220159 97242
$$ packed form
39931a549029O14797M12549L29532L40477K19199l3292l14765m97137l00521L54456
39921d23734Q80931N99908j99832n30283r2527L97393L60403p433l83324p27096
39911a25594q50864m72608O8812O8829l24285j57517P09503J135235M08361o19060
39901a59188q44722m29151j56273j01220J18298L97761M05952L16403M15190M10852
39891C73902k9396m75284l38260P8864M8476l31687l01904K60619O29951L84320
39881B99601k7410o7302J56527J95950p2134l07077j09971M55355P82078M27861
39871A733478j39032o3027N50691O46859p5612m87179J93753R34674L66740r97075
39861B664270j438671n66302K96211K02501l33332n37545l94057j13234L17401
$$ plain form
39852 97242 750389 1175596 990947 574441 406315 256759 -231079 -583884 -88918 919580
39842 919580 1425433 1297782 1384199 1954457 2235447 1863616 1664142 2312223 3142165 3147748
39832 3147748 2508643 2187909 2417324 2522145 2090778 1458734 1006448 722158 609629
39823 609629 881330 1461524 1778401 1400148 594352 -25488 -191810 -69827 141227 358899
39813 358899 435223 170939 -361822 -728364 -572840 -73318 257754 229153 179029 406235
39803 406235 645364 406706 -276106 -801832 -740869 -290440 129373 442392 872425 1518351
39793 1518351 2176672 2510967 2327927 1813471 1481714 1624345 1811921 1364109 422317
39784 422317 -5765 605349 1500072 1756183 1639694 1983475 2596205 2462052 1556985 1204681
$$ packed form
39852I7242O53147M25207j84649m16506j68126j49556m87838l52805M94966J008498
39842I19580N05853j27651Q6417N70258K80990l71831j99474O48081Q29942N583
39832C147748o39105l20734K29415J04821m31367o32044m52286k84290j12529
39823F09629K71701N80194L16877l78253q05796o19840j66322J21983K11054K17672
39813C58899P6324k64284n32761l66542J55524M99522L31072k8601n0124K27206
39803D06235K39129k38658o82812n25726O0963M50429M19813L13019M30033O45926
39793A518351O58321L34295j83040n14456l31757J42631J87576m47812r41792
39784D22317m28082O11114Q94723K56111j16489L43781O12730j34153r05067l52304
$$ plain form
39774 1204681 2114322 3162845 2998329 2027735 1687501 2226991 2508137 1954465 1416716
39765 1416716 1708453 2340430 2404147 1960459 1703112 1698740 1394101 747730 442569 766842
39755 766842 1028866 540423 -300602 -478198 294905 1254499 1644169 1634013 1953852 2887256
39745 2887256 3927953 4352546 3900154 2893830 1896265 1328500 1308161 1717943 2347458
39736 2347458 2917831 3047944 2469236 1454553 814020 1108619 1922020 2287145 1863960
39727 1863960 1288039 1247140 1688090 2198501 2682445 3183668 3408447 3038386 2347440 1917008
39717 1917008 1830743 1746884 1695633 2086225 2840910 3290457 3204180 3195183 3680713 4123617
39707 4123617 3891448 3281920 2965364 2858354 2401720 1693880 1428025 1738659 1993702
$$ packed form
39774A204681R09641J048523j64516r70594l40234N39490K81146n53672n37749
39765A416716K91737O31977O3717m43688k57347m372l04639o46371l05161L24273
39755G66842K62024m88443q41025j77596P73103R59594L89670j0156L19839R33404
39745B887256J040697M24593m52392j006324r97565n67765k0339M09782O29515
39736B347458N70373J30113n78708j014683o40533K94599Q13401L65125m23185
39727A863960n75921m0899M40950N10411M83944N01223K24779l70061o90946m30432
39717A917008q6265q3859n1251L90592P54685M49547q6277q997M85530M42904
39707D123617k32169o09528l16556j07010m56634p07840k65855L10634K55043
$$ plain form
39698 1993702 1868376 1803619 2123475 2457904 2469579 2513004 3030160 3764775 4134621 4025224
39688 4025224 3676490 3128387 2420057 2088434 2695032 3852342 4439781 3968811 3124142
39679 3124142 2700644 2611363 2373972 2042854 1999765 2103514 1795009 1050678 543254 645134
39669 645134 865073 647193 253778 346707 1012092 1779665 2424476 3102555 3732129 3968169
39659 3968169 3987074 4592746 6089110 7565112 7870141 6990833 5927523 5454539 5564423
39650 5564423 5942448 6328461 6417055 6008334 5365584 4937199 4667495 4107557 3275547 2774488
39640 2774488 2830343 2835399 2238130 1387737 1048513 1467192 2348350 3361355 4171542 4322161
39630 4322161 3705680 2975483 2907114 3432674 3824616 3748449 3568259 3616938 3756512 3798378
$$ packed form
39698A993702j25326o4757L19856L34429J1675M3425N17156P34615L69846j09397
39688D025224l48734n48103p08330l31623O06598J157310N87439m70970q44669
39679C124142m23498q9281k37391l31118m3089J03749l08505p44331n07424J01880
39669F45134K19939k17880l93415R2929O65385P67573O44811O78079O29574K36040
39659C968169J8905O05672J496364J476002L05029q79308j063310m72984J09884
39650E564423L78025L86013Q8594m08721o42750m28385k69704n59938q32010n01059
39640B774488N5855N056n97269q50393l39224M18679Q81158J013005Q10187J50619
39630D322161o16481p30197o8369N25560L91942p6167j80190M8679J39574M1866
$$ plain form
39620 3798378 3848721 4024956 4235666 4453511 4844942 5401511 5774015 5753574 5667477 5994138
39610 5994138 6732609 7437762 7831028 8133409 8711686 9492154 9881383 9422579 8500693
39601 8500693 8092586 8643213 9504019 9797628 9496398 9145951 8862024 8393365 8035296
39592 8035296 8464923 9459863 9826370 9159948 8745611 9858586 11894171 13251861 13624818
39583 13624818 14200686 15690301 17372858 18380508 18942086 19874543 21542338 23760650
39575 23760650 26141681 28146700 29409332 30494120 32769796 36934955 42119029 47084267
39567 47084267 51933732 57870133 65488555 74171663 83262227 93102613 104646024 118595910
39559 118595910 135282859 154970481 177761983 203163023 229795633 255296080 276312480
$$ packed form
39620C798378N0343J76235K10710K17845L91431N56569L72504k0441q6097L26661
39610E994138P38471P05153L93266L02381N78277P80468L89229m58804r21886
39601H500693m08107N50627Q60806K93609l01230l50447k83927m68659l58069
39592H035296M29627R94940L66507o66422m14337J112975K035585J357690L72957
39583A3624818N75868J489615J682557J007650N61578R32457J667795K218312
39575B3760650K381031K005019J262632J084788K275676M165159N184074M965238
39567D7084267M849465N936401P618422Q683108R090564R840386J1543411J3949886
39559A18595910J6686949J9687622K2791502K5401040K6632610K5500447K1016400
$$ plain form
39552 276312480 288998363 290344338 279760871 259655621 234327663 207911111 182944293
39545 182944293 160431663 140689609 123737213 109154661 96314577 85061735 75762274
39538 75762274 68435140 62287417 56493485 51043979 46368243 42478847 39052054 36072389
39530 36072389 33754098 31978896 30425653 29123325 28244284 27493617 26429160 25297582
39522 25297582 24735945 24626572 24096463 22745108 20999425 19143233 17015576 14921767
39514 14921767 13702794 13405080 12996570 12041412 11483651 11889415 12113188 10978484 9301813
39505 9301813 8719422 9189661 9322350 8772056 8518229 8829772 8736065 7827173 6971611 6722571
39495 6722571 6439819 5653220 5018293 5130304 5476517 5396113 5153999 5233980 5377720 5153771
$$ packed form
39552B76312480J2685883J345975j0583467k0105250k5327958k6416552k4966818
39545A82944293k2512630j9742054j6952396j4582552j2840084j1252842r299461
39538G5762274p327134o147723n793932n449506m675736l889396l426793k979665
39530C6072389k318291j775202j553243j302328q79041p50667j064457j131578
39522B5297582n61637j09373n30109j351355j745683j856192k127657k093809
39514A4921767j218973k97714m08510r55158n57761M05764K23773j134704j676671
39505I301813n82391M70239J32689n50294k53827L11543r3707r08892q55562k49040
39495F722571k82752p86599o34927J12011L46213q0404k42114P9981J43740k23949
$$ plain form
39485 5153771 4797679 4725320 4818938 4839466 4895202 4925119 4493804 3705770 3402425 3713202
39475 3713202 3458826 1984224 520496 442546 1143062 1211807 937745 1735037 3459249
39466 3459249 4338863 3706200 2895817 2959356 3209180 2796914 2280119 2619660 3656434
39457 3656434 4538542 4924940 4986600 4832576 4575959 4416294 4197130 3528121 2719736 2749978
39447 2749978 3788080 4650411 4392521 3568201 3116991 2871052 2180666 1313091 1045863
39438 1045863 1282011 1213601 660557 224252 220277 394024 637909 1107575 1628869 1816174
39428 1816174 1810105 2108378 2601580 2552809 1682898 597973 -14430 -23776 378200 918545
39418 918545 1171148 895251 545485 790701 1449292 1653015 1200565 877379 1125806 1315444
$$ packed form
39485E153771l56092p2359R3618K0528N5736K9917m31315p88034l03345L10777
39475C713202k54376j474602j463728p7950P00516O8745k74062P97292J724212
39466C459249Q79614o32663q10383O3539K49824m12266n16795L39541J036774
39457C656434Q82108L86398O1660j54024k56617j59665k19164o69009q08385L0242
39447B749978J038102Q62331k57890q24320m51210k45939o90386q67575k67228
39438A045863K36148o8410n53044m36305l975J73747K43885M69666N21294J87305
39428A816174o069K98273M93202m8771q69911j084925o12403r346M01976N40345
39418I18545K52603k75897l49766K45216O58591K03723m52450l23186K48427J89638
$$ plain form
39408 1315444 876211 308068 300675 535791 296544 -208797 -188962 276557 249310 -475277
39398 -475277 -847991 -106313 1024094 1394264 1106543 1190321 1831012 1976485 990535 -191089
39388 -191089 -238606 772715 1584657 1542837 1204041 1055532 631903 -535660 -1841241
39379 -1841241 -2265851 -1690875 -788846 61706 898026 1424279 1152303 387864 135866
39370 135866 723086 1326030 1232316 775126 523356 329569 -101019 -330085 228932 1201920
39360 1201920 1618457 1239148 724574 549077 534326 506624 637669 932439 1060625 970551
39350 970551 1061111 1422043 1490217 894241 137791 -75016 208646 485052 706815 1207927
39340 1207927 1869550 2104234 1746670 1296874 1085673 834967 386873 257852 875118
$$ packed form
39408A315444m39233n68143p393K35116k39247n05341J9835M65519k7247p24587
39398d75277l72714P41678J130407L70170k87721Q3778O40691J45473r85950j181624
39388a91089m7517J011321Q11942m1820l38796j48509m23629j167563j305581
39379a841241m24610N74976R02029Q50552Q36320N26253k71976p64439k51998
39370A35866N87220O02944r3714m57190k51770j93787m30588k29066N59017R72988
39360A201920M16537l79309n14574j75497j4751k7702J31045K94770J28186r0074
39350I70551R0560L60932O8174n95976p56450k12807K83662K76406K21763N01112
39340A207927O61623K34684l57564m49796k11201k50706m48094j29021O17266
$$ plain form
39331 875118 1655295 1562207 471714 -675516 -1103650 -942919 -603619 -100605 584964
39322 584964 1021407 826484 379377 413002 978491 1376410 1144125 596472 272242 307886
39312 307886 529454 722089 565855 -258785 -1512917 -2270364 -1835188 -653935 138227
39303 138227 34666 -429337 -610943 -572464 -654159 -658587 -59914 1008927 1586650 1046393
39293 1046393 54484 -163046 608208 1340884 1221562 675630 512093 633422 359545
39284 359545 -277916 -519161 -195120 -97164 -657591 -1120560 -679403 214402 511261 120734
39274 120734 -127765 61002 16457 -666958 -1297028 -963630 242084 1362066 1648221
39265 1648221 1137284 368683 -116005 -103728 173542 284764 98838 -81345 -3385 129045
$$ packed form
39331H75118P80177r3088j090493j147230m28134J60731L39300N03014O85569
39322E84964M36443j94923m47107L3625N65489L97919k32285n47653l24230L5644
39312C07886K21568J92635j56234q24640j254132p57447M35176J181253P92162
39303A38227j03561m64003j81606L8479q1695m428N98673J068841N77723n40257
39293A046393r91909k17530P71254P32676j19322n45932j63537J21329k73877
39284C59545o37461k41245L24041R7956n60427m62969M41157Q93805K96859l90527
39274A20734k48499J88767m4545o83415o30070L33398J205714J119982K86155
39265A648221n10937p68601m84688J2277K77270J11222j85926j80183P7960J32430
$$ plain form
39255 129045 -29001 -400244 -526248 -118272 672203 1483690 1994546 1982937 1467038 879456
39245 879456 794235 1253739 1578111 1155292 328965 120055 965458 2081685 2360369 1659875
39235 1659875 798317 357068 44342 -538918 -1010160 -636549 510609 1430731 1373656
39226 1373656 705482 303253 382316 348586 -241077 -1007291 -1268490 -1012355 -988921 -1766642
39216 -1766642 -2967497 -3674703 -3461978 -2712207 -1956501 -1307006 -706541 -339483 -395330
39207 -395330 -606228 -434911 286087 1179879 1739760 1671418 968676 24808 -445422 -82668
39197 -82668 536578 540678 31078 37786 971862 1876474 1777358 1134706 1094001 1648475 1578598
39186 1578598 295741 -1170895 -1415287 -256995 1315844 2315080 2404521 1783115 981678
$$ packed form
39255A29045j58046l71243j26004M07976P90475Q11487N10856j1609n15899n87582
39245H79456q5221M59504L24372m22819q26327k08910Q45403J116227K78684p00494
39235A659875q61558m41249l12726n83260m71242L73611J147158R20122n7075
39226A373656o68174m02229P9063l3730n89663p66214k61199K56135K3434p77721
39216a766642j200855p07206K12725P49771P55706O49495O00465L67058n5847
39207c95330k10898J71317P20998Q93792N59881o8342p02742r43868m70230L62754
39197h2668O19246M100n09600O708R34076R04612r9116o42652m0705N54474o9877
39186A578598j282857j466636k44392J158292J572839R99236Q9441o21406q01437
$$ plain form
39177 981678 600834 762754 895075 443108 -326289 -682871 -502626 -398894 -691501 -860106
39167 -860106 -373690 421543 765590 553096 355689 481204 630043 588853 659323 1046883
39157 1046883 1276858 751658 -296424 -942022 -685829 -7726 325026 133972 -211774
39148 -211774 -413644 -466393 -395284 -170464 52018 -51329 -492246 -746585 -338503 454111
39138 454111 882970 769581 792935 1451471 2173534 2026605 1092600 424522 580158 918067
39128 918067 642315 -99498 -632928 -744951 -672656 -503813 -233638 -135425 -421136 -765366
39118 -765366 -829325 -975979 -1631928 -2178813 -1575730 -114177 649948 55519 -741247 -590789
39108 -590789 25091 79043 -245735 -48402 656700 1032686 841789 629242 628764 567867
$$ packed form
39177I81678l80844J61920J32321m51967p69397l56582J80245J03732k92607j68605
39167h60106M86416P95233L44047k12494j97407J25515J48839m1190P0470L87560
39157A046883K29975n25200j048082o45598K56193O78103L32752j91054l45746
39148b11774k01870n2749P1109K24820K22482j03347m40917k54339M08082P92614
39138D54111M28859j13389K3354O58536P22063j46929r34005o68078J55636L37909
39128I18067k75752p41813n33430j12023P2295J68843K70175R8213k85711l44230
39118g65366o3959j46654o55949n46885O03083J461553P64125n94429p96766J50458
39108e90789O15880N3952l24778J97333P05102L75986j90897k12547m78o0897
$$ plain form
39098 567867 534269 970846 1691089 1893338 1374282 819105 631217 386417 -186587 -570531
39088 -570531 -324210 155757 295431 135195 -88782 -536849 -1288235 -1782836 -1471622 -705079
39078 -705079 -302523 -449978 -618178 -397722 144830 809919 1433722 1780744 1703508 1344587
39068 1344587 859169 151323 -719842 -1178376 -786826 -98861 -156331 -1100103 -1946473 -1923825
39058 -1923825 -1403091 -1130374 -1041953 -445839 763041 1673466 1404237 286622 -402970
39049 -402970 80392 1100868 1496396 974912 245883 -18223 251444 932640 1931619
39040 1931619 2764154 2653616 1524073 349166 9748 276227 419092 312005 311628 509352
39030 509352 809370 1356719 2133643 2487023 1899557 967001 729175 1224188 1615378 1584480
$$ packed form
39098E67867l3598M36577P20243K02249n19056n55177j87888k44800n73004l83944
39088e70531K46321M79967J39674j60236k23977m48067p51386m94601L11214P66543
39078g05079M02556j47455j68200K20456N42552O65089O23803L47022p7236l58921
39068A344587m85418p07846q71165m58534L91550O87965n7470r43772q46370K2648
39058a923825N20734K72717Q8421N96114J208880R10425k69229j117615o89592
39049d02970M83362J020476L95528n21484p29029k64106K69667O81196R98979
39040A931619Q32535j10538j129543j174907l39418K66479J42865j07087l77J97724
39030E09352L00018N47349P76924L53380n87466r32556k37826M95013L91190l0898
$$ plain form
39020 1584480 1570338 1656059 1312343 418357 -466687 -1088058 -1790465 -2555776 -2727210 -2086397
39010 -2086397 -1300765 -877059 -540662 -72899 160777 18679 -10946 232566 182206 -270475
39000 -270475 -249732 602763 1163461 471476 -584562 -531600 454980 1013203 775037 555924
38990 555924 630224 392166 -218319 -411826 80482 605845 825707 1105961 1347117 750730
38980 750730 -658461 -1507498 -903386 209371 451415 -36678 -83713 616516 1192483
38971 1192483 981639 304132 -179890 -226247 -49163 -50887 -502322 -1155037 -1283313 -470762
38961 -470762 766101 1490344 1343446 672682 -161543 -1098513 -1993141 -2418020 -2103484
38952 -2103484 -1364604 -876522 -1043944 -1646978 -2102418 -2066760 -1726488 -1412122 -1042798 -242658
$$ packed form
39020A584480j4142Q5721l43716q93986q85044o21371p02407p65311j71434O40813
39010b086397P85632M23706L36397M67763K33676j42098k9625K43512n0360m52681
39000b70475K0743Q52495N60698o91985j056038N2962R86580N58223k38166k19113
38990E55924P4300k38058o10485j93507M92308N25363K19862K80254K41156n96387
38980G50730j409191q49037O04112J112757K42044m88093m7035P00229N75967
38971A192483k10844o77507m84022m6357J77084j724m51435o52715j28276Q12551
38961d70762J236863P24243j46898o70764q34225r36970q94628m24879L14536
38952b103484P38880M88082j67422o03034m55440L5658L40272L14366L69324Q00140
$$ plain form
38942 -242658 962102 1927648 2121921 1834874 1820281 2282030 2535057 1807035 213615
38933 213615 -1277698 -1872665 -1718308 -1453281 -1212397 -586587 384167 855820 279708
38924 279708 -647519 -790017 -19540 839264 1256991 1358902 1158950 418400 -572358 -1011969
38914 -1011969 -753279 -636872 -1203921 -1806401 -1555205 -552288 398315 797026 600943
38905 600943 -139697 -1143329 -1725228 -1381159 -380553 609306 1226041 1434447 1273261
38896 1273261 982191 953912 1145285 997942 352028 -144927 -51737 116112 -162968 -400689
38886 -400689 60564 764686 755052 54373 -585088 -1083945 -1928943 -2777902 -2506325 -870968
38876 -870968 989938 2001807 2120223 1655725 750688 -76119 33450 1051804 1744195
$$ packed form
38942b42658J204760R65546J94273k87047j4593M61749K53027p28022j593420
38933B13615j491313n94967J54357K65027K40884O25810R70754M71653n76112
38924B79708r27227j42498P70477Q58804M17727J01911j99952p40550r90758m39611
38914a011969K58690J16407n67049o02480K51196J002917R50603L98711j96083
38905F00943p40640j003632n81899L44069J000606R89859O16735K08406j61186
38896A273261k91070k8279J91373j47343o45914m96955R3190J67849k79080k37721
38886d00689M61253P04122r634p00679o39461m98857q44998q48959K71577J635357
38876h70968J860906J011869J18416m64498r05037q26807J09569J018354O92391
$$ plain form
38867 1744195 1235324 171154 -322397 -149604 8367 -108096 -173870 24129 390157
38858 390157 796052 1058249 884972 264828 -356218 -629670 -720582 -891850 -1111488 -1378794
38848 -1378794 -1881072 -2400764 -2187808 -1025407 147106 412164 193294 550560 1520523
38839 1520523 2120254 1865526 1333358 1145250 1226555 1260992 1179158 970142 594240 281724
38829 281724 369234 652544 471384 -307435 -934188 -734583 38334 665549 853657 758621
38819 758621 489937 88675 -229799 -308117 -394879 -784528 -1183559 -965545 -122895 579439
38809 579439 653221 612751 1209787 2263862 2841183 2514789 1840653 1464868 1343845 1162085
38799 1162085 1009735 1136145 1347888 1209309 700618 205437 -22766 68520 586102 1431507
$$ packed form
38867A744195n08871j064170m93551J72793J57971j16463o5774J97999L66028
38858C90157M05895K62197j73277o20144o21046k73452r0912j71268k19638k67306
38848a378794n02278n19692K12956J162401J172513K65058k18870L57266R69963
38839A520523N99731k54728n32168j88108Q1305L4437q1834k09016l75902l12516
38829B81724Q7510K83310j81160p78819o26753J99605P72917O27215J88108r5036
38819G58621k68684m01262l18474p8318q6762l89649l99031K18014Q42650P02334
38809E79439P3782m0470N97036J054075N77321l26394o74136l75785j21023j81760
38799A162085j52350J26410K11743j38579n08691m95181k28203R1286N17582Q45405
$$ plain form
38789 1431507 1947875 1545199 655897 319068 759977 1190824 1145989 1064453 1205713 985695
38779 985695 19665 -1023657 -1363089 -1172856 -914046 -338754 830947 1836846 1692290
38770 1692290 717867 93114 96542 23532 -250610 -20153 733009 960519 237656 -381055
38760 -381055 15269 706508 443441 -669848 -1432928 -1265998 -654906 -75664 520855
38751 520855 1043045 941088 -39677 -1285589 -1918538 -1754709 -1353146 -1228655 -1309202 -1200661
38741 -1200661 -743420 -115350 507539 1116329 1658610 1948489 1922463 1712622 1316709 584338
38731 584338 -195544 -215595 758458 1647346 1236706 -131840 -998432 -860710 -719589 -1327664
38721 -1327664 -2043756 -2022959 -1546595 -1328163 -1285745 -993556 -759550 -1119740 -1594541 -1163673
$$ packed form
38789A431507N16368m02676q89302l36829M40909M30847m4835q1536J41260k20018
38779I85695r66030j043322l39432J90233K58810N75292J169701J005899j44556
38770A692290r74423o24753L428p3010k74142K30457P53162K27510p22863o18711
38760c81055L96324O91239k63067j113289p63080J66930O11092N79242N96519
38751E20855N22190j01957r80765j245912o32949J63829M01563J24491q0547J08541
38741a200661M57241O28070O22889O08790N42281K89879k6026k09841l95913p32371
38731E84338p79882k0051R74053Q88888m10640j368546q66592J37722J41121o08075
38721a327664p16092K0797M76364K18432M2418K92189K34006l60190m74801M30868
$$ plain form
38711 -1163673 33825 635762 -41546 -1055686 -1256175 -776887 -461515 -500467 -495613 -466636
38701 -466636 -816497 -1352571 -1300985 -587036 -272187 -1110430 -2257197 -2245987 -973083 216636
38691 216636 413684 109819 156 -103298 -456382 -451533 372568 1060950 396850 -959897
38681 -959897 -1060802 470618 1765468 1444554 499355 471499 1070163 968591 86276
38672 86276 -444932 -155700 347245 672673 1035877 1348780 1132786 501794 162869 246365
38662 246365 162138 -168768 -48500 642539 938069 282438 -426911 -138469 744987 1013590
38652 1013590 435504 -88955 34472 409703 455449 154317 -217373 -578228 -961342 -1238068
38642 -1238068 -1205564 -884365 -574405 -540588 -618856 -263734 771011 1839456 1888361 709410
$$ packed form
38711a163673J197498O01937o77308j014140k00489M79288L15372l8952M854K8977
38701d66636l49861n36074N1586P13949L14849q38243j146767J1210J272904J189719
38691B16636J97048l03865j09663j03454l53084M849Q24101O88382o64100j356747
38681i59897j00905J531420J294850l20914r45199k7856N98664j01572q82315
38672H6276n31208K89232N02945L25428L63204L12903k15994o30992l38925Q3496
38662B46365q4227l30906J20268O91039K95530o55631p09349K88442Q83456K68603
38652A013590n78086n24459J23427L75231M5746l01132l71690l60855l83114k76726
38642a238068L2504L21199L09960L3817p8268L55122J034745J068445M8905j178951
$$ plain form
38632 709410 -649371 -1024742 -434730 94153 -210604 -1157501 -2021306 -2264795 -1806520
38623 -1806520 -932156 -98771 369239 547272 811116 1401268 2130217 2566717 2490383 2125865
38613 2125865 1895919 1951685 2028468 1807211 1302021 788950 487365 473156 750696 1156776
38603 1156776 1319939 1043272 668830 723340 1232254 1726212 1879403 1748887 1442926 1048692
38593 1048692 872435 1155299 1484030 1170565 401257 231015 1053030 1869978 1708501
38584 1708501 1054193 1036050 1681137 1956639 1342622 441889 17924 181191 590846 839789
38574 839789 621778 82912 -79661 493993 1007007 424847 -863195 -1369627 -679650
38565 -679650 -122310 -722510 -1592763 -1316739 -127852 490110 -5 -604889 -433368
$$ packed form
38632G09410j358781l75371N90012N28883l04757r46897q63805k43489M58275
38623a806520Q74364Q33385M68010J78033K63844N90152P28949M36500p6334l64518
38613B125865k29946N5766P6783k21257n05190n13071l01585j4209K77540M06080
38603A156776J63163k76667l74442N4510N08914M93958J53191j30516l05961l94234
38593A048692j76257K82864L28731l13465p69308j70242Q22015Q16948j61477
38584A708501o54308j8143O45087K75502o14017r00733m23965J63267M09655K48943
38574H39789k18011n38866j62573N73654N13014n82160j288042n06432O89977
38565f79650N57340o00200q70253K76024J188887O17962m90115o04884J71521
$$ plain form
38556 -433368 154921 365732 133756 -37326 78267 249622 259455 180157 216701 451935
38546 451935 722998 725030 353261 -83473 -220053 -221801 -682912 -1760453 -2703312 -2575668
38536 -2575668 -1334407 121586 937474 1040565 891773 872772 1111682 1616714 2231547
38527 2231547 2567114 2319512 1659287 1028509 574336 139005 -169979 90208 933612
38518 933612 1568595 1245983 204782 -704071 -1103121 -1236056 -1200256 -756849 -3969 433165
38508 433165 187800 -346161 -581270 -397402 17596 539547 974290 955632 413444 -121515
38498 -121515 -82226 445688 901669 913335 545221 173782 341692 1312904 2443658 2529486
38488 2529486 1316538 141342 312503 1300581 1519061 635427 -115939 -13441 75332
$$ packed form
38556d33368N88289K10811k31976j71082J15593J71355R833p9298L6544K35234
38546D51935K71063K032l71769m36734j36580j748m61111j077541r42859J27644
38536b575668J241261J455993Q15888J03091j48792j9001K38910N05032O14833
38527B231547L35567k47602o60225o30778m54173m35331l08984K60187Q43404
38518I33612O34983l22612j041201r08853l99050j32935L5800M43407P52880M37134
38508D33165k45365n33961k35109J83868M14998N21951M34743j8658n42188n34959
38498a21515L9289N27914M55981J1666l68114l71439J67910R71212J130754Q5828
38488B529486j212948j175196J71161R88078K18480q83634p51366J02498Q8773
$$ plain form
38479 75332 -715385 -1675905 -1507060 -232926 911885 1229097 1205995 1406391 1606931 1372398
38469 1372398 871013 620446 714908 776089 600451 428148 440787 354357 -124150 -614730
38459 -614730 -387180 513608 1043236 485663 -457091 -549306 299793 1046349 1106412 1015674
38449 1015674 1312526 1686807 1714463 1668573 1956452 2327435 2330926 2123388 2122819 2217684 2044817
38438 2044817 1779682 1890956 2275628 2390467 2160917 2027828 2126372 2158879 2088176 2152637
38428 2152637 2081106 1175194 -468071 -1595448 -1214294 162823 1227284 1401182 1104002
38419 1104002 842876 693010 592601 582310 630604 561744 295578 -23775 -240867 -430402
38409 -430402 -802238 -1310427 -1446507 -696943 650824 1485488 1052038 -50482 -559940
$$ packed form
38479G5332p90717r60520J68845J274134J144811L17212k3102K00396K00540k34533
38469A372398n01385k50567R4462O1181j75638j72303J2639q6430m78507m90580
38459f14730K27550R00788N29628n57573r42754r2215Q49099P46556O0063r0738
38449A015674K96852L74281K7656m5890K87879L70983L491k07538n69R4865j72867
38438B044817k65135J11274L84672J14839k29550j33089R8544L2507p0703O4461
38428B152637p1531r05912j643265j127377L81154J377117J064461J73898k97180
38419A104002k61126j49866j00409j0291M8294o8860k66166l19353k17092j89535
38409d30402l71836n08189j36080P49564J347767Q34664m33450j102520n09458
$$ plain form
38400 -559940 -120916 454376 481475 204959 78449 -6132 -286935 -490524 -194504 511424
38390 511424 1194274 1597632 1601117 1056789 145684 -481165 -469593 -344444 -744048 -1389808
38380 -1389808 -1496100 -968765 -442793 -247296 -124159 8806 -175678 -667531 -819295
38371 -819295 -141245 1041225 1977717 2201196 1736866 1004297 608298 815799 1176572
38362 1176572 1094848 744181 800335 1246284 1254316 501082 -259663 -414684 -463010 -1059125
38352 -1059125 -1769347 -1711128 -1016902 -666578 -1006689 -1369465 -1207341 -759255 -394457 -14544
38342 -14544 594665 1355132 2086139 2625067 2590188 1599590 17942 -1065116 -1004427 -308944
38332 -308944 192767 404761 672412 906230 727373 273028 117021 409456 760186 1032823
$$ packed form
38400e59940M39024N75292K7099k76516j26510q4581k80803k03589K96020P05928
38390E11424O82850M03358L485n44328r11105o26849J1572J25149l99604o45760
38380a389808j06292N27335N25972J95497J23137J32965j84484m91853j51764
38371h19295O78050J182470R36492K23479m64330p32569l95999K07501L60773
38362A176572q1724l50667N6154M45949Q032p53234p60745j55021m8326n96115
38352a059125p10222N8219O94226L50324l40111l62776J62124M48086L64798L79913
38342a4544O09209P60467P31007N38928l4879r90598j581648j083058O0689O95483
38332c08944N01711K11994K67651K33818j78857m54345j56007K92435L50730K72637
$$ plain form
38322 1032823 1573575 2429740 2950513 2547304 1449172 372885 -210428 -198886 320158
38313 320158 942811 975290 106863 -1090788 -1746766 -1636042 -1197814 -844971 -705940 -848011
38303 -848011 -1223474 -1512733 -1539075 -1693063 -2343353 -2976024 -2698724 -1602388 -760895 -705267
38293 -705267 -783046 -362142 227578 471667 550955 772617 863893 613522 557588 1138797
38283 1138797 1755443 1642993 1225873 1468211 2201530 2318659 1514033 601816 58146
38274 58146 -522469 -1306296 -1747181 -1589063 -1245011 -791064 279769 1791840 2556856
38265 2556856 2041435 1278182 1242640 1358118 684674 -334616 -617675 -253052 -162586 -393842
38255 -393842 -207726 326770 320358 -251982 -267950 757340 1809897 1836028 1083297 421569
$$ packed form
38322A032823N40752Q56165N20773m03209j098132j076287n83313J1542N19044
38313C20158O22653L2479q68427j197651o55978J10724M38228L52843J39031j42071
38303h48011l75463k89259k6342j53988o50290o32671K77300J096336Q41493N5628
38293g05267p7779M20904N89720K44089P9288K21662R1276k50371n5934N81209
38283A138797O16646j12450m17120K42338P33319J17129q04626r12217n43670
38274E8146n80615p83827m40885J58118L44052M53947J070833J512071P65016
38265B556856n15421p63253l5542J15478o73444j019290k83059L64623R0466k31256
38255c93842J86116N34496o412n72340j5968J025290J052557K6131p52731o61728
$$ plain form
38245 421569 167859 176521 369491 560564 364603 -122168 -114233 773737 1744158 1806698
38235 1806698 1144415 773407 1120994 1665818 1849178 1665783 1377877 1232442 1472247
38226 1472247 2075111 2425337 1792663 319636 -905658 -992745 -148487 758309 1213302
38217 1213302 1346270 1408419 1342665 967707 405599 101993 296676 569810 221397 -748415
38207 -748415 -1348456 -677258 842845 1802120 1433993 435010 -43836 241558 669141
38198 669141 789525 730229 648638 386568 -147439 -689678 -985295 -1133934 -1293803 -1309939
38188 -1309939 -990800 -571906 -485325 -712781 -778768 -462373 -154098 -325022 -894099 -1329897
38178 -1329897 -1233345 -660398 12164 397468 368793 151236 103845 357468 726718 969771
$$ packed form
38245D21569k53710Q662J92970J91073j95961m86771P935Q87970R70421O2540
38235A806698o62283l71008L47587N44824J83360j83395k87906j45435K39805
38226A472247O02864L50226o32674j473027j225294q7087Q44258R06796M54993
38217A213302J32968O2149o5754l74958n62108l03606J94683K73134l48413r69812
38207g48415o00041O71198J520103R59275l68127r98983m78846K85394M27583
38198F69141J20384n9296q1591k62070n34007n42239k95617j48639j59869j6136
38188a309939L19139M18894Q6581k27456o5987L16395L08275j70924n69077m35798
38178a329897R6552N72947O72562L85304k8675k17557m7391K53623L69250K43053
$$ plain form
38168 969771 1003454 861772 610138 327011 30160 -333525 -636321 -462136 336078 1039714
38158 1039714 629808 -869128 -2197820 -2352705 -1712683 -1211180 -949399 -375668 503122
38149 503122 988095 766078 342439 212594 226813 59754 -164908 -58708 479988 1117159
38139 1117159 1328401 764173 -375635 -1339625 -1523242 -1167370 -990636 -1151091 -1082631
38130 -1082631 -461812 229436 395316 120284 -98879 -79773 -35030 -160695 -477524 -887005
38120 -887005 -1085151 -631445 533218 1760608 2249342 1903450 1350486 1115445 1081797
38111 1081797 868313 471616 258723 357183 349835 -186160 -962392 -1177743 -525161 388828
38101 388828 877986 1027404 1274079 1498855 1216854 537019 167093 354630 529358 259363
$$ packed form
38168I69771L3683j41682k51634k83127k96851l63685l02796J74185P98214P03636
38158A039714m09906j498936j328692j54885O40022N01503K61781N73731Q78790
38149E03122M84973k22017m23639j29845J4219j67059k24662J06200N38696O37171
38139A117159K11242n64228j139808r63990j83617L55872J76734j60455O8460
38130a082631O20819O91248J65880k75032k19163J9106M4743j25665l16829m09481
38120h87005j98146M53706J164663J227390M88734l45892n52964k35041l3648
38111A081797k13484l96697k12893R8460p348n35995p76232k15351O52582R13989
38101C88828M89158J49418K46675K24776k82001o79835l69926J87537J74728k69995
$$ plain form
38091 259363 -68202 88955 577812 810110 558123 134693 21810 531524 1489725 2048515
38081 2048515 1281654 -662243 -2390697 -2667954 -1690775 -620445 -205838 -305550 -442064
38072 -442064 -286070 245737 905094 1211794 976420 572841 396637 312455 25192 -272544
38062 -272544 -144782 318256 486010 -7337 -763465 -973147 -151154 1337316 2382972
38053 2382972 2073618 717426 -438013 -705492 -652292 -966475 -1311546 -989751 -219784
38044 -219784 117638 -251525 -792939 -1060846 -1019187 -608128 188395 876595 845249 265608
38034 265608 -108272 -41120 10246 -184298 -341661 -364157 -495776 -632906 -295948 497325
38024 497325 1101125 1189824 1049977 737404 -141038 -1464410 -2333438 -2235935 -1637936 -968075
$$ packed form
38091B59363l27565J57157M88857K32298k51987m23430j12883N09714R58201N58790
38081B048515p66861j943897j728454k77257R77179J070330M14607r9712j36514
38072d42064J55994N31807O59357L06700k35374m03579j76204q4182k87263k97736
38062b72544J27762M63038J67754m93347p56128k09682Q21993J488470J045656
38053B382972l09354j356192j155439k67479N3200l14183l45071L21795P69967
38044b19784L37422l69163n41414k67907M1659M11059P96523O88200l1346n79641
38034B65608l73880O7152N1366j94544j57363k2496j31619j37130L36958P93273
38024D97325O03800Q8699j39847l12573q78442j323372q69028R7503N97999O69861
$$ plain form
38014 -968075 15261 1205559 1516929 255468 -1604537 -2532900 -2273753 -1589012 -769973
38005 -769973 377655 1424851 1545446 865362 393125 439768 234026 -557517 -1014632
37996 -1014632 -298372 1006594 1655644 1383108 1053290 1385341 2140617 2575965 2285559
37987 2285559 1503638 789348 483306 407283 119904 -503761 -1040409 -947126 -188037 632239
37977 632239 824074 367180 39474 582025 1734129 2423518 2046058 1185464 802099
37968 802099 1090074 1534736 1735063 1604365 1029962 59371 -641723 -286196 912835
37959 912835 1778919 1613099 1035726 1035986 1669698 2158392 1947507 1193581 395138 -25663
37949 -25663 134395 747873 1363774 1575235 1414970 1258808 1387278 1766668 2177497 2398662
$$ packed form
38014i68075R83336J190298L11370j261461j860005r28363K59147O84741Q19039
38005g69973J147628J047196J20595o80084m72237M6643k05742p91543m57115
37996a014632P16260J304966O49050k72536l29818L32051P55276M35348k90406
37987B285559p81921p14290l06042p6023k87379o23665n36648R3283P59089Q20276
37977F32239J91835m56894l27706N42551J152104O89389l77460q60594l83365
37968H02099K87975M44662K00327j30698n74403r70591p01094L55527J199031
37959I12835Q66084j65820n77373K60O33712M88694k10885p53926p98443m20801
37949b5663J60058O13478O15901K11461j60265j56162J28470L79390M10829K21165
$$ plain form
37939 2398662 2306698 1934175 1446921 1026424 785022 736323 735870 542885 169667 90021
37929 90021 733217 1750403 2244363 1900515 1402384 1391366 1497663 962172 -114471 -858270
37919 -858270 -857796 -576779 -424312 -144868 498349 1023591 785257 -84583 -844536 -1095470
37909 -1095470 -1040080 -874850 -518135 -73366 -18770 -593949 -1342003 -1642139 -1485053 -1342043
37899 -1342043 -1419318 -1484582 -1395596 -1310842 -1238672 -834713 41146 905518 1211185 1136813
37889 1136813 1339068 1942520 2269912 1753337 725009 -3256 -122786 -67222 -358923
37880 -358923 -993692 -1481795 -1329222 -495237 494953 954648 698222 205130 -41305 -183131
37870 -183131 -612254 -1135474 -1108338 -503062 -184183 -694704 -1295492 -882294 416283 1321319
$$ packed form
37939B398662r1964l72523m87254m20497k41402m8699m53j92985l73218p9646
37929I0021O43196J017186M93960l43848m98131j1018J06297n35491j076643p43799
37919h58270M74K81017J52467K79444O43217N25242k38334q69840p59953k50934
37909a095470N5390J65230L56715M44769N4596n75179p48054l00136J57086J43010
37899a342043p7275o5264Q8986Q4754P2170M03959Q75859Q64372L05667p4372
37889A136813K02255O03452L27392n16575j028328p28265j19530N5564k91701
37880c58923o34769m88103J52573Q33985R90190M59695k56426m93092k46435j41826
37870a83131m29123n23220K7136O05276L18879n10521o00788M13198J298577R05036
$$ plain form
37860 1321319 1070624 268416 -113785 97519 481482 808511 1060860 1024462 477451 -318459
37850 -318459 -810544 -836387 -753249 -903555 -1245199 -1452600 -1110424 38269 1632393 2599526
37840 2599526 2075677 523141 -552563 -228272 861261 1424424 1053687 482667 467294
37831 467294 869630 1012980 668472 310472 327927 370069 -101160 -800119 -833798 -68620
37821 -68620 458043 -38434 -921180 -1121912 -767527 -828087 -1410151 -1533644 -694867 391350
37811 391350 909459 920410 861657 850864 858956 862450 521690 -494128 -1566527 -1510612 -383745
37800 -383745 211013 -575224 -1351665 -481718 1326574 1900439 606376 -1013137 -1463208
37791 -1463208 -771009 302855 1184187 1344735 457220 -832571 -1257007 -545558 125887
$$ packed form
37860A321319k50695q02208l82201K11304L83963L27029K52349l6398n47011p95910
37850c18459m92085k5843Q3138j50306l41644k07401L42176J148693J594124R67133
37840B599526n23849j552536j075704L24291J089533N63163l70737n71020j5373
37831D67294M02336J43350l44508l58000J7455M2142m71229o98959l3679P65178
37821f8620N26663m96477q82746k00732L54385o0560n82064j23493Q38777J086217
37811C91350N18109J0951n8753j0793Q092L494l40760j015818j072399N5915J126867
37800c83745N94758p86237p76441Q69947J808292N73865j294063j619513m50071
37791a463208O92199J073864Q81332J60548q87515j289791m24436P11449O71445
$$ plain form
37782 125887 -219191 -1035463 -1145411 -321452 638030 992613 670135 41657 -510838 -917979
37772 -917979 -1434130 -2121939 -2439295 -1843852 -743013 -136760 -237269 -249681 251575 633331
37762 633331 366072 19733 360346 1081679 1281966 825850 411152 464572 710841 803309
37752 803309 760538 704544 621247 477178 286949 44643 -207980 -315018 -205047 -53512
37742 -53512 -69386 -242633 -433268 -517992 -320965 328262 1264573 1962067 2053835 1678097
37732 1678097 1180613 749755 461035 322212 118779 -382768 -907985 -834427 -117192 489488
37722 489488 478915 290639 496265 845183 745181 250385 -133318 -313779 -550796 -710770
37712 -710770 -311025 692962 1737602 2311471 2374424 2147735 1838037 1503560 951282
$$ packed form
37782A25887l45078q16272j09948Q23959R59482L54583l22478o28478n52495m07141
37772i17979n16151o87809l17356N95443J100839O06253j00509j2412N01256L81756
37762F33331k67259l46339L40613P21333K00287m56116m14698N3420K46269R2468
37752H03309m2771n5994q3297j44069j90229k42306k52623j07038J09971J51535
37742e3512j5874j73247j90635q4724J97027O49227R36311O97494R1768l75738
37732A678097m97484m30858k88720j38823k03433n01547n25217P3558P17235O06680
37722D89488j0573j88276K05626L48918j00002m94796l83703j80461k37017j59974
37712g10770L99745J003987J044640N73869O2953k26689l09698l34477n52278
$$ plain form
37703 951282 -12310 -996602 -1124067 -134186 1052556 1411798 1031682 669781 608609 736733
37693 736733 1283689 2439147 3491731 3436073 2398234 1462311 1104397 848415 517685
37684 517685 640815 1297219 1648791 1120277 176074 -525367 -922123 -1074903 -783868 -196136
37674 -196136 41895 -206168 -242686 186425 218382 -719204 -1714380 -1625484 -831982 -546682
37664 -546682 -850037 -691559 306856 1266801 1386247 865430 316843 81178 301694 898000
37654 898000 1259220 696631 -544924 -1395027 -1342803 -1069014 -1371884 -2068623 -2385248 -1968448
37644 -1968448 -1103847 -310971 -72957 -589026 -1427669 -1760156 -1282908 -583099 -289477
37635 -289477 -300991 -282877 -436362 -1086756 -1803487 -1744682 -860389 -14705 211060 149772
$$ packed form
37703I51282r63592r84292j27465R89881J186742L59242l80116l61901o1172J28124
37693G36733N46956J155458J052584n5658j037839r35923l57914k55982l30730
37684E17685J23130O56404L51572n28514r44203p01441l96756j52780K91035N87732
37674a96136K38031k48063l6518M29111L1957r37586r95176Q8896P93502K85300
37664e46682l03355J58478R98415R59945J19446n20817n48587k35665K20516N96306
37654H98000L61220n62589j241555q50103N2224K73789l02870o96739l16625M16800
37644a968448Q64601P92876K38014n16069q38643l32487M77248O99809K93622
37635b89477j1514J8114j53485o50394p16731N8805Q84293Q45684K25765o1288
$$ plain form
37625 149772 254256 348460 96629 -326100 -582996 -812037 -1311253 -1836935 -1853945 -1376395
37615 -1376395 -927130 -682989 -331200 128598 173852 -325458 -640614 -155017 683848 987861
37605 987861 680034 495644 915261 1693133 2348109 2558747 2141800 1228429 449693 338492
37595 338492 506803 73586 -960245 -1489760 -790130 428637 937647 447885 -398612
37586 -398612 -1074238 -1520541 -1650127 -1182557 -83048 1237918 2238388 2516450 1876871
37577 1876871 525166 -792031 -1242888 -696073 134867 441596 79705 -481301 -797819
37568 -797819 -868698 -917590 -930550 -643621 -46264 401162 361868 223640 626537 1473621
37558 1473621 2015881 1990351 1961430 2247501 2280641 1630080 1012977 1424372 2614010 3337245
$$ packed form
37625A49772J04484R4204k51831m22729k56896k29041m99216n25682j7010M77550
37615a376395M49265K44141L51789M59798M5254m99310l15156M85597Q38865L04013
37605I87861l07827j84390M19617P77872O54976K10638m16947r13371p78736j11201
37595C38492J68311m33217j033831n29515O99630J218767N09010m89762q46497
37586c98612o75626m46303j29586M67570J099509J320966J000470K78062o39579
37577A876871j351705j317197m50857N46815Q30940L06729l61891n61006l16518
37568g97819p0879m8892j2960K86929N97357M47426l9294j38228M02897Q47084
37558A473621N42260k5530k8921K86071L3140o50561o17103M11395J189638P23235
$$ plain form
37548 3337245 3007905 2249195 1787148 1643118 1603429 1685998 1765440 1381241 411875 -477220
37538 -477220 -510790 323135 1374630 2022329 1993741 1334533 442946 -70416 82388 554915
37528 554915 788231 576743 30950 -764545 -1739946 -2635831 -3109888 -2994001 -2288661 -1077772
37518 -1077772 334578 1402736 1763618 1584850 1248659 834898 208483 -521829 -1005609
37509 -1005609 -1080987 -891858 -625885 -467771 -734146 -1579538 -2500435 -2645060 -1872639 -1080683
37499 -1080683 -1118044 -1701561 -1847694 -1144425 -90452 700388 1055695 981363 456279 -261134
37489 -261134 -623960 -453917 -215971 -259659 -207517 355113 948655 743811 -78149 -395985
37479 -395985 231368 853586 485054 -533267 -1173447 -1200409 -1213964 -1465625 -1457788 -757533
$$ packed form
37548C337245l29340p58710m62047j44030l9689Q2569P9442l84199r69366q89095
37538d77220l3570Q33925J051495O47699k8588o59208q91587n13362J52804M72527
37528E54915K33316k11488n45793p95495r75401q95885m74057J15887P05340J210889
37518a077772J412350J068158L60882j78768l36191m13761o26415p30312m83780
37509a005609p5378J89129K65973J58114k66375q45392r20897j44625P72421P91956
37499a080683l7361n83517j46133P03269J053973P90840L55307p4332n25084p17413
37489b61134l62826J70043K37946m3688N2142N62630N93542k04844q21960l17836
37479c95985O27353O22218l68532j018321o40180k6962j3555k51661P837P00255
$$ plain form
37469 -757533 444536 1703313 2693601 3074995 2538804 1306559 219827 -11816 477637
37460 477637 902543 608388 -349756 -1194426 -1004559 388640 2049432 2795023 2446219
37451 2446219 1885372 1854216 2166392 2262920 2035656 1746447 1493586 1167481 731170 204098
37441 204098 -486437 -1355691 -2182598 -2702287 -2862737 -2743510 -2400681 -1938757 -1517032 -1129950
37431 -1129950 -619514 -35743 326403 396379 446813 561852 488287 313180 676256 1752555
37421 1752555 2567744 2097748 709344 -311262 -447077 -303359 -376739 -413423 -126728
37412 -126728 284597 582173 760391 683667 162130 -425325 -381350 162164 205226 -605445
37402 -605445 -1321898 -1145559 -647970 -730646 -1141097 -1039959 -480606 -214800 -383396 -515123
$$ packed form
37469g57533J202069J258777R90288L81394n36191j232245j086732k31643M89453
37460D77637M24906k94155r58144q44670J89867J393199J660792P45591l48804
37451B446219n60847l1156L12176R6528k27264k89209k52861l26105m36311n27072
37441B04098o90535q69254q26907n19689j60450J19227L42829M61924M21725L87082
37431a129950N10436N83771L62146O9976N0434J15039p3565j75107L63076J076299
37421A752555Q15189m69996j388404j020606j35815J43718p3380l6684K86695
37412a26728M11325K97576J78218p6724n21537n87455M3975N43514M3062q10671
37402f05445p16453J76339M97589q2676m10451J01138N59353K65806j68596j31727
$$ plain form
37392 -515123 -591226 -948261 -1239044 -763820 52811 -155152 -1609042 -2710804 -2156246
37383 -2156246 -702800 42934 -210139 -497437 -276359 43881 60552 -80613 -146739 -115423
37373 -115423 90043 640936 1478281 2283610 2749189 2630771 1775626 501169 -323302
37364 -323302 -124337 601964 907243 630930 410784 553637 614914 210794 -385954 -683659
37354 -683659 -531660 -67735 468766 724254 435244 -209087 -738613 -974187 -1068663 -1049167
37344 -1049167 -833724 -665707 -910569 -1384521 -1559374 -1507209 -1859983 -2652520 -3079668 -2752986
37334 -2752986 -2304991 -2225471 -1984990 -1043535 53057 472385 367393 389288 434476 -56657
37324 -56657 -859443 -1117842 -652803 -145320 -24078 -68249 -127621 -335123 -515874 -254862
$$ packed form
37392e15123p6103l57035k90783M75224Q16631k07963j453890j101762N54558
37383b156246J453446P45734k53073k87298K21078L20240J6671j41165o6126L1316
37373a15423K05466N50893Q37345Q05329M65579j18418q55145j274457q24471
37364c23302J98965P26301L05279k76313k20146J42853O1277m04120n96748k97705
37354f83659J51999M63925N36501K55488k89010o44331n29526k35574r4476J9496
37344a049167K15443J68017k44862m73952j74853N2165l52774p92537m27148L26682
37334b752986M47995P9520K40481R41455J096592M19328j04992K1895M5188m91133
37324e6657q02786k58399M65039N07483J21242m4171n9372k07502j80751K61012
$$ plain form
37314 -254862 304968 554344 435278 501362 798584 661497 -24785 -336161 341538 1299394
37304 1299394 1529532 1096960 748642 694686 603258 472784 671510 1187424 1526685 1427338
37294 1427338 1174507 1085263 1021896 585709 -320909 -1228045 -1489613 -1027762 -491977 -400072
37284 -400072 -391045 122554 805633 785534 191262 231289 1368650 2486988 2540215 2057570
37274 2057570 2090121 2485967 2367281 1769088 1544003 1879728 2092952 1828565 1378722 817772
37264 817772 -94405 -1055873 -1361581 -1119854 -1261683 -1987474 -2265034 -1418118 -243777
37255 -243777 187208 45809 190795 670298 727021 43944 -855429 -1405114 -1543158 -1442915
37245 -1442915 -1230349 -1054954 -1058864 -1172354 -1160993 -912350 -572713 -479409 -982634 -2046488
$$ packed form
37314b54862N59830K49376j19066O6084K97222j37087o86282l11376O77699R57856
37304A299394K30138m32572l48318n3956r1428j30474J98726N15914L39261r9347
37294A427338k52831q9244o3367m36187r06618r07136k61568M61851N35785R1905
37284d00072R027N13599O83079k0099n94272M0027J137361J118338N3227m82645
37274B057570L2551L95846j18686n98193k25085L35725K13224k64387m49843n60950
37264H17772r12177r61468l05708K41727j41829p25791k77560Q46916J174341
37255b43777M30985j41399J44986M79503N6723o83077q99373n49685j38044J00243
37245a442915K12566J75395l910j13490J1361K48643L39637R3304n03225j063854
$$ plain form
37235 -2046488 -2910908 -2587711 -1039862 503863 869920 281206 -147460 17047 181322
37226 181322 -90145 -360513 -112684 366930 434627 87358 -69571 209746 406793 -15315
37216 -15315 -823899 -1302104 -1152880 -722020 -300306 342202 1416727 2448366 2696762
37207 2696762 2186738 1739069 1816594 1906587 1423643 731464 642454 1139300 1311778 632096
37197 632096 -332789 -749535 -577141 -391103 -445106 -398990 53900 696710 1063643 963259
37187 963259 566215 128581 -178648 -244622 -58389 178633 167933 -139237 -434064 -415272
37177 -415272 -145956 104018 229977 259316 51949 -595195 -1481493 -1988328 -1723775 -962487
37167 -962487 -293041 -52763 -256591 -784425 -1353157 -1523322 -1077117 -294989 392360 877404
$$ packed form
37235b046488q64420L23197J547849J543725L66057n88714m28666J64507J64275
37226A81322k71467k70368K47829M79614O7697l47269j56929K79317J97047m22108
37216a5315q08584m78205J49224M30860M21714O42508J074525J031639K48396
37207B696762n10024m47669P7525Q9993m82944o92179q9010M96846J72478o79682
37197F32096r64885m16746J72394J86038n4003M6116M52890O42810L66933j00384
37187I63259l97044m37634l07229o5974J86233K37022j0700l07170k94827J8792
37177d15272K69316K49974J25959K9339k07367o47144q86298n06835K64553P61288
37167i62487O69446K40278k03828n27834n68732j70165M46205P82128O87349M85044
$$ plain form
37157 877404 1239176 1370914 1182272 1027045 1374470 2026249 2219277 1675704 1016237 829792
37147 829792 840136 494758 20461 212489 1203954 2073437 1938469 1056438 483120 783416
37137 783416 1422438 1507101 900064 340734 444226 867997 780075 48079 -509944 -239273
37127 -239273 432477 616637 209921 -75489 131704 325665 -41214 -719074 -1039740 -784648
37117 -784648 -260543 253780 698883 997446 1053094 973665 954192 946368 759503 457415
37107 457415 286152 199367 -120938 -666113 -951784 -678914 -164194 170698 393978 768939
37097 768939 1127064 1015842 405323 -171668 -228030 229570 867438 1314206 1233801 476248
37087 476248 -629523 -1370807 -1315279 -814109 -635763 -1088978 -1656170 -1565438 -655562 429547
$$ packed form
37157H77404L61772J31738j88642j55227L47425O51779J93028n43573o59467j86445
37147H29792J0344l45378m74297J92028R91465Q69483j34968q82031n73318L00296
37137G83416O39022Q4663o07037n59330J03492M23771q7922p31996n58023K70671
37127b39273O71750J84160m06716k85410K07193J93961l66879o77860l20666K55092
37117g84648N24105N14323M45103K98563N5648p9429j9473p824j86865l02088
37107D57415j71263q6785l20305n45175k85671K72870N14720L34892K23280L74961
37097G68939L58125j11222o10519n76991n6362M57600O37868M46768q0405p57553
37087D76248j105771p41284N5528N01170J78346m53215n67192R0732R09876J085109
$$ plain form
37077 429547 932087 776086 565197 835129 1494236 2046436 2146569 1781901 1103130 339803
37067 339803 -214143 -424334 -522932 -825200 -1210004 -1181825 -581188 49271 68436 -465290
37057 -465290 -920767 -958230 -883721 -1026696 -1153953 -859380 -299123 -31294 -158393 -199797
37047 -199797 33250 67826 -338261 -571452 -117654 370595 -76179 -1107638 -1420472 -763608
37037 -763608 -292758 -594696 -726763 6817 597501 -131806 -1465469 -1722386 -702002
37028 -702002 288748 586589 815737 1336506 1530318 995518 225522 -332711 -808492 -1101540
37018 -1101540 -682538 272247 648525 -34720 -817241 -772869 -311885 -199934 -263540 -83344
37008 -83344 -83154 -701411 -1153925 -383292 1139086 1888759 1391248 596600 216332 -37030
$$ packed form
37077D29547N02540j56001k10889K69932O59107N52200J00133l64668o78771p63327
37067C39803n53946k10191r8598l02268l84804K8179O00637O30459J9165n33726
37057d65290m55477l7463P4509j42975j27257K94573N60257K67829j27099m1404
37047a99797K33047L4576m06087k33191M53798M88249m46774j031459l12834O56864
37037g63608M70850l01938j32067P33580N90684p29307j333663k56917J020384
37028g02002R90750K97841K29148N20769J93812n34800p69996n58233m75781k93048
37018a101540M19002R54785L76278o83245p82521M4372M60984J11951o3606J80196
37008h3344J90o18257m52514P70633J522378P49673m97511p94648l80268k53362
$$ plain form
36998 -37030 -395175 -435048 56053 579138 735782 748108 752338 343753 -640876 -1511355
36988 -1511355 -1499016 -750879 -43245 200310 157795 108648 136144 272547 610271 1174320
36978 1174320 1760335 1969601 1554002 816016 427644 611272 764938 272455 -582831
36969 -582831 -1024263 -875075 -600088 -396291 -34588 335266 73357 -926061 -1798609 -1763814
36959 -1763814 -1110237 -664307 -671024 -681713 -290134 482055 1419453 2354962 3141839 3561740
36949 3561740 3355645 2460192 1299425 610866 688933 998807 903424 515326 319968 257213
36939 257213 -67116 -447706 -297442 217251 312162 31074 404354 1720380 2788741
36930 2788741 2652828 1999368 1914172 2128040 1681834 716904 301989 748377 1298473 1415214
$$ packed form
36998c7030l58145l9873M91101N23085J56644J2326M230m08585r84629q70479
36988a511355J2339P48137P07634K43555m2515m9147K7496J36403L37724N64049
36978A174320N86015K09266m15599p37986l88372J83628J53666m92483q55286
36969e82831m41432J49188K74987K03797L61703L69854k61909r99418q72548L4795
36959a763814O53577M45930o717j0689L91579P72189R37398R35509P86877M19901
36949C561740k06095q95453j160767o88559P8067L09874r5383l88098j95358o2755
36939B57213l24329l80590J50264N14693R4911k81088L73280J316026J068361
36930B788741j35913o53460q5196K13868m46206r64930m14915M46388N50096J16741
$$ plain form
36920 1415214 1296459 1090348 643415 177501 251714 789930 999859 570038 164309 366476
36910 366476 872637 1168618 1307178 1436274 1162867 162814 -897591 -884121 306025
36901 306025 1402971 1197403 -47449 -946558 -600636 508794 1294253 1359029 1139065
36892 1139065 941212 496431 -295774 -795691 -396469 460950 745117 216896 -331065
36883 -331065 -294252 -42082 -199353 -691381 -956943 -805820 -605279 -693237 -941917 -954253
36873 -954253 -531118 123406 639510 888188 1052234 1247597 1263807 868382 193073 -462794
36863 -462794 -1061369 -1685091 -2064075 -1731041 -732389 250009 666017 624137 446511 80366
36853 80366 -647866 -1378777 -1320440 -199579 1119124 1314037 42182 -1522186 -1903993
$$ packed form
36920A415214j18755k06111m46933m65914P4213N38216K09929m29821m05729K02167
36910C66476N06161K95981J38560J29096k73407j000053j060405J3470J190146
36901C06025J096946k05568j244852q99109L45922J109430P85459O4776k19964
36892A139065j97853m44781p92205m99917L99222Q57419K84167n28221n47961
36883c31065L6813K52170j57271m92028k65562J51123K00541q7958k48680j2336
36873i54253M23135O54524N16104K48678J64046J95363J6210l95425o75309o55867
36863d62794n98575o23722l78984L33034R98652R82398M16008m1880j77626l66145
36853H0366p28232p30911N8337J120861J318703J94913j271855j564368l81807
$$ plain form
36844 -1903993 -1012499 -173837 -413109 -1282067 -1720490 -1474987 -1032241 -606879 -42972
36835 -42972 494095 627173 551367 841199 1387451 1410302 742335 199668 316922 590020
36825 590020 475156 282672 392512 352474 -353688 -1199525 -1258181 -630688 -274284 -545281
36815 -545281 -818655 -571674 -36990 323987 285144 -321309 -1524447 -2722564 -2928894
36806 -2928894 -1893303 -540586 43207 -269372 -788038 -923850 -679134 -458637 -632896
36797 -632896 -1134327 -1383924 -840956 304375 1265571 1556993 1430583 1342667 1404943 1546783
36787 1546783 1790792 2072275 2150865 2027728 2106492 2573410 2960678 2772967 2231336 1853647
36777 1853647 1583382 1046667 528881 812105 1868327 2566461 2138426 1244415 946110
$$ packed form
36844a903993Q91494Q38662k39272q68958m38423K45503M42746M25362N63907
36835d2972N37067J33078p5806K89832N46252K2851o67967n42667J17254K73098
36825E90020j14864j92484J09840m0038p06162q45837n8656O27493L56404k70997
36815e45281k73374K46981N34684L60977l8843o06453j203138j198117k06330
36806b928894J035591J352717N83793l12579n18666j35812K44716K20497j74259
36797f32896n01431k49597N42968J145331R61196K91422j26410q7916O2276J41840
36787A546783K44009K81483P8590j23137P8764M66918L87268j87711n41631l77689
36777A853647k70265n36715n17786K83224J056222O98134m28035q94011k98305
$$ plain form
36768 946110 1161623 959383 90501 -693906 -852065 -681784 -493784 17006 1051034
36759 1051034 1970603 1970031 1150343 288167 -261167 -793705 -1487298 -2049457 -2191298 -1896064
36749 -1896064 -1135591 96956 1290324 1547925 596507 -739205 -1420450 -1217328 -554417
36740 -554417 234063 1026665 1614130 1829423 1837230 1836359 1622714 930003 70234 -329411
36730 -329411 -201945 -82064 -223705 -278395 -30025 142436 -132369 -639428 -998158 -1251584
36720 -1251584 -1578087 -1761447 -1497918 -1009732 -761707 -672389 -235149 543471 975763 674602
36710 674602 110683 -174508 -389345 -980690 -1667561 -1695532 -997412 -431820 -676599 -1380808
36700 -1380808 -1693036 -1272124 -477073 160516 317792 -57788 -688516 -1035185 -755737
$$ packed form
36768I46110K15513k02240q68882p84407j58159J70281J88000N10790J034028
36759A051034R19569n72q19688q62176n49334n32538o93593n62159j41841K95234
36749a896064P60473J232547J193368K57601r51418j335712o81245K03122O62911
36740e54417P88480P92602N87465K15293P807q71k13645o92711q59769l99645
36730c29411J27466J19881j41641n4690K48370J72461k74805n07059l58730k53426
36720a251584l26503j83360K63529M88186K48025Q9318M37240P78620M32292l01161
36710F74602n63919k85191k14837n91345o86871k7971O98120N65592k44779p04209
36700a380808l12228M20912P95051O37589J57276l75580o30728l46669K79448
$$ plain form
36691 -755737 -127068 212002 -26926 -481400 -571849 -138566 356679 261002 -525954 -1269358
$$ packed form
36691g55737O28669L39070k38928m54474r0449M33283M95245r5677p86956p43404
$$ [...]
##END NTUPLES=NMR SPECTRUM
##END=
