##TITLE=31Pdec_LR-680-RM1
 , 24 sc
 5.7.2019
##JCAMPDX= 6.0         $$ Bruker NMR JCAMP-DX V2.0
##DATA TYPE= NMR SPECTRUM
##DATA CLASS= NTUPLES
##ORIGIN= UXNMR, Bruker Analytische Messtechnik GmbH
##OWNER= root
$$ XWIN-NMR		Version 3.5
$$ Fri Jul  5 15:16:10 2019 Russian Standard Time (UT+4h)  she@DPX200
##.OBSERVE FREQUENCY= 81.013821
##.OBSERVE NUCLEUS= ^31P
##.ACQUISITION MODE= SIMULTANEOUS
##.ACQUISITION SCHEME= undefined
##.AVERAGES= 24
##.DIGITISER RES= 17
##SPECTROMETER/DATA SYSTEM= spect
##.PULSE SEQUENCE= zgpg30
##.SOLVENT NAME= CDCl3
##.SHIFT REFERENCE= (INTERNAL, CDCl3, 0, 182.463)
##AUDIT TRAIL= $$ (NUMBER, WHEN, WHO, WHERE, WHAT)
$$ ##TITLE= Audit trail, XWIN-NMR		Version 3.5
$$ ##JCAMPDX= 5.01
$$ ##ORIGIN= Bruker BioSpin GmbH
$$ ##OWNER= she
$$ F:/spectra/data/she/nmr/P31/1/pdata/1/auditp.txt
$$ ##AUDIT TRAIL=  $$ (NUMBER, WHEN, WHO, WHERE, WHAT)
(   1,<2019-07-05 15:14:57.65 +0400>,<she>,<DPX200>,
      <created by zg, POWCHK disabled, PULCHK disabled
       configuration hash MD5:
       00 E9 B6 7A A2 85 ED C7 34 08 36 98 17 FE 4E 26
       data hash MD5: 32K
       30 B8 3F 0D 4C 58 12 63 41 74 7A 91 B8 A9 6C 84>)
(   2,<2019-07-05 15:15:05.48 +0400>,<she>,<DPX200>,
      <Start of raw data processing
       efp BC_mod = 2 LB = 1 FT_mod = 6 PKNL = 1 PHC0 = -3105.042 PHC1 = 680.7988 SI = 64K 
       data hash MD5: 64K
       E9 4C 2E C7 D2 9D C4 14 17 16 16 70 A1 68 6B D3>)
(   3,<2019-07-05 15:15:39.45 +0400>,<she>,<DPX200>,
      <pk PHC0 = 33.45238 PHC1 = -129.2 
       data hash MD5: 64K
       A4 1E 47 72 5B B6 6F 05 21 AF 42 C3 13 87 4A E5>)
$$ ##END=
$$ 
$$ hash MD5
$$ AA D7 A9 FD 28 38 5B CE DB 9F E2 B2 9B 34 68 0E
##$RELAX= 
##$RELAX= 
##$RELAX= 
##$RELAX= 
##$RELAX= 
##$RELAX= 
##$RELAX= 
##$RELAX= 
$$ Bruker specific parameters
$$ --------------------------
##$DU= <F:/spectra>
##$EXPNO= 1
##$NAME= <P31>
##$PROCNO= 1
##$TYPE= <nmr>
##$USER= <she>
##$AMP= (0..31)
100 100 100 100 100 100 100 100 100 100 100 100 100 100 100 100 100 100 
100 100 100 100 100 100 100 100 100 100 100 100 100 100 
##$AQSEQ= 0
##$AQ_mod= 1
##$AUNM= <au_zg>
##$AUTOPOS= <>
##$BF1= 81.014009
##$BF2= 200.13
##$BF3= 200.13
##$BF4= 200.13
##$BF5= 200.13
##$BF6= 200.13
##$BF7= 200.13
##$BF8= 200.13
##$BYTORDA= 1
##$CFDGTYP= 0
##$CFRGTYP= 5
##$CHEMSTR= <none>
##$CNST= (0..31)
1 1 145 1 1 1 1 1 1 1 1 1 1 1 1 1 1 1 1 1 1 1 1 1 1 1 1 1 1 1 1 1 
##$CPDPRG= <waltz16>
##$CPDPRG1= <>
##$CPDPRG2= <waltz16>
##$CPDPRG3= <>
##$CPDPRG4= <mlev>
##$CPDPRG5= <mlev>
##$CPDPRG6= <mlev>
##$CPDPRG7= <mlev>
##$CPDPRG8= <mlev>
##$CPDPRGB= <>
##$CPDPRGT= <>
##$D= (0..31)
0 1 0 0 0 0 0 0 0 0 0 0.03 2e-05 3e-06 0 0 0 0 0 0 0 0 0 0 0 0 0 0 0 0 
0 0 
##$DATE= 1562325297
##$DBL= (0..7)
120 120 120 11 120 120 24 19 
##$DBP= (0..7)
150 150 150 150 150 150 150 150 
##$DBP07= 0
##$DBPNAM0= <>
##$DBPNAM1= <>
##$DBPNAM2= <>
##$DBPNAM3= <>
##$DBPNAM4= <>
##$DBPNAM5= <>
##$DBPNAM6= <>
##$DBPNAM7= <>
##$DBPOAL= (0..7)
0.5 0.5 0.5 0.5 0.5 0.5 0.5 0.5 
##$DBPOFFS= (0..7)
0 0 0 0 0 0 0 0 
$$ [...]
##$SUBNAM2= <"">
##$SUBNAM3= <"">
##$SUBNAM4= <"">
##$SUBNAM5= <"">
##$SUBNAM6= <"">
##$SUBNAM7= <"">
##$SUBNAM8= <"">
##$SUBNAM9= <"">
##$SW= 369.568048894756
##$SWIBOX= (0..15)
0 1 3 0 0 0 0 0 0 0 0 0 0 0 0 0 
##$SW_h= 29940.119760479
##$TD= 32768
##$TD0= 1
##$TE= 0
##$TE2= 300
##$TE3= 300
##$TEG= 300
##$TL= (0..7)
0 120 53 12 22 120 120 120 
##$TP= (0..7)
150 150 150 150 150 150 150 150 
##$TP07= 0
##$TPNAME0= <>
##$TPNAME1= <>
##$TPNAME2= <>
##$TPNAME3= <>
##$TPNAME4= <>
##$TPNAME5= <>
##$TPNAME6= <>
##$TPNAME7= <>
##$TPOAL= (0..7)
0.5 0.5 0.5 0.5 0.5 0.5 0.5 0.5 
##$TPOFFS= (0..7)
0 0 0 0 0 0 0 0 
##$TUNHIN= 0
##$TUNHOUT= 0
##$TUNXOUT= 0
##$USERA1= <user>
##$USERA2= <user>
##$USERA3= <user>
##$USERA4= <user>
##$USERA5= <user>
##$V9= 5
##$VALIST= <valist>
##$VCLIST= <CCCCCCCCCCCCCCC>
##$VD= 0
##$VDLIST= <DDDDDDDDDDDDDDD>
##$VPLIST= <PPPPPPPPPPPPPPP>
##$VTLIST= <TTTTTTTTTTTTTTT>
##$WBST= 1024
##$WBSW= 4
##$XGAIN= (0..3)
0 0 0 0 
##$XL= 0
##$YL= 0
##$YMAX_a= 64547
##$YMIN_a= -68658
##$ZGOPTNS= <>
##$ZL1= 120
##$ZL2= 120
##$ZL3= 120
##$ZL4= 120
##$ABSF1= 0
##$ABSF2= 0
##$ABSG= 0
##$ABSL= 0
##$ALPHA= 0
##$AQORDER= 0
##$ASSFAC= 0
##$ASSFACI= 0
##$ASSFACX= 0
##$ASSWID= 0
##$AUNMP= <proc_1d>
##$AZFE= 0.1
##$AZFW= 0.5
##$BCFW= 0
##$BC_mod= 2
##$BYTORDP= 0
##$COROFFS= 0
##$CY= -3
##$DATMOD= 1
##$DC= 0
##$DFILT= <>
##$DTYPP= 0
##$F1P= 0
##$F2P= 0
##$FCOR= 1
##$FTSIZE= 65536
##$FT_mod= 6
##$GAMMA= 0
##$GB= 0
##$INTBC= 1
##$INTSCL= 5.30512e-09
##$ISEN= 30
##$LB= 1
##$LEV0= 0
##$LPBIN= 0
##$MAXI= 10000
##$MC2= 0
##$MEAN= 0
##$ME_mod= 0
##$MI= 50
##$NCOEF= 0
##$NC_proc= -6
##$NLEV= 6
##$NOISF1= 182.463
##$NOISF2= 159.3651
##$NSP= 0
##$NTH_PI= 0
##$NZP= 0
##$OFFSET= 182.463
##$PC= 4
##$PHC0= -3071.59
##$PHC1= 551.5988
##$PH_mod= 1
##$PKNL= yes
##$PPARMOD= 0
##$PSCAL= 0
##$PSIGN= 0
##$REVERSE= no
##$SF= 81.0140089999434
##$SI= 65536
##$SIGF1= 159.3651
##$SIGF2= -187.1042
##$SINO= 113.3802
##$SIOLD= 16384
##$SREGLST= <1H.CDCl3>
##$SSB= 0
##$STSI= 65536
##$STSR= 0
##$SW_p= 29940.119760479
##$SYMM= 0
##$S_DEV= 0
##$TDeff= 32768
##$TDoff= 0
##$TI= <>
##$TILT= no
##$TM1= 0
##$TM2= 0
##$TOPLEV= 0
##$USERP1= <user>
##$USERP2= <user>
##$USERP3= <user>
##$USERP4= <user>
##$USERP5= <user>
##$WDW= 1
##$XDIM= 65536
##$YMAX_p= 276443036
##$YMIN_p= -36084989
$$ End of Bruker specific parameters
$$ ---------------------------------
##NTUPLES= NMR SPECTRUM
##VAR_NAME=  FREQUENCY,     SPECTRUM/REAL,   SPECTRUM/IMAG
##SYMBOL=    X,             R,               I
##VAR_TYPE=  INDEPENDENT,   DEPENDENT,       DEPENDENT
##VAR_FORM=  AFFN,          ASDF,            ASDF
##VAR_DIM=   65536,         65536,           65536
##UNITS=     HZ,            ARBITRARY UNITS, ARBITRARY UNITS
##FACTOR=    0.456856943014862, 1,           1
##FIRST=     14782.0589164792, 0,            0
##LAST=      -15158.0608439998, 0,           0
##MIN=       -15158.0608439998, -36084989,   0
##MAX=       14782.0589164792, 276443036,    0
$$ Real data points
##PAGE= N=1
##DATA TABLE= (X++(R..R)), XYDATA
$$ [...]
$$ plain form
45261 -1206559 -438376 -679344 -1900988 -2481888 -1182629 1087856 2141970 1123673 -501047
45252 -501047 -998654 -666386 -1065482 -2357931 -2822210 -1235745 1591894 4168103 5918127
45243 5918127 6753463 6434667 5466790 5355028 6534920 7151158 5603035 3340333 3028952
45234 3028952 4577418 5438301 4713451 4269552 5248170 6133817 5531604 4568996 4803182
45225 4803182 5511563 5014063 3428193 2174918 1677514 1435030 1641016 2778885 4054157
45216 4054157 4133856 3260321 2891564 3378893 3726553 3539835 3325545 2809358 1063754
45207 1063754 -1233352 -1831696 -174990 1308361 554188 -1126202 -1067989 971608 3014753
45198 3014753 4065863 4959753 6098397 6421545 5338224 4178262 4582892 6198767 7101722
$$ packed form
45261a206559P68183k40968j221644n80900J299259K270485J054114j018297j624720
45252e01047m97607L32268l99096j292449m64279J586465K827639K576209J750024
45243E918127Q35336l18796r67877j11762J179892O16238j548123k262702l11381
45234C028952J548466Q60883p24850m43899R78618Q85647o02213r62608K34186
45225D803182P08381m97500j585870j253275m97404k42484K05986J137869J275272
45216D054157P9699q73535l68757M87329L47660j86718k14290n16187j745604
45207A063754k297106n98344J656706J483351p54173j680390N8213K039597K043145
45198C014753J051110Q93890J138644L23148j083321j159962M04630J615875R02955
$$ plain form
45189 7101722 6348337 5114792 4932639 5521157 5311989 4004128 3299496 4316105 5438699
45180 5438699 4415468 2038815 1484218 3646861 5551464 4673128 2624305 2406587 3687010
45171 3687010 3673973 1902676 973339 2281520 3969974 4136216 3536525 3595509 3880048
45162 3880048 3524424 3523943 5246375 7562209 7863272 5740402 3524106 2988155 3443745
45153 3443745 3625043 3699441 4422529 5602498 6575619 7356365 8165087 8397667 7287659
45144 7287659 5392329 4291975 4693120 5733731 6381805 6654417 7033561 7472524 7680313
45135 7680313 7819164 8048600 7726391 6111306 3839697 2591985 2949936 3596578 3206661
45126 3206661 2160231 1559409 1465209 1289848 1249639 1960413 2923399 3014365 2497316 2892840
$$ packed form
45189G101722p53385j233545j82153N88518k09168j307861p04632J016609J122594
45180E438699j023231k376653n54597K162643J904603q78336k048823k17718J280423
45171C687010j3037j771297r29337J308181J688454J66242n99691N8984K84539
45162C880048l55624m81J722432K315834L01063k122870k216296n35951M55590
45153C443745J81298P4398P23088J179969R73121P80746Q08722K32580j110008
45144G287659j895330j100354M01145J040611O48074K72612L79144M38963K07789
45135G680313J38851K29436l22209j615085k271609j247712L57951O46642l89917
45126C206661j046430o00822r4200j75361m0209P10774R62986R0966n17049L95524
$$ plain form
45116 2892840 4429882 5203853 3676082 781912 -1298473 -1436732 108341 2467960
45108 2467960 4304088 4276418 2547949 984140 821267 1132325 766843 578225 1984697
45099 1984697 4263235 5386264 5099200 5000602 5637407 5705367 4494191 3124573 2697715
45090 2697715 2939097 3406823 4407818 5785344 6233458 4912159 2694761 933522 9820
45081 9820 -122039 857230 2847107 4715811 5503292 5476870 5201777 4507171 3263722 2200271
45071 2200271 1909607 1914932 1717832 1828267 2682693 3569857 3885893 4389328 5686113 6496076
45061 6496076 5347154 3289439 2764559 4044322 4995449 4502034 3910674 4474328 5385713
45052 5385713 5420390 4951996 5031209 5531386 5502957 4742588 3902722 3395797 3087498 2896536
$$ packed form
45116B892840J537042P73971j527771k894170k080385j38259J545073K359619
45108B467960J836128k7670j728469j563809j62873L11058l65482j88618J406472
45099A984697K278538J123029k87064r8598O36805O7960j211176j369618m26858
45090B697715K41382M67726J000995J377526M48114j321299k217398j761239r23702
45081I820j31859R79269J989877J868704P87481k6422k75093o94606j243449j063451
45071B200271k90664N325j97100J10435Q54426Q87164L16036N03435J296785Q09963
45061F496076j148922k057715n24880J279763R51127m93415n91360N63654R11385
45052E385713L4677m68394P9213N00177k8429p60369q39866n06925l08299j90962
$$ plain form
45042 2896536 2987443 3380194 3799193 3940135 3756681 3585036 3948842 4960713 5971172
45033 5971172 6171762 5476187 4432634 3479953 2844327 2908889 3847576 4933914 5107549
45024 5107549 4393649 3966179 4582209 5711759 6521232 7026685 7846787 9240324 10689065
45015 10689065 11230396 10314112 8714887 8245402 9825473 12136837 13151484 12757393 12660753
45006 12660753 13715681 14731991 14274396 12450028 10504213 9716806 10976798 14164370
44998 14164370 17489681 18760596 17943146 17252369 18157125 19755601 20862054 21971968
44990 21971968 23828405 25568876 26060973 25997886 26784523 28048353 28140806 26728549 25106809
44981 25106809 24123732 23496572 23150681 23511472 24190093 23938737 22444976 20915885 20285965
$$ packed form
45042B896536R0907L92751M18999J40942j83454j71645L63806J011871J010459
45033E971172K00590o95575j043553r52681o35626O4562R38687J086338J73635
45024E107549p13900m27470O16030J129550Q09473N05453Q20102J393537J448741
45015A0689065N41331r16284j599225m69485J580071K311364J014647l94091r6640
45006A2660753J054928J016310m57595j824368j945815p87407J259992L187572
44998A4164370L325311J270915q17450o90777R04756J598476J106453J109914
44990B1971968J856437J740471M92097o3087P86637J263830R2453j412257j621740
44981B5106809r83077o27160l45891L60791O78621k51356j493761j529091o29920
$$ plain form
44972 20285965 19892938 18613505 16519324 14646133 13510265 12495092 10759128 8529677
44964 8529677 7195621 7707579 9044744 9216203 8022021 7508259 8869042 10357043 9808543
44955 9808543 8020199 7454411 8258652 8081025 5894114 3547305 2878755 3435218 3998713
44946 3998713 4465100 5021194 5107686 4573044 4527889 5660685 6831044 6725558 5879713
44937 5879713 5575697 5670045 5215094 4569072 5004814 6427895 7308022 7099828 7129129 8510832
44927 8510832 10438356 11293639 10609871 9186308 7810608 6631433 5648616 5242273 5937521
44918 5937521 7607537 9037640 8729657 6499004 3958360 2897778 3391597 4108233 4314535
44909 4314535 4703439 6033057 7780325 8757264 8607157 8000533 7502071 6932007 6003951
$$ packed form
44972B0285965l93027j279433k094181j873191j135868j015173j735964k229451
44964H529677j334056N11958J337165J71459j194182n13762J360783J488001n48500
44955I808543j788344n65788Q04241j77627k186911k346809o68550N56463N63495
44946C998713M66387N56094Q6492n34642m5155J132796J170359j05486q45845
44937E879713l04016R4348m54951o46022M35742J423081Q80127k08194K9301J381703
44927H510832J927524Q55283o83768j423563j375700j179175r82817m06343O95248
44918E937521J670016J430103l07983k230653k540644j060582M93819P16636K06302
44909D314535L88904J329618J747268R76939j50107o06624m98462n70064r28056
$$ plain form
44900 6003951 5014421 4447219 4188932 3694868 2906381 2458381 2807608 3638356 4406064
44891 4406064 4988219 5385266 5250968 4345872 3179059 2583248 2849203 3784747 5197166
44882 5197166 6548537 6631059 4812332 2489677 1999700 3882383 6401122 7949637 8546813
44873 8546813 8574727 7709848 6098768 5147280 5729135 6593113 5984052 4107930 2557284
44864 2557284 1933121 1634387 1588690 2401602 3739589 4260870 3616193 3139745 3904335
44855 3904335 5175686 5547069 4832501 4078648 4144682 4872972 5473433 5413255 5023907 5173579
44845 5173579 6065980 6664508 5963988 4607607 4277806 5406438 6520048 6233709 4955024
44836 4955024 4001517 3796651 3736706 3346293 2675900 1700182 158748 -1726057 -2842385
$$ packed form
44900F003951r89530n67202k58287m94064p88487m48000L49227Q30748P67708
44891D406064N82155L97047j34298r05096j166813n95811K65955R35544J412419
44882E197166J351371Q2522j818727k322655m89977J882683K518739J548515N97176
44873H546813K7914q64879j611080r51488N81855Q63978o09061j876122j550646
44864B557284o24163k98734m5697Q12912J337987N21281o44677m76448P64590
44855C904335J271351L71383p14568p53853O6034P28290O00461o0178l89348J49672
44845E173579Q92401N98528p00520j356381l29801J128632J113610k86339j278685
44836D955024r53507k04866n9945l90413o70393r75718j541434j884805j116328
$$ plain form
44827 -2842385 -2005735 684845 3532113 4688262 4056054 3356967 4017621 5477687 6177866
44818 6177866 5757037 5292592 5472602 5622369 4867030 3424144 2303412 2279395 3379499
44809 3379499 4728127 4742982 2429122 -1042041 -2913928 -1678984 1346741 3872008
44801 3872008 5177652 5914603 6255896 5758660 4813164 4663006 5599076 6306588 5605416
44792 5605416 3972632 2666139 2031152 1509947 919028 768092 1290432 1943342 2197801
44783 2197801 2339711 3063319 4472422 5846483 6355862 5763686 4451034 3001124 1819393
44774 1819393 989415 413696 124123 326117 950199 1351076 900511 -116027 -699229
44765 -699229 -383560 230000 444250 403027 630654 1197657 1972844 3195478 4899007
$$ packed form
44827b842385Q36650K690580K847268J156149o32208o99087O60654J460066P00179
44818F177866m20829m64445J80010J49767p55339j442886j120732k4017J100104
44809C379499J348628J4855k313860l471163j871887J234944L025725K525267
44801C872008J305644P36951L41293m97236r45496j50158R36070P07512p01172
44792E605416j632784j306493o34987n21205n90919j50936N22340O52910K54459
44783B197801J41910P23608J409103J374061N09379n92176j312652j449910j181731
44774A819393q29978n75719k89573K01994O24082M00877m50565j016538n83202
44765f99229L15669O13560K14250m1223K27627N67003P75187J222634J703529
$$ plain form
44756 4899007 6038913 5274421 2773502 338244 -602880 -402942 -225735 -387168 -316326
44747 -316326 235361 704003 526988 42249 295272 1894381 4147208 5585952 5469574
44738 5469574 4470685 3661672 3258281 2831031 2322569 2102373 2213434 2345706 2493277
44729 2493277 2896306 3368719 3444338 3191937 3128631 3321831 3326433 2947139 2283968 1288705
44719 1288705 335649 836158 3618481 6698797 6717065 3296579 77563 300265 3052497
44710 3052497 5243516 5618051 4975519 3819234 2174329 1094096 1958498 4208713 5668332
44701 5668332 5314988 4138398 3115420 1994459 493456 -773481 -1180583 -839555 -71718
44692 -71718 863786 1269578 393418 -1286023 -2227371 -1743677 -789917 -398139 -291175 389964
$$ packed form
44756D899007J139906p64492k500919k435258r41124J99938J77207j61433P0842
44747c16326N51687M68642j77015m84739K53023J599109K252827J438744j16378
44738E469574r98889q09013m03391m27250n08462k20196J11061J32272J47571
44729B493277M03029M72413P5619k52401o3306J93200M602l79294o63171r95263
44719A288705r53056N00509K782323L080316J8268l420486l219016K22702K752232
44710C052497K191019L74535o42532j156285j644905j080233Q64402K250215J459619
44701E668332l53344j176590j022978j120961j501003j266937m07102L41028P67837
44692g1718R35504M05792q76160j679441r41348M83694R53760L91778J06964O81139
$$ plain form
44682 389964 1776907 3245447 4118699 4070680 3379519 2881101 3018956 3057844 2182134 1176813
44672 1176813 1628934 3380741 4407176 3693304 2587295 2504589 2877326 2489976 1449602
44663 1449602 524302 -283647 -1109174 -1239616 -290751 519957 -89602 -1335563 -1443614
44654 -1443614 -329601 527455 532110 459710 596872 269232 -515562 -665561 260634 1377535
44644 1377535 2048887 2757936 3801629 4450150 4186731 3631744 3407293 3133762 2447814
44635 2447814 2040663 2638396 3706933 4224753 4145723 4074649 4029743 3631495 3145177 3203247
44625 3203247 3670878 3844848 3684502 3782577 4095877 3818308 2762398 1816329 1577290
44616 1577290 1488245 996533 731242 1543808 2837600 2993472 1555387 105747 571962
$$ packed form
44682C89964J386943J468540Q73252m8019o91161m98418J37855L8888q75710j005321
44672A176813M52121J751807J026435p13872j106009q2706L72737l87350j040374
44663A449602r25300q07949q25527j30442R48865Q10708o09559j245961j08051
44654a443614J114013Q57056M655p2400J37162l27640p84794j49999R26195J116901
44644A377535O71352P09049J043693O48521k63419n54987k24451k73531o85948
44635B447814m07151N97733J068537N17820p9030p1074m4906l98248m86318N8070
44625C203247M67631J73970j60346R8075L13300k77569j055910r46069k39039
44616A577290q9045m91712k65291Q12566J293792J55872j438085j449640M66215
$$ plain form
44607 571962 3181018 6428068 8570871 8671426 6651332 3289044 308112 -446898 1303544
44598 1303544 3698954 4556533 3740784 3098934 3974693 5540029 6023480 4979087 3595736
44589 3595736 2998820 3030071 2830574 2032741 1054781 516146 611053 906968 668167 -421532
44579 -421532 -1793585 -2491941 -2212589 -1583953 -1318555 -1390331 -1222374 -425943 820940
44570 820940 1889560 2094986 1356104 641913 1263369 3335004 5388198 6003268 5373527
44561 5373527 4608447 3979519 2889536 1411223 625791 1084905 1919771 2017988 1349141
44552 1349141 615247 286516 523517 1330086 2122224 1872924 536696 -319125 634282
44543 634282 2454095 2936800 1475377 -309995 -859601 -410412 -93053 -262597 -278387
$$ packed form
44607E71962K609056L247050K142803J00555k020094l362288k980932p55010J750442
44598A303544K395410Q57579q15749o41850Q75759J565336M83451j044393j383351
44589C595736n96916L1251j99497p97833r77960n38635R4907K95915k38801j089699
44579d21532j372053o98356K79352O28636K65398p1776J67957P96431J246883
44570H20940J068620K05426p38882p14191O21456K071635K053194O15070o29741
44561E373527p65080o28928j089983j478313p85432M59114Q34866R8217o68847
44552A349141p33894l28731K37001Q06569P92138k49300j336228q55821R53407
44543F34282J819813M82705j461423j785372n49606M49189L17359j69544j5790
$$ plain form
44534 -278387 590433 2344340 3943629 3910235 1942049 -199080 -391035 1244369 2562445
44525 2562445 2308397 1402384 942966 601911 -17906 11728 1449530 3121255 3427218
44516 3427218 2907855 3415766 5037040 5776997 4462944 2203118 570988 -10661 483040
44507 483040 2299543 4685511 5502058 3608685 799334 -151583 1114040 2549352 2757733
44498 2757733 2316594 1897085 909573 -981204 -2359693 -1619346 562398 1849173 1303036
44489 1303036 388434 581587 1354458 1385644 681001 241171 257865 42915 -452878 -446115
44479 -446115 198898 564604 159070 -284885 12148 877990 1905532 3170858 4519088
44470 4519088 5013257 3943123 1772651 -532420 -2392773 -3313869 -2758253 -1141088 109088
$$ packed form
44534b78387Q68820J753907J599289l3394j968186k141129j91955J635404J318076
44525B562445k54048r06013m59418l41055o19817K9634J437802J671725L05963
44516C427218n19363N07911J621274P39957j314053k259826j632130n81649M93701
44507D83040J816503K385968Q16547j893373k809351r50917J265623J435312K08381
44498B757733m41139m19509r87512j890777j378489P40347K181744J286775n46137
44489A303036r14602J93153P72871L1186p04643m39830J6694k14950m95793O763
44479d46115O45013L65706m05534m43955K97033Q65842J027542J265326J348230
44470D519088M94169j070134k170472k305071j860353r21096N55616J617165J250176
$$ plain form
44461 109088 431699 900708 1997942 2114239 52263 -2314269 -2271272 -304854 770341
44452 770341 312973 506172 2277531 3608573 2874921 1182812 70805 -671367 -1311672
44443 -1311672 -601953 2094068 4942811 6055639 6277188 7412140 9007294 9262047 8121716
44434 8121716 6973207 5932436 4008044 1722778 1035426 2372797 3857122 3885986 2681084
44425 2681084 1009755 -747959 -1816760 -1165016 833942 2358644 2386089 1620289 730124
44416 730124 -712930 -2785378 -4277928 -4296076 -3590082 -3232771 -2990722 -2047003 -492604
44407 -492604 880715 1598696 1570242 906744 353897 982781 2662867 3806501 3533079
44398 3533079 3054571 3743832 4778661 4241578 2087399 499676 1292732 4034847 6741049
$$ packed form
44461A09088L22611M69009J097234J16297k061976k366532M2997J966418J075195
44452G70341m57368J93199J771359J331042p33652j692109j112007p42172o40305
44443a311672P09719K696021K848743J112828K21549J134952J595154K54753j140331
44434H121716j148509j040771j924392k285266o87352J337371J484325K8864j204902
44425B681084j671329j757714j068801O51744J998958J524702K7445p65800q90165
44416G30124j443054k072448j492550j8148P05994L57311K42049R43719J554399
44407d92604J373319P17981k8454o63498n52847O28884J680086J143634k73422
44398C533079m78508O89261J034829n37083k154179j587723P93056K742115K706202
$$ plain form
44389 6741049 7606840 6232169 3934513 2647625 2840215 2989887 1889291 672760 1196859
44380 1196859 2992892 3651844 2263160 645390 618350 1675273 2324550 2475152 3200280
44371 3200280 4788993 6241268 6537003 5581216 3952129 2326946 1185474 691921 776253
44362 776253 1324942 2054912 2289734 1489841 188184 -328732 298486 871886 363798
44353 363798 -403996 174354 2128131 3822429 4232243 4060947 4199133 4280444 3676958
44344 3676958 3034089 3473670 4553907 4458590 2588589 783239 1112570 3168686 4587733
44335 4587733 4008969 2496767 1892689 2622438 3575452 3591847 2513642 1002822 -199419
44326 -199419 -794963 -905147 -596868 396255 2156784 3862352 4177493 2700206 648632
$$ packed form
44389F741049Q65791j374671k297656j286888J92590J49672j100596j216531N24099
44380A196859J796033O58952j388684j617770k7040J056923O49277J50602P25128
44371C200280J588713J452275K95735r55787j629087j625183j141472m93553Q4332
44362G76253N48689P29970K34822p99893j301657n16916O27218N73400n08088
44353C63798p67794N78350J953777J694298M09814j71296J38186Q1311o03486
44344C676958o42869M39581J080237r5317j870001j805350L29331K056116J419047
44335D587733n78764j512202o04078P29749R53014J6395j078205j510820j202241
44326a99419n95544j10184L08279R93123J760529J705568L15141j477287k051574
$$ plain form
44317 648632 -286654 404719 1791497 2625683 2388797 1386988 191761 -901978 -1896852
44308 -1896852 -2620676 -2565868 -1605018 -569961 -357699 -572126 -73387 1018312 1199681
44299 1199681 28677 -765225 213235 1678408 1520847 143886 -144676 1205072 2175387
44290 2175387 1429867 299412 560045 1873223 2683290 2465279 1786587 1013325 250442
44281 250442 -34753 434924 940630 605320 -217302 -370022 481050 1539341 2049320
44272 2049320 1962423 1592501 1401290 1952087 3228925 4133364 3590380 2174762 1704485
44263 1704485 3010187 4922449 5783321 5269687 4312848 3731199 3428859 2775903 1521139
44254 1521139 303148 84727 904104 1584125 1212091 573058 1298743 3646127 5957831
$$ packed form
44317F48632r35286O91373J386778Q34186k36886j001809j195227j093739r94874
44308a896852p23824N4808R60850J035057K12262k14427M98739J091699J81369
44299A199681j171004p93902R78460J465173j57561j376961k88562J349748R70315
44290B175387p45520j130455K60633J313178Q10067k18011o78692p73262p62883
44281B50442k85195M69677N05706l35310q22622j52720Q51072J058291N09979
44272B049320q6897l69922j91211N50797J276838R04439n42984j415618m70277
44263A704485J305702J912262Q60872n13634r56839n81649l02340o52956j254764
44254A521139j217991k18421Q19377O80021l72034o39033P25685K347384K311704
$$ plain form
44245 5957831 6524562 5337705 3800382 3266993 4038079 5284409 5835268 5460219 5231214
44236 5231214 5980045 6711132 5704033 3192471 1496611 1989560 3364106 3820725 3612999
44227 3612999 4009729 4782241 4600101 3520208 3107891 3815888 3989319 2245270 -500520
44218 -500520 -2393486 -3015394 -3162441 -2882839 -1268369 1652043 4111469 4472299 3237446
44209 3237446 2332260 2614491 2997823 2236481 761331 123413 1090236 3052805 5079710
44200 5079710 6675171 7460419 7042664 5581796 3790625 2036812 202540 -1219116
44192 -1219116 -999277 952618 2564295 1832785 -453374 -1754452 -1317738 -912007 -1700461
44183 -1700461 -2182422 -369015 3190675 5960792 6471937 5600018 4977126 5210160 5840955
$$ packed form
44245E957831N66731j186857j537323n33389P71086J246330N50859l75049k29005
44236E231214P48831P31087j007099k511562j695860M92949J374546M56619k07726
44227C612999L96730P72512j82140j079893m12317P07997J73431j744049k745790
44218e00520j892966o21908j47047K79602J614470K920412K459426L60830j234853
44209C237446r05186K82231L83332p61342j475150o37918R66823J962569K026905
44200E079710J595461P85248m17755j460868j791171j753813j834272j421656
44192a219116K19839J951895J611677p31510k286159j301078M36714M05731p88454
44183a700461m81961J813407L559690K770117N11145q71919o22892K33034O30795
$$ plain form
44174 5840955 6273881 6314536 6047344 5427411 4112936 1965133 -274339 -1374150 -1036872
44165 -1036872 -380043 -434889 -722128 -220991 598456 -15739 -2550995 -4964112 -4750710
44156 -4750710 -1773486 1697551 3494484 3396804 2574441 2012797 1888172 2027561 2357411
44147 2357411 2841919 3329220 3641460 3719934 3634668 3551847 3673735 4029297 4319915 4202193
44137 4202193 3741661 3301869 3003487 2766835 2916825 3937545 5245319 5207647 3347730
44128 3347730 1687579 2404260 4564755 5020027 2688660 -2413 -672763 -56398 -119718
44119 -119718 -705542 -90173 1892684 3365224 2957820 1193767 -701631 -1862488 -1591854
44110 -1591854 263706 2358967 2771336 1505975 771455 2016494 3925910 4340961 3129683
$$ packed form
44174E840955M32926M0655k67192o19933j314475k147803k239472j099811L37278
44165a036872O56829n4846k87239N01137Q19447o14195k535256k413117K13402
44156d750710K977224L471037J796933r7680q22363n61644j24625J39389L29850
44147B357411M84508M87301L12240P8474q5266q2821J21888L55562K90618j17722
44137D202193m60532m39792k98382k36652J49990J020720J307774l7672j859917
44128C347730j660151P16681K160495M55272k331367k691073o70350O16365o3320
44119a19718n85824O15369J982857J472540m07404j764053j895398j160857K70634
44110a591854J855560K095261M12369j265361p34520J245039J909416M15051j211278
$$ plain form
44101 3129683 1927070 1699530 1901734 1879514 1949065 2792074 4394599 5885167 6265574
44092 6265574 5316252 3864779 2990228 2928595 3048512 2831668 2325953 1646929 845665
44083 845665 487513 1414381 3381189 4777151 4473417 3289657 2803872 3298843 3843564
44074 3843564 3925641 3833745 3577641 2648304 1143319 195737 742215 2370341 3866528
44065 3866528 4639321 5147250 5894714 6373792 5486119 3186509 1147109 999784 2115296
44056 2115296 2225345 511595 -1095613 -440438 1987272 3730340 3330747 1620804 431379
44047 431379 890956 2675301 4160092 3710044 1574172 -25361 476180 1971357 2394791
44038 2394791 1678841 1459818 2364706 3442450 4163866 4983253 5576278 4524548 1672157
$$ packed form
44101C129683j202613k27540K02204k2220O9551Q43009J602525J490568L80407
44092F265574r49322j451473q74551o1633J19917k16844n05715o79024q01264
44083H45665l58152R26868J966808J395962l03734j183760m85785M94971N44721
44074C843564Q2077r1896k56104r29337j504985r47582N46478J628126J496187
44065C866528P72793N07929P47464M79078q87673k299610k039400j47325J115512
44056B115296J10049j713750j607208O55175K427710J743068l99593j709943j189425
44047D31379M59577J784345J484791m50048k135872j599533N01541J495177M23434
44038B394791p15950k19023R04888J077744P21416Q19387N93025j051730k852391
$$ plain form
44029 1672157 -799747 -843061 965626 2421174 2302484 1062804 -288262 -1008617 -875969
44020 -875969 -431995 -547329 -1194565 -1260503 -134202 1253881 1697921 1347382 1233559
44011 1233559 1675012 2029642 1782564 1176896 850781 1209056 1955462 2144753 1195051
44002 1195051 -85328 -246715 875992 1957668 2175557 2200302 2629245 2746668 1856588
43993 1856588 787676 867949 2104663 3406816 3961883 3541196 2298681 1199708 1634602
43984 1634602 3475635 4598906 3673324 2258923 2463880 3700226 3958388 3392364 3915852
43975 3915852 5469700 5572464 3146685 255163 -971142 -989125 -1221910 -1639227 -1420570
43966 -1420570 -652456 85813 827565 1644158 1827952 855283 -495886 -1026265 -537279
$$ packed form
44029A672157k471904m3314J808687J455548j18690j239680j351066p20355J32648
44020h75969M43974j15334o47236o5938J126301J388083M44040l50539j13823
44011A233559M41453L54630k47078o05668l26115L58275P46406J89291r49702
44002A195051j280379j61387J122707J081676K17889K4745M28943J17423q90080
43993A856588j068912Q0273J236714J302153N55067m20687j242515j098973M34894
43984A634602J841033J123271r25582j414401K04957J236346K58162n66024N23488
43975C915852J553848J02764k425779k891522j226305j7983k32785m17317K18657
43966a420570P68114P38269P41752Q16593J83794r72669j351169n30379M88986
$$ plain form
43957 -537279 448799 1659279 2863587 3433728 3136839 2788741 3131238 3586464 3138177
43948 3138177 1997286 1330581 1635205 2399574 3155277 3814701 4027235 3288475 1967735
43939 1967735 1367727 2248797 3771107 4423599 3809806 2975899 2825803 2768638 1695469
43930 1695469 143853 188115 2413250 4221962 2770059 -1031426 -3391924 -2414929 120437
43921 120437 2079202 3658823 5576953 6756727 5807105 3492275 1758253 1114981 705607
43912 705607 234135 72299 32417 -208798 98447 1805487 3985459 4770747 3927599
43903 3927599 2978820 2960752 3732639 5225429 7354236 8726023 7678955 4985939 3315585
43894 3315585 3386235 2968225 734005 -1286008 -814682 1095873 1842392 1301694 1638514
$$ packed form
43957e37279R86078J210480J204308N70141k96889l48098L42497M55226m48287
43948C138177j140891o66705L04624P64369P55703O59424K12534p38760j320740
43939A967735o00008Q81070J522310O52492o13793q33907j50096n7165j073169
43930A695469j551616M4262K225135J808712j451903l801485k360498R76995K535366
43921A20437J958765J579621J918130J179774r49622k314830j734022o43272m09374
43912G05607m71472j61836l9882k41215L07245J707040K179972P85288q43148
43903C927599r48779j8068P71887J492790K128807J371787j047068k693016j670354
43894C315585P0650m18010k234220k020013M71326J910555P46519n40698L36820
$$ plain form
43885 1638514 3665710 5688637 6006771 4728603 2889488 1327604 744457 1471548 2672930
43876 2672930 2875196 1756894 502716 95213 364322 1204649 3434780 7299019 10905194
43867 10905194 11629449 9139226 5973186 4774949 5659802 6741692 6665683 5861601 5406735
43858 5406735 5432174 5121720 3989598 2601695 1887812 2029137 2279250 1864656 933144
43849 933144 505602 1374852 3043549 4017803 3430312 2184556 2001364 3305061 4644337
43840 4644337 4525194 3259504 2343552 2345274 2373450 1775653 1317124 1925616 2999113 3143920
43830 3143920 2378798 2240397 3361939 4318724 3800333 2775403 3059456 4464928 5156709
43821 5156709 4616561 4286941 4929730 5321473 4470209 3324197 2923212 2420161 750019
$$ packed form
43885A638514K027196K022927L18134j278168j839115j561884n83147P27091J201382
43876B672930K02266j118302j254178m07503K69109Q40327K230131L864239L606175
43867A0905194P24255k490223l166040j198237Q84853J081890p6009q04082m54866
43858E406735K5439l10454j132122j387903p13883J41325K50113m14594r31512
43849I33144m27542Q69250J668697R74254n87491j245756j83192J303697J339276
43840D644337j19143j265690r15952J722K8176n97797m58529O08492J073497J44807
43830C143920p65122j38401J121542R56785n18391j024930K84053J405472O91781
43821E156709n40148l29620O42789L91743q51264j146012m00985n03051j670142
$$ plain form
43812 750019 -887296 -354246 2156092 4271917 4725980 4499490 4550576 4380460 3450018
43803 3450018 2368718 1889000 1990825 2613015 4057513 5980374 7130492 6792511 5472957
43794 5472957 3683533 1370862 -824563 -1383597 -164601 632084 -641419 -2355296
43786 -2355296 -1659932 1400054 3832521 3626681 1876254 715169 815561 1621642 2727367
43777 2727367 3937569 4612395 3983259 2130598 170313 -630388 147274 1829501 3308205
43768 3308205 4028620 4382990 5125354 6440660 7592014 7492977 5876442 4073793 4143684
43759 4143684 6572970 9197024 9357599 6983993 4421902 3304068 3127881 3216091 4152414
43750 4152414 6096847 7266033 5845603 2581453 -119153 -1098758 -1041523 -754439 -451616
$$ packed form
43812G50019j637315N33050K510338K115825M54063k26490N1086j70116r30442
43803C450018j081300m79718J01825O22190J444498J922861J150118l37981j319554
43794E472957j789424k312671k195425n59034J218996P96685j273503j713877
43786b355296O95364L059986K432467k05840j750427j161085J00392Q06081J105725
43777B727367J210202O74826o29136j852661j960285q00701P77662J682227J478704
43768C308205P20415L54370P42364J315306J151354r9037j616535j802649O9891
43759D143684K429286K624054J60575k373606k562091j117834j76187Q8210R36323
43750D152414J944433J169186j420430l264150k700606r79605N7235K87084L02823
$$ plain form
43741 -451616 -416147 -790633 -796247 427859 2248937 3112961 2611402 1670980 848867 -14739
43731 -14739 -426130 730576 3264253 5221405 5115270 3655804 2747320 3585712 6003248
43722 6003248 8738114 10086968 9254780 7321887 6032700 5671478 5219694 4382103 3834124
43713 3834124 3402292 1938961 -434818 -1842153 -1276356 20324 792383 1583183 3000153
43704 3000153 3940562 3342088 2327401 2627569 3883511 4523004 4504136 5002298 5827486
43695 5827486 5436297 3571797 1834482 1273046 1210822 963013 1048900 1963586 3138466
43686 3138466 3951310 4634570 5368244 5497218 4584814 3466044 3302187 4104891 5027245
43677 5027245 5679274 6275655 6692481 6249754 4611394 2428409 879114 709062 1712901
$$ packed form
43741d51616L5469l74486n614J224106J821078Q64024n01559r40422q22113q63606
43731a4739m11391J156706K533677J957152j06135j459466r08484Q38392K417536
43722F003248K734866J348854q32188j932893j289187l61222m51784q37591n47979
43713C834124m31832j463331k373779j407335N65797J296680P72059P90800J416970
43704C000153R40409n98474j014687L00168J255942O39493j8868M98162Q25188
43695E827486l91189j864500j737315n61436o2224k47809Q5887R14686J174880
43686C138466Q12844O83260P33674J28974r12404j118770j63857Q02704R22354
43677E027245O52029N96381M16826m42727j638360k182985j549295j70052J003839
$$ plain form
43668 1712901 3026216 3931589 4385281 4685124 4811041 4509032 4000856 3980788 4554227
43659 4554227 4705020 3482661 1508828 511021 1186250 2274697 2286652 1533908 1496421
43650 1496421 2443303 3019786 2591183 2599989 4411143 6784939 7188551 5290258 3336844
43641 3336844 2876950 2963335 2342566 1693059 2317624 3771981 4373212 3560098 2459955
43632 2459955 2356740 3538781 5370277 6745586 6902069 6432536 6791373 8065517 8273459
43623 8273459 6049113 2974608 1627687 2109584 2391508 1572637 687656 453260 425065
43614 425065 629220 1884845 3926012 5164562 5095219 5151874 6293109 7393088 6982965
43605 6982965 5062953 2328226 -694359 -2738666 -2009063 1132101 3433418 2623172
$$ packed form
43668A712901J313315R05373M53692K99843J25917l02009n08176k0068N73439
43659D554227J50793j222359j973833r97807O75229J088447J1955p52744l7487
43650A496421R46882N76483m28603Q806J811154K373796M03612j898293j953414
43641C336844m59894Q6385o20769o49507O24565J454357O01231q13114j100143
43632B459955j03215J182041J831496J375309J56483m69533L58837J274144K07942
43623H273459k224346l074505j346921M81897K81924q18871q84981k34396k8195
43614D25065K04155J255625K041167J238550o9343N6655J141235J099979m10123
43605F982965j920012k734727l022585k044307P29603L141164K301317q10246
$$ plain form
43597 2623172 578051 559716 2573203 3931791 3592303 3181193 3824916 4544434 4306305
43588 4306305 3626879 3456683 3984183 4995108 6080991 6345471 5410455 4726858 6006417
43579 6006417 8170023 8111982 5173417 2471239 2504605 3706575 3240201 1310921 294790
43570 294790 865830 1627311 1973721 2711493 3873711 4306115 3797592 3549730 4001505
43561 4001505 4108362 3449489 3167772 3903948 4601633 4535310 4776262 6087401 6933045
43552 6933045 5605743 3221347 2324766 3136350 3573842 2855552 2609023 3957353 5792503
43543 5792503 6809435 7213961 7299614 6301106 4202138 2944083 3878247 5343341 4961445
43534 4961445 3343015 3027056 4277101 4681451 3095972 1295680 913373 1156953 838932
$$ packed form
43597B623172k045121j8335K013487J358588l39488m11110O43723P19518k38129
43588D306305o79426j70196N27500J010925J085883K64480r35016o83597J279559
43579F006417K163606n8041k938565k702178L3366J201970m66374j929280j016131
43570B94790N71040P61481L46410P37772J162218M32404n08523k47862M51775
43561D001505J06857o58873k81717P36176O97685o6323K40952J311139Q45644
43552F933045j327302k384396q96581Q11584M37492p18290k46529J348330J835150
43543E792503J016932M04526Q5653r98508k098968j258055R34164J465094l81896
43534D961445j618430l15959J250045M04350j585479j800292l82307K43580l18021
$$ plain form
43525 838932 597654 1452334 2768436 3458609 3940659 4996195 5664424 4379675 1738287
43516 1738287 130801 708580 2435583 4065120 5241409 5492696 4049141 1354854
43508 1354854 -728512 -1019084 -180361 794057 2011226 3810699 5597870 6511853 6456353
43499 6456353 5681683 4166578 2200457 725084 229614 124560 76886 963523 3287386
43490 3287386 5559375 5847062 4441211 3387119 3636496 4296922 4611734 4884635 5128447
43481 5128447 4561179 3189324 2403914 3024216 3935049 3730537 2757383 2428440 3275018
43472 3275018 4772329 6433522 7919758 8561121 7926127 6547503 5120237 3515164
43464 3515164 1753572 1282612 3492596 7094035 8906207 7707074 5581201 4765417
$$ packed form
43525H38932k41278Q54680J316102O90173M82050J055536O68229j284749k641388
43516A738287j607486N77779J727003J629537J176289K51287j443555k694287
43508A354854k083366k90572Q38723R74418J217169J799473J787171R13983n5500
43499F456353p74670j515105j966121j475373m95470j05054m7674Q86637K323863
43490C287386K271989K87687j405851j054092K49377O60426L14812K72901K43812
43481E128447n67268j371855p85410O20302R10833k04512r73154l28943Q46578
43472C275018J497311J661193J486236O41363o34994j378624j427266j605073
43464C515164j761592m70960K209984L601439J812172j199133k125873q15784
$$ plain form
43456 4765417 4891999 4469129 3474139 2808911 2308980 1230171 134691 334622 1596449
43447 1596449 2281399 1950838 1970675 2988450 3669623 3020593 2368361 3431395 5448522
43438 5448522 6029786 4447124 2386154 1468557 1619967 2149678 2877766 3499097 3180549
43429 3180549 1853649 939833 1591600 2915829 3281227 2875597 3274241 4480011 4336574
43420 4336574 1745372 -1162010 -1592906 154981 1336019 783440 305260 1661367 3953545
43411 3953545 5124486 4811868 4313984 4400307 4602845 4478579 4247138 4021504 3514839
43402 3514839 2864068 2834434 3702567 4597968 4488232 3398141 2251330 1874709 2487472
43393 2487472 3774451 5074212 5784574 5902895 5911386 5942862 5508342 4396491 3385474
$$ packed form
43456D765417J26582m22870r94990o65228m99931j078809j095480J99931J261827
43447A596449O84950l30561J9837J017775O81173o49030o52232J063034K017127
43438E448522N81264j582662k060970r17597J51410N29711P28088O21331l18548
43429C180549j326900r13816O51767J324229L65398m05630L98644J205770j43437
43420D336574k591202k907382m30896J747887J181038n52579m78180J356107K292178
43411C953545J170941l12618m97884Q6323K02538j24266k31441k25634n06665
43402C514839o50771k9634Q68133Q95401j09736j090091j146811l76621O12763
43393B487472J286979J299761P10362J18321Q491L1476m34520j111851j011017
$$ plain form
43384 3385474 3501205 4764129 6136827 6622998 6100200 5206642 4698427 4799524 5017997
43375 5017997 4829852 4591061 5188509 6485394 6898675 5338488 3041112 2365350 3851776
43366 3851776 5551130 5509191 3991815 2782078 2990877 4188081 5290401 5696108 5629964
43357 5629964 5700045 6072249 6037045 4701782 2243619 86092 -426087 783066 2824604
43348 2824604 4820950 6159369 6300021 5172070 3725875 3324860 4259245 5309815 5171596
43339 5171596 4068812 3545480 4671570 6792417 8205524 7874526 6254044 4569802
43331 4569802 3705847 3903232 5014408 6473259 7246523 6629691 5334699 5126876 6882755
43322 6882755 9419707 10760077 10208571 8624591 7049223 5944566 5616511 6246034 7173370
$$ packed form
43384C385474J15731J262924J372698M86171n22798q93558n08215J01097K18473
43375E017997j88145k38791N97448J296885M13281j560187k297376o75762J486426
43366C851776J699354m1939j517376j209737K08799J197204J102320M05707o6144
43357E629964P0081L72204l5204j335263k458163k157527n12179J209153K041538
43348B824604J996346J338419J40652j127951j446195m01015R34385J050570j38219
43339E171596j102784n23332J126090K120847J413107l30998j620482j684242
43331D569802q63955J97385J111176J458851P73264o16832j294992k07823J755879
43322F882755K536952J340370n51506j583980j575368j104657l28055O29523R27336
$$ plain form
43313 7173370 7176366 6096730 5316654 5756976 6210421 4972887 2711397 2070209 4143863
43304 4143863 6817112 7377530 5668564 3735767 3282093 4564549 6986169 9337248
43296 9337248 9896806 7940250 5236896 4563908 6360973 8193307 8036594 6714779 6227421
43287 6227421 6923586 7587931 7454924 6745977 5731449 4669005 4427027 5741135 7741587
43278 7741587 8469047 7183247 5181595 4046904 4045327 4592903 5285438 5864789 5987810
43269 5987810 5736399 5771461 6357878 6780057 6357605 5533956 5268734 5773900 6547405 7251413
43259 7251413 7784269 7854515 7394381 7141070 7776961 8602231 8253597 6898683 6393600
43250 6393600 7662225 9157557 8971330 7524449 6796294 7451817 8313486 8532075 8526441
$$ packed form
43313G173370K996j079636p80076M40322M53445j237534k261490o41188K073654
43304D143863K673249N60418j708966j932797m53674J282456K421620K351079
43296I337248N59558j956556k703354o72988J797065J832334j56713j321815m87358
43287F227421O96165O64345j33007p08947j014528j062444k41978J314108K000452
43278G741587P27460j285800k001652j134691j577N47576O92535N79351J23021
43269E987810k51411L5062N86417M22179m22452q23649k65222N05166P73505P04008
43259G251413N32856P0246m60134k53311O35891Q25270l48634j354914n05083
43250F393600J268625J495332j86227j446881p28155O55523Q61669K18589n634
$$ plain form
43241 8526441 8367211 7024767 4373404 2538712 3531037 6228013 7547818 6531716
43233 6531716 5482719 6615504 9159316 10693318 10179142 8527166 6932511 5925374
43225 5925374 5780383 6680973 8263571 9663609 10219573 9867390 8994364 8250025 8228803
43216 8228803 8860134 9323598 9016509 8333896 7995379 7951650 7647692 7135313 7131562 7985188
43206 7985188 9245816 10268000 10667348 10257408 9205638 8236372 7984150 8095438 7656196
43197 7656196 6586211 5871920 6207999 7086779 7542364 7253587 6614862 6178666 6306797
43188 6306797 7002757 7875205 8541531 9087103 9760978 10312694 10192533 9409143 8593234
43179 8593234 8159137 7986192 7964140 8225215 8773543 9492994 10510327 11861752 12871847
$$ packed form
43241H526441j59230j342444k651363j834692R92325K696976J319805j016102
43233F531716j048997J132785K543812J534002n14176j651976j594655j007137
43225E925374j44991R00590J582598J400038N55964l52183q73026p44339k1222
43216H228803O31331M63464l07089o82613l38517m3729l03958n12379l751Q53626
43206G985188J260628J022184L99348m09940j051770r69266k52222J11288m39242
43197G656196j069985p14291L36079Q78780M55585k88777o38725m36196J28131
43188F306797O95960Q72448O66326N45572O73875N51716j20161p83390q15909
43179H593234m34097j72945k2052K61075N48328P19451J017333J351425J010095
$$ plain form
43170 12871847 12742385 11785201 11103236 10945603 10458457 9301733 8346500 8328357 8915983
43161 8915983 9621510 10490547 11265720 11071307 9799168 8734235 8842408 9444169 9624242
43152 9624242 9919052 11292968 13267842 14522320 14796235 14791323 14622397 13848660 12841678
43143 12841678 12686657 13655749 14910059 15692491 15756987 14787063 12691253 10560124 10069030
43134 10069030 11595029 13848260 15490554 16126447 15659492 13994757 11871874 10858143
43126 10858143 11733503 13547951 14852781 15271296 15358929 15558124 15982379 16820590 18177510
43117 18177510 19538824 20012222 19410350 18816987 19570596 21528303 22887108 22371516 21191006
43108 21191006 21679692 23976017 25492604 24273077 21493434 19666159 19650417 20703056
$$ packed form
43170A2871847j29462r57184o81965j57633m87146j156724r55233j8143N87626
43161H915983P05527Q69037P75173j94413j272139j064933J08173O01761J80073
43152I624242K94810J373916J974874J254478K73915m912j68926p73737j006982
43143A2841678j55021R69092J254310P82432O4496r69924k095810k131129m91094
43134A0069030J525999K253231J642294O35893m66955j664735k122883j013731
43126A0858143Q75360J814448J304830M18515Q7633J99195M24255Q38211J356920
43117A8177510J361314M73398o01872n93363P53609J957707J358805n15592j180510
43108B1191006M88686K296325J516587j219527k779643j827275j5742J052639
$$ plain form
43100 20703056 22262884 24011187 25065769 24943633 24729709 25563308 26629558 26582903 26293059
43091 26293059 27817108 30940357 33254992 33744073 33792950 34424545 35197697 36349903 39160158
43082 39160158 43149223 45687014 45819582 45917949 47849021 50028832 50371606 49863645 50689294
43073 50689294 52641080 54059296 54914087 56276859 57861728 58767578 59764720 62158878
43065 62158878 65063927 66493210 66668838 67528624 69260033 70151457 69878697 70058335 71107901
43056 71107901 71254560 69421889 66737772 64366785 62065526 59766663 58423097 58180851
43048 58180851 57653250 56159280 54908640 54818810 54882427 53941754 52450453 51156498 49610443
43039 49610443 47452017 45743358 45408849 45550302 44933564 44079199 44193884 44948631 45110712
$$ packed form
43100B0703056J559828J748303J054582j22136k13924Q33599J066250m6655k89844
43091B6293059J524049L123249K314635M89081M8877O31595P73152J152206K810255
43082C9160158L989065K537791J32568R8367J931072K179811L42774n07961Q25649
43073E0689294J951786J418216Q54791J362772J584869R05850R97142K394158
43065F2158878K905049J429283J75628Q59786J731409Q91424k72760J79638J049566
43056G1107901J46659j832671k684117k370987k301259k298863j343566k42246
43048E8180851n27601j493970j250640q9830O3617r40673j491301j293955j546055
43039D9610443k158426j708659l34509J41453o16738q54365J14685P54747J62081
$$ plain form
43030 45110712 44733670 44946382 45945875 46827659 47174728 47321890 47222230 46525168 45764663
43021 45764663 46094584 47670399 49393765 50391684 50805643 51103117 51563467 52470571 53888867
43012 53888867 55195939 55696349 55757034 56568204 58776650 62033853 65702089 69159688 71585530
43003 71585530 72448922 72290727 72250523 72854324 73932650 75401657 77197145 78806201 80045380
42994 80045380 82006805 85794973 90397304 93394890 94002335 93818840 94186231 94530876 94108597
42985 94108597 93720272 94402518 95595740 95979089 95355413 94526143 93940289 93549678 93436791
42976 93436791 93605082 93698184 93752468 94426391 95517090 95285619 92710924 89576808 88539441
42967 88539441 89620419 90542750 90325673 90395126 91822578 93588793 94486010 95047019 96482212
$$ packed form
43030D5110712l77042K12712R99493Q81784L47069J47162r9660o97062p60505
43021D5764663L29921J575815J723366R97919M13959K97474M60350R07104J418296
43012E3888867J307072N00410O0685Q11170K208446L257203L668236L457599K425842
43003G1585530Q63392j58195m0204O03801J078326J469007J795488J609056J239179
42994H0045380J961425L788168M602331K997586O07445j83495L67391L44645m22279
42985I4108597l88325O82246J193222L83349o23676q29270n85854l90611j12887
42976I3436791J68291R3102N4284O73923J090699k31471k574695l134116j037367
42967H8539441J080978R22331k17077O9453J427452J766215Q97217N61009J435193
$$ plain form
42958 96482212 99007847 102263514 106148853 110111823 112816184 113958825 115515076 119600075
42950 119600075 125660477 131372658 136007407 141254360 148634008 157603822 166648129 175057030
42942 175057030 183104211 191390619 200530843 210726438 221129746 230222974 237262885 242821810
42934 242821810 247529643 250841562 251513425 248868311 243169902 235133091 225548170 215192278
42926 215192278 204717373 194580107 185029446 175941545 166835978 157541641 148723754 141110876
42918 141110876 134348365 127587669 121256593 116934134 114885663 112987424 109168442 103997056
42910 103997056 99622062 96912310 95124031 93854291 93419677 93170755 91360329 87593394
42902 87593394 84010512 82813800 83490497 83772667 82825549 82050153 82688370 83981430 84398124
$$ packed form
42958I6482212K525635L255667L885339L962970K704361J142641J556251M084999
42950A19600075O060402N712181M634749N246953P379648Q969814R044307Q408901
42942A75057030Q047181Q286408R140224J0195595J0403308R093228P039911N558925
42934B42821810M707833L311919O71863k645114n698409q036811r584921j0355892
42926B15192278j0474905j0137266r550661r087901r105567r294337q817887p612878
42918A41110876o762511o760696o331076m322459k048471j898239l818982n171386
42910A03997056m374994k709752j788279j269740m34614k48922j810426l766935
42902H7593394l582882j196712O76697K82170r47118p75396O38217J293060M16694
$$ plain form
42893 84398124 83901484 84017065 85712983 87964237 88819281 87605544 85643151 84782207 85628513
42884 85628513 87374629 88962053 89923963 90255034 90117830 89956330 90465550 91950735 93755956
42875 93755956 94695802 94233877 93106375 92566617 92946315 93150167 91850291 89144829 86611275
42866 86611275 85497030 85276203 84470049 82593950 80589496 79366555 78720516 77994154 77093696
42857 77093696 76264890 75383397 74263043 73427804 73640543 74487343 74281796 71963388 68621075
42848 68621075 66479474 66579968 68059902 69547114 70441246 70662038 70042564 68680434 67405605
42839 67405605 67057019 67357802 67151112 65782279 63726381 61872352 60798524 60818540 62039736
42830 62039736 64046797 65996014 67290390 67810695 67499837 66445463 65524600 65976638 67727666
$$ packed form
42893H4398124m96640J15581J695918K251254Q55044j213737j962393q60944Q46306
42884H5628513J746116J587424R61910L31071j37204j61500N09220J485185J805221
42875I3755956R39846m61925j127502n39758L79698K03852j299876k705462k533554
42866H6611275j114245k20827q06154j876099k004454j222941o46039p26362r00458
42857G7093696q28806q81493j120354q35239K12739Q46800k05547k318408l342313
42848F8621075k141601J00494J479934J487212Q94132K20792o19474j362130j274829
42839F7405605l48586L00783k06690j368833k055898j854029j073828K0016J221196
42830F2039736K007061J949217J294376N20305l10858j054374r20863M52038J751028
$$ plain form
42821 67727666 68983409 68372559 66911532 66864371 69007379 71987298 74178055 75226819
42813 75226819 75863279 77116265 79743762 83569142 87294767 89770129 91517067 94207161
42805 94207161 98612219 104011960 109719364 116039776 123299104 131044239 138936708 147494964
42797 147494964 156997043 166354092 174221099 180897550 187942445 195780167 202653650 206430410
42789 206430410 206945623 206087814 205747522 206025288 205454050 202717175 197927831 192250985 186561641
42780 186561641 180725970 174088936 166399258 158256258 150773738 144651742 139411437 133831671
42772 133831671 127424879 121079027 115777931 111221394 106557563 102044098 98722997 96479040
42764 96479040 93834456 90095963 86365016 83632011 81079954 77468330 73338998 70377324
$$ packed form
42821F7727666J255743o10850j461027m7161K143008K979919K190757J048764
42813G5226819O36460J252986K627497L825380L725625K475362J746938K690094
42805I4207161M405058N399741N707404O320412P259328P745135P892469Q558256
42797A47494964R502079R357049P867007O676451P044895P837722O873483L776760
42789B06430410N15213q57809l40292K77766n71238k736875m789344n676846n689344
42780A86561641n835671o637034p689678q143000p482520o121996n240305n579766
42772A33831671o406792o345852n301096m556537m663831m513465l321101k243957
42764I6479040k644584l738493l730947k733005k552057l611624m129332k961674
$$ plain form
42756 70377324 68878780 67253966 64249811 60597948 58011763 57211185 57415636 57476804 57131702
42747 57131702 57108743 58039384 59403455 59947890 59282786 58504884 58761787 59658250 59803636
42738 59803636 58719371 57407193 56973542 57407209 57970604 58209008 58124183 57699701 56818393
42729 56818393 55645576 54598755 53643239 51976680 49062302 45994906 44967844 46737142
42721 46737142 49244881 49760782 48057543 46249071 45589254 45041005 43557241 42113448
42713 42113448 42087390 42690665 41822979 39264768 37371792 38154323 40785043 42689472 42517693
42704 42517693 41366491 41191457 42500990 43916158 43973418 42899867 42078641 42052292 42049355
42695 42049355 41636384 41632913 42649453 43721195 43513025 42290875 41577071 42230926 43936027
$$ packed form
42756G0377324j498544j624814l004155l651863k586185q00578K04451O1168l45102
42747E7131702k2959R30641J364071N44435o65104p77902K56903Q96463J45386
42738E9803636j084265j312178m33651M33667N63395K38404q4825m24482q81308
42729E6818393j172817j046821r55516j666559k914378l067396j027062J769298
42721D6737142K507739N15901j703239j808472o59817n48249j483764j443793
42713D2113448k6058O03275q67686k558211j892976P82531K630720J904429j71779
42704D2517693j151202j75034J309533J415168N7260j073551q21226k6349k937
42695D2049355m12971l471J016540J071742k08170j222150p13804O53855J705101
$$ plain form
42686 43936027 46222009 48735869 50601772 50841305 49765380 48960933 49475137 50711105
42678 50711105 51439153 51290467 50932038 51211113 52371446 53865170 54958667 55759268 57306598
42669 57306598 60156314 63303144 65285782 66029124 66648282 67650824 68467150 68812766 69374211
42660 69374211 70807750 72980649 75572028 78581553 81780451 84355909 85655594 85954256
42652 85954256 86259064 87683203 90919799 95658361 100461121 103940041 106233979 108724781
42644 108724781 112269995 116457006 120631651 124753335 129020582 133534875 138647995 144819854
42636 144819854 151768819 158483949 164364310 169621793 174406690 178510252 182233472 186439607
42628 186439607 191180794 195325559 198275645 201028652 204568508 208086377 210058160 210622621
$$ packed form
42686D3936027K285982K513860J865903K39533j075925q04447N14204J235968
42678E0711105P28048j48686l58429K79075J160333J493724J093497Q00601J547330
42669E7306598K849716L146830J982638P43342O19158J002542Q16326L45616N61445
42660F9374211J433539K172899K591379L009525L198898K575458J299685K98662
42652H5954256L04808J424139L236596M738562M802760L478920K293938K490802
42644A08724781L545214M187011M174645M121684M267247M514293N113120O171859
42636A44819854O948965O715130N880361N257483M784897M103562L723220M206135
42628A86439607M741187M144765K950086K753007L539856L517869J971783N64461
$$ plain form
42620 210622621 211634534 214436360 218614091 223058307 227350927 231735245 236296726 240694891
42612 240694891 244631993 248308109 252252453 256716213 261435328 266075347 270510215 274306882
42604 274306882 276443036 276318812 274760106 273029542 270878285 266638755 259454845 250422621
42596 250422621 241188530 232343107 223572184 214452462 204599294 193883500 183049128 173377422
42588 173377422 165264123 157828412 150240430 142562390 135007637 127544898 120749776 115744529
42580 115744529 112462983 109217094 105039571 101282393 99551662 98996246 97184815 93131698
42572 93131698 88034463 83399801 79822322 77395794 75951297 74772638 73124355 71238798
42564 71238798 70063740 69998585 70399533 70177293 68525253 65580754 62838251 62101787 63273630
$$ packed form
42620B10622621J011913K801826M177731M444216M292620M384318M561481M398165
42612B40694891L937102L676116L944344M463760M719115M640019M434868L796667
42604B74306882K136154j24224j558706j730564k151257m239530p183910r032224
42596B50422621r234091q845423q770923r119722r853168j0715794j0834372r671706
42588A73377422q113299p435711p587982p678040p554753p462739o795122n005247
42580A15744529l281546l245889m177523l757178j730731n55416j811431m053117
42572I3131698n097235m634662l577479k426528j444497j178659j648283j885557
42564G1238798j175058o5155M00948k22240j652040k944499k742503p36464J171843
$$ plain form
42555 63273630 64084892 63048921 61727739 62636563 65654173 68267668 69033128 68952928 69332246
42546 69332246 69998277 70155485 69692094 69021050 68503395 68427470 68829482 69114054 68530927
42537 68530927 67123053 65596343 64379601 63492512 63019469 62829837 62208628 60833252 59714879
42528 59714879 59879346 60472041 59753585 57868789 56890792 57871911 59499669 60125479 59593304
42519 59593304 58515011 57234532 56223082 56131101 56627172 56345120 54692871 52554504 50590759
42510 50590759 48264528 45431236 43395075 43039063 43046873 41476981 38359101 35377369 33594835
42501 33594835 32787263 32479329 32278378 31536302 30013417 28723916 28920497 30283015 31164237
42492 31164237 30586938 29017136 27257745 25670620 24550673 24172067 24201698 24000889 23778028
$$ packed form
42555F3273630Q11262j035971j321182R08824L017610K613495P65460q0200L79318
42546F9332246O66031J57208m63391o71044n17655p5925M02012K84572n83127
42537F8530927j407874j526710j216742q87089m73043j89632o21209j375376j118373
42528E9714879J64467N92695p18456j884796r77997R81119J627758O25810n32175
42519E9593304j078293j280479j011450r1981M96071k82052j652249k138367j963745
42510E0590759k326231k833292k036161l56012P810j569892l117880k981732j782534
42501C3594835q07572l07934k00951p42076j522885j289501J96581J362518Q81222
42492C1164237n77299j569802j759391j587125j119947l78606K9631k00809k22861
$$ plain form
42483 23778028 24503471 26294208 27825504 27989077 27381105 27321439 27871248 27732118 26014503
42474 26014503 23379885 21343683 20918850 21929840 23160943 23191157 21679305 19935166
42466 19935166 19612052 20687040 21499310 21093114 20501631 20892037 21404349 20246326 17491708
42457 17491708 15224336 14890900 15959757 17342391 18587987 19277995 18834780 17626679
42449 17626679 16856369 16732593 16312992 15748448 16584517 18724925 19493226 17603293 15756154
42440 15756154 16683921 18640718 18129761 15593802 14482305 15409671 15507717 13742497 12565794
42431 12565794 13231374 13525356 11941980 10491203 11016259 11844271 10839628 9200481 9196558
42422 9196558 10153744 9880331 8664345 8623674 9869302 10377878 9474757 8786242 9580555
$$ packed form
42483B3778028P25443J790737J531296J63573o07972n9666N49809j39130j717615
42474B6014503k634618k036202m24833J010990J231103L0214j511852j744139
42466A9935166l23114J074988Q12270m06196n91483L90406N12312j158023k754618
42457A7491708k267372l33436J068857J382634J245596O90008m43215j208101
42449A7626679p70310j23776m19601n64544Q36069K140408P68301j889933j847139
42440A5756154R27767J956797n10957k535959j111497R27366R8046j765220j176703
42431A2565794O65580K93982j583376j450777N25056Q28012j004643j639147l923
42422I196558R57186k73413j215986m0671J245628N08576r03121o88515P94313
$$ plain form
42413 9580555 11315242 13002267 14153644 14192189 12626501 10159311 8332704 7837856 8126687
42404 8126687 8567368 8968970 9181933 9193473 9377234 9792569 9742659 8952522 8457669 9163849
42394 9163849 10285118 10569957 10349480 10796653 11714877 11766446 10639086 9446250 9129083
42385 9129083 9744493 10976952 12064405 11788584 10048446 8828597 9864726 11929591
42377 11929591 12454572 11403482 11168519 12623750 13782518 12969058 11098306 9846406
42369 9846406 9392324 9092169 8925032 9068530 9069489 8524408 7944377 8146667 9186995 10327493
42359 10327493 10745882 10207268 9388891 9285633 9866300 9976530 9248731 9030468 10185647
42350 10185647 11202928 10378013 8791466 8623024 9226738 7932778 4739946 2959770
$$ packed form
42413I580555J734687J687025J151377L8545j565688k467190j826607m94848K88831
42404H126687M40681M01602K12963J1540J83761M15335m9910p90137m94853P06180
42394I163849J121269K84839k20477M47173R18224N1569j127360j192836l17167
42385I129083O15410J232459J087453k75821j740138j219849J036129K064865
42377A1929591N24981j051090k34963J455231J158768q13460j870752j251900
42369I846406m54082l00155j67137J43498R59n45081n80031K02290J040328J140498
42359A0327493M18389n38614q18377j03258N80667J10230p27799k18263J155179
42350A0185647J017281q24915j586547j68442O03714j293960l192832j780176
$$ plain form
42342 2959770 4387477 6817797 7686211 7518139 8005132 8847310 8565335 7005091 5263340
42333 5263340 4172301 4125950 5232897 6541891 6453232 4978323 4112543 4868119 5685658
42324 5685658 5193417 4656511 5734035 7427219 7651942 6788981 7134691 9186421 10744619
42315 10744619 9897090 7264759 5029570 4802216 6426021 8062752 7753800 5593189
42307 5593189 3760961 3749917 4604611 4901453 5182681 6801793 9303080 10858377 10881477
42298 10881477 10473327 10473961 10635163 10647699 10591668 10349207 9724473 9116027 9112210 9569561
42288 9569561 9874838 9740890 9074132 7834796 6845818 7565880 9782152 10807326 8762862
42279 8762862 5565766 4521792 5849901 7066662 7177271 7575442 8792200 9387248 8790004
$$ packed form
42342B959770J427707K430320Q68414j68072M86993Q42178k81975j560244j741751
42333E263340j091039m6351J106947J308994q8659j474909q65780P55576Q17539
42324E685658m92241n36906J077524J693184K24723q62961L45710K051730J558198
42315A0744619q47529k632331k235189k27354J623805J636731l08952k160611
42307E593189j832228j1044Q54694K96842K81228J619112K501287J555297K3100
42298A0881477m08150O34J61202J2536n6031k42461o24734o08446l817M57351
42288I569561L05277j33948o66758j239336r88978P20062K216272J025174k044464
42279H762862l197096j043974J328109J216761J10609L98171J216758N95048n97244
$$ plain form
42270 8790004 8491628 9236124 9435160 7866993 5891315 5243565 5309414 4519003 3207018
42261 3207018 3051443 4361635 5789317 6417716 6504048 6248666 5353386 4052865 3354926
42252 3354926 3738561 4377499 4149616 2979636 1798397 1414756 1750311 2179953 2456121
42243 2456121 3082906 4569559 6382262 7043936 5577797 2729536 469572 194789 1538738
42234 1538738 3058460 3929673 4515471 5103374 4813407 2728674 -124038 -1239109 454581
42225 454581 3194856 4589682 4313300 3762257 3851557 4265088 4443334 4301701 4182739
42216 4182739 4739035 6406008 8415789 9103265 7956843 6439790 5827497 5395725 4149063
42207 4149063 3132519 4001088 6072429 7094891 6612685 6212879 6438287 5934232 4171068
$$ packed form
42270H790004k98376P44496J99036j568167j975678o47750O5849p90411j311985
42261C207018j55575J310192J427682O28399Q6332k55382q95280j300521o97939
42252C354926L83635O38938k27883j169980j181239l83641L35555M29642K76168
42243B456121O26785J486653J812703O61674j466139k848261k259964k74783J343949
42234A538738J519722Q71213N85798N87903k89967k084733k852712j115071J693690
42225D54581K740275J394826k76382n51043Q9300M13531J78246j41633j18962
42216D182739N56296J666973K009781O87476j146422j517053o12293m31772j246662
42207D149063j016544Q68569K071341J022462m82206l99806K25408n04055j763164
$$ plain form
42198 4171068 2714727 2885360 4024330 4943771 5347647 5028554 3568403 1875665 2078318
42189 2078318 4480375 6388409 5677291 4003321 4419242 6864531 8328325 7154660
42181 7154660 5059403 4555137 5959375 7595717 8008667 7316654 6700520 6909178 7359299
42172 7359299 6902339 5418503 4086639 3889274 4461005 4732403 4175973 3156793 2603835
42163 2603835 3475260 5828308 8253559 9048779 8138334 6969218 6459550 6212388 5869643
42154 5869643 5728840 5571330 4504806 2733169 1868172 2478843 2945253 2023701 972237
42145 972237 1506230 3032097 3818406 3812159 4200669 4959443 5037814 4555648 4619492 5076147
42135 5076147 4625193 3373883 3158524 4678164 6141101 5729243 3992402 2685868 2256355
$$ packed form
42198D171068j456341J70633J138970R19441M03876l19093j460151j692738K02653
42189B078318K402057J908034p11118j673970M15921K445289J463794j173665
42181G154660k095257n04266J404238J636342M12950o92013o16134K08658M50121
42172G359299m56960j483836j331864j97365N71731K71398n56430j019180n52958
42163B603835Q71425K353048K425251P95220r10445j169116n09668k47162l42745
42154E869643j40803j57510j066524j771637q64997O10671M66410r21552j051464
42145I72237N33993J525867P86309o247L88510P58774P8371m82166O3844M56655
42135E076147m50954j251310k15359J519640J462937m11858j736841j306534m29513
$$ plain form
42126 2256355 1721487 592340 -190046 595838 2850454 4981359 5387023 4035722 2325768
42117 2325768 1447625 1454619 2011964 3078303 4274963 4557514 3493216 2163310 1769693
42108 1769693 1990081 1856093 1633946 2392342 3985664 4929590 4373875 3047001 2104564
42099 2104564 1943033 2196565 2197341 1618954 1247802 2456346 5005597 6312734 4419182
42090 4419182 982619 -516429 851585 2814784 3363307 2686564 1571352 193021
42082 193021 -908991 -778262 192760 336004 -603661 -791552 654838 1945677 1339787
42073 1339787 -251878 -1052153 -1136347 -1403270 -1283346 154006 1718734 1256830 -968816
42064 -968816 -2353717 -1528211 190064 1235676 1707441 2144607 2134056 1252653 233953
$$ packed form
42126B256355n34868j129147p82386P85884K254616K130905M05664j351301j709954
42117B325768q78143O994N57345J066339J196660K82551j064298j329906l93617
42108A769693K20388j33988k22147P58396J593322R43926n55715j326874r42437
42099B104564j61531K53532P76n78387l71152J208544K549251J307137j893552
42090D419182l436563j499048J368014J963199N48523o76743j115212j378331
42082A93021j102012J30729R71022J43244r39665j87891J446390J290839o05890
42073A339787j591665q00275q4194k66923J19924J437352J564728m61904k225646
42064i68816j384901Q25506J718275J045612M71765M37166j0551q81403j018700
$$ plain form
42055 233953 70131 648330 1171350 1397991 1694276 2263173 2980645 3657976 3928321 3272028
42045 3272028 1764835 473093 445903 1494564 2532021 2901772 2765006 2439376 2174597
42036 2174597 2453944 3516789 4465888 3961963 2231245 1243042 2132063 3532450 3548486
42027 3548486 2342893 1309246 644900 -190445 -202342 2240342 5952348 7228612 4781295
42018 4781295 1817199 1443500 2398883 1801025 102725 53942 1837204 2767101 1700278
42009 1700278 441007 269445 99592 -944725 -1820966 -1730108 -1647852 -2243894 -2396558
42000 -2396558 -1436575 -923492 -2196396 -3728554 -3164907 -958827 276202 -495635 -1743793
41991 -1743793 -1975279 -1428942 -909230 -463574 182252 788222 777972 -38464 -1051998
$$ packed form
42055B33953j63822N78199N23020K26641K96285N68897P17472O77331K70345o56293
42045C272028j507193j291742k7190J048661J037457L69751j36766l25630k64779
42036B174597K79347J062845R49099n03925j730718r88203Q89021J400387J6036
42027C548486j205593j033647o64346q35345j1897K442684L712006J276264k447317
42018D781295k964096l73699R55383n97858j698300m8783J783262R29897j066823
42009A700278j259271j71562j69853j044317q76241R0858Q2256n96042j52664
42000b396558R59983N13083j272904j532158N63647K206080J235029p71837j248158
41991a743793k31486N46337N19712M45656O45826O05970j0250q16436j013534
$$ plain form
41982 -1051998 -1114840 416687 2705489 4051302 3754857 2721594 2018593 1804549 2029650
41973 2029650 2891408 3806031 3207926 554985 -2400033 -3465654 -2319876 -50789 2424912
41964 2424912 4245823 4210420 2267942 480902 629306 1576115 972537 -1046470 -2121841
41955 -2121841 -1368150 -436572 -623390 -1111654 -739462 307364 1302131 1925977 1755000
41946 1755000 308529 -1658009 -2332380 -1157608 276613 457061 -141563 -221119 429953
41937 429953 1182628 1722935 1921546 1396009 269381 -338136 320712 1274854 966310
41928 966310 -558749 -1636565 -1146958 169636 777224 212141 -418876 274467 2300055
41919 2300055 4112802 4320147 3279033 2481900 2581098 2834757 2561677 2242537 2749468
$$ packed form
41982a051998o2842J531527K288802J345813k96445j033263p03001k14044K25101
41973B029650Q61758R14623n98105k652941k955018j065621J145778K269087K475701
41964B424912J820911l5403j942478j787040J48404R46809o03578k019007j075371
41955b121841P53691R31578j86818m88264L72192J046826R94767O23846j70977
41946A755000j446471j966538o74371J174772J434221J80448n98624p9556O51072
41937D29953P52675N40307J98611n25537j126628o07517O58848R54142l08544
41928I66310j525059j077816M89607J316594O07588n65083o31017O93343K025588
41919B300055J812747K07345j041114p97133R9198K53659k73080l19140N06931
$$ plain form
41910 2749468 4083612 5350293 5703330 5074730 4149649 3619629 3346688 2661105 1763394
41901 1763394 2002041 3940691 6028157 6474762 5657419 5000480 4272694 2356889 312641
41892 312641 660851 3121072 4199888 2365177 650138 2040612 4958889 6108970
41884 6108970 5622959 5942317 6943335 5997798 2645308 -311625 -843737 182813 1583035
41875 1583035 3600801 5891877 6452443 4381314 1780907 1067204 1863518 2322785 2190532
41866 2190532 2512433 3176894 2940458 1711878 907572 1278436 1887411 1715298 1101067
41857 1101067 929495 1172543 977445 -76516 -1313026 -1568074 -343011 1647236 3149932
41848 3149932 3638197 3681344 3975964 4443175 4619017 4482226 4283538 3832480 2732391
$$ packed form
41910B749468J334144J266681L53037o28600r25081n30020k72941o85583q97711
41901A763394K38647J938650K087466M46605q17343o56939p27786j915805k044248
41892C12641L48210K460221J078816j834711j715039J390474K918277J150081
41884F108970m86011L19358J001018r45537l352490k956933n32112J026550J400222
41875A583035K017766K291076N60566k071129k600407p13703P96314M59267j32253
41866B190532L21901O64461k36436j228580q04306L70864O08975j72113o14231
41857A101067j71572K43048j95098j053961j236510k55048J225063J990247J502696
41848C149932M88265M3147K94620M67211J75842j36791j98688m51058j100089
$$ plain form
41839 2732391 1351240 814685 1702854 3214393 3980812 3456278 2259324 1387748 1353443
41830 1353443 1898443 2300001 2080823 1637463 2013412 3752393 6047422 7350861 6866626
41821 6866626 5184746 3450012 2303204 1793877 1846400 2292196 2660619 2574670 2422019
41812 2422019 3031038 4381751 5144728 4035795 1400643 -1086766 -2246587 -2397948 -2484116
41803 -2484116 -2775622 -2844964 -2493161 -2102778 -1976606 -1777579 -1007559 91411 552817
41794 552817 -200482 -1496312 -1971924 -985023 698388 1597185 796320 -1273098 -3043356
41785 -3043356 -2950747 -839126 1696186 2750587 2007307 850247 561554 979315 1193363
41776 1193363 928824 628102 536715 443152 284674 408333 1073488 2026711 2665154 2458609
$$ packed form
41839B732391j381151n36555Q88169J511539P66419n24534j196954q71576l4305
41830A353443N45000M01558k19178m43360L75949J738981K295029J303439m84235
41821F866626j681880j734734j146808n09327N2523M45796L68423q5949j52651
41812B422019O09019J350713P62977j108933k635152k487409j159821j51361q6168
41803b484116k91506o9342L51803L90383J26172J99027P70020J098970M61406
41794E52817p53299j295830m75612R86901J683411Q98797q00865k069418j770258
41785c043356R2609K111621K535312J054401p43280j157060k88693M17761K14048
41776A193363k64539l00722r1387r3563j58478J23659O65155R53223O38443k06545
$$ plain form
41766 2458609 1346367 14757 -381634 762830 2724439 4017816 3785623 2405444
41758 2405444 854709 -115176 -204382 550028 1892591 3509532 5074027 6037175 5732843
41749 5732843 4211703 2741676 2694064 3840340 4523829 3789898 2538124 2014958 1923592
41740 1923592 996205 -897365 -2315766 -2092318 -748184 344815 558166 233835 -152436
41731 -152436 -313583 92568 1148381 2031662 1555588 -191480 -1421565 -560070 1817785
41722 1817785 3715046 4113461 3768850 3678854 3773739 3434141 2443837 984292 -551939
41713 -551939 -1286256 -307559 1853630 3111155 2287550 967422 1478573 3492553 4394166
41704 4394166 3061865 1336809 1041937 1394362 791023 -228528 227729 2224725 3615447
$$ packed form
41766B458609j112242j331610l96391J144464J961609J293377k32193j380179
41758B405444j550735r69885q9206P54410J342563J616941J564495R63148l04332
41749E732843j521140j470027m7612J146276O83489p33931j251774n23166r1366
41740A923592r27387j893570j418401K23448J344134J092999K13351l24331l86271
41731a52436j61147M06151J055813Q83281m76074j747068j230085Q61495K377855
41722A817785J897261L98415l44611q9996R4885l39598r90304j459545j536231
41713e51939p34317R78697K161189J257525q23605j320128N11151K013980R01613
41704D394166j332301j725056k94872L52425o03339j019551M56257J996996J390722
$$ plain form
41695 3615447 2985271 1290898 67839 -469583 -660513 -54373 1785423 3874285 4699421
41686 4699421 4291503 4016097 4290063 4009447 2703240 1729227 2210475 2894435 1629372
41677 1629372 -1455893 -3784106 -3418258 -1052141 1319894 2535154 2626367 2142057 1806538
41668 1806538 2126407 2746695 2810380 2324188 2295056 3020296 3333350 2423015 1386058 1762981
41658 1762981 3272501 4323043 4246375 3656503 2989990 2176872 1596271 1861900 2613128
41649 2613128 2925384 2998133 3931658 5586487 6260740 5053112 3094338 1741218 944764
41640 944764 264575 135658 959028 1986657 2325235 2230441 2275041 2055474 1020579 -46292
41630 -46292 234196 1928629 3824653 5098733 5774055 5765297 4805738 3418357 2761876
$$ packed form
41695C615447o30176j694373j223059n37422j90930O06140J839796K088862Q25136
41686D699421m07918k75406K73966k80616j306207r74013M81248O83960j265063
41677A629372l085265k328213L65848K366117K372035J215260R1213m84310l35519
41668A806538L19869O20288O3685m86192k9132P25240L13054r10335j036957L76923
41658A762981J509520J050542p6668n89872o66513q13118n80601K65629P51228
41649B613128L12256P2749R33525J654829O74253j207628j958774j353120p96454
41640I44764o80189j28917Q23370J027629L38578r4794M4600k19567j034895j066871
41630d6292K80488J694433J896024J274080O75322q758r59559j387381o56481
$$ plain form
41621 2761876 3159764 3639906 3239805 2084889 954189 405213 524744 968890 1049189
41612 1049189 285527 -913208 -1497433 -852289 636511 2068705 2767293 2612329 2035602
41603 2035602 1722298 2085043 3035239 4271696 5461309 6086329 5721500 4723355 3953667
41594 3953667 3459118 2295068 234827 -1368756 -1356235 -420004 200756 743117 2110749
41585 2110749 3825632 4646893 4744289 5169377 5352383 3513497 -18591 -2245035 -1242493
41576 -1242493 1474235 3459857 4374333 5103476 5516066 4945545 3841725 3163560 2815711
41567 2815711 2223828 1783918 2151635 2641143 1996274 456302 -520312 -396754 130123
41558 130123 821255 2176769 3808103 4218952 2899583 1398769 1559678 3552267 6165994
$$ packed form
41621B761876L97888M80142m00101j154916j130700n48976J19531M44146Q0299
41612A049189p63662j198735n84225O45144J488800J432194O98588j54964n76727
41603B035602l13304L62745R50196J236457J189613O25020l64829r98145p69688
41594C953667m94549j164050k060241j603583J2521R36231O20760N42361J367632
41585B110749J714883Q21261R7396M25088J83006j838886l532088k226444J002542
41576a242493K716728J985622R14476P29143M12590n70521j103820o78165l47849
41567B815711n91883m39910L67717M89508o44869j539972r76614J23558N26877
41558A30123O91132J355514J631334M10849j319369j500814J60909J992589K613727
$$ plain form
41549 6165994 8127626 8546336 6996286 4075860 1428894 467084 1227910 2779023 4281041
41540 4281041 5234325 5177673 3849868 1649761 -405330 -1274906 -558951 1147873 2609047
41531 2609047 3042292 2871497 3023274 3629216 4029078 3941043 3765109 3606249 2956899 1758832
41521 1758832 907035 1099889 1901840 2568698 3076021 3526943 3202876 1325097 -1436049
41512 -1436049 -3196750 -2700456 -346500 2474072 4426358 4832542 4077889 3448709 3852839
41503 3852839 4693186 4710028 3832345 3219250 3382672 3439916 2702793 1877739 1823799 2018090
41493 2018090 1423471 364682 235432 1398211 2592839 2761467 2492213 3063045 4657256
41484 4657256 6155225 6426764 5359444 3728054 2384861 1590148 1038267 526053 366294
$$ packed form
41549F165994J961632M18710j550050k920426k646966r61810P60826J551113J502018
41540D281041R53284n6652j327805k200107k055091q69576P15955J706824J461174
41531B609047M33245j70795J51777O05942L99862q8035j75934j58860o49350j198067
41521A758832q51797J92854Q01951O66858N07323M50922l24067j877779k761146
41512a436049j760701M96294K353956K820572J952286M06184p54653o29180M04130
41503C852839Q40347J6842q77683o13095J63422N7244p37123q25054n3940J94291
41493B018090n94619j058789j29250J162779J194628J68628k69254N70832J594211
41484D657256J497969K71539j067320j631390j343193p94713n51881n12214j59759
$$ plain form
41475 366294 811746 1317716 1063488 206738 -229683 6775 -167253 -1427239 -2593246
41466 -2593246 -2034624 -60924 1372811 1344144 1120805 2253365 4503797 6324020 6749766
41457 6749766 6117986 5246480 4539114 3853984 2891245 1679359 724864 525755 995558
41448 995558 1704088 2573339 3728232 4656931 4410868 3060986 2139233 2872036 4486815
41439 4486815 5118794 4156247 2866896 2699951 3658810 4553478 4431314 3506051 2783548
41430 2783548 2859005 3209098 2923171 1992250 1275929 1174680 1229233 1367633 2441758 4655897
41420 4655897 6429178 6135246 4416502 3351802 3626700 4069663 3974415 4180325 5330102
41411 5330102 6531779 6622623 5688474 4441231 2976299 1120134 -614873 -1360418 -818836
$$ packed form
41475C66294M45452N05970k54228q56750m36421K36458j74028j259986j166007
41466b593246N58622J973700J433735k8667k23339J132560K250432J820223M25746
41457F749766o31780q71506p07366o85130r62739j211886r54495j99109M69803
41448I95558P08530Q69251J154893R28699k46063j349882r21753P32803J614779
41439D486815O31979r62547j289351j66945R58859Q94668j22164r25263p22503
41430B783548P5457L50093k85927r30921p16321j01249N4553J38400J074125K214139
41420D655897J773281k93932j718744j064700K74898M42963r5248K05910J149777
41411E330102J201677R0844r34149j247243j464932j856165j735007p45545N41582
$$ plain form
41402 -818836 766786 3042595 5281466 6323482 5680359 4263359 3140629 2048597
41394 2048597 214378 -1741845 -2191700 -941051 138906 -390031 -1507181 -1237904 488340
41385 488340 1717213 1068776 -729238 -2216884 -3041943 -3629721 -3763287 -2724570 -743877
41376 -743877 900406 1554525 1898614 2466719 2596976 1779556 953249 1020822 892678 -1073148
41366 -1073148 -3972078 -4887698 -2924815 -584983 -139190 -541931 535292 3105781 5186013
41357 5186013 5789875 5685666 5608112 5514453 5507142 5850042 5933338 4705475 2493015 1157702
41347 1157702 1958364 4158267 6102949 6852023 6442597 5379176 4339011 3824725 3683202
41338 3683202 3207235 1821551 -437355 -2759641 -3587577 -1605071 2383132 5232810
$$ packed form
41402h18836J585622K275809K238871J042016o43123j417000j122730j092032
41394B048597j834219j956223m49855J250649J079957n28937j117150K69277J726244
41385D88340J228873o48437j798014j487646q25059n87778j33566J038717J980693
41376g43877J644283O54119L44089N68105J30257q17420q26307O7573j28144j965826
41366a073148k898930r15620J962883K339832M45793m02741J077223K570489K080232
41357E186013O03862j04209p7554r3659p311L42900Q3296j227863k212460j335313
41347A157702Q00662K199903J944682P49074m09426j063421j040165n14286j41523
41338C683202m75967j385684k258906k322286q27936J982506L988203K849678
$$ plain form
41330 5232810 4450225 1140866 -1269335 -974440 942930 2859005 4337653 5301488 5396395
41321 5396395 4913296 4793999 4965980 4144125 2104292 641152 1201869 2919568 4143369
41312 4143369 4612328 4798949 4351106 2815085 1015039 72768 -310163 -1052347 -1765384
41303 -1765384 -1280367 235556 1316064 1283995 895627 916403 1337857 1995505 2717606
41294 2717606 2845942 1848643 502002 269251 1339342 2406502 2597728 2501914 2928439
41285 2928439 3619073 3726253 3021113 2265299 2534882 3967252 5011203 3751074 625858
41276 625858 -1281106 90014 2896666 3908842 2896763 2166791 2394676 1941663 515068
41267 515068 314168 2365341 4484186 4568015 3628554 3654700 4442751 4671987 4476412 4661424
$$ packed form
41330E232810p82585l309359k410201K94895J917370J916075J478648R63835R4907
41321E396395m83099j19297J71981q21855k039833j463140N60717J717699J223801
41312D143369M68959J86621m47843j536021j800046r42271l82931p42184p13037
41303a765384M85017J515923J080508l2069l88368K0776M21454O57648P22101
41294B717606J28336r97299j346641k32751J070091J067160J91226r5814M26525
41285B928439O90634J07180p05140p55814K69583J432370J043951j260129l125216
41276F25858j906964J371120K806652J012176j012079p29972K27885m53013j426595
41267E15068k00900K051173K118845Q3829r39461K6146P88051K29236j95575J85012
$$ plain form
41257 4661424 4671827 3676130 2610721 2743482 3086134 1828513 -253219 -668547 586446
41248 586446 634345 -1834060 -4326439 -3963513 -1134221 1577174 2587978 2157358 1253918
41239 1253918 885115 1749405 3474691 4725444 4716618 3974801 3207112 2463878 2007611
41230 2007611 2710289 4483342 5394859 3820415 886949 -695463 -20032 1184321 1193307
41221 1193307 420315 296535 949345 1046216 -121188 -1278193 -572612 1845128 3551889
41212 3551889 2709498 519288 -170526 1621065 4114272 5383586 5452260 5328870 5350511
41203 5350511 5407452 5738535 6378206 6549982 5704517 4606234 4369958 4920633 5386149
41194 5386149 5447762 5196085 4248224 2423620 946975 1373323 3244592 4311335 3421233
$$ packed form
41257D661424J0403r95697j065409J32761L42652j257621k081732m15328J254993
41248E86446M7899k468405k492379L62926K829292K711395J010804m30620r03440
41239A253918l68803Q64290J725286J250753q826p41817p67689p43234m56267
41230B007611P02678J773053R11517j574444k933466j582412O75431J204353Q986
41221A193307p72992j23780O52810R6871j167404j157005P05581K417740J706761
41212C551889q42391k190210o89814J791591K493207J269314O8674j23390K1641
41203E350511N6941L31083O39671J71776q45465j098283k36276N50675M65516
41194E386149O1613k51677r47861j824604j476645M26348J871269J066743q90102
$$ plain form
41185 3421233 1860424 1357741 1998328 2770988 3088274 2917455 2231434 1237633 620314
41176 620314 759484 1082427 865819 378295 605337 2004106 3960985 5307259 5118637
41167 5118637 3373477 1161816 -119330 -113535 315569 478223 787272 1795335 2998131
41158 2998131 3489852 3421460 3746976 4516020 4475092 2864097 910767 731914 2820653
41149 2820653 5267812 5822269 4385227 2863591 2571200 2667042 1797150 468603 448068
41140 448068 2016615 3441989 3608263 3556498 4394406 5123859 4201186 2353739 1852616
41131 1852616 3204203 4539071 4627293 4651101 6034938 7915586 8136792 6123832 3572873
41122 3572873 2458705 3205846 4769807 5828594 5769734 4934722 4113392 3793911 4003455
$$ packed form
41185C421233j560809n02683O40587P72660L17286j70819o86021r93801o17319
41176F20314J39170L22943k16608m87524K27042J398769J956879J346274j88622
41167E118637j745160k211661j281146N795M29104J62654L09049J008063J202796
41158B998131M91721o8392L25516P69044m0928j610995j953330j78853K088739
41149B820653K447159N54457j437042j521636k92391R5842q69892j328547k0535
41140D48068J568547J425374J66274n1765Q37908P29453r22673j847447n01123
41131A852616J351587J334868Q8222K3808J383837J880648K21206k012960k550959
41122C572873j114168P47141J563961J058787n8860q35012q21330l19481K09544
$$ plain form
41113 4003455 4792303 6382575 8561062 10317508 10572307 9222217 7222313 5706686
41105 5706686 5213024 5666054 6812712 8419631 9975695 10529078 9482718 7748011 7333749
41096 7333749 9081294 11382698 12117290 11420722 11232958 12261202 13029152 12377815 11316704
41087 11316704 11382185 12345320 12794913 12239619 11415639 10981398 11003863 11427410 12110686 12670348
41077 12670348 13063576 13896055 15342635 16359993 16028935 15116088 15022279 15638296 15771420
41068 15771420 15452171 15996626 17512214 18159517 16737212 14579918 13772000 14451663 15059334
41059 15059334 14665610 13892487 13671088 13990755 14079115 13413236 12354314 11755020 11888074
41050 11888074 12016348 11388424 10367515 9934153 10269761 10635789 10570945 10324515 10106855
$$ packed form
41113D003455P88848J590272K178487J756446K54799j350090j999904j515627
41105E706686m93662M53030J146658J606919J556064N53383j046360j734707m14262
41096G333749J747545K301404P34592o96568j87764J028244P67950o51337j061111
41087A1316704O5481R63135M49593n55294q23980m34241K2465M23547O83276N59662
41077A2670348L93228Q32479J446580J017358l31058r12847r3809O16017J33124
41068A5771420l19249N44455J515588O47303j422305k157294q07918O79663O07671
41059A5059334l93724p73123k21399L19667Q8360o65879j058922n99294J33054
41050A1888074J28274o27924j020909m33362L35608L66028o4844k46430k17660
$$ plain form
41041 10106855 9832287 9607038 9473289 8743637 6877183 5056767 5302645 7648862 9888505
41032 9888505 10717728 11223285 12235782 12334585 10351552 8145237 8395606 10543675 11479329
41023 11479329 10023056 8343870 8662379 10601276 12399967 13114155 12906954 12429477 12581990
41014 12581990 13933347 15876252 17097183 17076908 16372267 15519053 14700155 14381424 14983606
41005 14983606 15880833 16070257 15913803 16715944 18389542 19252392 18619368 17833060 17949624
40996 17949624 18154661 17585322 17102352 17790443 18957377 19189259 18479236 17843650 17612058
40987 17612058 17531936 17842905 18719368 19181456 18089911 15917577 14201436 13574770 13605585
40978 13605585 14089458 15015927 15675374 15468386 15310118 16376211 17589256 16549005 13328911
$$ packed form
41041A0106855k74568k25249j33749p29652j866454j820416K45878K346217K239643
41032I888505Q29223N05557J012497R8803j983033k206315K50369K148069R35654
41023A1479329j456273j679186L18509J938897J798691P14188k07201m77477J52513
41014A2581990J351357J942905J220931k0275p04641q53214q18898l18731O02182
41005A4983606Q97227J89424j56454Q02141J673598Q62850o33024p86308J16564
40996A7949624K05037n69339m82970O88091J166934K31882p10023o35586k31592
40987A7612058q0122L10969Q76463M62088j091545k172334j716141o26666L0815
40978A3605585M83873R26469O59447k06988j58268J066093J213045j040251l220094
$$ plain form
40969 13328911 11023298 11477335 12596757 11589073 9239963 8736666 11004375 13495754
40961 13495754 13727857 12163081 10953850 11175467 12213005 13101938 13496028 13497489 13217639
40952 13217639 12649475 11752527 10634457 9684239 9350442 9667147 10204847 10682295 11389122
40943 11389122 12625346 13836485 13863769 12299807 10197127 9035204 9204301 9891416 10236475
40934 10236475 10074681 9654591 9269974 9269061 9827994 10494768 10475486 9634389 8770261 8686298
40924 8686298 9415305 10462551 11208579 10962176 9468903 7708183 7266675 8389003 9588675
40915 9588675 9844250 10080373 11465195 13326665 14166279 13880175 13330112 12410218 10543688
40906 10543688 8772630 9045507 11074081 12037052 10206099 7052494 4852543 3999998
$$ packed form
40969A3328911k305613M54037J119422j007684k349110n03297K267709K491379
40961A3495754K32103j564776j209231K21617J037538Q88933L94090J461k79850
40952A3217639n68164q96948j118070r50218l33797L16705N37700M77448P06827
40943A1389122J236224J211139K7284j563962k102680j161923J69097O87115L45059
40934A0236475j61794m20090l84617r13N58933O66774j9282q41097q64128q3963
40924H686298P29007J047246P46028k46403j493273j760720m41508J122328J199672
40915I588675K55575K36123J384822J861470Q39614k86104n50063r19894j866530
40906A0543688j771058K72877K028574R62971j830953l153605k199951q52545
$$ plain form
40898 3999998 3895866 4741472 6665069 8288342 8159085 7022124 6878015 8099158 9151790
40889 9151790 9071171 8572469 8511194 8737658 8949082 9411694 10142795 10310415 9225566 7369236
40879 7369236 5799474 4955972 4616644 4690938 5373144 6507044 7342844 7252248 6542516
40870 6542516 6231843 6875294 7852217 8140488 7627102 7117542 7067395 7045869 6739809 6703965
40860 6703965 7483660 8602287 9251688 9605082 10499420 11900692 12591941 11619215 9460857
40851 9460857 7520789 6797883 7119301 7378772 6544124 4698078 2982645 2317444 2515936
40842 2515936 2983766 3697654 4774404 5594090 5443739 4850014 5057802 6013769 6077174
40833 6077174 4312144 2113772 1704643 3507631 5759892 6496858 5350118 3550594
$$ packed form
40898C999998j04132Q45606J923597J623273j29257j136961j44109J221143J052632
40889I151790q0619m98702o1275K26464K11424M62612P31101J67620j084849j856330
40879G369236j569762q43502l39328P4294O82206J133900Q35800r0596p09732
40870F542516l10673O43451R76923K88271n13386n09560n0147k1526l06060l5844
40860F703965P79695J118627O49401L53394Q94338J401272O91249r72726k158358
40851I460857j940068p22906L21418K59471q34648j846046j715433o65201J98492
40842B515936M67830P13888J076750Q19686j50351n93725K07788R55967O3405
40833F077174j765030k198372m09129J802988K252261P36966j146740j799524
$$ plain form
40825 3550594 2668215 3312142 4683606 5351354 4664416 3392166 2830393 3341724 4005268
40816 4005268 3795003 2899704 2508561 3199066 4061533 3981348 3344723 3402192 4046955 3756960
40806 3756960 2299414 1798136 3723102 6206995 6379861 4543483 3660886 4959006 6616354
40797 6616354 7179451 7589499 8636276 8832903 6794488 4057061 3279011 4518381 5363623
40788 5363623 4348808 2430975 1230686 1381051 2627570 4202426 4976633 4318097 2862323
40779 2862323 1626690 676622 -347365 -906215 -196538 1181594 1828215 1832813 2735864
40770 2735864 4838522 6282939 5655275 4076067 3567623 4342893 4912350 4275956 2882863
40761 2882863 1664687 1034528 884356 1031284 1535281 2649648 4315012 5824958 6480892
$$ packed form
40825C550594q82379O43927J371464O67748o86938j272250n61773N11331O63544
40816D005268k10265q95299l91143O90505Q62467q0185o36625N7469O44763k89995
40806C756960j457546n01278J924966K483893J72866j836378q82597J298120J657348
40797F616354N63097M10048J046777J96627k038415k737427p78050J239370Q45242
40788E363623j014815j917833j200289J50365J246519J574856P74207o58536j455774
40779B862323j235633r50068j023987n58850P09677J378132O46621M598R03051
40770B735864K102658J444417o27664j579208n08444P75270N69457o36394j393093
40761B882863j218176o30159j50172J46928N03997J114367J665364J509946O55934
$$ plain form
40752 6480892 6534271 6832609 7519855 7895575 7684848 7486513 7607609 7419803 6450139 5278531
40742 5278531 4680535 4566273 4423969 4188797 4036034 3900170 3761013 3744238 3423580 1944710
40732 1944710 -381945 -1621555 -518457 1514365 2062757 844567 -251919 63819
40724 63819 1216554 2261454 3132842 4019896 4709926 5074953 5340695 5471300 5020182
40715 5020182 3867197 2437827 1113229 215510 519771 2603789 5426258 6783122
40707 6783122 5781195 3870559 2829327 2741941 2725343 2630467 2897339 3350831 3305716 2650718
40697 2650718 1963747 1717788 2037485 2948152 4129851 4672456 3881442 2295913 1296898
40688 1296898 1734813 3369260 5408889 7019282 7520493 6780196 5403087 4058151 2770443
$$ packed form
40752F480892N3379K98338O87246L75720k10727j98335J21096j87806r69664j171608
40742E278531n97996j14262j42304k35172j52763j35864j39157j6775l20658j478870
40732A944710k326655j239610J103098K032822N48392j218190j096486L15738
40724F3819J152735J044900Q71388Q87054O90030L65027K65742J30605m51118
40715E020182j152985j429370j324598q97719L04261K084018K822469J356864
40707F783122j001927j910636j041232q7386j6598r4876K66872M53492m5115o54998
40697B650718o86971k45959L19697R10667J181699N42605p91014j585529r99015
40688A296898M37915J634447K039629J610393N01211p40297j377109j344936j287708
$$ plain form
40679 2770443 1346474 170327 -145535 291514 825468 1250725 1820658 2325969 2130291
40670 2130291 1299258 769991 1060092 1672452 2231444 3293498 5221697 6941029 6937127
40661 6937127 5361349 4120060 4572755 5854117 5996622 4326324 2106014 829156
40653 829156 549441 356960 72886 571884 2235267 3942433 4318693 3529703 3011395
40644 3011395 3634956 5004216 6463238 7720984 8251942 7263771 5029166 3370074 3740500
40635 3740500 5258976 5722498 4416222 2830256 2485845 3163723 3761314 3893818 3742857
40626 3742857 3009582 1292693 -578096 -879464 824170 2814652 3332454 2795709 2804996
40617 2804996 3437680 3090100 1203447 -453958 -157197 1308266 1865175 1084780 361079
$$ packed form
40679B770443j423969j176147l15862M37049N33954M25257N69933N05311j95678
40670B130291q31033n29267K90101O12360N58992J062054J928199J719332l902
40661F937127j575778j241289M52695J281362J42505j670298k220310j276858
40653H29156k79715j92481k84074M98998J663383J707166L76260p88990n18308
40644C011395O23561J369260J459022J257746N30958r88171k234605j659092L70426
40635C740500J518476M63522j306276j585966l44411O77878N97591J32504j50961
40626C742857p33275j716889j870789l01368J703634J990482N17802n36745R287
40617B804996O32684l47580j886653j657405K96761J465463N56909p80395p23701
$$ plain form
40608 361079 416413 307051 -724942 -1824474 -1715364 -376542 1212683 2249140 2329417
40599 2329417 1265392 -418097 -1376546 -848688 202723 408310 195215 1350568 4147387
40590 4147387 6234872 5311541 2137600 -249799 -91305 1466974 2512124 2943236 3922085
40581 3922085 5418217 5860736 4582479 3242686 3709302 5307870 5593828 3659894 1223202
40572 1223202 144068 215670 121690 -510542 -1023658 -993393 -535697 250728 1206434 1736621
40562 1736621 1399125 708186 532045 831024 859525 545114 672191 1506154 2178319 1895265
40552 1895265 1042803 528051 538497 566562 346393 114470 10707 -172868 -455557 -341125
40542 -341125 530062 1563631 1605903 377577 -919638 -862510 620125 2454189 3881091
$$ packed form
40608C61079N5334j09362j031993j099532J09110J338822J589225J036457Q0277
40599B329417j064025j683489r58449N27858J051411K05587k13095J155353K796819
40590D147387K087485r23331l173941k387399J58494J558279J045150M31112R78849
40581C922085J496132M42519j278257j339793M66616J598568K85958j933934k436692
40572A223202j079134P1602r3980o32232n13116L0265M57696P86425R55706N30187
40562A736621l37496o90939j76141K98979K8501l14411J27077Q33963O72165k83054
40552A895265q52462n14752J0446K8065k20169k31923j03763j83575k82689J14432
40542c41125Q71187J033569M2272j228326j297215N7128J482635J834064J426902
$$ plain form
40533 3881091 4881622 5292343 4672696 3399987 2764015 3257926 3720916 3068270 2026811
40524 2026811 2046259 3159623 4196642 4646315 4887026 4793443 3681821 1868275 895692
40515 895692 1676657 3424878 4905580 5815729 6376901 6381198 5378707 3456669 1402272
40506 1402272 280549 822697 2714095 4479667 4686938 3359855 1760309 962228 1225786
40497 1225786 2348283 3669546 4111867 3421147 3018304 4137406 5454698 4567943 1884561
40488 1884561 641381 2312400 4400076 4185710 2497212 1771105 2080507 1509040 -446985
40479 -446985 -2165095 -2267142 -894142 1124291 2838413 3278618 2466350 1930904 2815484
40470 2815484 4044751 3935453 2936241 2834132 3730428 3986841 3037331 2067060 1815324
$$ packed form
40533C881091J000531M10721o19647j272709o35972M93911M62990o52646j041459
40524B026811J9448J113364J037019M49673K40711r3583j111622j813546r72583
40515H95692P80965J748221J480702R10149N61172M297j002491j922038k054397
40506A402272j121723N42148J891398J765572K07271j327083j599546p98081K63558
40497A225786J122497J321263M42321o90720m02843J119102J317292q86755k683382
40488A884561j243180J671019K087676k14366j688498p26107L09402n71467j956025
40479d46985j718110j02047J373000K018433J714122M40205q12268n35446Q84580
40470B815484J229267j09298r99212j02109Q96296K56413r49510r70271k51736
$$ plain form
40461 1815324 1882690 2436796 4292149 6747361 7619905 6280801 4566183 3792362 3080935
40452 3080935 1793782 1257130 2304460 3208855 2279068 840940 1140062 2539837 2606968
40443 2606968 1312776 1168126 3020148 4500496 3604526 1640234 1220542 2749365 4396771
40434 4396771 4838941 4685782 5288233 6995160 8804640 9440113 8613483 7162910 5968217
40425 5968217 5083681 4187241 3417030 3195239 3524704 4052433 4555784 4789608 4294074
40416 4294074 3188407 2727958 3916707 5727650 5996951 4229666 2236878 1638464 2047264
40407 2047264 2356654 2509426 2928429 3236807 2897509 2480701 2875664 3608400 3466011
40398 3466011 2741747 3189063 5256743 6931468 6350426 4362205 3140516 3093406 2809824
$$ packed form
40461A815324O7366N54106J855353K455212Q72544j339104j714618p73821p11427
40452C080935j287153n36652J047330R04395r29787j438128K99122J399775O7131
40443B606968j294192j44650J852022J480348q95970j964292m19692J528823J647406
40434D396771M42170j53159O02451J706927J809480O35473q26630j450573j194693
40425E968217q84536q96440p70211k21791L29465N27729N03351K33824m95534
40416D294074j105667m60449J188749J810943K69301j767285j992788n98414M08800
40407B047264L09390J52772M19003L08378l39298m16808L94963P32736j42389
40398C466011p24264M47316K067680J674725n81042j988221j221689m7110k83582
$$ plain form
40389 2809824 1739741 1080777 1662593 2597969 2827300 2658684 2765890 2844387 2543567
40380 2543567 2726639 4184567 5740480 5435268 3354710 1481645 783191 396763 -33716
40371 -33716 600766 2599155 4190527 3908958 2669951 2029311 1796064 1045459 251916
40362 251916 479979 1394889 2089356 3086506 5273365 7408593 7256397 5138045 3723626
40353 3723626 3918743 3662161 1734979 86772 704176 2380235 2763259 2018198 2039845
40344 2039845 3022350 3372667 2775608 2911334 4630868 6312694 5941370 3621663 1144924
40335 1144924 -178649 -442983 -303610 58699 998653 2611384 4116452 4453563 3625418
40326 3625418 2855213 2967820 3279734 2889781 2465456 3489868 5838297 7413114 6617745
$$ packed form
40389B809824j070083o58964N81816R35376K29331j68616J07206P8497l00820
40380B543567J83072J457928J555913l05212k080558j873065o98454l86428m30479
40371c3716O34482J998389J591372k81569j239007o40640k33247p50605p93543
40362B51916K28063R14910O94467R97150K186859K135228j52196k118352j414419
40353C723626J95117k56582j927182j648207O17404J676059L83024p45061K1647
40344B039845R82505L50317n97059J35726J719534J681826l71324k319707k476739
40335A144924j323573k64334J39373L62309R39954J612731J505068L37111q28145
40326C625418p70205J12607L11914l89953m24325J024412K348429J574817p95369
$$ plain form
40317 6617745 4284075 2633869 2960074 4754452 6546618 7112781 6247422 4804724 3848790
40308 3848790 3634913 3638982 3460636 3147566 2690804 2000792 1541317 2060699 3239625 3513187
40298 3513187 2004882 -66092 -838009 -173497 449604 113283 -604922 -848145 -493797
40289 -493797 313114 1583368 2907068 3337662 2593480 1739016 1853530 2494200 2407505
40280 2407505 1472005 826962 992028 1001819 -6032 -1179469 -829103 1413536 4135949
40271 4135949 5768726 5912396 4945014 3158643 915802 -784329 -799237 861213 2769529
40262 2769529 3540453 3288829 3152344 3542750 3657545 3003630 2544434 3402120 4862553
40253 4862553 4993431 3440307 2238205 3022819 4606787 4726401 3471546 3121659 4552836
$$ packed form
40317F617745k333670j650206L26205J794378J792166N66163q65359j442698r55934
40308C848790k13877M069j78346l13070m56762o90012m59475N19382J178926K73562
40298C513187j508305k070974p71917O64512O23101l36321p18205k43223L54348
40289d93797Q06911J270254J323700M30594p44182q54464J14514O40670q6695
40280B407505r35500o45043J65066R791j007851j173437L50366K242639K722413
40271D135949J632777J43670r67382j786371k242841j700131j4908J660450J908316
40262B769529P70924k51624j36485L90406J14795o53915m59196Q57686J460433
40253D862553J30878j553124j202102P84614J583968J19614j254855l49887J431177
$$ plain form
40244 4552836 5754126 4754689 2447690 1123179 1240618 1330145 627921 41627 358170
40235 358170 1085880 1684587 2648024 4392558 5917244 5684693 3523621 825464 -931424
40226 -931424 -1168386 -67529 1588742 2481477 1677246 -130398 -987707 278556 2846640
40217 2846640 5004724 5884274 5674307 4761112 3451251 2261276 1668518 1568173 1577603
40208 1577603 1816110 2667339 3694241 3607407 1752507 -886070 -2613724 -2639129 -1469259
40199 -1469259 -94440 837772 1348344 1994859 3176224 4365707 4499395 3468465 2638462
40190 2638462 3243654 4710200 5392337 4757141 3960979 4182303 5106253 5335283 3947633
40181 3947633 1559423 11917 721594 3003977 4529555 4034823 2948930 3351087 4929775
$$ packed form
40244D552836J201290r99437k306999j324511J17439Q9527p02224n86294L16543
40235C58170P27710N98707R63437J744534J524686k32551k161072k698157j756888
40226i31424k36962J100857J656271Q92735q04231j807644q57309J266263K568084
40217B846640K158084Q79550k09967r13195j309861j189975n92758j00345R430
40208A577603K38507Q51229J026902q6834j854900k638577j727654k5405J169870
40199a469259J374819R32212N10572O46515J181365J189483J33688j030930q30003
40190B638462O05192J466546O82137o35196p96162K21324R23950K29030j387650
40181C947633k388210j547506P09677K282383J525578m94732j085893M02157J578688
$$ plain form
40172 4929775 5467430 4120882 2444204 1869666 1989451 2089652 2630158 3903186 4622116
40163 4622116 3502817 1404276 275051 491977 804646 615044 707072 1603888 2550343
40154 2550343 2515670 1376026 -59750 -572589 712262 3252685 5030638 4581903 2902710
40145 2902710 2249201 3215836 4270222 4152654 3321786 2771296 2780493 3294252 4289954 5175904
40135 5175904 4925558 3463774 2025991 1634807 2096826 2815815 3444772 3356723 1922902
40126 1922902 29419 -211667 1674618 3414445 3071508 1814440 1854611 2870545 2750248
40117 2750248 1204266 143201 477214 940909 628156 522521 1506649 2630499 2673648
40108 2673648 2146040 2347774 3290464 3860747 3516126 2671118 1761349 938114 420791
$$ packed form
40172D929775N37655j346548j676678n74538J19785J00201N40506J273028P18930
40163D622116j119299k098541j129225K16926L12669j89602R2028Q96816R46455
40154B550343l4673j139644j435776n12839J284851K540423J777953m48735j679193
40145B902710o53509R66635J054386j17568q30868n50490R197N13759R95702Q85950
40135E175904k50346j461784j437783l91184M62019P18989O28957q8049j433821
40126A922902j893483k41086J886285J739827l42937j257068M0171J015934j20297
40117B750248j545982j061065L34013M63695l12753j05635R84128J123850M3149
40108B673648n27608K01734R42690N70283l44621q45008r09769q23235n17323
$$ plain form
40099 420791 234093 -151732 -1002331 -1400272 -245175 1850163 2857829 1889537 411021
40090 411021 280550 1425150 2306703 2060457 1114474 25133 -1072039 -1787990 -1537490
40081 -1537490 -793995 -1136633 -3106014 -4903134 -4486454 -2401344 -998849 -1005438 -649254
40072 -649254 1294015 3277785 3040389 817539 -991717 -1012875 -465793 -1421866 -4286574
40063 -4286574 -7243025 -7921541 -5713642 -2527829 -827644 -879500 -794056 527800 1882684
40054 1882684 1984931 1661564 2284733 3222474 2908177 1755437 1694326 2925471 3445750
40045 3445750 2179826 473333 -193845 -59598 196148 786825 1809905 2420782 2119103
40036 2119103 1578478 1295842 838630 331684 957906 2681344 3233057 1140763 -1684607
$$ packed form
40099D20791j86698l85825q50599l97941J155097K095338J007666r68292j478516
40090D11021j30471J144600Q81553k46246r45983j089341j097172p15951K50500
40081a537490P43495l42638j969381j797120M16680K085110J402495o589L56184
40072f49254J943269J983770k37396k222850j809256k1158N47082r56073k864708
40063d286574k956451o78516K207899L185813J700185n1856Q5444J321856J354884
40054A882684J02247l23367O23169R37741l14297j152740o1111J231145N20279
40045C445750j265924j706493o67178J34247K55746N90677J023080O10877l01679
40036B119103n40625k82636m57212n06946O26222J723438N51713k092294k825370
$$ plain form
40027 -1684607 -2351033 -752467 1126587 2501494 3928208 4960027 4428649 2934166
40019 2934166 2471347 3328579 3725008 2946562 2477550 3219909 3776138 2706105 790430
40010 790430 -235182 55866 877312 1532413 1690963 1308171 1027235 1768475 3372586
40001 3372586 4642785 5066008 5162046 4795899 2988867 236599 -981527 537967 2646648
39992 2646648 2765759 1424692 876519 1407979 1442985 682906 587131 1603999 2135040
39983 2135040 887407 -1344290 -2916515 -3180633 -2531283 -1552515 -640014 118553 949180
39974 949180 1892813 2474456 2402581 2189275 2318857 2306660 1565730 685561 626090 1052961
39964 1052961 846205 -7978 -462927 -156897 358707 970353 2002480 2988734 3156977
$$ packed form
40027a684607o66426J598566J879054J374907J426714J031819n31378j494483
40019B934166m62819Q57232L96429p78446m69012P42359N56229j070033j915675
40010G90430j025612K91048Q21446O55101J58550l82792k80936P41240J604111
40001C372586J270199M23223R6038l66147j807032k752268j218126J519494K108681
39992B646648J19111j341067n48173N31460L5006p60079r5775J016868N31041
39983B135040j247633k231697j572225k64118O49350R78768R12501P58567Q30627
39974I49180R43633N81643p1875k13306J29582j2197p40930q80169n9471M26871
39964A052961k06756q54183m54949L06030N15604O11646J032127R86254J68243
$$ plain form
39955 3156977 3047434 3684658 4136893 2311539 -1315534 -3368620 -2114282 104703 568755
39946 568755 1129 507916 1629804 1242110 -635843 -1726060 -941409 406179 939338
39937 939338 771780 458829 44695 -455588 -826357 -1044844 -889390 568130 3717524
39928 3717524 6867102 7548520 5516937 3060393 2182164 2830682 4010832 5097507 5667743
39919 5667743 5435909 4851654 4614789 4352924 3090935 1231379 472684 1310299 2299827
39910 2299827 2498357 2900034 4395200 5930326 6109401 5357541 5007392 5250969 5485565
$$ packed form
39955C156977j09543O37224M52235j825354l627073k053086J254338K218985M64052
39946E68755n67626N06787J121888l87694j877953j090217P84651J347588N33159
39937I39338j67558l12951m14134n00283l70769k18487J55454J457520L149394
39928C717524L149578O81418k031583k456544q78229O48518J180150J086675N70236
39919E667743k31834n84255k36865k61865j261989j859556p58695Q37615R89528
39910B299827J98530M01677J495166J535126J79075p51860l50149K43577K34596
$$ [...]
##END NTUPLES=NMR SPECTRUM
##END=
