##TITLE=31Pdec_LR-679-H1-CR7
 D2O, 24 sc
 25.6.2019
##JCAMPDX= 6.0         $$ Bruker NMR JCAMP-DX V2.0
##DATA TYPE= NMR SPECTRUM
##DATA CLASS= NTUPLES
##ORIGIN= UXNMR, Bruker Analytische Messtechnik GmbH
##OWNER= root
$$ XWIN-NMR		Version 3.5
$$ Tue Jun 25 14:01:34 2019 Russian Standard Time (UT+4h)  she@DPX200
##.OBSERVE FREQUENCY= 81.013821
##.OBSERVE NUCLEUS= ^31P
##.ACQUISITION MODE= SIMULTANEOUS
##.ACQUISITION SCHEME= undefined
##.AVERAGES= 24
##.DIGITISER RES= 17
##SPECTROMETER/DATA SYSTEM= spect
##.PULSE SEQUENCE= zgpg30
##.SOLVENT NAME= D2O
##.SHIFT REFERENCE= (INTERNAL, D2O, 0, 182.463)
##AUDIT TRAIL= $$ (NUMBER, WHEN, WHO, WHERE, WHAT)
$$ ##TITLE= Audit trail, XWIN-NMR		Version 3.5
$$ ##JCAMPDX= 5.01
$$ ##ORIGIN= Bruker BioSpin GmbH
$$ ##OWNER= she
$$ F:/spectra/data/she/nmr/P31/1/pdata/1/auditp.txt
$$ ##AUDIT TRAIL=  $$ (NUMBER, WHEN, WHO, WHERE, WHAT)
(   1,<2019-06-25 14:00:40.76 +0400>,<she>,<DPX200>,
      <created by zg, POWCHK disabled, PULCHK disabled
       configuration hash MD5:
       00 E9 B6 7A A2 85 ED C7 34 08 36 98 17 FE 4E 26
       data hash MD5: 32K
       6D 1F 48 86 03 48 52 4C F5 1E 4F F6 2B 0F 7F 36>)
(   2,<2019-06-25 14:00:42.79 +0400>,<she>,<DPX200>,
      <Start of raw data processing
       efp BC_mod = 2 LB = 1 FT_mod = 6 PKNL = 1 PHC0 = -2495.548 PHC1 = -101.6004 SI = 64K 
       data hash MD5: 64K
       35 61 97 6F C8 6D 86 78 62 5D D5 EB 9D 7E D8 19>)
(   3,<2019-06-25 14:01:02.56 +0400>,<she>,<DPX200>,
      <pk PHC0 = -5.197038 PHC1 = 17 
       data hash MD5: 64K
       D5 8E B5 69 7F C8 5B 17 2A 39 12 19 1D 22 EF A2>)
$$ ##END=
$$ 
$$ hash MD5
$$ B8 57 C4 75 EE 90 B1 BD 1E 0E 01 5B 70 01 A4 98
##$RELAX= 
##$RELAX= 
##$RELAX= 
##$RELAX= 
##$RELAX= 
##$RELAX= 
##$RELAX= 
##$RELAX= 
$$ Bruker specific parameters
$$ --------------------------
##$DU= <F:/spectra>
##$EXPNO= 1
##$NAME= <P31>
##$PROCNO= 1
##$TYPE= <nmr>
##$USER= <she>
##$AMP= (0..31)
100 100 100 100 100 100 100 100 100 100 100 100 100 100 100 100 100 100 
100 100 100 100 100 100 100 100 100 100 100 100 100 100 
##$AQSEQ= 0
##$AQ_mod= 1
##$AUNM= <au_zg>
##$AUTOPOS= <>
##$BF1= 81.014009
##$BF2= 200.13
##$BF3= 200.13
##$BF4= 200.13
##$BF5= 200.13
##$BF6= 200.13
##$BF7= 200.13
##$BF8= 200.13
##$BYTORDA= 1
##$CFDGTYP= 0
##$CFRGTYP= 5
##$CHEMSTR= <none>
##$CNST= (0..31)
1 1 145 1 1 1 1 1 1 1 1 1 1 1 1 1 1 1 1 1 1 1 1 1 1 1 1 1 1 1 1 1 
##$CPDPRG= <waltz16>
##$CPDPRG1= <>
##$CPDPRG2= <waltz16>
##$CPDPRG3= <>
##$CPDPRG4= <mlev>
##$CPDPRG5= <mlev>
##$CPDPRG6= <mlev>
##$CPDPRG7= <mlev>
##$CPDPRG8= <mlev>
##$CPDPRGB= <>
##$CPDPRGT= <>
##$D= (0..31)
0 1 0 0 0 0 0 0 0 0 0 0.03 2e-05 3e-06 0 0 0 0 0 0 0 0 0 0 0 0 0 0 0 0 
0 0 
##$DATE= 1561456840
##$DBL= (0..7)
120 120 120 11 120 120 24 19 
##$DBP= (0..7)
150 150 150 150 150 150 150 150 
##$DBP07= 0
##$DBPNAM0= <>
##$DBPNAM1= <>
##$DBPNAM2= <>
##$DBPNAM3= <>
##$DBPNAM4= <>
##$DBPNAM5= <>
##$DBPNAM6= <>
##$DBPNAM7= <>
##$DBPOAL= (0..7)
0.5 0.5 0.5 0.5 0.5 0.5 0.5 0.5 
##$DBPOFFS= (0..7)
0 0 0 0 0 0 0 0 
$$ [...]
##$SUBNAM2= <"">
##$SUBNAM3= <"">
##$SUBNAM4= <"">
##$SUBNAM5= <"">
##$SUBNAM6= <"">
##$SUBNAM7= <"">
##$SUBNAM8= <"">
##$SUBNAM9= <"">
##$SW= 369.568048894756
##$SWIBOX= (0..15)
0 1 3 0 0 0 0 0 0 0 0 0 0 0 0 0 
##$SW_h= 29940.119760479
##$TD= 32768
##$TD0= 1
##$TE= 0
##$TE2= 300
##$TE3= 300
##$TEG= 300
##$TL= (0..7)
0 120 53 12 22 120 120 120 
##$TP= (0..7)
150 150 150 150 150 150 150 150 
##$TP07= 0
##$TPNAME0= <>
##$TPNAME1= <>
##$TPNAME2= <>
##$TPNAME3= <>
##$TPNAME4= <>
##$TPNAME5= <>
##$TPNAME6= <>
##$TPNAME7= <>
##$TPOAL= (0..7)
0.5 0.5 0.5 0.5 0.5 0.5 0.5 0.5 
##$TPOFFS= (0..7)
0 0 0 0 0 0 0 0 
##$TUNHIN= 0
##$TUNHOUT= 0
##$TUNXOUT= 0
##$USERA1= <user>
##$USERA2= <user>
##$USERA3= <user>
##$USERA4= <user>
##$USERA5= <user>
##$V9= 5
##$VALIST= <valist>
##$VCLIST= <CCCCCCCCCCCCCCC>
##$VD= 0
##$VDLIST= <DDDDDDDDDDDDDDD>
##$VPLIST= <PPPPPPPPPPPPPPP>
##$VTLIST= <TTTTTTTTTTTTTTT>
##$WBST= 1024
##$WBSW= 4
##$XGAIN= (0..3)
0 0 0 0 
##$XL= 0
##$YL= 0
##$YMAX_a= 11816
##$YMIN_a= -11404
##$ZGOPTNS= <>
##$ZL1= 120
##$ZL2= 120
##$ZL3= 120
##$ZL4= 120
##$ABSF1= 0
##$ABSF2= 0
##$ABSG= 0
##$ABSL= 0
##$ALPHA= 0
##$AQORDER= 0
##$ASSFAC= 0
##$ASSFACI= 0
##$ASSFACX= 0
##$ASSWID= 0
##$AUNMP= <proc_1d>
##$AZFE= 0.1
##$AZFW= 0.5
##$BCFW= 0
##$BC_mod= 2
##$BYTORDP= 0
##$COROFFS= 0
##$CY= -3
##$DATMOD= 1
##$DC= 0
##$DFILT= <>
##$DTYPP= 0
##$F1P= 0
##$F2P= 0
##$FCOR= 1
##$FTSIZE= 65536
##$FT_mod= 6
##$GAMMA= 0
##$GB= 0
##$INTBC= 1
##$INTSCL= 5.30512e-09
##$ISEN= 30
##$LB= 1
##$LEV0= 0
##$LPBIN= 0
##$MAXI= 10000
##$MC2= 0
##$MEAN= 0
##$ME_mod= 0
##$MI= 50
##$NCOEF= 0
##$NC_proc= -7
##$NLEV= 6
##$NOISF1= 182.463
##$NOISF2= 159.3651
##$NSP= 0
##$NTH_PI= 0
##$NZP= 0
##$OFFSET= 182.463
##$PC= 4
##$PHC0= -2500.745
##$PHC1= -84.6004
##$PH_mod= 1
##$PKNL= yes
##$PPARMOD= 0
##$PSCAL= 0
##$PSIGN= 0
##$REVERSE= no
##$SF= 81.0140089999434
##$SI= 65536
##$SIGF1= 159.3651
##$SIGF2= -187.1042
##$SINO= 113.3802
##$SIOLD= 16384
##$SREGLST= <1H.CDCl3>
##$SSB= 0
##$STSI= 65536
##$STSR= 0
##$SW_p= 29940.119760479
##$SYMM= 0
##$S_DEV= 0
##$TDeff= 32768
##$TDoff= 0
##$TI= <>
##$TILT= no
##$TM1= 0
##$TM2= 0
##$TOPLEV= 0
##$USERP1= <user>
##$USERP2= <user>
##$USERP3= <user>
##$USERP4= <user>
##$USERP5= <user>
##$WDW= 1
##$XDIM= 65536
##$YMAX_p= 509711182
##$YMIN_p= -91738859
$$ End of Bruker specific parameters
$$ ---------------------------------
##NTUPLES= NMR SPECTRUM
##VAR_NAME=  FREQUENCY,     SPECTRUM/REAL,   SPECTRUM/IMAG
##SYMBOL=    X,             R,               I
##VAR_TYPE=  INDEPENDENT,   DEPENDENT,       DEPENDENT
##VAR_FORM=  AFFN,          ASDF,            ASDF
##VAR_DIM=   65536,         65536,           65536
##UNITS=     HZ,            ARBITRARY UNITS, ARBITRARY UNITS
##FACTOR=    0.456856943014862, 1,           1
##FIRST=     14782.0589164792, 0,            0
##LAST=      -15158.0608439998, 0,           0
##MIN=       -15158.0608439998, -91738859,   0
##MAX=       14782.0589164792, 509711182,    0
$$ Real data points
##PAGE= N=1
##DATA TABLE= (X++(R..R)), XYDATA
$$ [...]
$$ plain form
42253 1958328 3556172 3984547 2043315 -762467 -1799704 -437012 865509 -363596
42245 -363596 -3061147 -3973486 -2268520 -460035 -318214 -363637 1239768 3298427 3029282
42236 3029282 -95921 -3629537 -4931454 -3570664 -1189138 252719 228234 -5159 936683
42227 936683 2614737 3251717 2254248 1202412 1867024 4114783 6281751 6853294 5357641
42218 5357641 2501537 46571 -223085 1867593 4774611 7148603 9049236 10653032
42210 10653032 10778977 8074511 3443376 -45617 -215885 1860148 3074483 1597148
42202 1597148 -1418822 -3261065 -2262881 1001220 4333023 5224858 2375863 -2893771
42194 -2893771 -6994451 -7204458 -4640870 -2852753 -3338360 -4142341 -3358933 -1887425 -1414079
$$ packed form
42253A958328J597844M28375j941232k805782j037237J362692J302521j229105
42245c63596k697551r12339J704966J808485J41821m5423J603405K058659k69145
42236C029282l125203l533616j301917J360790K381526J441857k4485k33393R41842
42227I36683J678054O36980r97469j051836O64612K247759K166968N71543j495653
42218E357641k856104k454966k69656K090678K907018K373992J900633J603796
42210A0653032J25945k704466m631135l488993j70268K076033J214335j477335
42202A597148l015970j842243R98184L264101L331803Q91835k848995n269634
42194b893771m100680k10007K563588J788117m85607q03981P83408J471508M73346
$$ plain form
42185 -1414079 -1649402 -1456860 -1013130 -563728 1371922 5563731 8902751 7269661 1539862
42176 1539862 -2803336 -2726926 -928430 -803061 -1537667 -596873 1485303 1823332 -642263
42167 -642263 -4361902 -7756988 -10110458 -10386730 -7734075 -3384714 73112 1806552
42159 1806552 3270608 5029378 5108329 2054905 -1835152 -2647738 41693 2393357 1282199
42150 1282199 -1898443 -3817631 -3883951 -3872956 -3734486 -1148743 3922677 7401848 5985424
42141 5985424 1707926 -963995 -1059028 -1225145 -2911940 -4698268 -5344866 -5390439 -5092999
42132 -5092999 -3505669 -639104 1653404 2060420 1348345 713270 365318 474415 1582792
42123 1582792 3110015 3256621 1457292 -625102 -1318154 -443742 1894430 5662965 9107941
$$ packed form
42185a414079k35323J92542M43730M49402J935650M191809L339020j633090n729799
42176A539862m343198P6410J798496J25369p34606R40794K082176L38029k465595
42167f42263l719639l395086k353470k76272K652655M349361L457826J733440
42159A806552J464056J758770P8951l053424l890057q12586K689431K351664j111158
42150A282199l180642j919188o6320J0995J38470K585743N071420L479171j416424
42141E985424m277498k671921r5033j66117j686795j786328o46598m5573K97440
42132e092999J587330K866565K292508M07016p12075o35075l47952J09097J108377
42123A582792J527223J46606j799329k082394o93052Q74412K338172L768535L444976
$$ plain form
42114 9107941 9312498 6182017 3385186 3393662 4097146 2732723 573699 341826 880454
42105 880454 -1515046 -7065656 -11572657 -11774345 -8672995 -5237629 -3496998 -4219441 -6732686
42096 -6732686 -8355692 -6435595 -1837053 1595928 1693867 22729 -1245062 -2036526 -2825988
42087 -2825988 -2832496 -1673018 -1037628 -2496408 -4599225 -4244773 -639715 3735046 6071979
42078 6071979 5859385 4416069 2869151 1190797 -972936 -2916653 -2924669 -346238 2750553
42069 2750553 3294385 886585 -1535245 -1417069 332915 1229551 1068179 1886667 4177981
42060 4177981 5221962 2297837 -3576444 -8519882 -10115407 -9613650 -9600286 -10659392 -11320506
42051 -11320506 -10684862 -9671923 -9356349 -9225139 -7954110 -5308860 -2335996 69567
$$ packed form
42114I107941K04557l130481k796831Q476P03484j364423k159024k31873N38628
42105H80454k395500n550610m507001k01688L101350L435366J740631p22443k513245
42096f732686j623006J920097M598542L432981R7939j671138j267791p91464p89462
42087b825988o508J159478O35390j458780k102817L54452L605058M374761K336933
42078F071979k12594j443316j546918j678354k163733j943717q016K578431L096791
42069B750553N43832k407800k421830J18176J749984Q96636j61372Q18488K291314
42060D177981J043981k924125n874281m943438j595525N01757J3364j059106o61114
42051a1320506O35644J012939L15574J31210J271029K645250K972864K405563
$$ plain form
42043 69567 1834298 2857857 2326314 -588919 -5483475 -10394212 -12887364 -11840415 -8370122
42034 -8370122 -4718792 -2056397 160310 2459007 3891356 3225939 1087738 -374352
42026 -374352 -175640 118995 -1644597 -5214590 -7607662 -6207348 -2056524 763936 -243762
42017 -243762 -2723097 -2350371 1249754 3767850 2204797 -850977 -961021 2053792 4540097
42008 4540097 4412244 2888687 1141700 -1304479 -4107741 -5242548 -4100435 -2847163
42000 -2847163 -2925482 -2584521 -122012 2441321 1750665 -1972450 -5178539 -5559305 -3787803
41991 -3787803 -1118248 1854053 3764904 2728325 -761143 -3327483 -2569985 134333
41983 134333 1948495 2107403 1574095 654498 -879640 -2076324 -1533588 195916 970799
$$ packed form
42043F9567J764731J023559n31543k915233m894556m910737k493152J046949L470293
42034h370122L651330K662395K216707K298697J432349o65417k138201j462090
42026c74352J98712K94635j763592l569993k393072J400314M150824K820460j007698
42017b43762k479335L72726L600125K518096j563053l055774j10044L014813K486305
42008D540097j27853j523557j746987k446179k803262j134807J142113J253272
42000b847163p8319L40961K462509K563333o90656l723115l206089l80766J771502
41991c787803K669555K972301J910851j036579l489468k566340P57498K704318
41983A34333J814162J58908n33308r19597j534138j196684N42736J729504P74883
$$ plain form
41974 970799 176252 -340437 919756 2988932 4033501 3681047 2631043 1142335 -668898
41965 -668898 -1779343 -975560 1627202 4749461 7128443 7612325 5071947 -14280 -4362468
41956 -4362468 -4381201 -228114 4227329 5850705 5127778 4252510 4108537 4092340 3628216
41947 3628216 2838068 2437008 3278950 4948475 4954083 1384285 -3288906 -3824751 937801
41938 937801 5562552 4761960 440552 -1149267 2178643 6580904 8120904 6980285
41930 6980285 5206597 3496543 1575673 -500334 -2813262 -5753476 -8679458 -9784741
41922 -9784741 -8130918 -4615757 -547312 3150610 4979367 3351437 -771311 -3616809
41914 -3616809 -2578193 864120 3554556 4517677 4623828 3715275 620368 -4054879 -7393964
$$ packed form
41974I70799p94547n16689J260193K069176J044569l52454j050004j488708j811233
41965f68898j110445Q03783K602762L122259K378982M83882k540378n086227m348188
41956d362468j8733M153087M455443J623376p22927q75268j43973j6197m64124
41947C628216p90148m01060Q41942J669525N608l569798m673191n35845M762552
41938I37801M624751q00592m321408j589819L327910M402261J540000j140619
41930F980285j773688j710054j920870k076007k312928k940214k925982j105283
41922i784741J653823L515161M068445L697922J828757j627930m122748k845498
41914c616809J038616L442313K690436R63121J06151r08553l094907m675247l339085
$$ plain form
41905 -7393964 -7298401 -4924552 -3092523 -2911131 -2938425 -1667283 70520 32307 -2298814
41896 -2298814 -4715110 -5076583 -4047016 -3797024 -4694646 -4922846 -3170153 -57643 3144689
41887 3144689 5581161 6413648 5091507 2499489 339450 -1003704 -2421309 -3724615
41879 -3724615 -3441792 -1627543 -599609 -1630912 -2947046 -2538820 -1100200 -390474 -356275
41870 -356275 41294 450692 -225328 -1725941 -3063713 -4562571 -7195475 -10236944 -11395871
41861 -11395871 -9224140 -4263833 1560767 5526628 5265267 1201968 -2940047 -3944979
41853 -3944979 -2772099 -2719686 -4917353 -7763689 -9841761 -10744990 -9708630 -6509109 -3573300
41844 -3573300 -3907186 -6462215 -6849665 -3711307 -1100465 -2607212 -5937801 -6166375 -2753765
$$ packed form
41905g393964R5563K373849J832029J81392k7294J271142J737803l8213k331121
41896b298814k416296l61473J029567K49992q97622k28200J752693L112510L202332
41887C144689K436472Q32487j322141k592018k160039j343154j417605j303306
41879c724615K82823J814249J027934j031303j316134M08226J438620P09726L4199
41870c56275L97569M09398o76020j500613j337772j498858k632904l041469j158927
41861a1395871K171731M960307N824600L965861k61361m063299m142015j004932
41853c944979J172880N2413k197667k846336k078072r03229J036360L199521K935809
41844c573300l33886k555029l87450L138358K610842j506747l330589k28574L412610
$$ plain form
41835 -2753765 -265821 -2216384 -6397520 -7125546 -1453791 7257791 12177876 9772882
41827 9772882 3315728 -1202432 -1801236 -1267995 -1874955 -2506358 -1771540 -752592 -745083
41818 -745083 -856620 -227744 -459976 -3026057 -5983551 -6423321 -4976681 -4480264 -4953286
41809 -4953286 -3809769 -1131537 -529294 -3382229 -5908997 -4266695 307824 4125693
41801 4125693 6427169 8829281 10954743 10493521 7504245 5133148 5184823 5833065 5030923
41792 5030923 3691625 3618754 4276464 4029577 3390290 4413058 7278397 10042587 11976538
41783 11976538 14588278 18334458 20641918 19203812 15963518 15527038 19729042 25540046
41775 25540046 28750987 28461081 27272155 27834052 29983166 31178853 29387439 25369005
$$ packed form
41835b753765K487944j950563m181136p28026N671755Q711582M920085k404994
41827I772882o457154m518160n98804N33241o06960o31403P34818J018948P509
41818g45083j11537O28876k32232k566081k957494m39770J446640M96417m73022
41809d953286J143517K678232O02243k852935k526768J642302M574519L817869
41801D125693K301476K402112K125462m61222k989276k371097N1675O48242q02142
41792E030923j339298p2871O57710k46887o39287J022768K865339K764190J933951
41783A1976538K611740L746180K307460j438106l240294m36480M202004N811004
41775B5540046L210941k89906j188926N61897K149114J195687j791414m018434
$$ plain form
41767 25369005 21936836 20920996 21296650 20621289 17801996 13836596 10280174 7904528
41759 7904528 6734542 6391964 6123172 5230271 3883558 3073966 3480314 4678329 5545610
41750 5545610 5099643 3028550 40073 -2205786 -2257141 -430502 1223694 978513 -744612
41741 -744612 -1845190 -561281 3131714 7562004 10209184 8929627 3477598 -3625304
41733 -3625304 -8354097 -8307082 -4793957 -1299723 192164 581534 1213075 1565663 803526
41724 803526 552319 3642640 9838369 15190335 16723914 15749892 15003569 14451819 12303319
41715 12303319 8887701 6608365 6250367 6032835 4771576 3594743 3571356 3626536 2230201
41706 2230201 -66739 -1133027 292668 3488874 6559865 7757919 6545792 3952279
$$ packed form
41767B5369005l432169j015840L75654o75361k819293l965400l556422k375646
41759G904528j169986l42578k68792q92901j346713q09592M06348J198015Q67281
41750E545610m45967k071093k988477k245859n1355J826639J654196k45181j723125
41741g44612j100578J283909L692995M430290K647180j279557n452029p102902
41733c625304m728793M7015L513125L494234J491887L89370O31541L52588p62137
41724H03526k51207L090321O195729N351966J533579r74022p46323n51750k148500
41715A2303319l415618k279336l57998k17532j261259j176833k3387N5180j396335
41706B230201k296940j066288J425695L196206L070991J198054j212127k593513
$$ plain form
41698 3952279 1698762 892906 1798592 4290106 7503581 9473989 8668880 6026267 4104446
41689 4104446 4009855 4511391 4335399 3752795 3529884 3899077 5011390 6746058 7591170
41680 7591170 5637410 1517781 -1493356 -1255436 1198449 4170793 7334756 9814089
41672 9814089 9106125 4664149 480807 862368 4832715 7830223 7957471 7125993 6581380
41663 6581380 5244546 3053383 2248260 3770605 5188829 4021279 1062226 -1191392
41655 -1191392 -1549619 -22943 3300905 7173671 8508534 5311591 -264540 -3886671
41647 -3886671 -3826115 -2041348 -809691 -346943 -44905 -29160 -391224 -241285 1026235
41638 1026235 2117148 907014 -2763817 -6397925 -7385314 -5554520 -2631223 200403
$$ packed form
41698C952279k253517q05856R05686K491514L213475J970408q05109k642613j921821
41689D104446r4591N01536j75992n82604k22911L69193J112313J734668Q45112
41680G591170j953760m119629l011137K37920K453885K972344L163963K479333
41672I814089p07964m441976m183342L81561L970347K997508J27248q31478n44613
41663F581380j336834k191163q05123J522345J418224j167550k959053k253618
41655a191392l58227J526676L323848L872766J334863l196943n576131l622131
41647c886671O0556J784767J231657M62748L02038J5745l62064J49939J267520
41638A026235J090913j210134l670831l634108r87389J830794K923297K831626
$$ plain form
41630 200403 3093786 5940008 7292677 5843696 2453966 -286864 -605326 844334
41622 844334 1827803 550974 -2946096 -6801751 -8804494 -8395164 -7162495 -6919227 -7509045
41613 -7509045 -7100724 -4450349 -256808 3457695 4660751 2581901 -1101500 -2695430
41605 -2695430 220285 5656116 8919097 7942251 5266548 3952899 3555743 1948257
41597 1948257 -518616 -1488194 -759665 -978541 -3411687 -5621987 -5049013 -3038898 -2953634
41588 -2953634 -5116748 -6174123 -3706024 653484 3529547 3581820 1847706 -300596
41580 -300596 -1978088 -2413737 -1500502 -468406 -495954 -806458 223116 2029514 1905954
41571 1905954 -1205678 -4736701 -5527906 -3501781 -953693 625889 1316413 1172496 -125356
$$ packed form
41630B00403K893383K846222J352669j448981l389730k740830l18462J449660
41622H44334R83469j276829l497070l855655k002743M09330J232669K43268n89818
41613g509045M08321K650375M193541L714503J203056k078850l683401j593930
41605b695430K915715N435831L262981r76846k675703j313649l97156j607486
41597A948257k466873r69578P28529k18876k433146k210300N72974K010115Q5264
41588b953634k163114j057375K468099M359508K876063N2273j734114k148302
41580c00596j677492m35649R13235J032096k7548l10504J029574J806398j23560
41571A905954l111632l531023p91205K026125K548088J579582O90524j43917j297852
$$ plain form
41562 -125356 -2074552 -3457961 -3929548 -4298252 -5044551 -5611002 -5297696 -3895674 -1462130
41553 -1462130 1421856 3235263 2760453 966104 208711 1106111 1704117 539313 -961773
41544 -961773 -481712 1798836 3369512 2520597 -113577 -3026668 -5467324 -7246382 -8069465
41535 -8069465 -7896542 -7442879 -7454192 -7528628 -6451968 -4082855 -2218587 -2615225 -4305650
41526 -4305650 -4186057 -880100 3092723 4114122 1648732 -1730112 -3877686 -4778712
41518 -4778712 -4749531 -3105022 359801 4018180 5812133 5231930 3054972 42719 -3069003
41509 -3069003 -5095930 -5211075 -3950080 -2537265 -1537646 -844764 -379072 91884 1183898
41500 1183898 2864460 3773758 2838335 1086183 394097 728265 280145 -1720931 -4165878
$$ packed form
41562a25356j949196j383409m71587l68704p46299n66451L13306J402022K433544
41553a462130K883986J813407m74810j794349p57393Q97400N98006j164804j501086
41544i61773M80061K280548J570676q48915k634174k913091k440656j779058q23083
41535h069465J72923M53663j1313p4436J076660K369113J864268l96638j690425
41526d305650J19593L305957L972823J021399k465390l378844k147574r01026
41518d778712K9181J644509L464823L658379J793953n80203k176958l012253l111722
41509c069003k026927j15145J260995J412815R99619O92882M65692M70956J092014
41500A183898J680562R09298r35423j752152o92086L34168m48120k001076k444947
$$ plain form
41491 -4165878 -6228494 -8233152 -9596858 -8232741 -3764138 491486 1162470 -612071
41483 -612071 -863848 1497586 3582718 3298235 2077724 1697816 1363620 70099 -664828
41474 -664828 611307 1704685 -675433 -5501272 -8205378 -6979604 -4648664 -3418241
41466 -3418241 -1528227 2792529 7185491 7976419 5230723 2113645 476950 -187175
41458 -187175 -366462 31676 224632 -877811 -2632063 -3279506 -2510287 -1497320 -730429
41449 -730429 34676 29310 -1812071 -4366650 -5094508 -3646719 -2335059 -2590330 -3330702
41440 -3330702 -3348894 -2814598 -1665401 919039 4313914 6075220 5057717 2839950 947565
41431 947565 -1034392 -3259287 -4016665 -2285414 34696 391714 -1421071 -4036167 -6485550
$$ packed form
41491d165878k062616k004658j363706J364117M468603M255624O70984j774541
41483f12071k51777K361434K085132k84483j220511l79908l34196j293521p34927
41474f64828J276135J093378k380118m825839k704106J225774K330940J230423
41466c418241J890014M320756M392962P90928k745696l117078j636695o64125
41458a87175j79287L98138J92956j102443j754252o47443P69219J012967P66891
41449g30429P65105n366j841381k554579p27858J447789J311660k55271p40372
41440c330702j8192N34296J149197K584440L394875J761306j017503k217767j892385
41431I47565j981957k224895p57378J731251K320110L57018j812785k615096k449383
$$ plain form
41422 -6485550 -7803007 -6605111 -3043479 374117 1586860 979638 -665376 -3659886
41414 -3659886 -6934018 -7022699 -2547982 2650315 4180917 2837794 2181288 2494864 1386347
41405 1386347 -1131648 -2846547 -3821900 -5937757 -8262364 -7742255 -4828463 -3588441
41397 -3588441 -5304271 -6619275 -5406793 -3896764 -4064155 -4342813 -3502579 -3797094 -7090655
41388 -7090655 -11083288 -12648820 -12240616 -11767678 -10579282 -7163508 -3070471 -1537320
41380 -1537320 -3125492 -5627643 -7399676 -8122804 -7233416 -4433811 -1268794 276767
41372 276767 395974 614212 943328 97745 -1809803 -2884891 -1804588 788360 2948313
41363 2948313 2648145 -573050 -4187700 -4517837 -1296085 1605713 1556037 562703 869125
$$ packed form
41422f485550j317457J197896L561632L417596J212743o07222j645014k994510
41414c659886l274132q8681M474717N198297J530602j343123o56506L13576j108517
41405A386347k517995j714899r75353k115857k324607N20109K913792J240022
41397c588441j715830j315004J212482J510029j67391k78658Q40234k94515l293561
41388g090655l992633j565532M08204M72938J188396L415774M093037J533151
41380a537320j588172k502151j772033p23128Q89388K799605L165017J545561
41372B76767J19207K18238L29116q45583j907548j075088J080303K592948K159953
41363B948313l00168l221195l614650l30137L221752K901798m9676r93334L06422
$$ plain form
41354 869125 335721 -3779903 -8957878 -10407615 -8489754 -7661738 -8612322 -7433086 -3168932
41345 -3168932 -12407 -169415 -498728 880927 426341 -4135607 -8006650 -5828035 -401330
41336 -401330 1351907 -1031844 -1655309 1710238 4439880 3143651 950376 1907208 4685026
41327 4685026 5475473 4058678 3178294 3697568 4037102 3698074 4109118 5840212 7519023
41318 7519023 8081287 8190463 8679560 8967972 7810649 4726229 167575 -4854694 -8780833
41309 -8780833 -10008634 -8263734 -5119742 -2544357 -1176247 -456746 11317 34654 -368683
41300 -368683 -604807 -327929 -180615 -1195599 -3436468 -5526809 -5825498 -4173303 -2210960
41291 -2210960 -1575787 -1970056 -1750647 -462561 403241 -122773 -547421 969376 3328553
$$ packed form
41354H69125n33404m115624n177975j449737J917861Q28016r50584J179236M264154
41345c168932L156525j57008l29313J379655m54586m561948l871043K178615N426705
41336d01330J753237k383751o23465L365547K729642j296229k193275R56832K777818
41327D685026P90447j416795q80384N19274L39534l39028M11044J731094J678811
41318G519023N62264J09176M89097K88412j157323l084420m558654n022269l926139
41309h780833j227801J744900L143992K575385J368110P19501M68063K3337m03337
41300c68683k36124K76878J47314j014984k240869k090341k98689J652195J962343
41291b210960O35173l94269K19409J288086Q65802n26014m24648J516797K359177
$$ plain form
41282 3328553 3518644 1028282 -1028827 -66361 2668120 4213400 3547183 1485394 -1406862
41273 -1406862 -4598651 -6510757 -6241457 -5741780 -7613337 -10998135 -12426623 -10800864
41265 -10800864 -8511257 -7114208 -5291167 -2423305 -713533 -1367318 -1717849 604208
41257 604208 3083302 1930005 -1271998 -1238486 2850346 5618276 3207930 -1447868 -3414805
41248 -3414805 -2494609 -2036091 -3143695 -3471835 -1006592 3672109 8532089 11295451 10025318
41239 10025318 4954646 -295470 -1612604 1131600 4331629 5428337 5235171 5188446
41231 5188446 4958506 4085832 3673206 4490965 5018118 3485034 777007 -778737 -745485
41222 -745485 -628953 -1168541 -1738621 -2153892 -2826758 -3140507 -2006677 -367787 -729652
$$ packed form
41282C328553J90091k490362k057109R62466K734481J545280o66217k061789k892256
41273a406862l191789j912106K69300M99677j871557l384798j428488J625759
41265a0800864K289607J397049J823041K867862J709772o53785l50531K322057
41257F04208K479094j153297l202003L3512M088832K767930k410346m655798j966937
41248c414805R20196M58518j107604l28140K465243M678701M859980K763362j270133
41239A0025318n070672n250116j317134K744204L200029J096708j93166m6725
41231E188446k29940q72674m12626Q17759N27153j533084k708027j555744L3252
41222g45485J16532n39588n70080m15271o72866l13749J133830J638890l61865
$$ plain form
41213 -729652 -3449281 -5834370 -5998112 -5207152 -4891264 -3849314 -841999 2097179 2080924
41204 2080924 -85274 -1118933 -566750 -1406973 -4939268 -8399980 -8922943 -7107895 -5019675
41195 -5019675 -3061573 -929952 258891 -670734 -2559565 -3253267 -2684223 -2348165 -2097837
41186 -2097837 28407 4338959 7997301 8099691 4968110 1376084 -623181 -1116478
41178 -1116478 -1089582 -754655 667048 3708524 7377234 9522518 8908503 6610234 4699250
41169 4699250 3783491 2727888 765232 -1195192 -1792528 -966809 71046 155434 -985540
41160 -985540 -2815106 -4479866 -5391842 -5599104 -5559931 -5639416 -6028600 -6863267 -7893928
41151 -7893928 -8272187 -7373807 -5679535 -4035616 -2271906 266169 2853527 3632345 2233093
$$ packed form
41213g29652k719629k385089j63742P90960L15888J041950L007315K939178j6255
41204B080924k166198j033659N52183q40223l532295l460712n22963J815048K088220
41195e019675J958102K131621J188843r29625j888831o93702N69044L36058K50328
41186b097837K126244M310552L658342J02390l131581l592026j999265m93297
41178a116478K6896L34927J421703L041476L668710K145284o14015k298269j910984
41169D699250r15759j055603j962656j960424n97336Q25719J037855Q4388j140974
41160i85540j829566j664760r11976k07262L9173p9485l89184q34667j030661
41151g893928l78259Q98380J694272J643919J763710K538075K587358P78818j399252
$$ plain form
41142 2233093 544348 -114693 -997220 -3485728 -5934431 -5314998 -1735165 1029930 113771
41133 113771 -3148037 -5430665 -5487979 -4740682 -4703154 -5270424 -5434814 -4643622 -3171341
41124 -3171341 -1655937 -557645 -13361 -130447 -1130249 -2772853 -3792610 -2698267 467358
41115 467358 3610926 4267949 1743345 -2360552 -5432648 -5892270 -4598941 -4088180 -5594308
41106 -5594308 -7083273 -5562806 -1359396 1713348 1109576 -1464119 -3140679 -4018428
41098 -4018428 -5894404 -8191592 -8211931 -5441049 -2808548 -2802513 -4434385 -5151411 -4127978
41089 -4127978 -2507341 -1620939 -1993852 -3077017 -3160349 -707035 3362626 5903410 5039171
41080 5039171 2329578 505711 258013 386844 -93923 -1343736 -3092276 -4328936 -3740783
$$ packed form
41142B233093j688745o59041q82527k488508k448703O19433L579833K765095r16159
41133A13771l261808k282628n7314P47297L7528n67270j64390P91192J472281
41124c171341J515404J098292N44284j17086r99802j642604j019757J094343L165625
41115D67358L143568O57023k524604m103897l072096m59622J293329N10761j506128
41106e594308j488965J520467M203410L072744o03772k573695j676560q77749
41098d018428j875976k297188k0339K770882K632501O035j631872p17026J023433
41089d127978J620637Q86402l72913j083165q3332K453314M069661K540784q64239
41080E039171k709593j823867k47698J28831m80767j249813j748540j236660N88153
$$ plain form
41071 -3740783 -1771978 -759557 -1347853 -608795 3715170 8737485 9613086 6220734 2737331
41062 2737331 921322 -1478552 -4743883 -4767623 475676 6111288 6096924 1254392 -2574242
41053 -2574242 -2729677 -1727182 -1793789 -2010656 -1589702 -2020936 -4193503 -6147503 -5642178
41044 -5642178 -3169857 -799545 574685 1379398 1853200 1736105 849429 -788980 -2767004
41035 -2767004 -3899012 -3192477 -1516751 -793954 -1028920 -58788 2750890 4679237 3252960
41026 3252960 -123389 -2305026 -2680385 -2748314 -2603654 -984456 1550031 2759674 2415794
41017 2415794 2728788 4222038 4369603 2013870 128399 1512334 3984729 3224226 -748037
41008 -748037 -3439599 -2209891 454189 802818 -1634648 -4765411 -7301944 -9615197
$$ packed form
41071c740783J968805J012421n88296P39058M323965N022315Q75601l392352l483403
41062B737331j816009k399874l265331k3740N243299N635612j4364m842532l828634
41053b574242j55435J002495o6607k16867M20954m31234k172567j954000N05325
41044e642178K472321K370312J374230Q04713M73802j17095q86676j638409j978024
41035b767004j132008P06535J675726P22797k34966R70132K809678J928347j426277
41026C252960l376349k181637l75359o7929J44660J619198K534487J209643l43880
41017B415794L12994J493250J47565k355733j885471J383935K472395p60503l972263
41008g48037k691562J229708K664080L48629k437466l130763k536533k313253
$$ plain form
41000 -9615197 -11993916 -13446054 -12308162 -7908659 -2097611 1241384 -340858 -4650073
40992 -4650073 -6700220 -4374429 -635378 704175 -491846 -1856222 -2398382 -2876208
40984 -2876208 -3295400 -2636986 -1011746 78834 -103579 -896173 -1950244 -3722719 -5778191
40975 -5778191 -6415527 -4870915 -2511895 -1030889 -727352 -1325850 -2997134 -5347162 -6646093
40966 -6646093 -5677647 -3732426 -3264846 -4781683 -6311103 -5941180 -3783216 -1188040 1043881
40957 1043881 2976110 4360076 4022174 1231770 -2376363 -3490385 -764015 3065462
40949 3065462 4212234 2471143 930998 1370408 2457361 2916956 3582862 4915671 5232391
40940 5232391 3635046 2456518 4061720 6911670 7760136 6395926 4940911 3527430
$$ packed form
41000i615197k378719j452138J137892M399503N811048L338995j582242m309215
40992d650073k050147K325791L739051J339553j196021j364376n42160m77826
40984b876208m19192O58414J625240J090580j82413p92594j054071j772475k055472
40975e778191o37336J544612K359020J481006L03537n98498j671284k350028j298931
40966f646093R68446J945221M67580j516837j529420L69923K157964K595176K231921
40957A043881J932229J383966l37902k790404l608133j114022K726370L829477
40949C065462J146772j741091j540145M39410J086953M59595O65906J332809L16720
40940E232391j597345j178528J605202K849950Q48466j364210j455015j413481
$$ plain form
40932 3527430 578466 -2849821 -3184533 297036 3860722 4506910 3580942 3508590 3902955
40923 3902955 3063264 904224 -1732247 -4399928 -5623805 -2856296 3276785 7199829
40915 7199829 4623368 -1159621 -3346775 -846170 1318582 591598 413699 3507423
40907 3507423 6713742 6117452 3827192 5116441 10391773 14447108 13670045 10203329
40899 10203329 8009267 7894073 8141857 7835804 7293137 6347122 4459239 2364271 1773659
40890 1773659 3070287 4599385 4706581 3350448 1164768 -1736684 -4811602 -6004031
40882 -6004031 -3562929 1067829 3936645 2729869 -1084618 -4721324 -7029647 -8008692
40874 -8008692 -7215938 -4681085 -2330482 -2156105 -3351314 -3541252 -2666523 -2959305 -4663103
$$ packed form
40932C527430k948964l428287l34712L481569L563686O46188r25968p2352L94365
40923C902955q39691k159040k636471k667681j223877K767509O133081L923044
40915G199829k576461n782989k187154K500605K164752p26984j77899L093724
40907C507423L206319n96290k290260J289249N275332M055335p77063l466716
40899A0203329k194062j15194K47784l06053n42667r46015j887883k094968n90612
40890A773659J296628J529098J07196j356133k185680k901452l074918j192429
40882f004031K441102M630758K868816j206776l814487l636706k308323r79045
40874h008692P92754K534853K350603J74377j195209j89938Q74729k92782j703798
$$ plain form
40865 -4663103 -4845145 -1978516 1077320 1120366 -516806 -269590 1809690 2180280 -379802
40856 -379802 -2780656 -2390267 -594570 102199 -123307 229326 855540 531792 -167495
40847 -167495 167441 791609 -294442 -2430173 -2247386 1435685 5083860 4603478 669131
40838 669131 -2004187 -374706 3381541 4450560 992640 -3400094 -3419626 1783296 7360396
40829 7360396 8571262 6277938 4619370 4643971 3778273 1342975 121187 942624 165504
40820 165504 -4241297 -7799812 -5244518 1180414 4196839 1170614 -3774509 -6913090
40812 -6913090 -8569250 -8759348 -5089547 2154727 7568455 7103471 3639233 2323258
40804 2323258 3254555 3028028 1286738 853010 2276901 2954552 1789244 657783 650365
$$ packed form
40865d663103j82042K866629L055836M3046j637172K47216K079280L70590k560082
40856c79802k400854L90389J795697O96769k25506L52633O26214l23748o99287
40847a67495L34936O24168j086051k135731J82787L683071L648175m80382l934347
40838F69131k673318J629481L756247J069019l457920m392734j9532N202922N577100
40829G360396J210866k293324j658568K4601q65698k435298j221788Q21437p77120
40820A65504m406801l558515K555294O424932L016425l026225m945123l138581
40812f913090j656160j90098L669801P244274N413728m64984l464238j315975
40804B323258R31297k26527j741290m33728J423891O77651j165308j131461p418
$$ plain form
40795 650365 447330 -717449 -1745075 -2294704 -3560386 -5249068 -5013615 -2604912 -1415353
40786 -1415353 -3396911 -5176905 -2517147 3187923 6586797 5803033 4374617 5278146
40778 5278146 6552996 4793771 648598 -1827613 -512614 2516939 4289299 4473166
40770 4473166 4530710 4805052 4297869 2894249 1805555 1368251 197773 -2447759 -4976525
40761 -4976525 -5549371 -4613661 -3676593 -2687572 -801771 1062664 1080999 -220656 -301690
40752 -301690 1410189 2542723 1554327 -162935 -1090277 -1811171 -2809559 -2691304 -912785
40743 -912785 -2657 -2175279 -5381155 -5891037 -3749138 -2305318 -2740263 -2532032 113807
40734 113807 3349088 4388098 2934603 704908 -819922 -1107952 -360540 502512 590512
$$ packed form
40795F50365k03035j164779j027626n49629j265682j688682K35453K408703J189559
40786a415353j981558j779994K659758N705070L398874p83764j428416R03529
40778E278146J274850j759225m145173k476211J314999L029553J772360J83867
40770D473166N7544K74342n07183j403620j088694m37304j170478k645532k528766
40761d976525n72846R35710R37068R89021J885801J864435J8335j301655q1034
40752c01690J711879J132534r88396j717262r27342p20894r98388J18255J778519
40743i12785R10128k172622l205876n09882K141899J443820m34945K08231K645839
40734A13807L235281J039010j453495k229695j524830k88030P47412Q63052Q8000
$$ plain form
40725 590512 240423 515447 1455986 2115952 2245961 2248337 1526172 -893555 -3727598 -3935498
40715 -3935498 -817543 2736631 4243941 4321159 3825410 1274182 -4007203 -8412783 -7437749
40706 -7437749 -1633182 4119192 6716261 6917000 5717287 2619372 -1616481 -4139147
40698 -4139147 -3777856 -2936214 -3770115 -4822774 -3703504 -1164325 80788 -687133 -1956856
40689 -1956856 -2822162 -3529977 -3758922 -2965171 -2339462 -3805402 -6665692 -7723448 -5624398
40680 -5624398 -2833588 -1962759 -2082308 -550126 2820501 5587065 6162430 5427918 4668740
40671 4668740 3619734 1451351 -1265352 -2749035 -2177546 -913437 -1004248 -2658697 -4019182
40662 -4019182 -3780272 -3065047 -3626634 -4976767 -5137660 -4064054 -3970220 -5549532 -6351046
$$ packed form
40725E90512l50089K75024R40539O59966J30009K376p22165k419727k834043k07900
40715c935498L117955L554174J507310P7218m95749k551228n281385m405580R75034
40706g437749N804567N752374K597069K00739j199713l097915m235853k522666
40698d139147L61291Q41642q33901j052659J119270K539179J245113p67921j269723
40689a956856q65306p07815k28945P93751O25709j465940k860290j057756K099050
40680e624398K790810Q70829j19549J532182L370627K766564N75365p34512p59178
40671D668740j049006k168383k716703j483683N71489J264109r0811j654449j360485
40662d019182K38910P15225n61587j350133j60893J073606R3834j579312q01514
$$ plain form
40653 -6351046 -4620003 -2562927 -3156424 -5182205 -4732409 -1223000 1544124 882964 -1470744
40644 -1470744 -2943977 -4021863 -6119960 -7674848 -5585267 -77838 4597790 4848488
40636 4848488 1353415 -2564612 -4776523 -5669806 -6438237 -7111345 -6501051 -3863368 -317142
40627 -317142 1734352 737985 -2548894 -5581248 -5775065 -2278707 3072295 6800905 6930016
40618 6930016 5030472 3936868 3744319 2087585 -1499834 -4261491 -4381614 -3628497 -3755035
40609 -3755035 -3013519 455808 3801041 2365252 -3090973 -6398843 -3967500 916446
40601 916446 3059455 1368170 -1819198 -4437195 -5400695 -3868464 -393506 2570604
40593 2570604 3466435 3708828 5042670 6326164 5442206 3337398 3226420 5892750 8370078
$$ packed form
40653f351046J731043K057076n93497k025781M49796L509409K767124o61160k353708
40644a470744j473233j077886k098097j554888K089581N507429M675628K50698
40636D848488l495073l918027k211911q93283p68431o73108O10294K637683L546226
40627c17142K051494r96367l286879l032354j93817L496358N351002L728610J29111
40618F930016j899544j093604j92549j656734l587419k761657j20123P53117j26538
40609c755035P41516L469327L345233j435789n456225l307870K431343M883946
40601I16446K143009j691285l187368k617997r63500J532231L474958K964110
40593B570604Q95831K42393J333842J283494q83958k104808j10978K666330K477328
$$ plain form
40584 8370078 7773391 4463269 868926 -1119810 -913830 1119816 3735752 5313189
40576 5313189 5078662 3616156 2043934 1037805 514716 -221951 -1755169 -3426259 -3449189
40567 -3449189 -979750 2437581 4461943 4455389 3301876 1511562 -782035 -2398937 -1881078
40558 -1881078 29774 733637 -662797 -1952519 -1101205 648740 443258 -2382705 -5664871
40549 -5664871 -7122759 -6483814 -5044331 -4023417 -3433455 -2252141 83746 2362877
40541 2362877 2612058 744446 -893493 -407152 1225685 1773219 990042 720703 2060159
40532 2060159 3992048 5075344 5074146 4306456 2573734 -221397 -3093171 -4778777 -5254829
40523 -5254829 -5277875 -4479490 -1515958 3126747 6126122 5055525 2272933 2452435 6048176
$$ packed form
40584H370078n96687l310122l594343j988736K05980K033646K615936J577437
40576E313189k34527j462506j572222j006129n23089p36667j533218j671090k2930
40567c449189K469439L417331K024362o554j153513j790314k293597j616902N17859
40558a881078J910852P03863j396434j289722Q51314J749945k05482k825963l282166
40549e664871j457888O38945J439483J020914N89962J181314K335887K279131
40541B362877K49181j867612j637939M86341J632837N47534p83177k69339J339456
40532B060159J931889J083296j198p67690j732722k795131k871774j685606m76052
40523e254829k3046P98385K963532M642705K999375j070597k782592J79502L595741
$$ plain form
40514 6048176 8184894 5447880 871136 -511387 1257454 2229973 1430929 1809246 4093078
40505 4093078 4688970 1763853 -781779 1343145 6484863 9627517 9214765 7680167
40497 7680167 6598731 5277345 3746247 3457614 4584270 5444504 4966815 3353810 420901
40488 420901 -3941537 -7594365 -7515427 -3946424 -415883 921530 1091176 976158 -256738
40479 -256738 -2179330 -2273930 -214586 447338 -2353947 -5285877 -4582460 -2318573 -3366700
40470 -3366700 -7538288 -9445577 -6212817 -1225030 749864 -1004479 -3807571 -5192848
40462 -5192848 -4529157 -2752530 -1554727 -1701678 -1773210 145983 3459235 5361409 4332223
40453 4332223 1697835 -428911 -997883 313725 3173840 5748328 5771039 3390682 1423046
$$ packed form
40514F048176K136718k737014m576744j382523J768841R72519p99044L78317K283832
40505D093078N95892k925117k545632K124924N141718L142654m12752j534598
40497G680167j081436j321386j531098k88633J126656Q60234m77689j613005k932909
40488D20901m362438l652828P8938L569003L530541J337413J69646j15018j232896
40479b56738j922592r4600K059344O61924k801285k931930P03417K263887j048127
40470c366700m171588j907289L232760M987787J974894j754343k803092j385277
40462e192848O63691J776627J197803j46951p1532J919193L313252J902174j029186
40453D332223k634388k126746n68972J311608K860115K574488K2711k380357j967636
$$ plain form
40444 1423046 2009638 4363110 6238411 6083849 3460931 -725921 -3923351 -3924953 -1823234
40435 -1823234 -859742 -1791361 -2026489 -228397 1405026 1134898 679029 1694838 2362522
40426 2362522 866210 -359997 1900100 5732032 6432310 4004042 3266278 6055980
40418 6055980 8306904 6664626 3680704 3521360 5608454 5954796 3163159 -84872
40410 -84872 -969712 499993 2453406 3351930 3013378 2498950 3060519 4610000 5482694
40401 5482694 4242755 1360610 -1378916 -2725793 -2762205 -2208568 -1389786 58961 2251407
40392 2251407 3742522 2195377 -2572270 -7172485 -8106290 -6112121 -4906413 -5908458
40384 -5908458 -6952907 -6482483 -5803304 -6012874 -5914841 -5006260 -5530631 -8690662 -11295270
$$ packed form
40444A423046N86592K353472J875301j54562k622918m186852l197430j602K101719
40435a823234R63492r31619k35128J798092J633423k70128m55869J015809O67684
40426B362522j496312j226207K260097L831932P00278k428268p37764K789702
40418F055980K250924j642278k983922j59344K087094L46342k791637l248031
40410h4872q84840J469705J953413Q98524l38552n14428N61569J549481Q72694
40401E482694j239939k882145k739526j346877l6412N53637Q18782J448747K192446
40392B251407J491115j547145m767647m600215r33805J994169J205708j002045
40384e908458j044449M70424O79179k09570R8033R08581n24371l160031k604608
$$ plain form
40375 -11295270 -9749731 -5725584 -3915374 -4956799 -4748593 -1016889 3415438 5096189
40367 5096189 4355479 3535845 3439948 3526808 3714824 3999357 3599470 2176488 837227
40358 837227 556960 789167 1011754 2241982 5118958 7585873 6822143 3154724 -108195
40349 -108195 -864151 -339298 -655554 -2068666 -3453048 -4131478 -4110477 -3361943 -1962101
40340 -1962101 -509512 484160 1409027 3075045 5504333 7681152 8423389 7242780 4683797
40331 4683797 2228941 1451685 2557275 3939424 3889123 2620677 1765793 1882873 1644902
40322 1644902 58620 -1587300 -1172341 1277081 3300991 2888037 756045 -681878
40314 -681878 -114459 1395839 1839712 681844 -383714 611419 3279281 4924495 3641675
$$ packed form
40375a1295270J545539M024147J810210j041425K08206L731704M432327J680751
40367E096189p40710q19634r5897Q6860J88016K84533l99887j422982j339261
40358H37227k80267K32207K22587J230228K876976K466915p63730l667419l262919
40349a08195p55956N24853l16256j413112j384382o78430K1001P48534J399842
40340a962101J452589R93672R24867J666018K429288K176819P42237j180609k558983
40331D683797k454856p77256J105590J382149n0301j268446q54884J17080k37971
40322A644902j586282j645920M14959K449422K023910m12954k131992j437923
40314f81878N67419J510298M43873j157868j065558R95133K667862J645214j282820
$$ plain form
40305 3641675 635046 -1317158 -1055194 363215 1689737 2648342 3214149 3254520 3078936
40296 3078936 2967739 2018616 -880452 -4555797 -5982862 -4193323 -1924002 -1940300 -3309663
40287 -3309663 -3177963 -1056337 814682 799240 -498518 -1824265 -2715022 -3157135 -3158155
40278 -3158155 -2869093 -2237486 -807437 1122424 1749278 -283691 -3513272 -4924189 -3555584
40269 -3555584 -1239648 230998 883348 1306047 1528458 1807805 2829820 4215867 4267942
40260 4267942 2240078 -304967 -1458118 -1283895 -1073594 -1119962 -570535 776897 1684766
40251 1684766 756776 -1943363 -4738248 -5760312 -4587442 -2416342 -618201 456517
40243 456517 1086187 1386635 1457310 1471043 956214 -821570 -2797585 -2196643 1374989
$$ packed form
40305C641675l006629j952204K61964J418409J326522R58605N65807M0371j75584
40296C078936j11197r49123k899068l675345j427065J789539K269321j6298j369363
40287c309663J31700K121626J871019j5442j297758j325747q90757m42113j020
40278c158155K89062O31607J430049J929861O26854k032969l229581j410917J368605
40269c555584K315936J470646O52350M22699K22411K79347J022015J386047N2075
40260D267942k027864k545045j153151J74223K10301m6368N49427J347432R07869
40251A684766r27990k700139k794885j022064J172870K171100J798141J074718
40243D56517O29670L00448P0675J3733n14829j777784j976015O00942L571632
$$ plain form
40234 1374989 3770330 1414988 -2640678 -2013137 3684608 7584339 5155513 381744
40226 381744 -766322 835180 -307243 -5356133 -9341121 -8124036 -3119637 1730622
40218 1730622 4558870 5762552 5759895 4363445 1821333 -477262 -581688 2310584 6495245
40209 6495245 9014140 8853426 7751215 7108634 5896639 3194586 909866 1378415 3475333
40200 3475333 4116312 3056511 2968586 4630127 5364368 3336741 555979 -109031 1177950
40191 1177950 2157678 1803675 809326 -302425 -1615536 -2555840 -1788085 1083345 4417695
40182 4417695 5761623 4251878 1544621 -27219 -73627 -89648 -728851 -705073 636053
40173 636053 1428915 54720 -1438726 462539 5379744 8848527 8046434 4982108 2887475
$$ packed form
40234A374989K395341k355342m055666O27541N697745L899731k428826m773769
40226C81744j148066J601502j142423n048890l984988J217085N004399M850259
40218A730622K828248J203682k657j396450k542112k298595j04426K892272M184661
40209F495245K518895j60714j102211o42581j211995k702053k284720M68549K096918
40200C475333O40979j059801q7925J661541P34241k027627k780762o65010J286981
40191A177950R79728l54003r94349j111751j313111r40304P67755K871430L334350
40182D417695J343928j509745k707257j571840m6408j6021o39203K3778J341126
40173F36053P92862j374195j493446J901265M917205L468783q02093l064326k094633
$$ plain form
40164 2887475 2014580 809967 -757512 -1312116 -408849 1246956 3234570 5336617 6578326
40155 6578326 6090628 4665117 3782178 3152682 1022962 -2580138 -4632553 -2533683 2085034
40146 2085034 4658249 2952301 -443752 -1757714 -895829 -901036 -3142960 -5546983 -6211207
40137 -6211207 -6191056 -6953156 -7325507 -5708161 -3742926 -4282112 -6204407 -5020418 653541
40128 653541 6551943 8086779 5522223 2279650 559433 521406 1616036 2487986 1234808
40119 1234808 -1998873 -4082450 -2746921 24834 971010 674663 2539638 7015424
40111 7015424 10227928 9212614 5762286 3511800 3118010 2274075 -431302 -3592511
40103 -3592511 -5011741 -4387314 -3375291 -3432816 -4232203 -4361847 -3189819 -1522659 -527490
$$ packed form
40164B887475q72895j204613j567479n54604R03267J655805J987614K102047J241709
40155F578326m87698j425511q82939o29496k129720l603100k052415K098870M618717
40146B085034K573215j705948l396053j313962Q61885n207k241924k404023o64224
40137f211207K0151p62100l72351J617346J965235n39186j922295J183989N673959
40128F53541N898402J534836k564556l242573j720217l8027J094630Q71950j253178
40119A234808l233681k083577J335529K771755R46176k96347J864975M475786
40111G015424L212504j015314l450328k250486l93790q43935k705377l161209
40103c592511j419230O24427J012023n7525p99387j29644J172028J667160R95169
$$ plain form
40094 -527490 -672073 -1881762 -3948507 -6188478 -7225653 -5975872 -2940845 -99738
40086 -99738 713035 -635846 -2591938 -3511655 -3147591 -2221539 -847008 1391703 3564001
40077 3564001 3530848 1284925 140750 2169297 4204895 1988759 -2741750 -3974992
40069 -3974992 -571012 1483546 -2045119 -7461199 -9325412 -8492633 -9039537 -10236523
40061 -10236523 -7678685 -1499485 2476211 720269 -3558131 -5542483 -4559653 -2731143
40053 -2731143 -994962 1047979 3193632 4694047 5296448 5020656 3931588 2848279
40045 2848279 2855132 3319965 2043845 -1440719 -4198957 -3072918 1345195 5378786 6494858
40036 6494858 5648236 5433242 6818618 8222315 7762324 5947808 5290518 7027748 9378813
$$ packed form
40094e27490j44583j209689k066745k239971j037175J249781L035027K841107
40086i9738Q12773j348881j956092r19717L64064R26052J374531K238711K172298
40077C564001l3153k245923j144175K028547K035598k216136m730509j233242
40069c974992L403980K054558l528665n416080j864213Q32779n46904j196986
40061a0236523K557838O179200L975696j755942m278400j984352R82830J828510
40053b731143J736181K042941K145653J500415O02401k75792j089068j083309
40045B848279O853M64833j276120l484564k758238J126039M418113M033591J116072
40036F494858q46622k14994J385376J403697m59991j814516o57290J737230K351065
$$ plain form
40027 9378813 9923778 8573383 6833973 5251007 3545607 2540808 3558594 5945016
40019 5945016 7357047 6701555 4896693 2746766 242326 -1942166 -2730627 -2868085 -4322044
40010 -4322044 -6721822 -7026782 -3958554 -287290 901203 55088 -498073 -113279 280775
40001 280775 330362 257649 -210477 -1192757 -1926279 -2136938 -2931807 -4814047 -6130062 -5209525
39991 -5209525 -2799383 -592252 1280878 3149782 3549443 835509 -3571349 -6310547
39983 -6310547 -6335748 -5499142 -4823416 -2928264 1051771 5418620 8176012 9604932 10999092
39974 10999092 11996893 10963390 7762486 4628740 3686224 4274142 3607803 269649 -3696045
39965 -3696045 -4989202 -2926015 180883 2399976 4056390 5627141 6024797 4775161
$$ packed form
40027I378813N44965j350395j739410j582966j705400j004799J017786K386422
40019E945016J412031o55492j804862k149927k504440k184492p88461j37458j453959
40010d322044k399778l04960L068228L671264J188493q46115n53161L84794L94054
40001B80775M9587p2713m68126r82280p33522k10659p94869j882240j316015R20537
39991e209525K410142K207131J873130J868904L99661k713934m406858k739198
39983f310547k5201Q36606O75726J895152L980035M366849K757392J428920J394160
39974A0999092R97801j033503l200904l133746r42516N87918o66339l338154l965694
39965c696045j293157K063187L106898K219093J656414J570751L97656j249636
$$ plain form
39957 4775161 4101208 6196953 9333599 9588322 6403172 3592386 4093743 6175917 6181636
39948 6181636 3226536 -342377 -1966024 -985995 1386331 3021446 2489176 743251
39940 743251 458002 2626804 4643941 3261653 -978952 -4015958 -3183344 -235011 1343565
39931 1343565 678164 -280445 -117674 425517 475677 827661 2487614 4606168 5487506
39922 5487506 5002331 4200356 2929501 197913 -2754393 -2457709 2146535 7250567 8646319
39913 8646319 7071845 6301827 6867069 5218231 -313586 -5952529 -6718400 -2294365 3227203
39904 3227203 6176535 6009307 4058923 1725294 -12923 -874526 -1551227 -2789884 -3961875
39895 -3961875 -3420336 -544028 3417375 6832895 9044873 9675422 7788367 3273220
$$ packed form
39957D775161o73953K095745L136646K54723l185150k810786N01357K082174N719
39948F181636k955100l568913j623647R80029K372326J635115n32270j745925
39940G43251k85249K168802K017137j382288m240605l037006Q32614K948333J578576
39931A343565o65401r58609J62771N43191N0160L51984J659953K118554Q81338
39922E487506m85175q01975j270855k731588k952306K96684M604244N104032J395752
39913H646319j574474p70018N65242j648838n531817n638943p65871M424035N521568
39904C227203K949332j67228j950384k333629j738217q61603o76701j238657j171991
39895c961875N41539K876308L961403L415520K211978O30549j887055m515147
$$ plain form
39887 3273220 -1339496 -2378063 799303 4327970 3788935 -820486 -5153636 -5345812
39879 -5345812 -1749541 2125218 3321770 1753806 -339339 -655342 1200860 3785023
39871 3785023 5792340 7294596 8371452 7541980 3438377 -2094645 -4818638 -2953772
39863 -2953772 521135 1703401 479739 -188702 1393302 4019839 5956843 7044282
39855 7044282 7982248 8765873 8602534 7100245 5281900 5244964 8142201 12151373 13364413
39846 13364413 9710515 3605459 -236177 502331 3855187 6119225 5649965 4273572
39838 4273572 5287253 9790323 14976422 16893489 15036721 12827744 12903144 13687175 12254154
39829 12254154 9175990 8018551 10283744 13348226 14261827 13778618 15063633 19059474
$$ packed form
39887C273220m612716j038567L177366L528667n39035m609421m333150j92176
39879e345812L596271L874759J196552j567964k093145l16003J856202K584163
39871C785023K007317J502256J076856q29472m103603n533022k723993J864866
39863b953772L474907J182266j223662o68441J582004K626537J937004J087439
39855G044282R37966P83625j63339j502289j818345l6936K897237M009172J213040
39846A3364413l653898o105056l841636P38508L352856K264038m69260j376393
39838D273572J013681M503070N186099J917067j856768k208977P5400P84031j433021
39829A2254154l078164j157439K265193L064482R13601m83209J285015L995841
$$ plain form
39821 19059474 22743023 22579200 18856198 15278492 14136555 13561942 10874297 7043766
39813 7043766 5190793 5408275 4568332 1732282 31843 1581926 4060951 4843700 5327605
39804 5327605 7806097 10618281 10373516 7372800 4929559 4440848 4842329 5811968 7483256
39795 7483256 7911163 5310657 2411366 3863230 9168479 13031943 13298292 13346820 15302770
39786 15302770 16412542 14771088 13491458 15418996 17986351 17801566 16958231 19625838
39778 19625838 24475971 25952551 22576221 19063418 19434584 21993865 22757940 21069020
39770 21069020 19717103 20798371 23244788 24408628 23199176 21081120 19922502 19668058
39762 19668058 19161138 18630812 19501319 21754333 23652859 24566031 25781263 27647184 28300871
$$ packed form
39821A9059474L683549j63823l723002l577706j141937n74613k687645l830531
39813G043766j852973K17482q39943k836050j700439J550083K479025P82749M83905
39804E327605K478492K812184k44765l000716k443241m88711M01481R69639J671288
39795G483256M27907k600506k899291J451864N305249L863464K66349M8528J955950
39786A5302770J109772j641454j279630J927538K567355j84785q43335K667607
39778A9625838M850133J476580l376330l512803L71166K559281P64075j688920
39770B1069020j351917J081268K446417J163840j209452k118056j158618k54444
39762A9668058n06920n30326Q70507K253014J898526R13172J215232J865921O53687
$$ plain form
39753 28300871 26594556 24140556 22971158 23231117 24622834 27671563 31502265 32744397
39745 32744397 29419548 24349299 22076553 23561287 26195685 27836901 28520717 29257344
39737 29257344 31237396 35118160 39240497 40087785 36584443 32225580 30698689 31398727
39729 31398727 31919189 32640563 35230554 38477195 39830837 39939700 41355285 43439937
39721 43439937 43028894 40021606 37909498 38428541 39956767 41792270 45570562 51125579
39713 51125579 55095251 55638036 55277534 57216016 61609222 66907801 71917789 75114599
39705 75114599 75173566 74085159 76640739 84484519 93270086 98041828 99086234 100160442
39697 100160442 103283966 107981575 113818731 120829884 128473672 136374194 145190752 155137497
$$ packed form
39753B8300871j706315k454000j169398K59959J391717L048729L830702J242132
39745C2744397l324849n070249k272746J484734K634398J641216O83816P36627
39737B9257344J980052L880764M122337Q47288l503342m358863j526891P00038
39729C1398727N20462P21374K589991L246641J353642J08863J415585K084652
39721D3439937m11043l007288k112108N19043J528226J835503L778292N555017
39713E1125579L969672N42785l60502J938482M393206N298579N009988L196810
39705G5114599N8967j088407K555580P843780Q785567M771742J044406J074208
39697A00160442L123524M697609N837156P011153P643788P900522Q816558R946745
$$ plain form
39689 155137497 164966433 174086085 184276470 197562203 213642241 230854525 248173493
39682 248173493 264984673 280947695 297715716 318465233 343607813 369258427 392296949
39675 392296949 414389912 438005725 461048265 479399021 492755067 503294967 509711182
39668 509711182 507631150 496026630 478608507 458346810 435010959 408944969 382624970
39661 382624970 356767521 329228229 300109934 273962710 253875252 236803601 218276998
39654 218276998 198882986 182136063 168194571 154235847 139873438 127647692 118427630
39647 118427630 110599723 103955790 99926932 97058257 90945356 80945159 72777868 70971489
39639 70971489 71913805 68792002 61462701 56339007 56728426 58345786 55979056 50427021
$$ packed form
39689A55137497R828936R119652J0190385J3285733J6080038J7212284J7318968
39682B48173493J6811180J5963022J6768021K0749517K5142580K5650614K3038522
39675C92296949K2092963K3615813K3042540J8350756J3356046J0539900O416215
39668E09711182k080032j1604520j7418123k0261697k3335851k6065990k6319999
39661C82624970k5857449k7539292k9118295k6147224k0087458j7071651j8526603
39654B18276998j9394012j6746923j3941492j3958724j4362409j2225746r220062
39647A18427630p827907o643933m028858k868675o112901j0000197q167291j806379
39639G0971489R42316l121803p329301n123694L89419J617360k366730n552035
$$ plain form
39631 50427021 45948257 43689734 41308740 37909700 35665926 36061102 37252339 36520333
39623 36520333 33764408 31024775 29195957 26747783 22075541 16220062 12306360 12217803
39615 12217803 14548061 16315242 16149461 15073040 14647711 15471827 17272556 19110675
39607 19110675 19371450 17005071 13262502 10931889 11327228 13236350 15183176 17078800
39599 17078800 18964782 19972987 19672056 18802463 17553955 14991182 11546115 9869713
39591 9869713 11185738 12882218 12217982 10496312 10618711 12262892 13038982 13118717 14646255
39582 14646255 17131552 17715933 16274118 16151850 18890323 21800771 21991655 19771614
39574 19771614 17058072 15317003 15812437 18703515 21093076 19433687 14870037 12509757
$$ packed form
39631E0427021m478764k258523k380994l399040k243774L95176J191237p32006
39623C6520333k755925k739633j828818k448174m672242n855479l913702q8557
39615A2217803K330258J767181j65781j076421m25329Q24116J800729J838119
39607A9110675K60775k366379l742569k330613L95339J909122J946826J895624
39599A7078800J885982J008205l00931q69593j248508k562773l445067j676402
39591I869713J316025J696480o64236j721670J22399J644181P76090P9735J527538
39582A4646255K485297N84381j441815j22268K738473K910448J90884k220041
39574A9771614k713542j741069M95434K891078K389561j659389m563650k360280
$$ plain form
39566 12509757 14196355 16092844 15138338 13466795 13801310 14706354 13804762 12016559 10901494
39557 10901494 9152120 5718683 3287227 4245769 5985180 5013096 3314172 5294761
39549 5294761 10160404 12994671 12477053 11773546 11884868 9872607 4691679 -235344 -1847557
39540 -1847557 -901075 617469 1904310 2264919 1328945 1178676 4411731 9189733 10361174
39531 10361174 6726857 2859927 2138915 2647860 2317604 3243521 7174118 10745416 9784754
39522 9784754 5679323 2987540 2585966 1537313 -1428814 -4501321 -6334516 -7230556
39514 -7230556 -6854794 -4198984 -237487 2193565 1795621 70749 -970609 -501522 1513394
39505 1513394 4293606 5928450 5166446 3404625 2826596 2904715 1339657 -1562487 -2472096
$$ packed form
39566A2509757J686598J896489r54506j671543L34515R05044r01592j788203j115065
39557A0901494j749374l433437k431456R58542J739411r72084j698924J980589
39549E294761M865643K834267n17618p03507J11322k012261n180928m927023j612213
39540a847557R46482J518544J286841L60609r35974j50269L233055M778002J171441
39531A0361174l634317l866930p21012N08945l30256R25917L930597L571298r60662
39522I784754m105431k691783m01574j048653k966127l072507j833195q96040
39514g230556L75762K655810L961497K431052l97944j724872j041358M69087K014916
39505A513394K780212J634844p62004j761821n78029P8119j565058k902144r09609
$$ plain form
39496 -2472096 281320 4429835 7304038 8908214 9855092 8990722 5706605 2654430
39488 2654430 2908968 5201285 5140338 1334893 -2540772 -2702048 34853 1954499 1204986
39479 1204986 -924171 -2557897 -3170957 -3051670 -2351972 -1143966 378093 2087697 3828361
39470 3828361 5060884 5166336 4170711 2664808 1061440 -434387 -1218777 -590196 1080355
39461 1080355 2293186 2003012 823310 473372 2387019 6499955 10449471 10446047 4846981
39452 4846981 -2774528 -6221701 -3516174 625765 692370 -2971093 -5595882 -4711677 -2454617
39443 -2454617 -1414139 -1268599 -625759 67083 -674265 -2494406 -2697263 996350 7420233
39434 7420233 11978544 10470986 3535149 -3409922 -5589167 -3562564 -1345936 -805777
$$ packed form
39496b472096K753416M148515K874203J604176R46878q64370l284117l052175
39488B654430K54538K292317o0947l805445l875665j61276K736901J919646p49513
39479A204986k129157j633726o13060J19287O99698J208006J522059J709604J740664
39470C828361J232523J05452r95625j505903j603368j495827p84390O28581J670551
39461A080355J212831k90174j179702l49938J913647M112936L949516l424n599066
39452D846981p621509l447173K705527M141939O6605l663463k624789Q84205K257060
39443b454617J040478J45540O42840O92842p41348j820141k02857L693613O423883
39434G420233M558311j507558o935837o945071k179245K026603K216628N40159
$$ plain form
39426 -805777 -72962 2565045 5633809 6463216 4666246 2200592 653120 -235559 -1309970
39417 -1309970 -2178207 -1393090 1460271 4590157 5835957 5369832 5241529 6302461 7394187
39408 7394187 7829111 8220951 7954992 4829867 -823594 -4693160 -4082441 -2164185 -2919969
39399 -2919969 -4552170 -2986021 25477 -1316858 -7154221 -10635029 -7773998 -2650399
39391 -2650399 -292357 127296 1621269 3770478 4941123 6253579 8841243 10094848
39383 10094848 7205544 2360534 127116 1249759 2953619 3831639 4364485 3906305
39375 3906305 1495452 -1013930 -842897 923876 520366 -2345787 -3563182 -742737
39367 -742737 3337016 4929425 4097601 3436300 3986599 4354434 3085784 629569 -1058533
$$ packed form
39426h05777P32815K638007L068764Q29407j796970k465654j547472q88679j074411
39417a309970q68237P85117K853361L129886J245800m66125j28303J060932J091726
39408G394187M34924L91840k65959l125125n653461l869566O10719J918256p55784
39399b919969j632201J566149L011498j342335n837363l480808K861031N123599
39391b650399K358042M19653J493973K149209J170645J312456K587664J253605
39383A0094848k889304m845010k233418J122643J703860Q78020N32846m58180
39375C906305k410853k509382J71033J766773m03510k866153j217395K820445
39367g42737M079753J592409q31824o61301N50299L67835j268650k456215j688102
$$ plain form
39358 -1058533 -738675 296459 -488770 -3265071 -5036734 -3728651 -1405357 -1353142 -3314973
39349 -3314973 -4158613 -2427559 363577 2454705 3355764 2925083 1233319 -815017 -2552601
39340 -2552601 -4560706 -6778662 -7034471 -4114334 -761854 -101383 -337024 2604421 7727132
39331 7727132 9376500 5649777 1244966 121341 220068 -1543718 -3303022 -1448400
39323 -1448400 2880456 4962806 3104572 351564 -204396 1153636 2357167 2297303 1289469
39314 1289469 149740 -547342 -793980 -854359 -508958 926270 3492167 6024702 7056398
39305 7056398 5934245 3115143 -36121 -2002377 -2570721 -3258446 -5287847 -7631733
39297 -7631733 -8385735 -7512915 -6576181 -6247420 -5921145 -5284408 -4273349 -2209676 576862
$$ packed form
39358a058533L19858J035134p85229k776301j771663J308083K323294N2215j961831
39349c314973q43640J731054K791136K091128R01059m30681j691764k048336j737584
39340b552601k008105k217956k55809K920137L352480O60471k35641K941445N122711
39331G727132J649368l726723m404811j123625R8727j763786j759304J854622
39323a448400M328856K082350j858234k753008n55960J358032J203531n9864j007834
39314A289469j139729o97082k46638o0379L45401J435228K565897K532535J031696
39305G056398j122153k819102l151264j966256n68344o87725k029401k343886
39297g631733p54002Q72820R36734L28761L26275O36737J011059K063673K786538
$$ plain form
39288 576862 1191017 -2464098 -7299879 -7965200 -4258703 -1296003 -1590734 -1845159 542933
39279 542933 2727957 1412482 -1439385 -1809183 373783 2262099 2784627 2616974 1467573
39270 1467573 -889739 -2428810 -1240503 1146375 1911429 1004012 91931 -733855 -1785175
39261 -1785175 -1154600 2701233 7104104 8067148 6078797 4761273 4677041 3184564 114606
39252 114606 -1403943 -289163 969884 957126 995237 1134179 -791179 -4313290 -5134469
39243 -5134469 -1449779 2391558 1658709 -2339199 -4712024 -3485061 -662751 1337826
39235 1337826 1618429 632168 255582 2473031 6147021 7108958 3599919 -541768 -765338
39226 -765338 2012340 3119174 682293 -2555433 -3181732 -229351 4954601 9496427
$$ packed form
39288E76862O14155l655115m835781o65321L706497K962700k94731k54425K388092
39279E42933K185024j315475k851867l69798K182966J888316N22528j67653j149401
39270A467573k357312j539071J188307K386878P65054r07417r12081q25786j051320
39261a785175O30575L855833M402871R63044j988351j317524q4232j492477l069958
39252A14606j518549J114780J259047j2758L8111J38942j925358l522111q21179
39243e134469L684690L841337p32849l997908k372825J226963K822310K000577
39235A337826K80603r86261l76586K217449L673990R61937l509039m141687k23570
39226g65338K777678J106834k436881l237726o26299K952381N183952M541826
$$ plain form
39218 9496427 10339170 7183436 3535765 2843285 4607871 6364633 7688067 9100836
39210 9100836 8755108 4612541 -702919 -2074191 568845 1644110 -1737246 -5525081
39202 -5525081 -5336201 -2995534 -2764971 -4340017 -4179393 -1980129 -1078317 -2748520 -4319341
39193 -4319341 -3616304 -1821166 -688119 307047 2326438 4532486 4921399 3046254 747864
39184 747864 427067 2834364 6018378 6711818 3927085 938438 1937223 6544809 9767211
39175 9767211 8219692 4216562 2129261 2645058 3029780 1908225 886104 1359921 2248217
39166 2248217 1861802 374275 -735134 -786000 -476840 -819816 -2102284 -3617020 -4178776
39157 -4178776 -3305251 -1949750 -1488465 -1994726 -2366265 -2258089 -2712466 -4297295 -5770258
$$ packed form
39218I496427Q42743l155734l647671o92480J764586J756762J323434J412769
39210I100836l45728m142567n315460j371272K643036J075265l381356l787835
39202e525081J88880K340667K30563j575046J60624K199264R01812j670203j570821
39193d319341P03037J795138J133047R95166K019391K206048L88913j875145k298390
39184G47864l20797K407297L184014O93440k784733k988647R98785M607586L222402
39175I767211j547519m003130k087301N15797L84722j121555j022121M73817Q88296
39166B248217l86415j487527j109409n0866L09160l42976j282468j514736n61756
39157d178776Q73525J355501M61285n06261l71539J08176m54377j584829j472963
$$ plain form
39148 -5770258 -5674884 -4476195 -3762068 -3744487 -3213818 -2209433 -2921169 -6559184 -10392131
39139 -10392131 -10033541 -5018328 -278897 -741878 -5545142 -9399475 -9199496 -6998403
39131 -6998403 -5916981 -5529272 -3238453 1175272 4840986 5404160 3285649 138295
39123 138295 -3022131 -5442833 -6058232 -4579178 -2334496 -901710 -242319 988498 3388435
39114 3388435 5619193 5464305 2169388 -2268086 -4750377 -4563249 -4436402 -6960988 -10597877
39105 -10597877 -11080355 -6742427 -398459 4606180 8045516 11196996 13431785 12627774
39097 12627774 8438116 3334350 205018 -147444 870556 1296053 306091 -1453644
39089 -1453644 -3183930 -5021884 -6897059 -6947591 -3247822 2494841 5482215 3585919
$$ packed form
39148e770258R5374J198689P14127J7581N30669J004385p11736l638015l832947
39139a0392131L58590N015213M739431m62981m803264l854333J99979K201093
39131f998403J081422L87709K290819M413725L665714N63174k118511l147354
39123A38295l160426k420702o15399J479054K244682J432786O59391J230817K399937
39114C388435K230758j54888l294917m437474k482291J87128J26847k524586l636889
39105a0597877m82478M337928O343968N004639L439336L151480K234789q04011
39097A2627774m189658n103766l129332l52462J018000M25497r89962j759735
39089a453644j730286j837954j875175n0532L699769N742663K987374j896296
$$ plain form
39081 3585919 457059 719430 3764031 5161659 3292933 1244106 1796007 3519510
39073 3519510 3246376 468301 -2440322 -3492360 -3121518 -3007705 -3665993 -3643001 -1377901
39064 -1377901 2251066 4227439 2944850 440499 -257226 749736 627032 -1858961
39056 -1858961 -4499403 -4776035 -3161429 -2178824 -3139451 -4864280 -5236955 -3404232 -704840
39047 -704840 381816 -1316244 -4167412 -5337889 -4019872 -2260986 -2232406 -3438842 -3309326
39038 -3309326 -293355 4088388 6366242 4453033 76489 -2479992 -657202 3568323
39030 3568323 5790398 3885730 -111079 -2618554 -1995576 658357 3166088 4209275
39022 4209275 4085760 3921204 4096972 3794361 2515514 1438820 2169161 4344903 5789273
$$ packed form
39081C585919l128860K62371L044601J397628j868726k048827N51901J723503
39073C519510k73134k778075k908623j052038L70842J13813o58288K2992K265100
39064a377901L628967J976373j282589k504351o97725J006962j22704k485993
39056a858961k640442k76632J614606R82605r60627j724829l72675J832723K699392
39047g04840J086656j698060k851168j170477J318017J758886K8580j206436J29516
39038c309326L015971M381743K277854j913209m376544k556481J822790M225525
39030C568323K222075j904668l996809k507475O22978K653933K507731J043187
39022D209275j23515j64556J75768l02611j278847j076694P30341K175742J444370
$$ plain form
39013 5789273 5322195 4255067 4493528 6097591 7569000 7945965 7609642 7169939 6529694
39004 6529694 5414547 4155211 3219282 2217108 303434 -2208417 -3624822 -2970302
38996 -2970302 -1418170 -546622 16791 1666242 4085816 5322199 4391214 1909602 -1565673
38987 -1565673 -5398830 -7272923 -4990682 -480777 1529911 40754 -902589 786933
38979 786933 1523046 -1328305 -3733394 -1114478 3348414 3026611 -1545877 -3479538 -585774
38970 -585774 1591819 -850406 -4387663 -4350590 -1538389 720590 1692940 2040072 1174972
38961 1174972 -840803 -1831166 -941373 -587250 -2178130 -3162832 -1550544 -34445 -1673637
38952 -1673637 -4398962 -4344974 -2383215 -2428574 -4723173 -5894735 -5059330 -4771663 -5645411
$$ packed form
39013E789273m67078j067128K38461J604063J471409L76965l36323m39703o40245
39004F529694j115147j259336r35929j002174j913674k511851j416405O54520
38996b970302J552132Q71548N63413J649451K419574J236383r30985k481612l475275
38987a565673l833157j874093K282241M509905K010688j489157r43343J689522
38979G86933P36113k851351k405089K618916M462892l21803m572488j933661K893764
38970e85774K177593k442225l537257L7073K812201K258979R72350L47132q65100
38961A174972k015775r90363Q89793L54123j590880r84702J612288J516099j639192
38952a673637k725325N3988J961759m5359k294599j171562Q35405K87667q73748
$$ plain form
38943 -5645411 -4935320 -1737221 675179 -282751 -2665882 -3345157 -2614194 -2882601 -4453414
38934 -4453414 -5231546 -3996043 -1745260 309059 2324270 4561051 5548435 3050118
38926 3050118 -2708707 -7971598 -9033539 -6515057 -4361669 -4513776 -4701965 -2426595
38918 -2426595 1010504 2241784 226878 -2945285 -4776904 -4281131 -1978433 430885
38910 430885 933543 -921417 -3434169 -4830259 -5015879 -4576225 -3519387 -2059438 -947716
38901 -947716 220237 2995608 6773564 7909732 4498698 -289729 -2586937 -3285294
38893 -3285294 -5472845 -8456340 -9055096 -7815839 -8663923 -12070126 -13680772 -11098083
38885 -11098083 -7366443 -5628102 -4544043 -1881675 967706 1659578 1431462 2938171
$$ packed form
38943e645411P10091L198099K412400r57930k383131o79275P30963k68407j570813
38934d453414p78132J235503K250783K054319K015211K236781R87384k498317
38926C050118n758825n262891j061941K518482K153388j52107j88189K275370
38918b426595L437099J231280k014906l172163j831619M95773K302698K409318
38910D30885N02658j854960k512752j396090j85620M39654J056838J459949J111722
38901i47716J167953K775371L777956J136168l411034m788427k297208o98357
38893c285294k187551k983495n98756J239257q48084l406203j610646K582689
38885a1098083L731640J738341J084059K662368K849381O91872k28116J506709
$$ plain form
38877 2938171 5103353 4380479 938768 -471027 2838607 7013175 6251755 455134
38869 455134 -4394487 -3605567 773952 3202322 1728099 -504713 -393376 1210529 1579482
38860 1579482 -154592 -2731989 -4427899 -3660967 8368 3876679 3570561 -1054750
38852 -1054750 -4021850 -601723 5671587 7635171 4397608 1304425 761681 -642355
38844 -642355 -4724600 -7618490 -6181006 -3572098 -4384552 -7639234 -8800150 -6425828
38836 -6425828 -2861065 45026 2126561 2846104 1596215 -331069 -996345 -781968 -1644492
38827 -1644492 -3808182 -5580892 -5972453 -5074314 -2513031 1496945 3938374 1507764
38819 1507764 -3925980 -6053737 -2215015 2381835 1410579 -3878075 -6449402 -3041644
$$ packed form
38877B938171K165182p22874l441711j409795L309634M174568p61420n796621
38869D55134m849621P88920M379519K428370j474223k232812J11337J603905L68953
38860A579482j734074k577397j695910P66932L669335L868311l06118m625311
38852a054750k967100L420127O273310J963584l237563l093183n42744j404036
38844f42355m082245k893890J437484K608908q12454l254682j160916K374322
38836f425828L564763K906091K081535P19543j249889j927284o65276K14377q62524
38827a644492k163690j772710l91561Q98139K561283M009976K441429k430610
38819A507764n433744k127757L838722M596850r71256n288654k571327L407758
$$ plain form
38811 -3041644 2149797 3942540 2470531 957955 295747 -814302 -1975653 -1194754
38803 -1194754 1244909 2303361 222315 -3496353 -6545402 -7624615 -5686149 -907063
38795 -907063 2872075 983176 -4890075 -6817317 -962393 6444688 7502164 2903206
38787 2903206 -1355060 -3717604 -6712413 -9319153 -7639736 -2824051 -677062 -2449431
38779 -2449431 -3171845 -668141 1044026 -129516 -78972 3749018 6756558 4329389 -651785
38770 -651785 -2689297 -1733595 -1010096 -465185 1962795 5181435 6419767 5967871 5811711
38761 5811711 5511246 3894131 2745803 4121083 5892417 4792241 2168017 1735633
38753 1735633 3137980 3033035 1487834 1704543 3731116 3923716 1067761 -1891742 -2880266
$$ packed form
38811c041644N191441J792743j472009j512576o62208j110049j161351P80899
38803a194754K439663J058452k081046l718668l049049j079213J938466M779086
38795i07063L779138j888899n873251j927242N854924P407081J057476m598958
38787B903206m258266k362544k994809k606740J679417M815685K146989j772369
38779b449431p22414K503704J712167j173542N0544L827990L007540k427169m981174
38770f51785k037512R55702P23499N44911K427980L218640J238332m51896j56160
38761E811711l00465j617115j148328J375280J771334j100176k624224m32384
38753A735633J402347j04945j545201K16709K026573J92600k855955k959503r88524
$$ plain form
38744 -2880266 -2976384 -2987594 -2025029 -383940 21980 -1060200 -1969875 -2486785 -3758187
38735 -3758187 -4818937 -3469547 -990933 -1256381 -4159870 -4839478 -1244439 2257768
38727 2257768 1464033 -1592174 -2399759 -668538 133334 -2058097 -6023701 -9159151 -9253122
38718 -9253122 -5820791 -1293995 578965 -1178053 -3773262 -4569181 -4015642 -3764783 -4114985
38709 -4114985 -4530414 -4653561 -3757726 -1253644 1499010 2285645 1577162 2023762 3600030
38700 3600030 2948700 -723942 -2978254 -219377 4768335 6775546 5194641 3475289
38692 3475289 3372307 3546453 3009383 2415933 1976056 888916 -832772 -1981026 -1838985
38683 -1838985 -866337 223377 950981 897312 -36385 -1450846 -2920972 -3999413 -3790860
$$ packed form
38744b880266r6118j1210R62565J641089M05920j082180r09675n16910j271402
38735c758187j060750J349390K478614k65448k903489o79608L595039L502207
38727B257768p93735l056207q07585J731221Q01872k191431l965604l135450r3971
38718i253122L432331M526796J872960j757018k595209p95919N53539K50859l50202
38709d114985m15429j23147Q95835K504082K752654P86635p08483M46600J576268
38700C600030o51330l672642k254312K758877M987712K007211j580905j719352
38692C475289j02982J74146n37070n93450m39877j087140j721688j148254J42041
38683a838985R72648J089714P27604n3669r33697j414461j470126j078441K08553
$$ plain form
38674 -3790860 -1935883 -86889 -451033 -2541627 -3662254 -3053247 -2709045 -3228501 -2260455
38665 -2260455 1158582 4026604 3561666 1093068 -736008 -1718088 -2231115 -823941 2690517
38656 2690517 4589064 2084244 -1350146 -267496 4620542 7569413 6242080 3934669
38648 3934669 3436574 3745668 3743607 4469460 6090285 6406058 4236821 1384067 -224051
38639 -224051 -668070 -252079 1489946 3755184 4399592 3452501 3885684 7030839 9801348
38630 9801348 8637321 4134659 -417672 -3333666 -5104604 -6040370 -5712644 -4285616
38622 -4285616 -2737765 -1892133 -1937801 -2335161 -1941957 -448727 128543 -2640070 -7451543
38613 -7451543 -9329368 -5466153 771670 3591080 1266244 -2883173 -4834915 -3219963
$$ packed form
38674c790860J854977J848994l64144k090594j120627O09007L44202n19456R68046
38665b260455L419037K868022m64938k468598j829076r82080n13027J407174L514458
38656B690517J898547k504820l434390J082650M888038K948871j327333k307411
38648C934669m98095L09094k061P25853J620825L15773k169237k852754j608118
38639b24051m44019M15991J742025K265238O44408r47091M33183L145155K770509
38630I801348j164027m502662m552331k915994j770938r35766L27726J427028
38622d285616J547851Q45632m5668l97360L93204J493230N77270k768613m811473
38613g451543j877825L863215O237823K819410k324836m149417j951742J614952
$$ plain form
38605 -3219963 855143 5224286 7869191 8106018 6875418 5564261 5030708 5729280 7251662
38596 7251662 7350571 3667820 -2269737 -5106648 -1825762 4147019 7538510 7918901 8382039
38587 8382039 9166297 7247842 2272530 -1834702 -2604065 -2338622 -3622978 -5124197 -4669779
38578 -4669779 -3416340 -3396386 -3216134 -349663 3520697 3839677 -203704 -4399578 -5459768
38569 -5459768 -4487080 -3407757 -1762605 775584 1927581 -139535 -3443569 -4884807
38561 -4884807 -4723929 -5357650 -6942712 -7599681 -7225419 -7483659 -8014482 -6365001 -2588866
38552 -2588866 -463802 -2300929 -5188983 -4710140 -745510 2632826 2221518 -1106574
38544 -1106574 -3927059 -3960857 -2412924 -2695234 -6044720 -8947842 -6978280 -1161521 2380339
$$ packed form
38605c219963M075106M369143K644905K36827j230600j311157n33553O98572J522382
38596G251662R8909l682751n937557k836911L280886N972781L391491L80391M63138
38587H382039P84258j918455m975312m107232p69363K65443j284356j501219M54418
38578d669779J253439J9954J80252K866471L870360L18980m043381m195874j060190
38569e459768R72688J079323J645152K538189J151997k067116l304034j441238
38561d884807J60878o33721j585062o56969L74262k58240n30823J649481L776135
38552b588866K125064j837127k888054M78843L964630L378336m11308l328092
38544a106574k820485l3798J547933k82310l349486k903122J969562N816759L541860
$$ plain form
38535 2380339 163787 -4198241 -5146679 -2167671 864042 1220599 -624435 -2882514
38527 -2882514 -3536061 -894971 3934851 6270410 2770583 -3595430 -6730886 -4971938
38519 -4971938 -1982310 -459488 932909 3591700 5795522 5224958 1896124 -2872371
38511 -2872371 -7873572 -11061183 -9938121 -4854012 149044 1561738 -264862 -3260445
38503 -3260445 -6691568 -10190089 -12046168 -11024074 -8397281 -6008941 -3845085 -1673519
38495 -1673519 -1164013 -3416040 -5869278 -5185293 -2441077 -1746176 -3810271 -4853347 -2762838
38486 -2762838 -409438 -816085 -2365804 -1846526 69811 119778 -1758972 -1816947 1802178
38477 1802178 6057707 7269878 5860072 4602183 3893976 1733531 -2022883 -4389605
$$ packed form
38535B380339k216552m362028r48438K979008L031713L56557j845034k258079
38527b882514o53547K641090M829822K335559l499827o366013l135456J758948
38519d971938K989628J522822J392397K658791K203822n70564l328834m768495
38511b872371n001201l187611J123062N084109N003056J412694j826600k995583
38503c260445l431123l498521j856079J022094K626793K388340K163856K171566
38495a673519N09506k252027k453238O83985K744216O94901k064095j043076K090509
38486b762838K353400m06647j549719N19278J916337M9967j878750n7975L619125
38477A802178M255529J212171j409806j257889p08207k160445l756414k366722
$$ plain form
38469 -4389605 -3160940 80160 2257867 2566250 2372587 2543332 2722248 2661618 2461493
38460 2461493 1750434 349264 -396883 1139598 4061079 5353002 3838118 1911515
38452 1911515 2142179 3679750 3703407 1461518 -1070393 -2307855 -2893576 -3799695 -4106331
38443 -4106331 -2172539 1329682 3194028 1436721 -1620343 -1633596 2351522 6515761
38435 6515761 7096395 4840177 2936104 1950236 -459384 -5037624 -9001756 -9581294 -7474159
38426 -7474159 -5546378 -5453981 -6585818 -7171692 -5499464 -1199443 3634999 5596100 3319407
38417 3319407 -942442 -3771630 -3777727 -1835825 558939 2148657 2208680 1213653 533808
38408 533808 561495 -55432 -2431691 -5633093 -7851441 -8438642 -7667837 -5537237 -2357044
$$ packed form
38469d389605J228665L241100K177707L08383j93663J70745J78916o0630k00125
38460B461493p11059j401170p46147J536481K921481J291923j514884j926603
38452A911515K30664J537571K3657k241889k531911j237462n85721r06119l06636
38443d106331J933792L502221J864346j757307l057064j3253L985118M164239
38435F515761N80634k256218j904073r85868k409620m578240l964132n79538K107135
38426g474159J927781R2397j131837n85874J672228M300021M834442J961101k276693
38417C319407m261849k829188o097J941902K394764J589718O0023r95027o79845
38408E33808K7687o16927k376259l201402k218348n87201P70805K130600L180193
$$ plain form
38399 -2357044 165410 144440 -2209006 -4668579 -5291859 -3913068 -1793751 -622822 -1348237
38390 -1348237 -3155811 -4160424 -3794599 -3550027 -4434494 -5023228 -3638134 -1366017 -840735
38381 -840735 -2586770 -4633702 -5465471 -5291452 -4538405 -3311820 -2564959 -3557780 -5574072
38372 -5574072 -6295201 -5250294 -4776395 -6371750 -8166105 -7769797 -5953290 -5282308 -6181390
38363 -6181390 -6811638 -6425641 -6235491 -6525253 -5327428 -1326305 3563673 6213980 5954087
38354 5954087 4560708 3192734 1329414 -1190512 -3175602 -3985586 -4654718 -5789491
38346 -5789491 -5930835 -3967045 -2011890 -3256910 -7209926 -9783647 -8630561 -5837542
38338 -5837542 -4309459 -4014125 -3549241 -3173904 -3751563 -4138409 -2463706 571199 2304773
$$ packed form
38399b357044K522454k0970k353446k459573o23280J378791K119317J170929p25415
38390a348237j807574j004613L65825K44572q84467n88734J385094K272117N25282
38381h40735j746035k046932q31769J74019P53047J226585P46861r92821k016292
38372e574072p21129J044907M73899j595355j794355L96308J816507O70982q99082
38363f181390o30248L85997J90150k89762J197825M001123M889978K650307k59893
38354E954087j393379j367974j863320k519926j985090q09984o69132j134773
38346e789491j41344J963790J955155j245020l953016k573721J153086K793019
38338e837542J528083K95334M64884L75337n77659l86846J674703L034905J733574
$$ plain form
38329 2304773 1912802 1149674 1115295 748569 -735867 -2169665 -2430386 -2314575 -2892418
38320 -2892418 -3394293 -2570021 -1325227 -1963082 -4794017 -7272009 -7139402 -5143297 -3666277
38311 -3666277 -3588911 -3880897 -3892662 -4248326 -4923462 -4167899 -835808 3331330 5673942
38302 5673942 6211298 6948101 7812572 6326632 2306648 -191334 1998994 6196647 6977082
38293 6977082 3115171 -1487606 -3313259 -2725336 -1755806 -1138166 -544486 156482 1034034
38284 1034034 2352223 3975385 5331975 6134840 6225457 5011436 2474527 350390 338801
38275 338801 1303984 694283 -1043711 -503044 3079091 5452227 3089022 -1142557 -1448180
38266 -1448180 2934215 6838575 6210664 2662350 -2693 -904713 -1773994 -3486501 -5394750
$$ packed form
38329B304773l91971p63128l4379l66726j484436j433798k60721J15811n77843
38320b892418n01875Q24272J244794o37855k830935k477992J32607J996105J477020
38311c666277P7366k91986j1765l55664o75136P55563L332091M167138K342612
38302E673942N37356P36803Q64471j485940m019984k497982K190328M197653P80435
38293F977082l861911m602777j825653N87923R69530O17640N93680P00968Q77552
38284A034034J318189J623162J356590Q02865R0617j214021k536909k124137j1589
38275C38801R65183o09701j737994N40667L582135K373136k363205m231579l05623
38266a448180M382395L904360o27911l548314k665043r02020q69281j712507j908249
$$ plain form
38257 -5394750 -7298396 -9608316 -11353905 -10160570 -5323930 317216 2888813 1492132
38249 1492132 -1104081 -1484153 1236045 4692682 5101570 609016 -6169209 -9816154
38241 -9816154 -7795010 -3717687 -3019263 -6014082 -7939071 -5860196 -2214571 -429592
38233 -429592 -352688 -102718 448635 749370 1644296 3261671 3012202 -637422 -4184338
38224 -4184338 -3144300 1085403 3147854 1995813 1878673 4387658 5181009 1101862
38216 1101862 -4210478 -5351707 -2343632 848044 2286057 2743628 2423473 1017709
38208 1017709 39409 1396068 3930858 4518812 2558586 557620 100337 -92394 -1488737
38199 -1488737 -3347197 -3915322 -2631465 -501694 834409 377953 -1016091 -1169270 493021
$$ packed form
38257e394750j903646k309920j745589J193335M836640N641146K571597j396681
38249A492132k596213l80072K720198L456637M08888m492554o778225l646945
38241i816154K021144M077323O98424k994819j924989K078875L645625J784979
38233d29592P6904K49970N51353L00735Q94926J617375k49469l649624l546916
38224d184338J040038M229703K062451j152041j17140K508985P93351m079147
38216A101862n312340j141229L008075L191676J438013M57571l20155j405764
38208A017709r78300J356659K534790N87954j960226k000966m57283j92731j396343
38199a488737j858460n68125J283857K129771J336103m56456j394044j53179J662291
$$ plain form
38190 493021 1377755 -985637 -4684229 -5097402 -1182011 2578336 1811091 -2253218 -4822971
38181 -4822971 -3768744 -1625452 -1737288 -4413994 -7408168 -8750422 -8137684 -6370244
38173 -6370244 -4662147 -4301672 -5740618 -7708058 -8350505 -7814869 -8374656 -10806367 -12066840
38164 -12066840 -8927902 -3363491 -1296848 -5144488 -10279547 -10686772 -6160257 -1636495
38156 -1636495 -649342 -1999901 -2612017 -1352236 620483 1921189 2526779 3569668 5582979
38147 5582979 7022040 5538256 1331289 -2034504 -1551030 1296181 2105206 -1272771
38139 -1272771 -6586197 -10017877 -9786152 -6947651 -3949637 -2687901 -3125028 -3652978 -3347833
38130 -3347833 -3480796 -5840032 -9839846 -12521113 -11634701 -7892213 -3973672 -1959870
$$ packed form
38190D93021Q84734k363392l698592m13173L915391L760347p67245m064309k569753
38181d822971J054227K143292j11836k676706k994174j342254O12738J767440
38173f370244J708097L60475j438946j967440o42447N35636n59787k431711j260473
38164a2066840L138938N564411K066643l847640n135059m07225M526515M523762
38156a636495R87153j350559o12116J259781J972719J300706O05590J042889K013311
38147E582979J439061j483784m206967l365793M83474K847211Q09025l377977
38139a272771n313426l431680K31725K838501K998014J261736m37127n27950L05145
38130c347833j32963k359236l999814k681267Q86412L742488L918541K013802
$$ plain form
38122 -1959870 -1934066 -2634900 -3128239 -3608327 -4347575 -4472592 -3012490 -1001543 -702576
38113 -702576 -2166759 -2563862 -213664 2567652 2487697 -342695 -3192058 -4697511 -5632050
38104 -5632050 -6417128 -6525511 -6352012 -7336902 -9798522 -12383989 -13971314 -14641392 -14671013
38095 -14671013 -14007481 -12767015 -10913777 -7656981 -2686528 2180323 4197344 2595991
38087 2595991 -791670 -3310659 -2843360 1154802 5910517 6130755 -317735 -8280312
38079 -8280312 -10299508 -5537929 -264237 501395 -2169012 -5084544 -7136299 -7735199
38071 -7735199 -5339240 -438259 3194274 3139826 1509903 795218 -387971 -3907594 -7251719
38062 -7251719 -6515586 -2634505 -107106 -321888 -677347 -147159 -903483 -3354303 -4039806
$$ packed form
38122a959870K5804p00834m93339m80088p39248j25017J460102K010947K98967
38113g02576j464183l97103K350198K781316p9955k830392k849363j505453r34539
38104e632050p85078j08383J73499r84890k461620k585467j587325o70078k9621
38095a4671013O63532J240466J853238L256796M970453M866851K017021j601353
38087B595991l387661k518989M67299L998162M755715K20238o448490p962577
38079h280312k019196M761579N273692P65632k670407k915532k051755n98900
38071g735199K395959M900981L632533n4448j629923p14685j183189l519623l344125
38062g251719P36133L881081K527399k14782l55459N30188p56324k450820o85503
$$ plain form
38053 -4039806 -811452 3197818 3609052 634273 -1941490 -2217953 -1724389 -2012775 -2518564
38044 -2518564 -2407182 -2363481 -3135965 -3544537 -1775106 1459798 2801671 210374 -4082048
38035 -4082048 -6052940 -4818424 -3286427 -3773438 -5059483 -4892796 -3573769 -3024472 -3280736
38026 -3280736 -2333104 418950 2661523 2062613 -630739 -2545751 -2102411 -396353 673909
38017 673909 604593 108133 -585973 -2127415 -4493702 -6090963 -5430208 -3254606 -1834874
38008 -1834874 -2196371 -3102069 -2820018 -848273 2086911 4472610 4428992 1333382 -2562715
37999 -2562715 -3849339 -2011020 -81253 -377134 -1499932 -1018810 668952 1205735 -201862
37990 -201862 -2231216 -3637846 -4009350 -2929471 -450314 1813933 1918164 -37520 -2158098
$$ packed form
38053d039806L228354M009270M11234k974779k575763k76463M93564k88386n05789
38044b518564J11382M3701p72484m08572J769431L234904J341873k591297m292422
38035d082048j970892J234516J531997m87011j286045J66687J319027N49297k56264
38026c280736R47632K752054K242573n98910k693352j915012M43340J706058J070262
38017F73909o9316m96460o94106j541442k366287j597261O60755K175602J419732
38008a834874l61497r05698K82051J971745K935184K385699m3618l095610l896097
37999b562715j286624J838319J929767k95881j122798M81122J687762N36783j407597
37990b01862k029354j406630l71504J079879K479157K264247J04231j955684k120578
$$ plain form
37981 -2158098 -3179147 -3268797 -2756261 -1626888 -186931 1039117 1786129 1358371 -1554085
37972 -1554085 -6598540 -10281213 -9276347 -4888379 -1664476 -1601517 -2452963 -2078409 -1386361
37963 -1386361 -1748354 -2246984 -1437698 60984 721905 582738 845190 1925222 3287881
37954 3287881 4397103 4749319 3964700 2868230 3237995 5206563 6163807 3826356 -578398
37945 -578398 -3786022 -4279333 -2986948 -1153164 444867 716470 -1037381 -3581387 -4886693
37936 -4886693 -5032359 -6031100 -8322940 -9487451 -7500090 -3607008 -558747 806759
37928 806759 1627204 2421884 2223876 396550 -1932934 -2673842 -527565 3887156 8016911
37919 8016911 8892582 5824464 1541800 -565626 -398966 -799907 -2882581 -3899213 -1436960
$$ packed form
37981b158098j021049q9650N12536J129373J439957J226048P47012m27758k912456
37972a554085n044455l682673J004866M387968L223903O2959q51446L74554O92048
37963a386361l61993m98630Q09286J498682O60921j39167K62452J080032J362659
37954C287881J109222L52216p84619j096470L69765J968568R57244k337451m404754
37945e78398l207624m93311J292385J833784J598031K71603j753851k544006j305306
37936d886693j45666r98741k291840j164511J987361L893082L048261J365506
37928H06759Q20445P94680j98008j827326k329484p40908K146277M414721M129755
37919H016911Q75671l068118m282664k107426J66660m00941k082674j016632K462253
$$ plain form
37910 -1436960 2054921 1770939 -2961419 -7716422 -8921873 -7827742 -7273794 -7331823 -6499087
37901 -6499087 -5137428 -4746231 -4924843 -4090190 -2759607 -3088842 -5041340 -6009401 -4875717
37892 -4875717 -3546152 -3338850 -2771693 -797100 441005 -1149116 -3457192 -2574261 1382521
37883 1382521 4147441 3276105 1245606 1413708 3254268 3585292 1299682 -1249415 -1529686
37874 -1529686 42282 854834 -750896 -3798030 -6021596 -6288633 -5281697 -4112278
37866 -4112278 -3117368 -2353056 -2420114 -3771225 -5441373 -5613105 -3797181 -1622203 -889446
37857 -889446 -1417055 -1508993 -229620 1596873 2676356 2816180 2886150 3638377 4906830
37848 4906830 5730759 5074267 2814537 331137 -372948 1283109 3666605 4845302 4786669
$$ packed form
37910a436960L491881k83982m732358m755003j205451J094131N53948n8029Q32736
37901f499087J361659L91197j78612Q34653J330583l29235j952498r68061J133684
37892d875717J329565K07302N67157J974593J238105j590121k308076Q82931L956782
37883A382521K764920q71336k030499J68102J840560L31024k285610k549097k80271
37874a529686J571968Q12552j605730l047134k223566k67037J006936J169419
37866d112278R94910P64312o7058j351111j670148j71732J815924K174978P32757
37857h89446n27609r1938J279373J826493J079483J39824O9970P52227J268453
37848D906830Q23929o56492k259730k483400p04085J656057K383496J178697n8633
$$ plain form
37839 4786669 4575857 3915925 1243452 -3316419 -7060522 -7918193 -6944211 -6069690 -4840458
37830 -4840458 -1629082 2726111 5084700 3935019 1042972 -1144238 -1798382 -1063615
37822 -1063615 724776 2269736 1630801 -1485598 -5103545 -7493395 -8790902 -9330018
37814 -9330018 -8380066 -5939023 -3807420 -2945674 -1485119 2319018 6661231 8519517
37806 8519517 8336330 9069731 10945261 10828258 7558927 4437350 4607399 6649088 7009532
37797 7009532 4852081 2046296 -248930 -2301175 -3787896 -3729095 -2522418 -1827976 -2039229
37788 -2039229 -1813079 -667774 -130864 -1348138 -3271940 -4539145 -5615741 -7252860
37780 -7252860 -7931105 -5265463 106679 4253631 4253184 1181948 -1923246 -3568773 -4195307
$$ packed form
37839D786669k10812o59932k672473m559871l744103q57671R73982Q74521J229232
37830d840458L211376M355193K358589j149681k892047k187210o54144P34767
37822a063615J788391J544960o38935l116399l617947k389850j297507n39116
37814i330018R49952K441043K131603Q61746J460555L804137M342213J858286
37806H519517j83187P33401J875530j17003l269331l121577J70049K041689L60444
37797G009532k157451k805785k295226k052245j486721N8801J206677O94442k11253
37788b039229K26150J145305N36910j217274j923802j267205j076596j637119
37780g252860o78245K665642N372142M146952m47l071236l105194j645527o26534
$$ plain form
37771 -4195307 -4399204 -4341671 -4326759 -4539618 -4390871 -3168453 -1139034 867095 2584467
37762 2584467 4066850 4775165 4085410 2429086 849020 -186944 -461147 608239 2419682
37753 2419682 1822305 -3878269 -12248283 -16889330 -14455003 -8235029 -3489148 -1649610
37745 -1649610 -1080741 -1247157 -3019118 -5780950 -7261614 -6492015 -4898283 -4082244 -3938128
37736 -3938128 -3263972 -1304915 1322278 2682248 1100513 -2612557 -5502294 -5945098
37728 -5945098 -5437337 -5648747 -5474692 -3197627 -37688 1312964 707609 6986 -716534
37719 -716534 -2791919 -4924167 -3701692 913914 4527301 4471589 3462572 4758979 6923781
37710 6923781 6557976 3857833 1932736 1984801 2469669 2271582 1709985 789734 -842925
$$ packed form
37771d195307k03897N7533J4912k12859J48747J222418K029419K006129J717372
37762B584467J482383P08315o89755j656324j580066j035964k74203J069386J811443
37753B419682n97377n700574q370014m641047K434327O219974M745881J839538
37745a649610N68869j66416j771961k761832j480664P69599J593732Q16039J44116
37736c938128O74156J959057K627193J359970j581735l713070k889737m42804
37728e945098N07761k11410J74055K277065L159939J350652o05355p00623p23520
37719g16534k075385k132248J222475M615606L613387n5712j009017J296407K164802
37710F923781l65805k700143j925097N2065M84868j98087n61597r20251j632659
$$ plain form
37701 -842925 -2394512 -2825161 -3070555 -4896397 -7551075 -8119617 -5637919 -2519849 -1181296
37692 -1181296 -1295332 -1275247 -674920 -22530 387728 502862 177239 -601990 -1948946
37683 -1948946 -4547532 -8573751 -12159818 -12781891 -10613469 -8498886 -7766846 -6218411
37675 -6218411 -1751159 3949248 7412463 7722676 6583694 5044622 2910449 1268868
37667 1268868 2621205 7207388 11184621 10316699 4673546 -1840391 -6113192 -8229594
37659 -8229594 -9130449 -8005732 -3864557 1190322 2878389 -167397 -4180039 -4795905
37651 -4795905 -2374316 -560654 -620511 -363304 1262310 2042915 364906 -1901612 -2668311
37642 -2668311 -3248378 -5768447 -8798745 -8992505 -6174181 -3435120 -2557255 -2698915 -3582867
$$ packed form
37701h42925j551587m30649k45394j825842k654678n68542K481698L118070J338553
37692a181296j14036K0085O00327O52390M10258J15134l25623p79229j346956
37683a948946k598586m026219l586067o22073K168422K114583P32040J548435
37675f218411M467252N700407L463215L10213j138982j539072k134173j641581
37667A268868J352337M586183L977233q67922n643153o513937m272801k116402
37659h229594r00855J124717M141175N054879J688067l045786m012642o15866
37651d795905K421589J813662n9857K57207J625614P80605j678009k266518p66699
37642b668311n80067k520069l030298j93760K818324K739061Q77865j41660q83952
$$ plain form
37633 -3582867 -6261160 -9789041 -10629053 -7197404 -2446255 -139065 -706575 -2352493
37625 -2352493 -3887291 -4500597 -3047075 -98551 1113129 -1455246 -5206134 -5999215
37617 -5999215 -3598713 -1289938 -1032698 -1975944 -3114123 -4156906 -3915272 -1187578 2255039
37608 2255039 2662430 -820979 -4945856 -6861097 -7086377 -6935086 -5926298 -3606530 -1507377
37599 -1507377 -1046968 -1177317 -167899 1630671 2648811 2517093 1968421 1486789 1509246
37590 1509246 2623749 4111628 3913745 1728476 285548 1404244 2740021 1240164
37582 1240164 -1931848 -3411269 -3287731 -4577884 -7390191 -8132439 -5442650 -2678259
37574 -2678259 -2551759 -2892914 -516035 3377142 4901177 3064710 527041 -592360
$$ packed form
37633c582867k678293l527881q40012L431649M751149K307190n67510j645918
37625b352493j534798o13306J453522K948524J211680k568375l750888p93081
37617e999215K400502K308775K57240r43246j138179j042783K41634K727694L442617
37608B255039M07391l483409m124877j915241k25280J51291J008788K319768K099153
37599a507377M60409j30349J009418J798570J018140j31718n48672m81632K2457
37590A509246J114503J487879j97883k185269j442928J118696J335777j499857
37582A240164l172012j479421J23538j290153k812307p42248K689789K764391
37574b678259J26500l41155K376879L893177J524035j836467k537669j119401
$$ plain form
37566 -592360 -880423 -1504566 -2193551 -2118220 -1512785 -1642722 -3519373 -6745640 -9415676
37557 -9415676 -9538483 -7023709 -3902410 -2205061 -2122293 -2620432 -3098521 -3710364 -4599643
37548 -4599643 -5604793 -6472803 -6875179 -6484541 -5311958 -3618950 -1501295 787601 2273729
37539 2273729 2152984 1174819 621616 -105071 -2680686 -6072575 -6396411 -2383451 1645758
37530 1645758 1215284 -1831104 -2041129 1403286 3507209 1097888 -2508214 -2513011 792338
37521 792338 3280496 2988060 1939830 2636738 5216203 8212782 10254649 10470614 8458026
37512 8458026 4620458 180167 -3449871 -5305671 -5227634 -3984714 -2889355 -2974301 -4525807
37503 -4525807 -7159218 -9765395 -10617174 -8730317 -5518895 -3998251 -5635534 -8823730
$$ packed form
37566e92360k88063o24143o88985P5331O05435j29937j876651l226267k670036
37557i415676j22807K514774L121299J697349Q2768m98139m78089o11843q89279
37548d599643j005150q68010m02376L90638J172583J693008K117655K288896J486128
37539B273729j20745r78165n53203p26687k575615l391889l23836M012960M029209
37530A645758m30474l046388k10025L444415K103923k409321l606102m797L305349
37521G92338K488158k92436j048230O96908K579465K996579K041867K15965k012588
37512H458026l837568m440291l630038j855800P8037J242920J095359q4946j551506
37503d525807k633411k606177q51779J886857L211422J520644j637283l188196
$$ plain form
37495 -8823730 -11026153 -11328913 -10100673 -7527088 -4011322 -1112179 -311947 -1183784 -2184803
37486 -2184803 -2777924 -3251107 -3092506 -1650214 -173559 -791422 -3100838 -4171494 -2799272
37477 -2799272 -1467753 -2765005 -5889956 -8337703 -9208072 -8922118 -7357842 -4676235
37469 -4676235 -2744422 -3023844 -3748794 -2008169 1593766 3185734 800352 -3402698
37461 -3402698 -6702829 -8943641 -10932237 -12065906 -11237917 -8650216 -5516853 -3238190
37453 -3238190 -3378988 -6322841 -9100172 -7381410 -1468192 2533745 279040 -4615773
37445 -4615773 -5587467 -2349478 -435387 -2380599 -4760706 -4912504 -5224076 -7880885 -9690620
37436 -9690620 -6577470 -869296 761117 -3665726 -8606259 -8201576 -3109870 1676818
$$ packed form
37495h823730k202423l02760J228240K573585L515766K899143Q00232q71837j001019
37486b184803n93121m73183J58601J442292J476655o17863k309416j070656J372222
37477b799272J331519j297252l124951k447747q70369K85954J564276K681607
37469d676235J931813k79422p24950J740625L601935J591968k385382m203050
37461c402698l300131k240812j988596j133669Q27989K587701L133363K278663
37453c238190j40798k943853k777331J718762N913218M001937k254705m894813
37445d615773r71694L237989J914091j945212k380107j51798l11572k656809j809735
37436i690620L113150N708174J630413m426843m940533M04683N091706M786688
$$ plain form
37428 1676818 3528131 4044564 5113235 5994388 5246821 3531185 2535205 1957126 -69721
37419 -69721 -3339151 -4892935 -3299023 -1261078 -1554204 -2221804 640662 6078164 8514209
37410 8514209 5634049 1946163 2262459 5032001 5435030 2717525 443008 446496 650497
37401 650497 -624935 -1650740 -178784 2848966 4295926 2518436 -1241928 -4567021
37393 -4567021 -5991153 -5731862 -5061739 -5055788 -5724212 -6221659 -5689711 -3900652 -1562255
37384 -1562255 -110464 -431115 -1433462 -894413 1554653 3345104 2006379 -1609340
37376 -1609340 -4517499 -5265918 -4734610 -3766072 -2073520 169159 1451698 630512 -1372137
37367 -1372137 -2363868 -1121019 1352759 2644835 1326019 -1219511 -2158729 -975351
$$ packed form
37428A676818J851313N16433J068671Q81153p47567j715636r95980n78079k026847
37419f9721l269430j553784J593912K037945k93126o67600K862466N437502K436045
37410H514209k880160l687886L16296K769542M03029k717505k274517L488K04001
37401F50497j275432j025805J471956L027750J446960j777490l760364l325093
37393d567021j424132K59291O70123N951o68424m97447N31948J789059K338397
37384a562255J451791l20651j002347N39049K449066J790451j338725l615719
37376a609340k908159p48419N31308R68538J692552K242679J282539q21186k002649
37367a372137r91731J242849K473778J292076j318816k545530r39218J183378
$$ plain form
37359 -975351 -602467 -3474473 -7695234 -9222234 -7120624 -4165433 -2390360 -761297
37351 -761297 2063995 5089022 6395349 5608977 3830734 2303847 1902098 2705452 3451329
37342 3451329 2638881 594406 -965925 -1595276 -2349465 -2980893 -1477717 2413080 5721847
37333 5721847 6079359 4757485 3852391 2705393 -140333 -3294127 -4194778 -3418596 -3904119
37324 -3904119 -6233162 -7966255 -7785727 -7124197 -7131443 -7042116 -6443896 -6243554 -6134400 -4058112
37314 -4058112 -132610 1528368 -2347517 -9237477 -13508970 -12968497 -9942130 -6618223
37306 -6618223 -2697984 1865019 4974598 5076108 3892739 4422376 6873821 8228780
37298 8228780 5841436 497601 -4206209 -5006805 -1573254 3524572 7216042 8160745
$$ packed form
37359i75351L72884k872006m220761j527000K101610K955191J775073J629063
37351g61297K825292L025027J306327p86372j778243j526887m01749Q03354P45877
37342C451329q12448k044475j560331o29351p54189o31428J503176L890797L308767
37333E721847L57512j321874r05094j146998k845726l153794r00651P76182m85523
37324c904119k329043j733093J80528O61530p246Q9327N98220K00342J09154K076288
37314d058112L925502J660978l875885o889960m271493N40473L026367L323907
37306f618223L920239M563003L109579J01510j183369N29637K451445J354959
37298H228780k387344n343835m703810q00596L433551N097826L691470R44703
$$ plain form
37290 8160745 6533565 2525147 -3342146 -8469393 -9166153 -4976656 -300714 596739
37282 596739 -957846 -418891 2816430 4423949 2082688 -682149 -85953 1879462 892437
37273 892437 -2371898 -3196982 -626002 808384 -1438661 -3279954 12839 6217480
37265 6217480 8630306 5025211 269901 -475002 1938247 2789650 82266 -3350283
37257 -3350283 -4205862 -3167515 -3530847 -6058408 -7363619 -4505386 395134 2268729
37249 2268729 -715737 -5396351 -8128443 -8554419 -8091930 -7170340 -5640567 -4076522 -2781119
37240 -2781119 -891851 1719742 3051605 1566841 -1010658 -1898130 -1397646 -2165582 -4685202
37231 -4685202 -6291365 -5114047 -2517759 -779734 -361709 -458595 -540726 -253145 831927
$$ packed form
37290H160745j627180m008418n867293n127247o96760M189497M675942Q97453
37282E96739j554585N38955L235321J607519k341261k764837N96196J965415r87025
37273H92437l264335q25084K570980J434386k247045j841293L292793O204641
37265F217480K412826l605095m755310p44903K413249Q51403k707384l432549
37257c350283q55579J038347l63332k527561j305211K858233M900520J873595
37249B268729k984466m680614k732092m25976M62489R21590J529773J564045J295403
37240b781119J889268K611593J331863j484764k577499q87472N00484p67936k519620
37231d685202j606163J177318K596288J738025M18025r6886q2131K87581J085072
$$ plain form
37222 831927 2212841 2235282 -51514 -3454468 -5787794 -5935463 -4391507 -2468204 -1304108
37213 -1304108 -932854 -173332 1705337 3285042 2302142 -1195327 -4607517 -6197419 -7015296
37204 -7015296 -8563499 -10350940 -11117053 -10832727 -9759871 -7094849 -2924127 -399295
37196 -399295 -2861156 -8765908 -12491800 -11154006 -7970927 -7226957 -8284761 -7318514 -3615834
37187 -3615834 -701681 -918148 -2044565 -963169 1540269 2113510 -37523 -2038266
37179 -2038266 -1562292 99047 205541 -1724052 -3726779 -4150768 -3388596 -3107961 -4497609
37170 -4497609 -7041269 -8591908 -7174272 -3285889 75093 253328 -2583461 -6091152
37162 -6091152 -8053071 -7543176 -4904535 -1628461 506191 1204471 1871109 3197490 3723506
$$ packed form
37222H31927J380914K2441k286796l402954k333326j47669J543956J923303J164096
37213a304108L71254P59522J878669J579705r82900l497469l412190j589902q17877
37204g015296j548203j787441p66113K84326J072856K665022M170722K524832
37196c99295k461861n904752l725892J337794L183079P43970j057804R66247L702680
37187c615834K914153k16467j126417J081396K503438N73241k151033k000743
37179b038266M75974J661339J06494j929593k002727m23989P62172K80635j389648
37170d497609k543660j550639J417636L888383L360982J78235k836789l507691
37162f091152j961919N09895K638641L276074K134652O98280O66638J326381N26016
$$ plain form
37153 3723506 2230214 322627 456618 2087552 2272417 36146 -2344528 -2831320 -2052193
37144 -2052193 -1470121 -1370152 -1896641 -4116672 -8307217 -12409054 -13832064 -12142951 -8857751
37135 -8857751 -5417808 -2557678 -881603 -633551 -1129350 -1430466 -1422756 -1568617 -1979394
37126 -1979394 -2434680 -2944670 -3588401 -4075553 -4097228 -3933996 -4240940 -5321928 -6804404
37117 -6804404 -7812029 -7438574 -5467864 -2708712 -345686 844824 428269 -1618785
37109 -1618785 -3853192 -3524655 281100 4216233 3756383 -1140217 -5740717 -6331174 -3953563
37100 -3953563 -1653857 -585813 -277466 -508757 -990392 -713532 651534 1903188 2128927
37091 2128927 1981805 2028910 1593855 518433 35962 339055 -426736 -2743203 -3759101
$$ packed form
37153C723506j493292j907587J33991J630934J84865k236271k380674m86792P79127
37144b052193N82072R9969n26489k220031m190545m101837j423010J689113L285200
37135h857751L439943K860130J676075K48052m95799l01116P710j45861m10777
37126a979394m55286n09990o43731m87152k1675J63232l06944j080988j482476
37117f804404j007625L73455J970710K759152K363026J190510m16555k047054
37109a618785k234407L28537L805755L935133m59850m896600m600500n90457K377611
37100c953563K299706J068044L08347k31291m81635K76860J365066J251654K25739
37091B128927j47122M7105m35055j075422m82471L03093p65791k316467j015898
$$ [...]
##END NTUPLES=NMR SPECTRUM
##END=
