##TITLE=31Pdec_LR-678-RM3
 , 24 sc
 26.6.2019
##JCAMPDX= 6.0         $$ Bruker NMR JCAMP-DX V2.0
##DATA TYPE= NMR SPECTRUM
##DATA CLASS= NTUPLES
##ORIGIN= UXNMR, Bruker Analytische Messtechnik GmbH
##OWNER= root
$$ XWIN-NMR		Version 3.5
$$ Wed Jun 26 16:31:55 2019 Russian Standard Time (UT+4h)  she@DPX200
##.OBSERVE FREQUENCY= 81.013821
##.OBSERVE NUCLEUS= ^31P
##.ACQUISITION MODE= SIMULTANEOUS
##.ACQUISITION SCHEME= undefined
##.AVERAGES= 24
##.DIGITISER RES= 17
##SPECTROMETER/DATA SYSTEM= spect
##.PULSE SEQUENCE= zgpg30
##.SOLVENT NAME= CDCl3
##.SHIFT REFERENCE= (INTERNAL, CDCl3, 0, 182.463)
##AUDIT TRAIL= $$ (NUMBER, WHEN, WHO, WHERE, WHAT)
$$ ##TITLE= Audit trail, XWIN-NMR		Version 3.5
$$ ##JCAMPDX= 5.01
$$ ##ORIGIN= Bruker BioSpin GmbH
$$ ##OWNER= she
$$ F:/spectra/data/she/nmr/P31/1/pdata/1/auditp.txt
$$ ##AUDIT TRAIL=  $$ (NUMBER, WHEN, WHO, WHERE, WHAT)
(   1,<2019-06-26 16:30:27.29 +0400>,<she>,<DPX200>,
      <created by zg, POWCHK disabled, PULCHK disabled
       configuration hash MD5:
       00 E9 B6 7A A2 85 ED C7 34 08 36 98 17 FE 4E 26
       data hash MD5: 32K
       3C 4D 86 85 AC 50 39 11 12 3A 25 A4 17 5D 03 92>)
(   2,<2019-06-26 16:31:03.56 +0400>,<she>,<DPX200>,
      <Start of raw data processing
       efp BC_mod = 2 LB = 1 FT_mod = 6 PKNL = 1 PHC0 = -2600.042 PHC1 = 209.1996 SI = 64K 
       data hash MD5: 64K
       27 93 81 12 7A A3 13 EA A7 E8 B7 36 F8 61 AD C6>)
(   3,<2019-06-26 16:31:17.76 +0400>,<she>,<DPX200>,
      <pk PHC0 = 4.654463 PHC1 = -9.999998 
       data hash MD5: 64K
       4D 65 36 D8 29 01 35 87 01 74 F8 53 70 0C DD BA>)
(   4,<2019-06-26 16:31:20.81 +0400>,<she>,<DPX200>,
      <abs ABSG = 5 
       data hash MD5: 64K
       B7 B6 36 9E 8D B7 79 2F 29 CA 06 86 1F 86 75 81>)
$$ ##END=
$$ 
$$ hash MD5
$$ A5 2B 5E 6B 4C 43 CB 16 DE 47 51 6A 33 0D B1 C4
##$RELAX= 
##$RELAX= 
##$RELAX= 
##$RELAX= 
##$RELAX= 
##$RELAX= 
##$RELAX= 
##$RELAX= 
$$ Bruker specific parameters
$$ --------------------------
##$DU= <F:/spectra>
##$EXPNO= 1
##$NAME= <P31>
##$PROCNO= 1
##$TYPE= <nmr>
##$USER= <she>
##$AMP= (0..31)
100 100 100 100 100 100 100 100 100 100 100 100 100 100 100 100 100 100 
100 100 100 100 100 100 100 100 100 100 100 100 100 100 
##$AQSEQ= 0
##$AQ_mod= 1
##$AUNM= <au_zg>
##$AUTOPOS= <>
##$BF1= 81.014009
##$BF2= 200.13
##$BF3= 200.13
##$BF4= 200.13
##$BF5= 200.13
##$BF6= 200.13
##$BF7= 200.13
##$BF8= 200.13
##$BYTORDA= 1
##$CFDGTYP= 0
##$CFRGTYP= 5
##$CHEMSTR= <none>
##$CNST= (0..31)
1 1 145 1 1 1 1 1 1 1 1 1 1 1 1 1 1 1 1 1 1 1 1 1 1 1 1 1 1 1 1 1 
##$CPDPRG= <waltz16>
##$CPDPRG1= <>
##$CPDPRG2= <waltz16>
##$CPDPRG3= <>
##$CPDPRG4= <mlev>
##$CPDPRG5= <mlev>
##$CPDPRG6= <mlev>
##$CPDPRG7= <mlev>
##$CPDPRG8= <mlev>
##$CPDPRGB= <>
##$CPDPRGT= <>
##$D= (0..31)
0 1 0 0 0 0 0 0 0 0 0 0.03 2e-05 3e-06 0 0 0 0 0 0 0 0 0 0 0 0 0 0 0 0 
0 0 
##$DATE= 1561552226
##$DBL= (0..7)
120 120 120 11 120 120 24 19 
##$DBP= (0..7)
150 150 150 150 150 150 150 150 
##$DBP07= 0
##$DBPNAM0= <>
##$DBPNAM1= <>
##$DBPNAM2= <>
$$ [...]
##$SUBNAM3= <"">
##$SUBNAM4= <"">
##$SUBNAM5= <"">
##$SUBNAM6= <"">
##$SUBNAM7= <"">
##$SUBNAM8= <"">
##$SUBNAM9= <"">
##$SW= 369.568048894756
##$SWIBOX= (0..15)
0 1 3 0 0 0 0 0 0 0 0 0 0 0 0 0 
##$SW_h= 29940.119760479
##$TD= 32768
##$TD0= 1
##$TE= 0
##$TE2= 300
##$TE3= 300
##$TEG= 300
##$TL= (0..7)
0 120 53 12 22 120 120 120 
##$TP= (0..7)
150 150 150 150 150 150 150 150 
##$TP07= 0
##$TPNAME0= <>
##$TPNAME1= <>
##$TPNAME2= <>
##$TPNAME3= <>
##$TPNAME4= <>
##$TPNAME5= <>
##$TPNAME6= <>
##$TPNAME7= <>
##$TPOAL= (0..7)
0.5 0.5 0.5 0.5 0.5 0.5 0.5 0.5 
##$TPOFFS= (0..7)
0 0 0 0 0 0 0 0 
##$TUNHIN= 0
##$TUNHOUT= 0
##$TUNXOUT= 0
##$USERA1= <user>
##$USERA2= <user>
##$USERA3= <user>
##$USERA4= <user>
##$USERA5= <user>
##$V9= 5
##$VALIST= <valist>
##$VCLIST= <CCCCCCCCCCCCCCC>
##$VD= 0
##$VDLIST= <DDDDDDDDDDDDDDD>
##$VPLIST= <PPPPPPPPPPPPPPP>
##$VTLIST= <TTTTTTTTTTTTTTT>
##$WBST= 1024
##$WBSW= 4
##$XGAIN= (0..3)
0 0 0 0 
##$XL= 0
##$YL= 0
##$YMAX_a= 99867
##$YMIN_a= -131878
##$ZGOPTNS= <>
##$ZL1= 120
##$ZL2= 120
##$ZL3= 120
##$ZL4= 120
##$ABSF1= 182.463
##$ABSF2= -187.1042
##$ABSG= 5
##$ABSL= 3
##$ALPHA= 0
##$AQORDER= 0
##$ASSFAC= 0
##$ASSFACI= 0
##$ASSFACX= 0
##$ASSWID= 0
##$AUNMP= <proc_1d>
##$AZFE= 0.1
##$AZFW= 0.5
##$BCFW= 0
##$BC_mod= 2
##$BYTORDP= 0
##$COROFFS= 0
##$CY= -3
##$DATMOD= 1
##$DC= 0
##$DFILT= <>
##$DTYPP= 0
##$F1P= 0
##$F2P= 0
##$FCOR= 1
##$FTSIZE= 65536
##$FT_mod= 6
##$GAMMA= 0
##$GB= 0
##$INTBC= 1
##$INTSCL= 5.30512e-09
##$ISEN= 30
##$LB= 1
##$LEV0= 0
##$LPBIN= 0
##$MAXI= 10000
##$MC2= 0
##$MEAN= 0
##$ME_mod= 0
##$MI= 50
##$NCOEF= 0
##$NC_proc= -5
##$NLEV= 6
##$NOISF1= 182.463
##$NOISF2= 159.3651
##$NSP= 0
##$NTH_PI= 0
##$NZP= 0
##$OFFSET= 182.463
##$PC= 4
##$PHC0= -2595.387
##$PHC1= 199.1996
##$PH_mod= 1
##$PKNL= yes
##$PPARMOD= 0
##$PSCAL= 0
##$PSIGN= 0
##$REVERSE= no
##$SF= 81.0140089999434
##$SI= 65536
##$SIGF1= 159.3651
##$SIGF2= -187.1042
##$SINO= 113.3802
##$SIOLD= 16384
##$SREGLST= <1H.CDCl3>
##$SSB= 0
##$STSI= 65536
##$STSR= 0
##$SW_p= 29940.119760479
##$SYMM= 0
##$S_DEV= 0
##$TDeff= 32768
##$TDoff= 0
##$TI= <>
##$TILT= no
##$TM1= 0
##$TM2= 0
##$TOPLEV= 0
##$USERP1= <user>
##$USERP2= <user>
##$USERP3= <user>
##$USERP4= <user>
##$USERP5= <user>
##$WDW= 1
##$XDIM= 65536
##$YMAX_p= 351958183
##$YMIN_p= -18259678
$$ End of Bruker specific parameters
$$ ---------------------------------
##NTUPLES= NMR SPECTRUM
##VAR_NAME=  FREQUENCY,     SPECTRUM/REAL,   SPECTRUM/IMAG
##SYMBOL=    X,             R,               I
##VAR_TYPE=  INDEPENDENT,   DEPENDENT,       DEPENDENT
##VAR_FORM=  AFFN,          ASDF,            ASDF
##VAR_DIM=   65536,         65536,           65536
##UNITS=     HZ,            ARBITRARY UNITS, ARBITRARY UNITS
##FACTOR=    0.456856943014862, 1,           1
##FIRST=     14782.0589164792, 0,            0
##LAST=      -15158.0608439998, 0,           0
##MIN=       -15158.0608439998, -18259678,   0
##MAX=       14782.0589164792, 351958183,    0
$$ Real data points
##PAGE= N=1
##DATA TABLE= (X++(R..R)), XYDATA
$$ [...]
45716A627523j55164j4581M32393N39256M40n19277l66326O5342j2471n34893
45706A062242p50389l66077J96248N39207O20221M25368n1660m98459n11433j80173
45696D85095K8799k7035o5413L6530J07310J75040M97427R39411R22589L04097
45686C403850k14292J6821O60876Q30751K40451n32814q53561o88986m22747l17977
45676B122372l18310k50208o6600J44719L26080M90602N51880K91724l10607q43624
45666B138028q41597l81364l5733j93449o45208q78173n79853J59750R25122J228506
45656H96029Q94665K35992k71836m06480j71630L73324R26931Q86756L7407q59164
45646B541994q19388L8937O25155L88162q6764k18444l12204p81437j196581q56099
$$ plain form
45716 1627523 1472359 1457778 1890171 2429427 2429867 1910590 1544264 1609606 1597135 1062242
45706 1062242 311853 -54224 142024 681231 1301452 1726820 1675160 1176701 665268 485095
45696 485095 513894 486859 421446 457976 565286 740326 1237753 2177164 3099753 3403850
45686 3403850 3189558 3206379 3867255 4698006 4938457 4405643 3552082 2863096 2440349 2122372
45676 2122372 1804062 1553854 1487254 1631973 1958053 2448655 3000535 3292259 2981652 2138028
45666 2138028 1296431 915067 879334 685885 40677 -837496 -1417349 -1257599 -332477 896029
45656 896029 1790694 2026686 1754850 1348370 1176740 1550064 2476995 3363751 3401158 2541994
45646 2541994 1722606 1761543 2386698 2774860 2688096 2469652 2157448 1376011 179430 -676669
45636f76669Q2716P59365P40149M17721L22755M78932N06984J50376l54667m65826
45626A961836k8950L75051J59618l64628m38341r7149j00627n43213n82096R6130
45616D37631O23976L73762j2013J79175M64929J00370n45757o42131k42175J07064
45606H44831M29640Q47522P58300j88507r64196n15038L59414J97354n64667k50703
45596I53950J058092J466855M34315l45709Q4098L69838n98275j594268j078612
45587G50284L02097R42381P45275O11848M62502l79757j442037j514070n40202
45578f1679L99143P79316R20598Q03633N3595q89347r60758m9071P58880P28626
45568B482936K45082j71035n60239q82096o38595L04383J187085J204263M95207
$$ plain form
45636 -676669 -593953 165412 905561 1323282 1646037 2124969 2631953 2782329 2427662 1961836
45626 1961836 1932886 2307937 2467555 2102927 1664586 1567437 1466810 923597 341501 437631
45616 437631 1061607 1435369 1423356 1602531 2067460 2167830 1622073 979942 737767 844831
45606 844831 1274471 2121993 2880293 2691786 1727590 1212552 1571966 1769320 1204653 953950
45596 953950 2012042 3478897 3913212 3567503 3651601 4021439 3423164 1828896 750284
45587 750284 1052381 1994762 2740037 3351885 3814387 3434630 1992593 478523 -61679
45578 -61679 337464 1116780 2037378 2841011 2894606 2005259 1044501 995430 1754310 2482936
45568 2482936 2728018 2556983 1996744 1114648 476053 780436 1967521 3171784 3666991
45559C666991j11207p9465L65615N76550J53020o26176j077988r04358m82496
45550A480486k24185m1589K45990M32071L12398J37618J61745J54298r2119k43178
45540B323535l9679J03133j31894j84928M22446R31003L90683n52887m08470P34402
45530C587344J145958J07763r40204n77250N90726J031068M25151k97179m45877
45521D627500j59396J75347L72006M56448O24661R81947J175172P46995M624j39845
45511H865459N03140R94355O76908K39885O64916J714459K310365K039197J448992
45502A9457676J069819R47897J086081J585902K230421K509530K236889J714183
45494C2838398J143258K87450j038400k420218l107571k803957k019522j563998
$$ plain form
45559 3666991 3555784 3476319 3841934 4418484 4571504 3945328 2867340 1962982 1480486
45550 1480486 1256301 1214712 1460702 1892773 2205171 2342789 2504534 2658832 2566713 2323535
45540 2323535 2283856 2386989 2255095 2070167 2492613 3423616 3814299 3261412 2852942 3587344
45530 3587344 4733302 4841065 3900861 3323611 3914337 4945405 5370556 5073377 4627500
45521 4627500 4468104 4643451 5015457 5471905 6096566 7078513 8253685 9000680 9005304 8865459
45511 8865459 9368599 10362954 11039862 11279747 11944663 13659122 15969487 18008684 19457676
45502 19457676 20527495 21475392 22561473 24147375 26377796 28887326 31124215 32838398
45494 32838398 33981656 34269106 33230706 30810488 27702917 24898960 22879438 21315440
45486B1315440j738449k119355k147071j768208j363267j188601j146645j067384
45478H776460r48618q57398p72566n95192k52899J67729L64215P1873n29848r02614
45468D521142p78363m19595j26159R0256J44832k13784p58340p11729J13068P90507
45458B651835O15182J94960K71655K94951m79336j194653m82358R93211J095555
45449C961002n36295j810927j280766r018M73289K85137J83353N1181k84784j05253
45439I26919Q90004J466653N46292r34664j336987o50206k0716K49220N89728
45430A726243O85146j14109j210215j279457k94957M63987L66953j6751k55663
45421G1177m95636n38613O9349Q92077R30443K67929R332L80912L80206l11105
$$ plain form
45486 21315440 19576991 17457636 15310565 13542357 12179090 10990489 9843844 8776460
45478 8776460 7827842 6970444 6197878 5602686 5349787 5517516 5881731 5953604 5423756 4521142
45468 4521142 3742779 3323184 3197025 3287281 3432113 3218329 2459989 1748260 1861328 2651835
45458 2651835 3267017 3461977 3733632 4028583 3549247 2354594 1872236 2865447 3961002
45449 3961002 3424707 1613780 333014 323996 797285 1082422 1265775 1316956 1032172 926919
45439 926919 1816923 3283576 3829868 2895204 1558217 908011 887295 1136515 1726243
45430 1726243 2411389 2297280 1087065 -192392 -487349 -23362 343591 326840 71177
45421 71177 -424459 -963072 -893723 -1646 928797 1196726 1206058 1586970 1967176 1656071
45411A656071o19310M8471O59983K23688n80683n29522K53926O63419L20026j20177
45401A975892j09394J71954K66539k7470n22381p61470m40606J59079M64363L83682
45391A560188L15156L39305P6743m52187n83047l8288M67173K05488m89661p23978
45381F76892k69633K85390M30955K82277K50412M70375O34822L78523j61601l83936
45371B594476m8237K44483j28370p86830q17469j16412N12605N89073M76093N56615
45361C076027O63680N41039K17069k33810o93592p48829j60627M38238J84329
45352C283524o62350r79868m64068L9099J4521j19588j41684m32706q17263l77887
45342f58270R23671J756346J310210M09218l9635l18319o85691m21405O31912
$$ plain form
45411 1656071 1036761 1085232 1745215 1968903 1388220 858698 1112624 1776043 2096069 1975892
45401 1975892 1866498 2038452 2304991 2277521 1755140 993670 553064 712143 1176506 1560188
45391 1560188 1875344 2214649 2291392 1839205 1256158 1217870 1685043 1890531 1400870 676892
45381 676892 407259 692649 1123604 1405881 1656293 2126668 2761490 3140013 2978412 2594476
45371 2594476 2546239 2790722 2662352 1875522 1058053 941641 1454246 2043319 2519412 3076027
45361 3076027 3739707 4280746 4497815 4264005 3570413 2821584 2660957 3099195 3283524
45352 3283524 2621174 1641306 1177238 1216337 1230858 1111270 969586 536880 -280383 -658270
45342 -658270 265401 2021747 3331957 3741175 3701540 3383221 2697530 2276125 2908037
45333B908037J029829j59058j457905j031568M17740Q28414M6624k97634K68822
45324B553301N29392m9054n47382m33735k55983j93034K53388P60645K35670j111285
45314A741923j572217n31143N09460L62123j07450K06758P02837L56352l28583
45305A340060k16485N24090Q91870P75164P47596O68417l4921r63753j049669
45296B682369k41428L59375J84602q3238K34562P77593Q15444L01211k29094m44217
45286D357179m82424n41447m91760l0967P74297J300078J014022K17223k99683
45277E816518l03610k30339k15540J65968Q90580J095981L05442p01155r86072
45268E837773p89794r10578j279190j157075m50536J80899M02032M47715L35726
$$ plain form
45333 2908037 3937866 3778808 2320903 1289335 1707075 2535489 2582113 2284479 2553301
45324 2553301 3082693 3033639 2486257 2052522 1796539 1603505 1856893 2617538 2853208 1741923
45314 1741923 169706 -361437 148023 510146 402696 609454 1312291 1668643 1340060
45305 1340060 1123575 1647665 2539535 3314699 4062295 4730712 4695791 3732038 2682369
45296 2682369 2440941 2800316 2984918 2901680 3136242 3913835 4729279 5030490 4801396 4357179
45286 4357179 3874755 3333308 2841548 2810581 3584878 4884956 5898978 6116201 5816518
45277 5816518 5512908 5282569 5067029 5232997 6123577 7219558 7525000 6823845 5837773
45268 5837773 5047979 4137401 2858211 1701136 1250600 1431499 1833531 2281246 2616972
45259B616972k21922j005561j250359o79888J04942N08164N95233O26936N34626
45250A829143K13706r2722o9312K36277M64918K93266k90851q70190q54726j50320
45240G09189N58816N61971J7976l17557j06902L12616N43136M63498Q2944l78817
45230B446870m26631O6605L73575j39211q06560m54858O79923J089981K53640
45221C083334o16101n96209m09485q41991j119795k24759J110244J309426L58014
45212B052678k85479O460L75807K31761J34086M71644N91969j9980p17066o62454
45202B179426o7990L32337M21281M93616M23198o5200n92069m92248R8779L48659
45192C079789j7472l14386K2854N82590N95048J3173m67353l32486J59764L74066
$$ plain form
45259 2616972 2395050 1389489 139130 -540758 -435816 72348 667581 1294517 1829143
45250 1829143 2042849 1950127 1880815 2117092 2582010 2875276 2584425 1714235 859509 709189
45240 709189 1268005 1829976 1847952 1530395 1423493 1736109 2279245 2742743 2825687 2446870
45230 2446870 2020239 2086844 2460419 2321208 1514648 1059790 1739713 2829694 3083334
45221 3083334 2467233 1871024 1461539 619548 -500247 -725006 385238 1694664 2052678
45212 2052678 1767199 1773659 2149466 2381227 2515313 2986957 3578926 3558946 2841880 2179426
45202 2179426 2111436 2443773 2865054 3358670 3781868 3716668 3124599 2632351 2731130 3079789
45192 3079789 3062317 2747931 2770785 3353375 3948423 3961596 3494243 3161757 3321521 3695587
45182C695587J10523j41042J63553Q40927J123008O68816O2663j3476K41697J56432
45172F908688k21543j15397O55593J141520N82714l13521k05845R82993J839175
45163A1254377J294317l554o01786r7222N24342L15806m54148q09137l72696K91494
45153A1341793N56453M26606J51819l61616j209798j819857j400353j90876N15248
45144H009419M3963o40822l00447P32971J060538K99849n18438p25782r05129
45135G056122j480791j644787o93424M75489M90226m01130p58852k35719Q7150
45126B894284k34719k31686N63971R33008j43532j529284j350758K34056J248493
45117B383833P20796k35022m10695j48637k97836o34756l59467M19969P49089
$$ plain form
45182 3695587 3806110 3665068 3828621 4669548 5792556 6461372 6524035 6510559 6752256 6908688
45172 6908688 6687145 6571748 7227341 8368861 8951575 8638054 8432209 9415202 11254377
45163 11254377 12548694 12545140 11943354 11846132 12370474 12686280 12232132 11422995 11050299 11341793
45153 11341793 11898246 12324852 12476671 12115055 10905257 9085400 7685047 7494171 8009419
45144 8009419 8053382 7412560 7112113 7845084 8905622 9205471 8687033 7961251 7056122
45135 7056122 5575331 3930544 3237120 3712609 4202835 3801705 3042853 2807134 2894284
45126 2894284 2659565 2427879 2991850 3924858 3781326 2252042 901284 1135340 2383833
45117 2383833 3104629 2869607 2458912 2310275 2012439 1377683 1018216 1438185 2187274
45108B187274K47087l62340k74781L87685Q20822N03214k79506p86683o07734
45099A835038o0723K42944J36242k8472J1073J20345J48348J78225J91315o7499
45089B706836n56595p10344k13856L76589L74024J2214L0979L90248K83612m63058
45079B230649r13152l73800M92619N65694j62058o32271j92644O23562Q72144
45070B510743K90775n56895r50230o56308n2119K79606J23958j86875k08310R0865
45060F85210L68656M01137L30680L95627N74134N94664K56691l06114o97788o40921
45050A961976k94183q4463j64109j87763K02590P88606R50706M60203j75051l12461
45040C146051P3278M66727N13321L27035R1976k57118p18832q95906m26523L38709
$$ plain form
45108 2187274 2434361 2072021 1797240 2184925 3005747 3508961 3229455 2442772 1835038
45099 1835038 1774315 2017259 2153501 2125029 2136102 2256447 2404795 2583020 2774335 2706836
45089 2706836 2150241 1439897 1226041 1602630 1976654 1988868 2019847 2410095 2693707 2230649
45079 2230649 1317497 943697 1436316 2002010 1839952 1207681 1015037 1638599 2510743
45070 2510743 2801518 2244623 1294393 638085 585966 865572 989530 802655 594345 685210
45060 685210 1053866 1455003 1785683 2181310 2755444 3350108 3606799 3300685 2602897 1961976
45050 1961976 1667793 1583330 1419221 1231458 1434048 2222654 3173360 3633563 3458512 3146051
45040 3146051 3219329 3686056 4199377 4526412 4618388 4361270 3642438 2746532 2320009 2658718
45030B658718N81259N0317n91650o84543l91307k30317j98633N4336M12843L52839
45020B013862j78272n83579m56477k7633L93336Q06652J069795P08489l09512
45011C436661j126341r55380j54225L09011K06273J38789L80025M30330q6377
45002B578766p29302q04659k41866M01956N79461J96735l79759o31340l85774
44993E84218m4006p2979l15871k04870L21062O45396M09625N2871L6876O2063
44983A474385l43015q19273n40675M84901J229555R51187R1350m29540l34448
44974A764427l0919R0620n9593m48151q86149r23199k65392O72549J074871P00338
44964A689402J66971J05294L97259M88225J21203n28819j143142j329463p12413
$$ plain form
45030 2658718 3239977 3290294 2698644 2014101 1622794 1392477 1193844 1248180 1661023 2013862
45020 2013862 1835590 1252011 795534 767901 1161237 1967889 3037684 3746173 3436661
45011 3436661 2310320 1354940 1200715 1509726 1715999 1854788 2234813 2665143 2578766
45002 2578766 1849464 1044805 802939 1204895 1784356 1981091 1601332 969992 584218
44993 584218 540212 467233 151362 -53508 267554 912950 1322575 1375446 1412322 1474385
44983 1474385 1131370 312097 -228578 256323 1485878 2437065 2528415 2098875 1764427
44974 1764427 1733508 1824128 1764535 1316384 430235 -492964 -758356 -85807 989064 1689402
44964 1689402 1856373 1961667 2358926 2847151 2968354 2439535 1296393 -33070 -745483
44955g45483N43456J488883J263528K03560n02408l48287q0359m71286j134893
44946B16711j104030k39454N63164N30080j15474n56168l53806J70295M32672
44937d56010L06360K18041M96730Q40977P16783J60303k42727j84401L8959J31000
44927B026015J99754L45403L82504K79727L35382N40490L58780l53002q26033
44918C289020m78762K5834k90322j151484j408560p60407k7806K26518K64689
44909c11280K86227Q6203j52215J87312R93913J241140M89367l70770m89337k41591
44899A718969k98937m26944j69022N3137l22555p29123k24691P93563R78010J03201
44889A475608n91944l76709l3229l17679n97438J8756J000940J017173r3970j075517
$$ plain form
44955 -745483 -202027 1286856 2550384 2753944 2251536 1903249 1822890 1351604 216711
44946 216711 -887319 -1126773 -563609 -33529 -149003 -705171 -1058977 -888682 -456010
44937 -456010 -149650 68391 565121 1406098 2122881 2283184 2040457 1856056 1895015 2026015
44927 2026015 2225769 2571172 2953676 3233403 3568785 4109275 4468055 4115053 3289020
44918 3289020 2810258 2836092 2545770 1394286 -14274 -774681 -802487 -575969 -311280
44909 -311280 -25053 61150 -91065 96247 1090160 2331300 2820667 2449897 1960560 1718969
44899 1718969 1420032 993088 824066 877203 554648 -174475 -399166 394397 1372407 1475608
44889 1475608 883664 506955 473726 156047 -441391 -422635 578305 1595478 1501508 425991
44879D25991r97883k91699K08313L81388M70007L15561k64755p17993k83766P56986
44869B150J240310P21225P3654R4151L46482P3455m69977n29543j87182j16294
44859A248431l14086k23562M6388j20652m79192j09856P96680Q66998j90748q14146
44849G06255j9141Q76716L10037r89501j195957k52385L35589J13841J32124P80643
44839G98221J039642L32661m29493l37233J86200K64106j29600m05411k25978
44830A093115L41377R61851J053160L18871n85070o95694j52343R722l89787l60843
44820A594359M28359Q60128J70120p01649o05846J3533M4230l75876k46649M65952
44810A646661P65867K48253l93160m98751j33507L68889P25338N86218j25445
$$ plain form
44879 425991 -571892 -863591 -655278 -273890 196117 511678 246923 -471070 -754836 2150
44869 2150 1242460 1963685 2037339 2131490 2477972 2551427 2081450 1551907 1364725 1248431
44859 1248431 934345 710783 757171 636519 157327 47471 844151 1711149 1520401 706255
44849 706255 687114 1563830 1873867 884366 -311591 -563976 -228387 -114546 17578 798221
44839 798221 1837863 2170524 1741031 1403798 1589998 1854104 1724504 1319093 1093115
44830 1093115 1434492 2396343 3449503 3768374 3183304 2487610 2335267 2344989 1955202 1594359
44820 1594359 2022718 2882846 3052966 2351317 1745471 1759004 1803234 1427358 1180709 1646661
44810 1646661 2412528 2660781 2267621 1768870 1635363 2004252 2729590 3315808 3190363
44801C190363p83415o81372j3458M54088N09712M93041L64775k20789r28192q80974
44791A503779n431P05618N86059J17186K452K04842L41189L64987L84486L18383
44781D523550J25058n7489k31355m86699n00951J85182J160167J287238L15972
44772F320673n29910k35957N57409O52461J11714j17557R0549k4915n85013p20327
44762E519127l918P81420P78749K27563k9414K79842O92354P56766N26641L83980
44752I913110N81080R31435R70589N60581K00492M27770J046359J417190J459883
44743A7508489J757073K528191L139314L011137K532686K591158L483463M743065
44735D1294576N856558O720522P451162Q052693Q231839P369440M894653J013004
$$ plain form
44801 3190363 2406948 1725576 1712118 2166206 2675918 3168959 3533734 3312945 2384753 1503779
44791 1503779 1498348 2203966 2790025 2907211 2909663 3114505 3455694 3820681 4205167 4523550
44781 4523550 4648608 4591119 4359764 3873065 3372114 3557296 4717463 6004701 6320673
44772 6320673 5790763 5554806 6112215 6764676 6876390 6758833 6849382 6824467 6239454 5519127
44762 5519127 5515209 6296629 7075378 7302941 7273527 7553369 8245723 9002489 9529130 9913110
44752 9913110 10494190 11425625 12396214 12956795 13157287 13585057 14631416 16048606 17508489
44743 17508489 19265562 21793753 24933067 27944204 30476890 33068048 36551511 41294576
44735 41294576 47151134 53871656 61322818 69375511 77607350 84976790 89871443 90884447
44727I0884447l076686o051795p536507q086588q264229q102910p442519o366037
44719C5957176n148899m024957l132856k515042k072081j671106j378363j424424
44711A4589448j816614k104091j727155o74483K95692K87478p38113j727823j573631
44702D810708l74180O75981P25534J66264j35553l6549n3396m00096p07899o73790
44692C997024m65993l88390n07669o90585p41112n02189n9810K52390K98714L54211
44682A546591N26977L56644m01300r79175m96634N56927Q48037J96311k33901
44673A920477L1762M1840o19684p02658O17114J827762J031427r94080j684155
44664A469805l77492R25286P21474p1477r3171L47396L39064J44828M10081N66432
$$ plain form
44727 90884447 87807761 81755966 74219459 66132871 57868642 49765732 42323213 35957176
44719 35957176 30808277 26783320 23650464 21135422 19063341 17392235 16013872 14589448
44711 14589448 12772834 10668743 8941588 8267105 8562797 8850275 8112162 6384339 4810708
44702 4810708 4436528 5112509 5838043 6004307 5868754 5832205 5778809 5378713 4670814 3997024
44692 3997024 3531031 3142641 2634972 1944387 1203275 701086 641276 893666 1192380 1546591
44682 1546591 2073568 2430212 2028912 1049737 553103 1110030 1958067 2154378 1920477
44673 1920477 1952239 1994079 1374395 671737 1288851 3116613 4148040 3153960 1469805
44664 1469805 1092313 2017599 2739073 2667596 2574425 2921821 3260885 3405713 3815794 4382226
44654D382226k92124j444166j205269M33605J473280O79689p00327q17269K55844
44645B765489R74991O49280O7301l3205P1978o6830k29163o7057J72957J14445
44635D420186j9449J58440L44169p7692q97192j151429m63453M40428P94880O69007
44625D217895M46795J62273j47458r6607L87063O11548P2834o17420n89637j02580
44615D344706j03644o54488q76889m41606n847K9414J29230N71259P36894R4820
44605C823849q05796j027635m93628O9269J43603j33461l50388k57759N6083K22419
44595A246556p34l23435k55918J31383K68619j5297k62782k29262k52654m55713
44585a49237l24938L69691Q86666M65002m67820p77724q7267Q66532J203392P35383
$$ plain form
44654 4382226 4090102 2645936 1440667 1874272 3347552 4027241 3326914 2509645 2765489
44645 2765489 3740480 4389760 4457061 4423856 4495834 4429004 4199841 4132784 4305741 4420186
44635 4420186 4400737 4559177 4903346 4825654 3928462 2777033 2313580 2754008 3548888 4217895
44625 4217895 4664690 4826963 4679505 4582898 4969961 5581509 5654343 5036923 4447286 4344706
44615 4344706 4241062 3586574 2709685 2268079 2262232 2291646 2420876 2992135 3729029 3823849
44605 3823849 3018053 1990418 1496790 1566059 1709662 1576201 1225813 968054 1024137 1246556
44595 1246556 1245822 922387 666469 797852 1066471 1051174 788392 559130 306476 -149237
44585 -149237 -474175 -104484 782182 1247184 779364 1640 -85627 780905 1984297 2719680
44575B719680n0678m70687k46153J38610k4711o09174o92581K1417N60661R6959
44565A443343p06713o90211j3108J74402l33573m37646M78723J462492J226420
44556B604129j89057j526133j726067q45954K17388O24944K96420j50685j45855
44547h40870K58950O19893O55961L84776j4715k24800K1710N04227O29938K66107
44537B261177m4817o6796l71576j212049j632642p17502P92627J314218N62185
44528H84825l35803o69120p33909o17220Q5947J018463J019145m9103p95508m06068
44518e98351Q2431l63295r34805m06548O30567O87613r3910k39246M18317M20667
44508c96560o26848j053974J75322J460384Q37492r02618j304380O4230J108870
$$ plain form
44575 2719680 2669002 2198315 1952162 2090772 2066061 1456887 764306 785723 1346384 1443343
44565 1443343 736630 46419 33311 207713 -125860 -563506 -84783 1377709 2604129
44556 2604129 2415072 888939 -837128 -1683082 -1465694 -840750 -544330 -695015 -840870
44547 -840870 -581920 37973 693934 1078710 1063995 839195 860905 1365132 1995070 2261177
44537 2261177 2216360 2149564 1777988 565939 -1066703 -1784205 -991578 322640 884825
44528 884825 549022 -120098 -854007 -1471227 -1385280 -366817 652328 603225 -192283 -598351
44518 -598351 -515920 -879215 -1814020 -2220568 -1590001 -902388 -996298 -1235544 -817227 -396560
44508 -396560 -1023408 -2077382 -1902060 -441676 395816 -506802 -1811182 -1746952 -638082
44499f38082N67038j96584L39014J333136J068814k05618p66585j90360K81075
44490A591848Q3719J05306O87798P06223m14849j317849o49985P57029J094041
44481B643281J85928n72447m10077J18460L93165L73277M1972o24701j113933
44472A034925q24565p0546K83976J12703J0438J25420M7819k10994j90796Q6747
44462D05127J80813J52268L65000N11623L0755o42948n79120Q339J04660k12959
44452C23558L3717N97250J29627j162006j236123N01511J844390J076283m07119
44443A701088n13221K79059J87004o79463p44685J80878P61113N12969K57882
44434A942624K85691m0945p27483q74813k35642L67683M37521L63480L82733J68188
$$ plain form
44499 -638082 -71044 -267628 71386 1404522 2473336 2267718 1501133 1310773 1591848
44490 1591848 1675567 1780873 2468671 3174894 2760045 1442196 792211 1549240 2643281
44481 2643281 2829209 2256762 1846685 1965145 2358310 2731587 2773559 2148858 1034925
44472 1034925 210360 139814 423790 536493 546931 672351 720170 509176 318380 405127
44462 405127 585940 738208 1103208 1614831 1645586 1002638 423518 431857 536517 323558
44452 323558 357275 954525 1084152 -77854 -1313977 -812466 1031924 2108207 1701088
44443 1701088 1187867 1466926 1653930 974467 229782 410660 1171773 1684742 1942624
44434 1942624 2228315 2187370 1459887 585074 349432 717115 1154636 1518116 1900849 2069037
44424B069037l02746n38340m08754k76355j55494K66775P17814N24715j59630
44415A737022m01033L5590L00530j62563q25713r82915n82161J08216Q23998J096219
44405A147190O04692o1648O6838Q40709J045272K52500m98013l66755M7577j20685
44395B957677n60215m55918R0124L27264J34980N6829K22664J28741m24551q92493
44385A585102p60730k89479j01951k55313j85510L42781P04576K88130m04568
44376I23038l08423N47024Q96449J30749o92700m91684J35562k8187p70546q47810
44366e06528n3483N60788M44499J31044k7681l39116p07192l98313O52078J415054
44356A171150J189517N04580J09106m5564k94517n37290n62778m57712l00023
$$ plain form
44424 2069037 1766291 1227951 819197 542842 387348 654123 1371937 1896652 1737022
44415 1737022 1335989 1371579 1672109 1509546 683833 -299082 -881243 -773027 50971 1147190
44405 1147190 1751882 1690234 1757072 2597781 3643053 3895553 3397540 3030785 3078362 2957677
44395 2957677 2397462 1941544 2031668 2358932 2493912 2550741 2773405 2902146 2477595 1585102
44385 1585102 824372 534893 432942 177629 -7881 334900 1039476 1327606 923038
44376 923038 614615 1161639 2058088 2188837 1496137 1004453 1140015 1111828 341282 -506528
44366 -506528 -560011 777 445276 576320 548639 209523 -497669 -895982 -243904 1171150
44356 1171150 2360667 2865247 2974353 2928789 2634272 2096982 1534204 1076492 776469
44347G76469l6060J29038q5924l51601o8753N03798M66795k01848m77968N2722
44337G06668N41613L06191k52450o40512r69915j103640l88973R97419J660245
44328H56646Q32806m64062r51211o73311k12953M24538J098652R63880j31180
44319A743805q18888j38543Q14486O32801j30793j66179J50855l92403j253041
44310D42100p31442J007945J822398Q06881m48061m46616J64183M4514p48437
44301A913465j171143p94860j08423K50017L0020m37999l98247M45074J223259
44292I51163Q46400l95913j117570p33608o066M07710P25928J027417P26147k93462
44282B138146j065895q42104j80915J60k46209k74847M0221L39486M80786N09199
$$ plain form
44347 776469 740409 869447 783523 431922 363169 866967 1333762 1131914 653946 706668
44337 706668 1248281 1554472 1302022 661510 -308405 -1412045 -1801018 -803599 856646
44328 856646 1689452 1225390 274179 -399132 -612085 -187547 911105 1874985 1743805
44319 1743805 924917 786374 1600860 2233661 2102868 1936689 2087544 1695141 442100
44310 442100 -289342 718603 2541001 3347882 2899821 2453205 2617388 2661902 1913465
44301 1913465 742322 -52538 -160961 89056 119076 -318923 -717170 -272096 951163
44292 951163 1797563 1401650 284080 -449528 -455594 -47884 678044 1705461 2431608 2138146
44282 2138146 1072251 230147 49232 49392 -196817 -471664 -431443 -91957 388829 898028
44272H98028K75089k84975p64403p38776l67178q2317M8939K02796L19409K46843
44262b46545J56497L19970N98123O05608L05350P499j94008n25782r59452r60495
44252h93235j78702P96004Q71411j72657j165101q68158M04678J154958O76018
44243F25216j44682k78246O1123J17322p2319L4276L39517K81660n3712J572N27075
44232A438802Q00923L83222l16116o94494o09108l09530j78185m41640p29278
44223f55404k83167Q34269J340400M40238p06926n13604N55412O78521l62745
44214A326994q53031k6461P16173K22421o13930n85789j18833j19797k09896L10977
44204D8828P64483J13071r59464p97445N99525J403647N97533o91350r77728l52249
$$ plain form
44272 898028 1173117 888142 123739 -615037 -982215 -1064532 -1015593 -812797 -493388 -246545
44262 -246545 -90048 229922 828045 1433653 1739003 1746502 1552494 1026712 67260 -893235
44252 -893235 -1071937 -275933 595478 422821 -742280 -1610438 -1205760 -50802 625216
44243 625216 480534 202288 263411 380733 308414 342690 682207 963867 910155 911727 1438802
44232 1438802 2239725 2622947 2306831 1612337 1003229 693699 515514 73874 -655404
44223 -655404 -938571 -104302 1236098 1676336 969410 455806 1011218 1689739 1326994
44214 1326994 473963 447502 1163675 1386096 772166 186377 67544 -52253 -262149 48828
44204 48828 813311 926382 -33082 -830527 -231002 1172645 1770178 1078828 101100 -251149
44194b51149R9288O652m2282L06074N31971L5639q46591j125451m77940K76938
44184a486851L98477L43776Q72199J472039R22502n84819j308000m15410P42262
44175I56175O44104k64457n40030K9071M19907J07008l84880m69048j27821L24966
44165F94995M81550R4192m37113l31598L41329M79991l13412p81345J36766J406504
44155A771859J271659j12574j009757p19984k19300k37246l15431l8779K12859
44146F03306J58008J01134J55992N632k80317j98592J82514K05976j77178k99760
44136D56715q4178k18868o99428n50914M32552J035451N08107j80252P222M42392
44126A148799J4911q85575j013922l01227K21666K22697L52134P64471P40976
$$ plain form
44194 -251149 -151861 -145209 -187491 118583 650554 686193 -160398 -1285849 -1763789 -1486851
44184 -1486851 -1088374 -744598 127601 1599640 2522142 1937323 629323 213913 956175
44175 956175 1600279 1335822 795792 824863 1244770 1351778 966898 497850 370029 694995
44165 694995 1176545 1270737 833624 502026 843355 1323346 1009934 228589 365355 1771859
44155 1771859 3043518 2930944 1921187 1201203 981903 744657 429226 390447 603306
44146 603306 761314 862448 1018440 1024072 743755 545163 727677 933653 756475 456715
44136 456715 372537 153669 -545759 -1096673 -664121 371330 879437 699185 706407 1148799
44126 1148799 1163710 278135 -735787 -1037014 -815348 -592651 -240517 523954 1264930
44117A264930P5777l50122Q1451P02352N48009k35831o77048l43125K34691M22155
44107A723239K07069n3079j78259j81065N52L91146O69482M11203k52647o49237
44097B088404m69345k17731l90195o68822n10614j18372l9122r1015L31456R82246
44087H96890R21760J24941k45135L53565Q84471L49932o08493p45842j29691J47292
44077A949690k49743n99845m71285k29213j16675J34059N08130M46705j95772
44068A176051o95376m92411o4458j24529m02776k8618J001558J551228Q04432
44059B725101n63613j154832n30698L94335O23675K08611j44016j50842j20326
44050A287395k13296j35665K92189P17114O87924K47063j75855l04820k25448
$$ plain form
44117 1264930 1340707 990585 1072036 1774388 2322397 2086566 1409518 1066393 1301084 1723239
44107 1723239 1930308 1877229 1698970 1517905 1518457 1909603 2579085 2990288 2737641 2088404
44097 2088404 1619059 1401328 1011133 342311 -168303 -286675 -325797 -416812 -85356 896890
44087 896890 1818650 1943591 1698456 2052021 2936492 3286424 2677931 1932089 1802398 1949690
44077 1949690 1699947 1100102 628817 399604 282929 416988 925118 1371823 1176051
44068 1176051 480675 -11736 -76194 -200723 -603499 -632117 369441 1920669 2725101
44059 2725101 2161488 1006656 475958 870293 1493968 1702579 1558563 1407721 1287395
44050 1287395 1074099 938434 1230623 1947737 2635661 2882724 2706869 2402049 2176601
44041B176601j35086p4914N4683K50624K50862j91801q16546r62313m40540O2337
44031A73907o9292l91093q4884O15507O77804k2490l75526K14534Q53753O02792
44021B195012p6444k35054j0258j68576o02954n16975R0652L13229k16065p79459
44011f892o95179j46746L58932O45311P12724N44688L19394L01712L61140J03671
44001B498755m30772p69386p48509n87644j97066P09910J625107J407378l7442
43992C470331j198546q57060K51827N91999k1102n22458m08867k03383k25733
43983H77008j26757J76841K04518j07138j17180L58219N30990p2609o56701l32836
43973G34355M21836N08404k4831j09483N65006J063773P04704J1517k65336k16376
$$ plain form
44041 2176601 2041515 1966601 2021284 2271908 2522770 2330969 1514423 552110 111570 173907
44031 173907 104615 -286478 -371362 244145 921949 899459 523933 738467 1592220 2195012
44021 2195012 2118568 1883514 1873256 1704680 1101726 584751 675403 988632 772567 -6892
44011 -6892 -702071 -848817 -489885 155426 868150 1412838 1732232 2033944 2395084 2498755
44001 2498755 2067983 1298597 550088 -37556 -234622 475288 2100395 3507773 3470331
43992 3470331 2271785 1414725 1666552 2258551 2237449 1714991 1306124 1102741 877008
43983 877008 750251 927092 1131610 1024472 907292 1265511 1796501 1723892 1067191 734355
43973 734355 1156191 1664595 1639764 1530281 2095287 3159060 3863764 3875281 3609945 3393569
43963C393569k78461l67115j94781M2475L222j38325o4192l1735m46402r17925
43953A000330o14620M19836J141418Q97040K00919j78769k23573l17372m65038
43944A860171m16092k02449j3404K24306O33686R18677O31765j01963n84572l90850
43934B559275J03218K22212j52811m55749j85376L96054N52872O7857m19748l22520
43924B365284K3508q1595n31969n57995l038M12283L22741L07979P51686R66058
43914C974942K54652p83790r85383k97253K73443K31301Q5264J83027O7984n75611
43904B428576j114570p51418K68978Q48138L73310n34804p35972J15245J144667
43895B042150J254307M08736m22160n97091m82913n20542l56566L50398Q52931
$$ plain form
43963 3393569 3115108 2747993 2553212 2595687 2598909 2460584 2396392 2364657 1918255 1000330
43953 1000330 385710 805546 1946964 2844004 3044923 2866154 2642581 2325209 1860171
43944 1860171 1444079 1241630 1228226 1452532 2086218 3004895 3636660 3534697 2950125 2559275
43934 2559275 2662493 2884705 2731894 2276145 2090769 2486823 3039695 3107552 2687804 2365284
43924 2365284 2388792 2307197 1775228 1217233 1214195 1626478 1949219 2257198 3008884 3974942
43914 3974942 4229594 3445804 2460421 2163168 2436611 2667912 2753176 2936203 3004187 2428576
43904 2428576 1314006 562588 831566 1679704 2053014 1518210 782238 897483 2042150
43895 2042150 3296457 3705193 3283033 2685942 2203029 1682487 1325921 1676319 2529250
43886B529250J82510j103937j325031n3243J122178P85609m03653q54883k78676
43877F00124K96459K67863O1844Q2252J12545k4888n8668J29273J47833k30619
43867A384018n46073k80405L41514O76894N59083L55699K56360N2224l24340n52162
43857A922812m16030j43607J1789J61703M15996M64030J8234n21604m38363K64182
43847A739142P55182M58854k36618n74017l27546J41053L82448J70812l70107
43838B139203p28673m20600L40585P48323M00427k25399n41695n75736n47545
43829E88890k95874K88098P12316M63003j61632m51357k74787m5018N3278J40890
43819A017807J69689M1346m662K25206L74125J26125l7960M48186J078728Q69462
$$ plain form
43886 2529250 2711760 1607823 282792 229549 1351727 2137336 1733683 878800 600124
43877 600124 896583 1164446 1226290 1308542 1421087 1396199 1337531 1466804 1614637 1384018
43867 1384018 837945 557540 899054 1575948 2135031 2490730 2747090 2799314 2474974 1922812
43857 1922812 1506782 1363175 1374964 1536667 1952663 2416693 2434927 1913323 1474960 1739142
43847 1739142 2494324 2953178 2716560 2142543 1814997 1956050 2338498 2509310 2139203
43838 2139203 1410530 989930 1330515 2078838 2479265 2253866 1712171 1136435 588890
43829 588890 293016 581114 1293430 1756433 1594801 1143444 868657 823639 876917 1017807
43819 1017807 1187496 1228842 1224180 1449386 1823511 1949636 1911676 2359862 3438590 4308052
43809D308052q0502p33277o98842m69356j34307P21744J669471J504360J56203
43800F243546q82674o81605q4797o4643k35816K3077K64353k9749k69458J34118
43790D416352M79969l2320p31832n88837q5145l10595q47615m19021P22884J024308
43780C628148K21478k44714K98828P31063J97728m67589k65744L75238N13023
43771D987459J47485j83913m09152o12216m33376L39063J113615J191845O71450
43762F812260N6056n06482r88017j043919n12736Q6170J96319l2743j94699l13257
43752C558952m61495k62684M33582Q69297L21940n99054o51268J60610N20204
43743C890084j92836q96620l85293Q54508J248905K81558p99850o28293N09959
$$ plain form
43809 4308052 4227550 3494273 2795431 2326075 2191768 2913512 4582983 6087343 6243546
43800 6243546 5360872 4679267 4594470 4529827 4294011 4317088 4581441 4551692 4282234 4416352
43790 4416352 4896321 4864001 4132169 3543332 3458187 3147592 2299977 1880956 2603840 3628148
43780 3628148 3849626 3604912 3903740 4634803 4832531 4364942 4099198 4474436 4987459
43771 4987459 5134944 4951031 4541879 3929663 3496287 3835350 4948965 6140810 6812260
43762 6812260 6868316 6361834 5373817 4329898 3817162 3903332 4099651 4066908 3872209 3558952
43752 3558952 3097457 2834773 3268355 4137652 4459592 3860538 3209270 3369880 3890084
43743 3890084 3697248 2800628 2415335 3269843 4518748 4800306 4000456 3372163 3882122
43734C882122J107946M87728l06553m3514Q69559R62121q3832q93696m19966N31090
43724F093005N91824j08778l07234L00452N88582j55199j002285o77019N62374
43715E885722J202787N02837n63339p04290q0371L2764p72068j286773m09204
43706C808065J110670J583057O93354k37992l18588j33867l21761l83718K02667
43697F001887P37017L48095m36284m80430P0948J04668m69593n36924K62459Q27606
43687F429449L57824l89786l35618L43683O87468L76731r7350l13457l10533k90007
43677F458404l53992l86573m3540P76901J376738Q17183o83061j617266r60635
43668E384159N20563J287115Q23319j77067r02889j004519m92726K02688L55757
$$ plain form
43734 3882122 4990068 5477796 5171243 5127729 5997288 6959409 6875577 5981881 5561915 6093005
43724 6093005 6684829 6576051 6268817 6569269 7157851 7002652 6000367 5323348 5885722
43715 5885722 7088509 7591346 7028007 6323717 6243346 6276110 5504042 4217269 3808065
43706 3808065 4918735 6501792 7195146 6957154 6638566 6504699 6182938 5799220 6001887
43697 6001887 6738904 7086999 6650715 6170285 6241233 6345901 5876308 5339384 5601843 6429449
43687 6429449 6787273 6397487 6061869 6405552 7093020 7469751 7372401 7058944 6748411 6458404
43677 6458404 6104412 5717839 5674299 6451200 7827938 8645121 7962060 6344794 5384159
43668 5384159 5904722 7191837 8015156 7838089 6935200 5930681 5437955 5640643 5996400
43659E996400k15803p25791m59832J58013K95014P1260J96206N40905K73816n74792
43649E555396r12794k53420N08649M57975j44250n55861n85666l33216K76707
43640D013520R84874R85037P1542o52602j83588Q02982Q90523P4015l02155K96421
43630F980569Q23417L77197m63791o59310j93524J92670J58218o9374k77437l73902
43620F494733k11324J34222K12571j24227k54316L30887J003957P27575l37597
43611G976481r26422m76911J53029J40828r9133J45851N38977K58168n29145q17036
43601F364687k99399K46885K90130L24972Q70775J437518J200244L11450k01993
43592A0545269K11458R83561J264867R87739Q40296J361618K297571K902030K830128
$$ plain form
43659 5996400 5780597 5054806 4594974 4752987 5048001 5119261 5315467 5856372 6130188 5555396
43649 5555396 4642602 4389182 4897831 5355806 5211556 4655695 4070029 3736813 4013520
43640 4013520 4998394 5983431 6054973 5402371 5218783 6021765 6912288 6986303 6684148 6980569
43630 6980569 7803986 8181183 7717392 7058082 6864558 7057228 7215446 7146072 6868635 6494733
43620 6494733 6283409 6417631 6630202 6505975 6251659 6582546 7586503 8314078 7976481
43611 7976481 7050059 6573148 6726177 6867005 6767872 6913723 7452700 7710868 7181723 6364687
43601 6364687 6065288 6312173 6602303 6927275 7798050 9235568 10435812 10747262 10545269
43592 10545269 10756727 11740288 13005155 13992894 14833190 16194808 18492379 21394409 24224537
43583B4224537K634799L236400M885748O792979P764820O964274M097409n23179
43575F0077787n626294r140790r577913p449156m811288l224951k583679k061970
43567A5601746j518006j367015j497556j194030k57988M77344J77095q16590j336089
43558H268911q18107Q7265M29577O1713m50696p07167p82547p46306m28899J32258
43548E046002M63500K34270k30357m03833k70223j26779P8505N67540R81385O06668
43538F946678m44270j054468n64096K49417L14280j36722j1570Q18130J175998
43529G293377L06843r08683j048869J85R29773O42287m93353j145718n35024P35930
43519E776748J361637P62315l16643p30945k79004J95405m226n53921o21540N5382
$$ plain form
43583 24224537 26859336 30095736 34981484 41774463 49539283 56503557 60600966 60077787
43575 60077787 54451493 45310703 35732790 28283634 23472346 20247395 17663716 15601746
43567 15601746 14083740 12716725 11219169 10025139 9767151 10244495 10421590 9605000 8268911
43558 8268911 7450804 7538069 7967646 8029359 7578663 6871496 6088949 5342643 4913744 5046002
43548 5046002 5509502 5743772 5513415 5109582 4839359 4712580 4791085 5358625 6340010 6946678
43538 6946678 6502408 5447940 4883844 5133261 5447541 5310819 5299249 6117379 7293377
43529 7293377 7600220 6691537 5642668 5642853 6572626 7214913 6721560 5575842 5040818 5776748
43519 5776748 7138385 7900700 7584057 6853112 6574108 6769513 6765287 6211366 5589826 5645208
43509E645208Q98179J153412O02420k94287p82356m61697K70502N57243N5936
43500G644560n98471n87226K724L18406m4848m76258k24819N56887J030335P34487
43490H355777M1041l93899k89074J63257N48740N14414O6041l37535k33166K42250
43480H677846M98268L27069J79920L79035N22272J35362m59980n74203k40325
43471I445264j32974m18072m80703J312M74622L89583J8767q2853J09147L31470
43461I655563N80641Q38739P32041J36778k97610N167N31898L67443l62718o91644
43451A1496298l23353P9626J50742K93036O73661P89808M59623L06668P00167
43442A4626276J018174N96880k48487p70244p71489m57553J06359P52120R67934
$$ plain form
43509 5645208 6543387 7696799 8299219 8004932 7222576 6760879 7031381 7588624 7644560
43500 7644560 7046089 6458863 6461587 6779993 6735145 6258887 6034068 6590955 7621290 8355777
43490 8355777 8396818 8002919 7713845 7877102 8425842 8940256 9006297 8668762 8435596 8677846
43480 8677846 9176114 9503183 9683103 10062138 10584410 10719772 10259792 9685589 9445264
43471 9445264 9312290 8894218 8413515 8414827 8889449 9279032 9297799 9214946 9324093 9655563
43461 9655563 10236204 11074943 11806984 11943762 11646152 11651319 12183217 12550660 12187942 11496298
43451 11496298 11172945 11252571 11403313 11696349 12370010 13159818 13619441 13926109 14626276
43442 14626276 15644450 16241330 15992843 15222599 14451110 13993557 14099916 14852036 15819970
43433A5819970N77798J96620L77245P97386R28252R20310J052373R29220K31994
43424B1831168k47269M75321J892651K497679J908950J265774J375257J722535
43416C2722066J720752J783241K457048L336749L634503L344787L178197L602152
43408E5779495M399548M990516M945721M406248M084884M507655N224564N234035
43400I3572666M212326K753670J361190o7199j572263k756799l462784m136099
43392H9904708n055948n783973n839271n400534m911031m498544m183589m098757
43384E0133061m065414l540696k471607j608603j451551j519445j261458j004325
43376C3209962j235130j590163j470436j123010j096618j068458l66691N98874
$$ plain form
43433 15819970 16397768 16594388 16971633 17769019 18697271 19617581 20669954 21599174 21831168
43424 21831168 21583899 22059220 23951871 26449550 28358500 29624274 30999531 32722066
43416 32722066 34442818 36226059 38683107 42019856 45654359 48999146 52177343 55779495
43408 55779495 60179043 65169559 70115280 74521528 78606412 83114067 88338631 93572666
43400 93572666 97784992 100538662 101899852 101832653 100260390 97503591 94040807 89904708
43392 89904708 84848760 79064787 73225516 67824982 62913951 58415407 54231818 50133061
43384 50133061 46067647 42526951 40055344 38446741 36995190 35475745 34214287 33209962
43376 33209962 31974832 30384669 28914233 27791223 26694605 25626147 25259456 25858330
43368B5858330O67224l11569j209752j279534r77785q40393o12486m5190L32752
43359B1581597l2209p57753j005959o05187j40730j13611m30549o38656m11814
43350A7445129J21839M50988K33361k38689l97230j78717m8238k43201m76702
43341A6668540m95559m36853m38768l54863r6390J38854K15609K72761L77524
43332A5850855L48973J36292k8070p0712k28707n03095m66747J0213L50998R7277
43322A5497277l03692j71267L03440L99085J25029K35444Q72839J110589L24155
43313A8392899o99899p73659k0388L15917k75271q36674m18430N02519P79153
43304A6966167K71616j17457R7847M27044L96363K06797J06358p1917l37979l11689
$$ plain form
43368 25858330 26525554 26213985 25004233 23724699 22746914 21906521 21294035 21248845 21581597
43359 21581597 21549388 20791635 19785676 19180489 19039759 18926148 18495599 17856943 17445129
43350 17445129 17566968 18017956 18251317 18012628 17615398 17436681 17388443 17145242 16668540
43341 16668540 16172981 15736128 15297360 14942497 14846107 14984961 15200570 15473331 15850855
43332 15850855 16199828 16336120 16308050 16237338 16008631 15505536 15038789 15049002 15400000 15497277
43322 15497277 15193585 15022318 15325758 15724843 15849872 16085316 16958155 18068744 18392899
43313 18392899 17693000 16919341 16898953 17214870 16939599 16102925 15684495 16187014 16966167
43304 16966167 17237783 17120326 17218173 17645217 18041580 18248377 18354735 18282818 17944839 17633150
43294A7633150n5057k73097j014248j105030J35910J473030J324746J07767m73746
43285A7753425k8477L28597J87667L40714Q52345O01449n74238j095682k9310
43276A8336490J314108J382355O15645L12437M55531K19268k70561k95619j1799
43267B2057855j8080o026O19880J249667Q26984k21808m96240J13121L98360N9430
43257B4583143J30192R10074J279559O66373N7296K76109P25488P50606R07286
43248C0286126J776741K635893K520811J796506J503950J764903J931416J848112
43240D6064458J936575K346201K900152L596401M391631M814884M573218M255740
43232G4879260M679685N762140O719526P151797P283683P366654P447285P475560
$$ plain form
43294 17633150 17578093 17304996 16290748 15185718 15321628 16794658 18119404 18227171 17753425
43285 17753425 17724948 18053545 18241212 18581926 19434271 20035720 19461482 18365800 18336490
43276 18336490 19650598 21032953 21648598 21961035 22416566 22635834 22365273 22069654 22057855
43267 22057855 22039775 22033749 22653629 23903296 24730280 24508472 24012232 24125353 24523713 24583143
43257 24583143 24713335 25623409 26902968 27569341 27626637 27902746 28628234 29378840 30286126
43248 30286126 32062867 34698760 37219571 39016077 40520027 42284930 44216346 46064458
43240 46064458 48001033 50347234 53247386 56843787 61235418 66050302 70623520 74879260
43232 74879260 79558945 85321085 92040611 99192408 106476091 113842745 121290030 128765590
43224A28765590P099637N727840L416277J271821K32478j77400j094711k698305
43216A42543227m205014n130893n577156n526012m940155m449980m810658n614195
43208A02289164n623022m540632l396332k940706k742307k264255j778615j617393
43200G7385902j423635q86665n41546j047224k065380k524905j830123m38729
43192F6627695N63062L26492r42236j968116j725191p51181m08044q70427r75654
43183E9876400l21387j12238j129527k164228j728776l77376J54638m61674r68343
43174E2767489o80035k93771m33100p38025p64286p11590q28460r24872q42530
43165D6550820p25196n87948k95553j08545m77439j123974j161148l80916M01532
$$ plain form
43224 128765590 135865227 141593067 145009344 146281165 146513643 146336243 145241532 142543227
43216 142543227 138338213 133207320 127630164 122104152 117163997 112714017 107903359 102289164
43208 102289164 96666142 92125510 88729178 85788472 83046165 80781910 79003295 77385902
43200 77385902 75962267 75075602 74534056 73486832 71421452 68896547 67066424 66627695
43192 66627695 67190757 67517249 66575013 64606897 62881706 62130525 61722481 60852054 59876400
43183 59876400 59555013 59442775 58313248 56149020 54420244 54042868 54197506 53735832 52767489
43174 52767489 52087454 51793683 51360583 50622558 49858272 49146682 48318222 47393350 46550820
43165 46550820 45825624 45237676 44942123 44833578 44356139 43232165 42071017 41690101 42091633
43156D2091633N73134M44688M17468L32448J05811J20200M19988L86234j29901
43147D4761703k30874O35653J518585J236034K01829j65857M92197J146151R93865
43138E0589286L69022l4717k450K63393M00858M5830p26726j213783q88225j85935
43128D8616553J38345J43260L87122P62462O35181K1709m26015n96686r74557
43119D8707374j444034j260391m94376k51769r28250j420893p94176L11298P61012
43110D3185795M86681M7379n31104j423472k153384k156241j738781j502286j281390
43101C2933197o78458j68384m61704j086571r23964o2546K25380n01572j176177
43092B8099201r44112l70298l20356o22999n96060j86449J74802L62541N14126
$$ plain form
43156 42091633 42664767 43109455 43526923 43859371 43965182 44085382 44505370 44891604 44761703
43147 44761703 44530829 45166482 46685067 47921101 48122930 47957073 48449270 49595421 50589286
43138 50589286 50958308 50923591 50921141 51184534 51585392 51631222 50904496 49690713 48802488 48616553
43128 48616553 48754898 48898158 49285280 50047742 50682923 50704632 50278617 49681931 48707374
43119 48707374 47263340 46002949 45508573 45256804 44328554 42907661 42113485 42424783 43185795
43110 43185795 43672476 43719855 43188751 41765279 39611895 37455654 35716873 34214587 32933197
43101 32933197 32254739 32086355 31624651 30538080 29614116 29551570 29776950 29275378 28099201
43092 28099201 27155089 26784791 26464435 25841436 25245376 25058927 25233729 25596270 26110396
43083B6110396N34135K41455k00852m62497m80616l90591k41624n9007O5476J96093
43073B5312368N61755J084078J261507Q64146L81782L41906M90656K10149m00228
43064C0108119m89169L63113J410265J546594O71791j28242J30608J147415J790947
43055C6551441J642001J534787K320832L626058M356323M047136L053191J707082
43047E8838851J48662j104070j374484q22094m07727n82917p30988j97491Q36106
43038E4603848J826980K525679K843700K787097K830441L560138M623288M979321
43030H0580492M624403M932942O585798Q347724Q919754Q895080R585538J0880289
43022A43352020J1809917J2453466J3495952J4354349J3646624J1398588Q913761
$$ plain form
43083 26110396 26644531 26885986 26685134 26222637 25742021 25351430 25109806 25050799 25116275 25312368
43073 25312368 25874123 26958201 28219708 29083854 29465636 29807542 30298198 30508347 30108119
43064 30108119 29618950 29982063 31392328 32938922 33610713 33482471 33613079 34760494 36551441
43055 36551441 38193442 39728229 42049061 45675119 50031442 54078578 57131769 58838851
43047 58838851 58987513 57883443 56508959 55686865 55279138 54696221 53965233 53767742 54603848
43038 54603848 56430828 58956507 61800207 64587304 67417745 70977883 75601171 80580492
43030 80580492 85204895 90137837 96723635 105071359 113991113 122886193 132471731 143352020
43022 143352020 155161937 167615403 181111355 195465704 209112328 220510916 229424677
43015B29424677O386957K619023k481692p047927r685700j1077360j2247229j2828189
43007A83062560j2208526j0980614r881980q467596o297381m427739m052975m364018
42999A22381731l519877j394745L89817J116162J909959L665435N579240O534540
42991A36662262O869383P859877J0030664J2726498J5054070J6700804J7969139
42984B23872697J9334833K0863674K1895855K1437180J8937789J4566144Q823146
42977C49731318K226865m601627j0888837j5919823j9229574k0691682k0626733
42970B59999907j9704840j8470849j7023737j5319203j3547682j1930884j0415140
42963A53587572q951205p820614p217557o731447n792728m499083l459054k924826
$$ plain form
43015 229424677 235811634 238430657 235948965 228901038 219215338 208137978 195890749 183062560
43007 183062560 170854034 159873420 149991440 141523844 135226463 130798724 126745749 122381731
42999 122381731 118861854 117467109 117856926 118973088 120883047 124548482 130127722 136662262
42991 136662262 143531645 151391522 161422186 174148684 189202754 205903558 223872697
42984 223872697 243207530 264071204 285967059 307404239 326342028 340908172 349731318
42977 349731318 351958183 347356556 336467719 320547896 301318322 280626640 259999907
42970 259999907 240295067 221824218 204800481 189481278 175933596 164002712 153587572
42963 153587572 144636367 136815753 129598196 122866749 117074021 112574938 109115884 106191058
42955A06191058k636619k429887k378280k350915k051946j567508j317444j403788
42947I0054671j531288j570215j599103j400976o50066K90429N41267n7884o21254
42938H3455581m71235k394J58694J55535M30225Q07757Q23464O57709R66178J821026
42928H8802540K459765K227662J361413O62645O11500R47754J058594O73567P1609
42919I8877049m14522q43301j362825j718719j541610j021939p51853q92931j069581
42910H9259768j137426j406221j920727k179150j887766j438125j283118j318049
42902G6689186j214018r37437o57616n35044p53998j282143j556874j105526n20182
42893F8126348q59710j893396k128956j063696j06537m45678j289370j373980
$$ plain form
42955 106191058 103554439 101124552 98746272 96395357 94343411 92775903 91458459 90054671
42947 90054671 88523383 86953168 85354065 83953089 83303023 83593452 84134719 84076835 83455581
42938 83455581 82984346 82981952 83140646 83296181 83726406 84534163 85357627 86015336 86981514 88802540
42928 88802540 91262305 93489967 94851380 95514025 96125525 97073279 98131873 98805440 98877049
42919 98877049 98462527 97619226 96256401 94537682 92996072 91974133 91222280 90329349 89259768
42910 89259768 88122342 86716121 84795394 82616244 80728478 79290353 78007235 76689186
42902 76689186 75475168 74537731 73880115 73345071 72591073 71308930 69752056 68646530 68126348
42893 68126348 67266638 65373242 63244286 62180590 62074053 61628375 60339005 58965025
42885E8965025j027338j249203j711155j424942p59638r18124j730782j877628
42877D8266215j245074j126760j854017k147829j380345o89140j006990j550799
42869C7265261j281607n47130j88433j27813N2351R3753k50930l51721L29850
42860C4993581J092363R52727J99750j15889J93982L99552R1353m87764j055496
42851C6264159j366867j019415n0337O35412L33216l37951l30337K01334K44477
42842C4573691l85464q70955p70495m23736l2954N03491Q07004K43128r04045
42833C2739665j575415j430823j111808q77098k51026O52756Q45560J14069l60504
42824B8745376J41980O46342J44535o56658n79657n4006l76779j435544j831137
$$ plain form
42885 58965025 57937687 56688484 54977329 53552387 52792749 51874625 50143843 48266215
42877 48266215 47021141 45894381 44040364 41892535 40512190 39823050 38816060 37265261
42869 37265261 35983654 35436524 35248091 35120278 35172629 35266382 35015452 34663731 34993581
42860 34993581 36085944 37038671 37238421 37122532 37316514 37716066 37807419 37319655 36264159
42851 36264159 34897292 33877877 33827540 34462952 34796168 34458217 34127880 34329214 34573691
42842 34573691 34188227 33317272 32546777 32123041 32090087 32593578 33400582 33643710 32739665
42833 32739665 31164250 29733427 28621619 27744521 27493495 28146251 28991811 29105880 28745376
42824 28745376 28887356 29533698 29678233 29021575 28441918 28387912 28011133 26575589 24744452
42815B4744452j134739m38587m89223p33176o32862o00824r68741j156184o97119
42806A7892997j98199l58816p53799n96504j58720k82851p84985o18449K94874
42797A4435548O52819k99534j446457j243143J40719J078447O63751k97886o10647
42788A3073617k23673J1652l32191p78497p46208l32363m7142l2612N4987L74789
42778A1022359N37523J95021l23444m43716k55585l68715q29626r09726k73771
42769H350320L45552J81795m38739o83351m50010k35238j59360k6479n9957n49690
42759F274843r51404n13651K26484p3381j332754j756167m09724J259604J437060
42750D160910L42453n07462m95319r1151M12348R59941J007472J27500r09181
$$ plain form
42815 24744452 23609713 23171126 22681903 21948727 21315865 20715041 19746300 18590116 17892997
42806 17892997 17694798 17335982 16582183 15985679 15826959 15544108 14759123 14140674 14435548
42797 14435548 15088367 14788833 13342376 12099233 12239952 13318399 13982150 13684264 13073617
42788 13073617 12849944 12861596 12529405 11750908 11004700 10672337 10625195 10592583 10647570 11022359
42778 11022359 11559882 11754903 11431459 10987743 10732158 10363443 9533817 8624091 8350320
42769 8350320 8695872 8877667 8438928 7755577 7305567 7070329 6910969 6884490 6824533 6274843
42759 6274843 5323439 4809788 5036272 4962891 3630137 1873970 1464246 2723850 4160910
42750 4160910 4503363 3995901 3500582 3409431 3821779 4781720 5789192 5916692 5007511
42741E007511r37730j03695M59061M38827M86553O78850L65003l18508l34700
42732E741172M47893Q05137J15932o07341m32545L1068j11325m37377q8512N55795
42722F019897M28078m21458q34849k82552M50116M49324j93965o47251l16666
42713D650674N51292J079675O76740j92015m93043K3977N26073L72117j5674O730
42703G186546L01794M13938M15965N68438O60911M53272K90363M79887N58019
42694A1329133J04771j78727O36289J983912K251198J022413l24082n60996o3117
42685A6200794J69061l7538k60664m46763p99944j086290q49082k30275O0461
42676A2719760l20949r11334j092518q43934n83738m62122k00188L08134O13632
$$ plain form
42741 5007511 4069781 3966086 4425147 4863974 5350527 6029377 6394380 6075872 5741172
42732 5741172 6189065 6994202 7110134 6502793 6070248 6101316 5989991 5552614 5464102 6019897
42722 6019897 6447975 6026517 5191668 4909116 5359232 5808556 5614591 4967340 4650674
42713 4650674 5201966 6281641 6958381 6766366 6273323 6297300 6823373 7195490 7179816 7186546
42703 7186546 7488340 7902278 8318243 8886681 9547592 10000864 10291227 10771114 11329133
42694 11329133 11433904 11255177 11891466 13875378 16126576 17148989 16824907 16263911 16200794
42685 16200794 16369855 16332317 16071653 15624890 14824946 13738656 12889574 12659299 12719760
42676 12719760 12398811 11487477 10394959 9551025 8967287 8505165 8304977 8613111 9226743
42667I226743K64079m57240p85940m51168L3955J16347j89002n34219o40017l36211
42657F247327L30105Q84366Q30296L97659K77808M78411K51869n41599r67334
42648H188908m85660P5932j57744o99933o38622k18771k71357o37376n03019M2256
42638D694614J53382k27761l37408q6028k28120q61590j067617m27565K49107
42629A861014J99572k49678m15735k32712j6499R5217Q0169p3902k00952j57690
42619H88804j72931m16657m26894K22176R35986Q32253K44409K29795O99882N42615
42609C579438l00778n52043K15360P78593L11091l68601m14332k88706n20016
42600B440006n97911k09237j53660p90057r56041J47236J305634J129321L25230
$$ plain form
42667 9226743 9490822 9033582 8247642 7796474 7830429 7946776 7757774 7223555 6583538 6247327
42657 6247327 6577432 7461798 8292094 8689753 8967561 9445972 9697841 9156242 8188908
42648 8188908 7703248 7779180 7621436 6921503 6282881 6064110 5792753 5155377 4652358 4694614
42638 4694614 4847996 4620235 4282827 4196799 3968679 3107089 2039472 1611907 1861014
42629 1861014 2060586 1810908 1395173 1162461 1145962 1241179 1321348 1247446 1046494 888804
42619 888804 715873 299216 -127678 94498 1030484 1862737 2107146 2336941 3036823 3579438
42609 3579438 3278660 2726617 2941977 3720570 4031661 3663060 3248728 2960022 2440006
42600 2440006 1842095 1632858 1479198 689141 -266900 -119664 1185970 2315291 2640521
42591B640521L16355O64566j4619j296760j405174j71099O82817L44638n7653
42582A703592L39591P49655K95036n00178o36210o0217N41305O73304L07176k12009
42572C201045l55680m1794O1935m45660p75998j04036P72036L98615q75177j152821
42562F82465Q0832J120137P54362L4470K60211P72290K46607r06873j139298k38205
42552A666998M12385K9600m78227l420J133910J659273R94056j42101p27850o05214
42542C939410l80868l90485l11859O0135K91997M2001k45479o8690J80412j34099
42532B982475o54106m70251L80615R27479P10034J62111l77453q83131r08741
42523A869032K8974J185057J118800j62828j007857n45295J51361K403m51542
$$ plain form
42591 2640521 2956876 3621442 3606823 2310063 904889 733790 1416607 1761245 1703592
42582 1703592 2043183 2792838 3087874 2587696 1951486 1891269 2432574 3105878 3413054 3201045
42572 3201045 2845365 2803571 2865506 2419846 1643848 1539812 2311848 2710463 1835286 682465
42562 682465 763297 1883434 2637796 2672266 2932477 3704767 3951374 3044501 1905203 1666998
42552 1666998 2079383 2108983 1630756 1627336 2761246 4420519 5414575 5272474 4544624 3939410
42542 3939410 3558542 3168057 2856198 2916333 3208330 3250331 3004852 2936162 3116574 2982475
42532 2982475 2328369 1858118 2238733 3166212 3876246 4038357 3660904 2777773 1869032
42523 1869032 1898006 3083063 4201863 4039035 3031178 2485883 2637244 2639647 2188105
42514B188105l13030J15992J80754J40027L77385L52628l66444q95371k50911
42505A529135Q76768R82452m0541q60499o33756J86881Q02295Q32771K92943l73848
42495C594601m73862M9330L57797J4836j93204L81335R35859M96170k90341j50069
42485D722452O30997P13404L1424k02854K65586L56810k73022n88582r9146K33934
42475E791003k72253q43004o49836j44289o4158j68457N7718K96718p574n72013
42465C423855o84282k39482L42042P92515R83128P01314L7463m38276m15609l04128
42455D198540m68397n63057k26723J21082p7940n11173m41106J03109L95904J77735
42445B707974l0838J44646L71284K23666j37136k61531j22273j28736m40025o10423
$$ plain form
42514 2188105 1875075 1991067 2171821 2311848 2689233 3041861 2675417 1780046 1529135
42505 1529135 2405903 3388355 3347814 2487315 1853559 2040440 2842735 3675506 3968449 3594601
42495 3594601 3120739 3170069 3527866 3542702 3349498 3730833 4666692 5162862 4872521 4722452
42485 4722452 5353449 6066853 6098277 5895423 6161009 6517819 6244797 5656215 5557069 5791003
42475 5791003 5518750 4675746 4025910 3881621 3817463 3649006 3706724 4003442 3995868 3423855
42465 3423855 2739573 2500091 2842133 3634648 4617776 5319090 5356553 4918277 4502668 4198540
42455 4198540 3730143 3167086 2940363 3061445 2983505 2472332 2031226 2134335 2530239 2707974
42445 2707974 2677136 2821782 3193066 3416732 3279596 3018065 2895792 2767056 2327031 1716608
42435A716608j71567O01176R20993N42820J06530J71745M04999J88767l97221
42426D084850q03039q41267o04935O1863J132717J743397J051376l36476r28413
42417D560073l95550J29434k8820j97352J59822L92652j03473p13736o17392j16398
42407C069260J4120k01007k62273j85622k20984j10998M07987Q04309M22370l68819
42397C368343o28043j98442K61767L91906L98028L37746j2025n51425q06663n49916
42387B011276k2500L79190L11153l11880r36080o72555N11940J467321J334160
42378D072025O86906M33463L41554k39704q64832o05398K03210L30202l48497
42369D008929p01278k63611J54986J8155k13402k68215n55713r63022n85880O04952
$$ plain form
42435 1716608 1545041 2146217 3067210 3610030 3716560 3888305 4293304 4482071 4084850
42426 4084850 3281811 2440544 1835609 1897472 3030189 4773586 5824962 5488486 4560073
42417 4560073 4164523 4293957 4265137 4067785 4227607 4620259 4516786 3803050 3185658 3069260
42407 3069260 3083380 2882373 2620100 2434478 2213494 2102496 2510483 3314792 3737162 3368343
42397 3368343 2740300 2541858 2803625 3195531 3593559 3931305 3919280 3367855 2561192 2011276
42387 2011276 1988776 2367966 2679119 2367239 1431159 758604 1270544 2737865 4072025
42378 4072025 4758931 5192394 5533948 5294244 4429412 3824014 4027224 4357426 4008929
42369 4008929 3307651 3044040 3199026 3217181 3003779 2735564 2179851 1216829 630949 1235901
42359A235901J178087K87700q68047p60163K75304Q00687M79320J65404K47793
42350C041986K41700r5197l76680l51547j61477J64829O79249J011388O85401
42341D839652o6447n51745o42972p64147q94721n39468J63665L33974k32280m91416
42331A154095L10605J318247J200512Q4448p05374o19802m36362o80251o73125
42322I52993J72033J016541O27373o73863j269831m90700N10748N11193j37488
42313A218999l02904K49900Q65711J165532J205376P80129l13889j353642j172643
42304B342569J53457J121618P58292j38253l07400K29716N22710J96830k77019
42295D602520m96425m99430l65873j14856R8472K25764N72241J221951J481907
$$ plain form
42359 1235901 2413988 2701688 1833641 1073478 1348782 2149469 2628789 2794193 3041986
42350 3041986 3283686 3188489 2811809 2460262 2298785 2463614 3142863 4154251 4839652
42341 4839652 4773205 4221460 3578488 2814341 1919620 1380152 1543817 1877791 1645511 1154095
42331 1154095 1464700 2782947 3983459 4067907 3362533 2742731 2306369 1626118 952993
42322 952993 1125026 2141567 2768940 2095077 825246 334546 845294 1356487 1218999
42313 1218999 916095 1165995 2031706 3197238 4402614 5182743 4868854 3515212 2342569
42304 2342569 2496026 3617644 4375936 4237683 3930283 4159999 4682709 4879539 4602520
42295 4602520 4106095 3606665 3240792 3125936 3224408 3450172 4022413 5244364 6726271
42286F726271O76051o32859j102268l83502M36391M30988K864n4024J15424j52126
42276F063210p38129p99196q2652O21891N73378L2941k20732O2615M42107M64365
42266F419798J34904k20080k74972Q1874O09345Q13854M39841j53481l80739j87012
42256G283332n6410k03925k27527J66331N32548K63331m64174q60448n62762R56
42246E871252K98980K75992J45492L408j82006m45321p63744r21587n38873L91826
42236D135419J104292P64411l43414r34237k86184Q33006J171325N12520k55372
42227F701766l46117R1793L15645r0946o92946o45808K20268R69933O34064m41308
42217F716344r67795m55776K06415J59102k87084m38671l92371o47813j055729
$$ plain form
42286 6726271 7402322 6769463 5667195 5283693 5720084 6151072 6153936 6099912 6215336 6063210
42276 6063210 5325081 4525885 4443233 5065124 5638502 5671443 5450711 5513326 5955433 6419798
42266 6419798 6554702 6334622 6059650 6141524 6750869 7564723 8004564 7851083 7470344 7283332
42256 7283332 7226922 7022997 6795470 6961801 7494349 7757680 7293506 6433058 5870296 5871252
42246 5871252 6170232 6446224 6591716 6595124 6413118 5967797 5204053 4282466 3743593 4135419
42236 4135419 5239711 6004122 5660708 4726471 4440287 5273293 6444618 6957138 6701766
42227 6701766 6355649 6447442 6763087 6672141 5979195 5333387 5553655 6523588 7157652 6716344
42217 6716344 5748549 5292773 5499188 5658290 5371206 4932535 4540164 3892351 2836622
42208B836622j009747m55300M5903J57926N3636n5402r5353R4390N96160J022955
42198C191790Q05404m6367q44773r70332m75265O3236J32048k22180m47705k19273
42188I66583K852l44867p75285j91458J275191J982539J016858l55629n08424
42179C068360K15224L35365l23825o41348k82953o0828k09027K4872P55865R73727
42169C855432K21742n68741n51913j07433J31208K78472N16316M31584j83481
42160D023186p31682p38741n72453n78953l78000K60045P22810N47297K57832
42151B811341L76839M55180J0152m22822k18266J53094o180l09804p6115K66339
42141C039758o6922o32130m16273L42775N56019K06781K09767M85896o224j150026
$$ plain form
42208 2836622 1826875 1371575 1417478 1575404 1629040 1573638 1478285 1572675 2168835 3191790
42198 3191790 3997194 3950827 3106054 2135722 1660457 1723693 1855741 1633561 1185856 966583
42188 966583 969435 624568 -150717 -342175 933016 2915555 3932413 3576784 3068360
42179 3068360 3283584 3618949 3295124 2653776 2370823 2309995 2100968 2125840 2881705 3855432
42169 3855432 4077174 3508433 2956520 2849087 2980295 3258767 3775083 4206667 4023186
42160 4023186 3291504 2552763 1980310 1401357 1023357 1283402 2006212 2553509 2811341
42151 2811341 3188180 3643360 3653512 3230690 3012424 3165518 3159338 2849534 2773419 3039758
42141 3039758 2972836 2340706 1924433 2267208 2823227 3030008 3239775 3725671 3719447 2569421
42131B569421j433567l46013P15845O92942L99323Q02472J241818O96891k96692
42122E042440m99501m732O9352m80422p31744k66971K46439K37436l1751j37731
42112C442815p7106P3762L79361O51121M30799l13178r35323q78080l49512M0746
42102B465405N3103n0169K0274K20245K60337m2403m92049o32140k32767M00173
42092A970009P45297O29242K92005k5469k77231l88077j67256L57940P30627M75391
42082D342478k84397q42905o58560L2998N03828L73115m9451k81226k38561j01928
42072B795391J11005M54346O74619M02207k35129o48003n86908m76059p03379
42063A788090r92017q55263l58252M0413K26749N18704J041132J447408J356594
$$ plain form
42131 2569421 1135854 789841 1505686 2198628 2597951 3400423 4642241 5339132 5042440
42122 5042440 4542939 4538207 4607559 4127137 3395393 3128422 3374861 3612297 3580546 3442815
42112 3442815 3365709 3439471 3818832 4469953 4900752 4587574 3652251 2774171 2424659 2465405
42102 2465405 2518508 2468339 2488613 2708858 2969195 2926792 2434743 1802603 1569836 1970009
42092 1970009 2715306 3344548 3636553 3611084 3333853 2945776 2778520 3136460 3867087 4342478
42082 4342478 4058081 3215176 2556616 2589614 3093442 3466557 3417106 3135880 2897319 2795391
42072 2795391 2906396 3360742 4035361 4437568 4202439 3554436 2967528 2491469 1788090
42063 1788090 796073 -59190 -417442 -377029 -150280 368424 1409556 2856964 4213558
42054D213558P71685p111o36642q57531o34251k59091j05170k02545k53799j07321
42044A921782M5504M3248L9316K05785L78457K89222L6060O19K90440N52731M46100
42033D249264O8844k41094l50221l50318k56429P718K98651K38896l00136q95755
42023B469420r87520m98614J61583O18306P85975O54042J94288l71615n30446
42014B495419k1862O87873P86869K7040r31320j172482m44158O13436J091052
42005C131867O41401k44111p44999n13402M0607K78300N2621k45957l17525l45491
41995A733311n86805p92795m15240N83315J470194J490002O71563k92147p77406
41986C083992o35093r0004M21597M42993q2633o11234n76205j29398J10347J0082
$$ plain form
42054 4213558 4985243 4978132 4341490 3483959 2849708 2590617 2485447 2282902 2029103 1921782
42044 1921782 1967286 2010534 2049850 2255635 2634092 2923314 2959374 2959993 3250433 3803164 4249264
42033 4249264 4318108 4077014 3726793 3376475 3120046 3127764 3426415 3665311 3365175 2469420
42023 2469420 1481900 983286 1144869 1763175 2549150 3203192 3397480 3025865 2495419
42014 2495419 2473557 3161430 3948299 3975339 3044019 1871537 1427379 2040815 3131867
42005 3131867 3773268 3529157 2784158 2270756 2311363 2589663 2642284 2396327 2078802 1733311
41995 1733311 1146506 353711 -61529 521786 1991980 3481982 4153545 3861398 3083992
41986 3083992 2448899 2358895 2780492 3223485 3140852 2529618 1953413 1824015 1934362 1944444
41976A944444N0958L87731M49997j25270p32875n68466J88462O03519K52073l35306
41966B115267m78346r7098M05454O05290L04171l70245r86758j113912o77552
41957b93729K7273N89609P12362M26366J71272L46007O62268M08598m27241r15985
41947A706800m95285J39755J10288l12705l28334k1755n6807k96634R538P36322
41937A191183Q64203J25511n31349m43526q6405j8855l5804J28701K31908J84333
41927A609900L45960O40656L66740n10876r33219l61232K48211J5848l50099J87410
41917A259299J092698J027889j7028p94261p27758m24648l41587k00534J57782
41908A031852M07374L96061L09363J16498l05866n19211L9791Q85893P85274m58329
$$ plain form
41976 1944444 1995402 2383133 2833130 2707860 1974985 1406519 1594981 2198500 2450573 2115267
41966 2115267 1636921 1539823 1945277 2550567 2854738 2484493 1497735 383823 -293729
41957 -293729 -266456 323153 1035515 1461881 1633153 1979160 2641428 3050026 2622785 1706800
41947 1706800 1211515 1351270 1461558 1148853 820519 798764 741957 445323 454861 1191183
41937 1191183 2055386 2180897 1649548 1206022 1119617 1100762 1064958 1193659 1425567 1609900
41927 1609900 1955860 2596516 2963256 2452380 1519161 1157929 1406140 1421988 1071889 1259299
41917 1259299 2351997 3379886 3362858 2568597 1840839 1416191 1074604 874070 1031852
41908 1031852 1439226 1835287 2144650 2261148 1955282 1436071 1475862 2361755 3147029 2688700
41898B688700j445155r18322O02585J471040Q07294o87067j600647j214102q2405
41889c78079P04285P46861N22192L56240q0441q58771j173819m55508N10760N73065
41879D66785r9614l88239K6752M44053N05033N63723O74459L97297k01593m25316
41869A963340p1354K57064J69394p2131k73256n56770p65877n37344n8153J79206
41859B34119L42586Q94089J344472P32984n74021j077607m11160J65760m4699
41850A606523j94504K38494L53977l75262q43629j51398O89773L50492o42688
41841A031778q33121o5019O40176P34048L75731l11812j016380r65224l9348O05545
41831A56374J91455l16529J81218R28140N54908n08179o93295J60665P51677M77905
$$ plain form
41898 2688700 1243545 325223 927808 2398848 3206142 2519075 918428 -295674 -378079
41889 -378079 326206 1073067 1595259 1951499 1871058 1012287 -161532 -617040 -106280 466785
41879 466785 367171 -21068 5684 449737 954770 1518493 2192952 2590249 2388656 1963340
41869 1963340 1891986 2149050 2318444 2246313 1973057 1416287 650410 113066 54913 234119
41859 234119 576705 1470794 2815266 3548250 2974229 1896622 1485462 1651222 1606523
41850 1606523 1412019 1650513 2004490 1629228 785599 634201 1323974 1674466 1031778
41841 1031778 198657 133638 773814 1507862 1883593 1571781 555401 -409823 -449171 156374
41831 156374 347829 31300 212518 1140658 1695566 1187387 494092 654757 1406434 1884339
41821A884339p6100n60231j059324j085764j12858R94468Q13251l94532r57146
41812e53897l04616M88921O70046N45377K13997n77467j175146n50266O71008
41803e72043P28530l87612p52893K50067Q51758j1410q62192l07712O08565L62579
41793i2363n03878o09163p9800J31815R8555L57336N29414J47122j19364L38682
41783A98356O52801o4956q65636m15330O05935N80564k83764m19276L21838N57024
41773H67556r5038n03178j68565R0169j14984j15006L05118M24748O0378r855
41763G41343M35587N57630k2714n33238l95950m0396R1448J81545K78327P5860
41753A369442k08834M1381N55679L62770m18178n01274L77587Q35282J15515o51030
$$ plain form
41821 1884339 1808239 1248008 188684 -897080 -1009938 -15470 797781 403249 -553897
41812 -553897 -858513 -369592 300454 845831 1059828 482361 -692785 -1243051 -572043
41803 -572043 156487 -231125 -984018 -733951 117807 106397 -755795 -1063507 -454942 -92363
41793 -92363 -596241 -1205404 -1285204 -1153389 -1054834 -697498 -168084 -20962 -140326 198356
41783 198356 851157 786201 -79435 -494765 111170 691734 407970 -11306 310532 867556
41773 867556 772518 269340 100775 190944 75960 -39046 266072 690820 751198 741343
41763 741343 1176930 1734560 1711846 1178608 782658 742262 833710 1015255 1293582 1369442
41753 1369442 1160608 1201989 1757668 2120438 1702260 1200986 1578573 2413855 2529370 1878340
41743A878340l96739K39958L41616L17320Q06420J302051J227575J159321J551506
41734H427368J443235K1642j625936k034245j626500j619353j643060o18450P19195
41725A443896O22775o14581r04557K12326Q51706J5915q20393l01998O95108P72991
41715A973188J43464k66769m59268p89185q80147l75660J68970K55066L50011
41706A19670P74285P48761k20060j045628n75308M97425P64992L59130L83695
41697A806962P23534L09690p18044j027386l05710L22410K73377J87234L35900
41688A907967Q5167n54207n55814K21486M30046n10233j152295k84178R70625
41679E58564Q90745j07553k75696N98480J012732K60314o28513o74221k22873
$$ plain form
41743 1878340 1481601 1721559 2063175 2380495 3186915 4488966 5716541 6875862 8427368
41734 8427368 9870603 9892245 8266309 6232064 4605564 2986211 1343151 724701 1443896
41725 1443896 2066671 1452090 547533 759859 1611565 1627480 807087 505089 1200197 1973188
41715 1973188 2116652 1849883 1390615 601430 -278717 -654377 -485407 -230341 119670
41706 119670 893955 1642716 1422656 377028 -198280 299145 1064137 1423267 1806962
41697 1806962 2530496 2840186 2122142 1094756 789046 1111456 1384833 1572067 1907967
41688 1907967 1993134 1438927 883113 1104599 1534645 1024412 -127883 -412061 558564
41679 558564 1449309 1341756 1066060 1664540 2677272 2937586 2309073 1634852 1411979
41670A411979L486k4757o1598j87512m40476m80692j16673K83333K93784J2462
41660F93336j48546o031K48071K84364k3286l89734m08554j82325k70679p12515
41650i15899o82069K72098J236743J095205K22374j08222K79485L87125p9283
41641A707557k17374L70042P93507L96990j98458l21218l58960p33115q22461
41632F16510l0326Q92911P99330j43953q28188q45997o51593m39442n828M61518
41622a75058N23502L28954L65593M91558J63433m81439p51417n43917l77335l34036
41612g90162k1851M03893L11604j82740k16884L47073O20774K18129j06154J42904
41602G26586L55305O0133j45829J97317L61229l04980r74827n19080N84300R21402
$$ plain form
41670 1411979 1415465 1390708 1329110 1141598 701122 220430 103757 387090 680874 693336
41660 693336 544790 538759 786830 1071194 1047908 658174 249620 67295 -203384 -915899
41650 -915899 -1597968 -1325870 -89127 1006078 1228452 1120230 1399715 1786840 1707557
41641 1707557 1490183 1860225 2653732 3050722 2852264 2531046 2172086 1438971 616510
41632 616510 586184 1479095 2278425 2134472 1306284 460287 -191306 -630748 -636576 -175058
41622 -175058 348444 677398 1042991 1534549 1697982 1216543 465126 -78791 -456126 -790162
41612 -790162 -812013 -408120 -96516 -279256 -496140 -149067 471707 689836 583682 726586
41602 726586 1081891 1142024 996195 1193512 1554741 1249761 274934 -244146 340154 1261556
41592A261556L09458j58566n9703j31861o75690q95857l12863L59004L88302J23231
41582B07011J91058L73559Q8506n31435q25201n66434r9966K57270M14477L15061
41572a76094K8003j52794q4939J0174N7237L96825J026938J121931J39005j021117
41562A345169j035995j30682K40734k72013l79555N54719J226134M75782o29541
41553A394752l76664P84526Q92657l72400j194256n42973L44125J93346l18841
41544H04272m6042N52986L87223j99678q8055M76521K58957o48154q03337P7592
41534G72285N12213k03342o79725J95274J180975O13486p48064p92881N83119
41525A433340J308340L95439o73901m88079J67861p5997p90929n66101N21850
$$ plain form
41592 1261556 1571014 1412448 1352745 1220884 545194 -350663 -663526 -304522 83780 207011
41582 207011 398069 771628 860134 328699 -496502 -1062936 -1162902 -905632 -491155 -176094
41572 -176094 -148091 -300885 -385824 -375650 -318413 78412 1105350 2227281 2366286 1345169
41562 1345169 309174 178492 419226 147213 -232342 322377 1548511 2024293 1394752
41553 1394752 1018088 1802614 2695271 2322871 1128615 585642 929767 1123113 804272
41544 804272 758230 1311216 1698439 1498761 1410706 1887227 2146184 1498030 694693 772285
41534 772285 1284498 1081156 401431 596705 1777680 2391166 1643102 850221 1433340
41525 1433340 2741680 3137119 2463218 1975139 2143000 2067003 1276074 709973 1231823
41516A231823R28175O75j144771j337854p17541K2850O51915J037685P12123l45440
41506A039640j142579q09543J22336M71450R9118j34946Q3919J58999j38247j70193
41496d20046L49418O44791P6750p21269p42528j17665J69196k06676n68732l73727
41486a910488R1996L06548K12661Q1939O2018Q7350M5601q6660j94026j52235
41476a455296o7465j72192l53799j37959N74371J139891R74110L65866l3587j80280
41466F53660m15286n64205j40206O03055P42489J9931o83945n47225J64851O45041
41456D78160N83971K65771L1495J1157J07766K7144l89439p80843o34383j00929
41446d00130J19538j62848l58064j44482k6575l62232n59378K3403Q94129J002638
$$ plain form
41516 1231823 2159998 2160673 1015902 -321952 -1039493 -1016643 -364728 672957 1385080 1039640
41506 1039640 -102939 -912482 -790146 -318696 -219578 -354524 -270605 -111606 -249853 -420046
41496 -420046 -70628 574163 650913 -70356 -812884 -930549 -761353 -968029 -1536761 -1910488
41486 -1910488 -1818492 -1511944 -1299283 -1217344 -1155326 -1067976 -1022375 -1109035 -1303061 -1455296
41476 -1455296 -1522761 -1694953 -2048752 -2186711 -1612340 -472449 501661 867527 833940 653660
41466 653660 238374 -325831 -466037 137018 879507 899438 215493 -331732 -166881 478160
41456 478160 1062131 1327902 1359397 1370554 1478320 1505464 1116025 335182 -299201 -400130
41446 -400130 -280592 -443440 -801504 -945986 -972561 -1334793 -1894171 -1870768 -976639 25999
41436B5999K45562m39040m50361k45258m91378j053187j164264m02436P43109
41427c231254J306722Q57393J5152k33646K94059Q34782P54410K99811O2644J69837
41417A129910L60585M63383L94218L5310m72591o65078m04303k08892m46148o27854
41407d41460j67474N30213N60658q4156m94525k29195J46980J00690j12795j05738
41397b96802p7255l40395o12710l78313K85422P74913P56444M51875J56725j00939
41387F18965l17605k98454M8918L97505L03742j85393n24586l62454L8590K54753
41377b6019K77369L18113L03563L8297k89859l37634k69987n30392r14445o72777
41367b103771K15203P26463K64021l49154r7716O44162P20545R986m24542L4105
$$ plain form
41436 25999 271561 -167479 -617840 -863098 -1354476 -2407663 -3571927 -3974363 -3231254
41427 -3231254 -1924532 -1067139 -1051987 -1285633 -991574 -156792 597618 897429 960073 1129910
41417 1129910 1490495 1953878 2348096 2383406 1910815 1245737 841434 632542 186394 -441460
41407 -441460 -608934 -78721 481937 397781 -96744 -325939 -178959 -78269 -191064 -296802
41397 -296802 -374057 -714452 -1327162 -1705475 -1420053 -645140 111304 563179 719904 618965
41387 618965 301360 2906 51824 449329 753071 567678 43092 -319362 -280772 -26019
41377 -26019 251350 569463 873026 911323 621464 283830 13843 -516549 -1430994 -2103771
41367 -2103771 -1888568 -1162105 -898084 -1247238 -1344954 -700792 19753 29739 -394803 -360698
41357c60698P35878P92802J96970m08611n68101l19164M188N4320k25186m85774
41347e83376l62412M3609L22035L38851L48651N31102P29948P12374M60391J37746
41337B678919j17756l46143o85626j024505q76643j198R33550R44154R9091m54685
41327A149158r5478M89704N51504L39251K33324j58132j023063j410169n90152
41318e14053L90821N5481j107735j270378m7101J087556J159155O98365J92111
41309F44222o21453j412608j048761M28651J252615M03856q11357q21697q3225
41300b069757O3393l27871k68074K36828L68183J44984L16809P99577O78589j72314
41290b29653p41040l73053L88748P18008M57447p0336n36132o67455l46687J88380
$$ plain form
41357 -360698 375180 1167982 1364952 956341 388240 69076 73264 127584 -97602 -583376
41347 -583376 -945788 -902179 -580144 -241293 107358 638460 1368408 2080782 2541173 2678919
41337 2678919 2561163 2215020 1529394 504889 -371754 -372952 560598 1504752 1603843 1149158
41327 1149158 1053680 1543384 2094888 2434139 2667463 2509331 1486268 76099 -514053
41318 -514053 -123232 -67751 -1175486 -2445864 -2492965 -1405409 -246254 452111 644222
41309 644222 22769 -1389839 -2438600 -2009949 -757334 -353478 -1164835 -1986532 -2069757
41300 -2069757 -2006364 -2334235 -2602309 -2365481 -1997298 -1852314 -1535505 -735928 -57339 -229653
41290 -229653 -970693 -1343746 -954998 -236990 220457 150121 -386011 -1053466 -1400153 -1211773
41280a211773N68046O81658N53616P7944o73054j141413q45536p5364M81157O00944
41270i83775N24461L84141K21226K93673P08181R67539N54781k28461o73499o87098
41260A081169o74374o38046k58425K53979L16866M584k952L82174M39857j16460
41250G88372n82855l82753M3340L7429k04556l9162N21915Q08607M98998O0508
41240A549843M8558L13769K03029m84868j056531p51215J18298M09084k97347
41231E2620j015682p05954K72886P93768O23396N05941P46653P58527K03918l46507
41221A889566l24958l3112p5809m11318n06184j79221J77079J60938j44952k93481
41211B58548j1815M28310M96961Q7842l46468m59398m16436l75709p2707N74569
$$ plain form
41280 -1211773 -643727 37931 591547 669491 -3563 -1144976 -1990512 -2065876 -1584719 -983775
41270 -983775 -459314 -75173 146053 439726 1147907 2115446 2670227 2441766 1768267 1081169
41260 1081169 406795 -231251 -489676 -235697 81169 85753 82801 464975 904832 788372
41250 788372 205517 -177236 -133896 -96467 -301023 -340185 181730 990337 1489335 1549843
41240 1549843 1598401 1912170 2115199 1630331 573800 -177415 -59117 349967 52620
41231 52620 -963062 -1669016 -1396130 -602362 21034 526975 1273628 2032155 2236073 1889566
41221 1889566 1564608 1531496 1455687 1044369 538185 358964 536043 696981 552029 258548
41211 258548 246733 675043 1172004 1259846 913378 453980 37544 -338165 -410872 163697
41201A63697R31041M27288m70627q49225o12452l08518J8564P45673J544901J511441
41191C101783N86044k12844k45288L8489J00841J2111j74848o73668j164499q46886
41181E21235J69718O60469J36505k88745K36398P91963K55296o96154o85488L0209
41171A131406O4078o48896p22609K96437J114803P00420l06847q01242o63784
41162A63766l31985Q7349N11710M84712j30093o62902n56268k11992k10161k53328
41152a109192K33632Q77564P58114j01056o43419k93402L26606M51379J43839
41143F44065j84378m87618p40271m90122M51420J243379Q53024m07831j088262
41134b06594n26220K89164K27467l79181l99280L16439P71080L82236j81834l4565
$$ plain form
41201 163697 1094738 1522026 1051399 202174 -410278 -718796 -700232 45441 1590342 3101783
41191 3101783 3687827 3474983 3229695 3268184 3369025 3381136 3206288 2532620 1368121 521235
41181 521235 690953 1351422 1487927 1199182 1435580 2227543 2482839 1786685 1101197 1131406
41171 1131406 1195484 546588 -176021 120416 1235219 1935639 1628792 827550 163766
41162 163766 -168219 -80870 430840 915552 785459 122557 -433711 -645703 -855864 -1109192
41152 -1109192 -875560 2004 760118 659062 15643 -277759 48847 500226 644065
41143 644065 459687 -27931 -768202 -1258324 -806904 436475 1289499 881668 -206594
41134 -206594 -732814 -443650 -216183 -595364 -994644 -678205 92875 475111 293277 258712
41124B58712O76124J022594N18561l49731p78132n48164j58878j28234l47156
41115A65696l36191n6138n394l37368m42216J00574O58951M15105k46166k32409
41105c15556M52513N89246k73011r22447l03884P76073Q21789j35506p10437k68087
41095b89307L68129L87648P3550M4458K69428L60337K68228J70932N9278j07431
41085A605250j34911R7003L05344J86652q4931j52502o9617j23168k15636j0661
41075A402823L22918J88022m25120o87536j41498M36284O6316r40126j357193
41066a135110p51861Q1824M46728N63956P63147P41179K06666m06909n32065k89739
41056c12184j18814l9258J00654R5541k20396m62019k81276m1214j38275j21927
$$ plain form
41124 258712 934836 1957430 2475991 2126260 1348128 799964 641086 512852 165696
41115 165696 -170495 -226633 -232027 -569395 -1011611 -911037 -252086 163019 -83147 -315556
41105 -315556 136957 726203 453192 -469255 -773139 2934 824723 689217 -21220 -289307
41095 -289307 78822 466470 540020 584478 853906 1214243 1482471 1653403 1712681 1605250
41085 1605250 1470339 1567342 1872686 2059338 1974407 1821905 1752288 1629120 1413484 1402823
41075 1402823 1725741 1913763 1488643 801107 659609 1095893 1162209 222083 -1135110
41066 -1135110 -1886971 -1805147 -1358419 -794463 -31316 709863 916529 509620 -22445 -312184
41056 -312184 -430998 -470256 -369602 -274061 -494457 -956476 -1237752 -1278966 -1417241 -1539168
41046a539168N73562J425077J430816O42934n4168m63082j073376j655167j331517
41037b044089k24276M51217K99839K86841Q45537R75184N9826q29286n51344L35136
41027c95415N91809J30328l44302o49124q68060n71315M07112J059877M23359
41018b15731p85932j078455l35560K84321K54612R6292N3842k21602o09197m47000
41008c004410K71452P55884O89571O15297Q40647R32400N59809j1081m73444p58188
40998D17937o76618j18258L58721O7343o08554n71952K76430P71569K38283n58836
40988d03935o91089l20193q8653p5578j0404R0655R2540Q5689J33401J01043O700
40977a079824M1191O3535k77997p32057n41532L19186Q33340L58959m03001m58370
$$ plain form
41046 -1539168 -965606 459471 1890287 2533221 2479053 2015971 942595 -712572 -2044089
41037 -2044089 -2268365 -1817148 -1517309 -1230468 -384931 590253 650079 -179207 -730551 -395415
41027 -395415 196394 326722 -17580 -666704 -1534764 -2106079 -1698967 -639090 -215731
41018 -215731 -1001663 -2080118 -2415678 -2131357 -1876745 -1780453 -1726611 -1948213 -2557410 -3004410
41008 -3004410 -2732958 -1977074 -1287503 -672206 168441 1100841 1660650 1649569 1176125 417937
40998 417937 -258681 -376939 -18218 49125 -559429 -1131381 -854951 -83382 154901 -403935
40988 -403935 -1095024 -1415217 -1503870 -1579448 -1589852 -1499197 -1406657 -1320968 -1187567 -1086524 -1079824
40977 -1079824 -1038633 -975098 -1253095 -1985152 -2526684 -2207498 -1374158 -1015199 -1418200 -1876570
40967a876570J15087N28483N02132M15436N27563O55234N23755Q7355m04753n62478
40957E11244l10956j28387l83232n83508k1038R05261R98690N9828p11198n01793
40947a65089J0733n1560l98851k93405K03347N43794N71393L48537j80026o56014
40937f7141k91317Q03570J225324K42451q15467m43833O44529O44274m50062r62670
40927E29658l33922J66093k36638o30051j81710M89180N67003L74129M84834N60888
40917A789464J09824m13202l14868J31135J96176n7983m3580J90103P8562l37347
40907A328284l98782N0233M23679L98660L30449M40083L85202J3326j89346O2725
40897B844513J94531l43658j004988q47328p8537J16325n94846j060303l33542
$$ plain form
40967 -1876570 -1761483 -1233000 -730868 -315432 212131 867365 1391120 1478475 1073722 511244
40957 511244 200288 71901 -311331 -894839 -915877 -10616 988074 1047902 336704 -165089
40947 -165089 -154356 -205916 -604767 -898172 -694825 -151031 420362 768899 588873 -67141
40937 -67141 -358458 445112 1670436 1912887 1097420 653587 1298116 1942390 1492328 529658
40927 529658 195736 361829 125191 -504860 -686570 -197390 369613 743742 1228576 1789464
40917 1789464 1899288 1486086 1171218 1302353 1498529 1440546 1396966 1587069 1665631 1328284
40907 1328284 929502 979735 1403414 1802074 2132523 2572606 2957808 2971134 2781788 2844513
40897 2844513 3039044 2695386 1690398 843070 764533 880858 286012 -774291 -1107833
40888a107833Q75374J233619O70693K38782L67935L50308l14468j033991j015962
40879B64457l63779K20303L65316K03964l9476k00251j43432O7844J51598q354
40869E18190j80279j80037j49744k06180j35350K45826O74983P17887L05544k30477
40859A380363n23029m48190k22993k52593o06106p19104j05291O85224N52057
40850b59662n48411j309789p95437L31431Q65812O29487K69863J09000K6584M5968
40840f35154J98580J28245l77143p52625l60559M16381O22587J21677k78144m4046
40830i60201M76923O87584L68499k91424p87363n90730J45826M95378k4264n79057
40820a058829j83230P06554Q17376o217o75381n58062r4740L06681P29197R21264
$$ plain form
40888 -1107833 -232459 1001160 1671853 1910635 2278570 2628878 2314410 1280419 264457
40879 264457 -99322 120981 486297 690261 650785 450534 307102 374946 526544 518190
40869 518190 337911 157874 8130 -198050 -333400 -87574 587409 1305296 1610840 1380363
40859 1380363 857334 409144 186151 -66442 -672548 -1391652 -1496943 -811719 -259662
40850 -259662 -808073 -2117862 -2913299 -2581868 -1716056 -1086569 -816706 -707706 -681122 -635154
40840 -635154 -436574 -308329 -685472 -1438097 -1798656 -1382275 -759688 -638011 -916155 -960201
40830 -960201 -483278 204306 572805 281381 -505982 -1096712 -950886 -455508 -479772 -1058829
40820 -1058829 -1242059 -535505 281871 275654 -399727 -957789 -1052529 -745848 -16651 904613
40810I04613K99625q34134j269269n83033K19738K91320P5865K21726M34872K39776
40800A099m8671l1131j15265p33024j309438j015839r1444N24864N30449L80459
40790a907941L98428N64518Q77999J156700Q14551l30114j336330j136601l5190
40781i33980P13176O61393M95487O17354M97381k52140j077355j253334q21686
40772a353704k96960P1626K98896K98304k6524m93965p51172n84501k1867O85733
40762b174134J111776R40080L32071j91609l15344j74821k8473K4691n0916k61652
40752g88331l95804j43639L99675O82979M24527Q2820K12344N69774L98466l94252
40742A048559r30554n46775J63674P8554q24937j282725m38354Q94135J252049
$$ plain form
40810 904613 1204238 370104 -899165 -1482198 -1262460 -971140 -895275 -673549 -238677 1099
40800 1099 -47572 -78703 -193968 -926992 -2236430 -3252269 -3343713 -2818849 -2288400 -1907941
40790 -1907941 -1509513 -944995 -66996 1089704 1904255 1574141 237811 -898790 -933980
40781 -933980 -220804 440589 936076 1553430 2050811 1798671 721316 -532018 -1353704
40772 -1353704 -1650664 -1579038 -1280142 -981838 -1008362 -1502327 -2253499 -2838000 -2859867 -2174134
40762 -2174134 -1062358 -122278 209793 18184 -297160 -471981 -500454 -475763 -526679 -788331
40752 -788331 -1184135 -1327774 -928099 -245120 179407 262227 474571 1044345 1442811 1048559
40742 1048559 118005 -428770 -265096 -186542 -1011479 -2294204 -2732558 -1838423 -586374
40733e86374M46669l12992j59007M20426N68890K73371K1721j44877m60612o69130
40723f01915l06467L30961L72730l18744q33238n34759N0804K03630K03030P38003
40713f95965J506087J391275J00624j240587j476569p73111j31072k1247o5728
40704a406293J61311N64154P36765L97151l45632r23906p02426K39581R54175
40695c25120O92580j00167m16989j11663M9993k96439o18623m80158j73025j6986
40685a796597J61701M00771K56840l15293n11451J33473P87828M60265m42248
40676h64711o90383l427P59314R51756P17699L49614j4553j34289P0969J40386
40666A282375k56816n58821j56025L73655P3034o41791m86760N04142Q96618J56205
$$ plain form
40733 -586374 -139705 -452697 -611704 -191278 377612 650983 672704 527827 67215 -601915
40723 -601915 -908382 -577421 -204691 -523435 -1356673 -1891432 -1840628 -1636998 -1433968 -695965
40713 -695965 810122 2201397 2302021 1061434 -415135 -1188246 -1319318 -1340565 -1406293
40704 -1406293 -1244982 -680828 55937 453088 107456 -816450 -1518876 -1279295 -325120
40695 -325120 367460 267293 -149696 -261359 -211366 -507805 -1126428 -1606586 -1779611 -1796597
40685 -1796597 -1634896 -1234125 -977285 -1292578 -1804029 -1670556 -882728 -422463 -864711
40676 -864711 -1555094 -1558521 -799207 152549 870248 1219862 1205309 1071020 1141989 1282375
40666 1282375 1025559 466738 310713 684368 757402 115611 -371149 132993 1029611 1185816
40656A185816o03406n92141m08892m91748j80967P20313J029110N5578r74336
40647b60673p40046J36053L58353J50533M54816Q32273J34827j179075j384386
40638a497325j29523J020330R00265R2874l60216k62135J10182N28947N76827
40629I80226j11180j031868j171477m54225R7940r2219m34749l12620M6389K69356
40619b214427M80969P30109O11034L7563l18070L9399O25308O52259M5394o50736
40609C8802r36972o09505J52624O79058L75235l37993l61534M66182R35190K12847
40599F13934q13999p92129J41602O70000K18831m55191n51688j98070N5901N0507
40589a060302K3774J77350M55860N93959L56449j28081l92241k00196P5513o6659
$$ plain form
40656 1185816 582410 -9731 -418623 -910371 -1091338 -371025 658085 713663 -260673
40647 -260673 -1000719 -864666 -506313 -355780 99036 931309 1066136 -112939 -1497325
40638 -1497325 -1626848 -606518 293747 386621 26405 -235730 -125548 403399 980226
40629 980226 869046 -162822 -1334299 -1788524 -1690584 -1782803 -2217552 -2530172 -2483783 -2214427
40619 -2214427 -1733458 -1003349 -392315 -354752 -672822 -633423 -8115 644144 689538 38802
40609 38802 -898170 -1507675 -1355051 -675993 -300758 -638751 -1000285 -534103 401087 613934
40599 613934 -200065 -992194 -850592 -180592 38239 -416952 -968640 -1166710 -1110809 -1060302
40589 -1060302 -1036528 -859178 -403318 190641 547090 419009 26768 -173428 -97915 -164574
40579a64574n61210q95622p94742m08429R4049O79570J164137J177526N94917
40570H85622k20729p38936o92763j81204M42978P38723M67489j44034n75798n54070
40560e72722k94537j39631j45048j68073j63578j41967J9155L81191O25758L51522
40550b47930k44417m48683o578M62530L79882M7239K4775J23653j91210o84715
40540g85454o02506K7503L73180J86887J20360L71662K27259m74042o52023L17584
40530h89590J303438J007669k0561l34034J18082J95535l28605n43654k31539
40521B76741k43597p52067p03132L51596J215904P16971n63328j141390n63593
40512a405895L35898O78811L54183j68709l57319q9907J92680L9796l24606l18803
$$ plain form
40579 -164574 -725784 -1621406 -2416148 -2824577 -2730528 -2050958 -886821 290705 885622
40570 885622 664893 -74043 -766806 -948010 -505032 233691 701180 557146 -18652 -572722
40560 -572722 -867259 -1006890 -1151938 -1320011 -1483589 -1625556 -1606401 -1225210 -599452 -247930
40550 -247930 -492347 -941030 -947608 -485078 -105196 -57957 -33182 90471 -100739 -785454
40540 -785454 -1387960 -1360457 -987277 -800390 -680030 -308368 -81109 -555151 -1207174 -889590
40530 -889590 413848 1421517 1400956 1066922 1185004 1380539 1051934 508280 276741
40521 276741 33144 -718923 -1422055 -1070459 145445 862416 299088 -842302 -1405895
40512 -1405895 -1069997 -391186 -37003 -205712 -563031 -652938 -460258 -420462 -745068 -1063871
40502a063871O2505K81452K17768L02298N80909N18464m654l64556k28094r6341
40492B05880l76133o68732m80289J1910L62904M45674K77929j23821m38206k63571
40482a046455J50730J94884K9893L51070Q43514L00277j195718j795947n54647
40473b722399R42703R30493N9944m740N72427L60702o50087j047578m43316Q5801
40463a916050N5211J71829N84986L60774o96743j303770n97067N29280Q63955
40454a947595N55704M18820M70597J80426m17698p89234p24656m03346N0075N06033
40444b100874O62019M50521K88138M65810O72347N79660M34122M80606K78387
40435B210736n97489j483876j245578K5792R09339N55027k09325k40883K42422
$$ plain form
40502 -1063871 -1001366 -719914 -502146 -199848 381061 899525 894871 530315 302221 205880
40492 205880 -170253 -838985 -1319274 -1307364 -944460 -498786 -220857 -344678 -782884 -1046455
40482 -1046455 -895725 -700841 -670948 -319878 523636 823913 -371805 -2167752 -2722399
40473 -2722399 -1779696 -849203 -789259 -793999 -221572 139130 -510957 -1558535 -2001851 -1916050
40463 -1916050 -1860839 -1689010 -1104024 -743250 -1439993 -2743763 -3340830 -2811550 -1947595
40454 -1947595 -1391891 -973071 -502474 -322048 -739746 -1528980 -2253636 -2656982 -2606907 -2100874
40444 -2100874 -1438855 -988334 -700196 -234386 437961 1017621 1451743 1932349 2210736
40435 2210736 1613247 129371 -1116207 -1090415 -181076 373951 164626 -76257 166165
40426A66165K70259j17827K8494P32067P25846m98592j501558q39957O59763R93267
40416F17927p9386p81232p0312R54474R31521J24961m12896m54414l72896j60146
40406B97601K80881M86940Q5956l88618k66048J37417R8801k33331j42290L73204
40396G30513O08506K89936j63343l95171l99312k24697k5126j08058l61791j53319
40386b01862N38431O42258l94285j328733p60895O43977J127190N23362J91087
40377I80530M96884L31333o72086j325869q47208j8310K61188J74277R5929j69857
40367f93189n77122m86558J90805O32466M79008L81331O03623M10263m30253q96218
40357c85844l68506K64673J59613r5707K29863N70235K06247k65946l1154L58785
$$ plain form
40426 166165 436424 318597 347091 1079158 1805004 1306412 -195146 -1035103 -375340 617927
40416 617927 538541 -242691 -313003 641471 1572992 1697953 1285057 830643 457747 297601
40406 297601 578482 1065422 1151378 762760 496712 634129 732930 499599 357309 730513
40396 730513 1339019 1628955 1465612 1070441 671129 446432 421306 313248 -48543 -201862
40386 -201862 336569 978827 584542 -744191 -1505086 -861109 266081 789443 980530
40377 980530 1477414 1808747 1136661 -189208 -1036416 -1054726 -793538 -619261 -523332 -693189
40367 -693189 -1270311 -1756869 -1566064 -933598 -454590 -73259 530364 940627 510374 -385844
40357 -385844 -754350 -489677 -330064 -425771 -195908 374327 580574 314628 283474 642259
40347F42259o01o27334n24617m8586j86590n54970M178J132266J227213P3927
40337A137145o92943j66026N18042J50330p18523q70651k69835K12579K29859
40328d70023J53015K04259K15111J30665J54847L58745N07943L67271J0505k65723
40318A366615l16534l24198m55443m71757n7188M94983M97384o5874l55378P6962
40308C89572N40301K56301m66354p88447n34422j07169K76022M78416R9102q51008
40298g07686j385740o78501N84624J036844N16169N251m4473o5839j77846K283
40288i14914K70217o3040p16520m65606Q89122J868788J322043k2996p85095p32149
40278F49850m98258l33158r8282O2124n1494j71241J0070K45404J91421N9609
$$ plain form
40347 642259 641658 14324 -510293 -558879 -745469 -1300439 -1296261 -163995 1063218 1137145
40337 1137145 444202 278176 796218 946548 228025 -642626 -912461 -699882 -470023
40328 -470023 -317008 -112749 102362 233027 387874 746619 1254562 1621833 1632338 1366615
40318 1366615 1050081 725883 270440 -201317 -258505 236478 733862 667988 312610 389572
40308 389572 929873 1186174 719820 -68627 -603049 -710218 -434196 44220 143322 -707686
40298 -707686 -2093426 -2771927 -2187303 -1150459 -634290 -629039 -673512 -739351 -917197 -914914
40288 -914914 -644697 -707737 -1424257 -1889863 -1000741 868047 2190090 2167094 1381999 649850
40278 649850 151592 -181566 -279848 -217724 -269218 -440459 -430389 -184985 6436 66045
40268F6045J84897L43632J53531k03435l08494k25477k38490j94672J77310N54432
40258C09279L94173j27961l32787j44430j90852o79742r24958l35045O57710J076037
40248b98576N37209l99870q77840n18834L29024R34493P86700k4078r24799j290356
40238a746927q44571J19315Q48665P34778k026m50038n4398O78036P99173P8648
40228A60655p73522r49116l19160N55024R19323M16568n43931j073384p12203
40219b319746N7533M65621L92724K28918L8327m29751r13182o67713L60638J164408
40209a622223R99747L99239J79641J18050l77708q01328j38358J162516J370767
40200A290343O5650r62435l01741R40352R19956r2291l70154L82685P63965J92936
$$ plain form
40268 66045 250942 594574 748105 544670 236176 10699 -227791 -422463 -245153 309279
40258 309279 703452 575491 242704 98274 -92578 -772320 -1697278 -2032323 -1374613 -298576
40248 -298576 238633 -161237 -1039077 -1557911 -1228887 -294394 492306 468228 -456571 -1746927
40238 -1746927 -2591498 -2472183 -1623518 -888740 -890766 -1340804 -1395202 -717166 82007 160655
40228 160655 -612867 -1561983 -1881143 -1326119 -406796 9772 -534159 -1607543 -2319746
40219 -2319746 -2262213 -1796592 -1403868 -1174950 -1136623 -1566374 -2479556 -3147269 -2786631 -1622223
40209 -1622223 -622476 -223237 -43596 74454 -303254 -1104582 -1242940 -80424 1290343
40200 1290343 1355993 393558 91817 1032169 1952125 1859834 1489680 1872365 2636330 2829266
40190B829266k74701j8900J22602l63861n85516P641L43281m45342j227300n48690
40180a61520Q74382J139115L4549q85435q14521m71274l75476j09496M04625M80462
40170A15411L297j96166J61393K33924m02146q91852n35773N0991P6229j42745
40160a527437J8929K88344J35544j00365J69170N72114L11242m27526o90745k27940
$$ plain form
40190 2829266 2554565 2535665 2658267 2294406 1708890 1716531 2059812 1614470 387170 -161520
40180 -161520 712862 1851977 1886526 1001091 186570 -284704 -660180 -769676 -365051 115411
40170 115411 118708 -77458 83935 317859 -84287 -976139 -1511912 -1460921 -1384692 -1527437
40160 -1527437 -1508508 -1220164 -1084620 -1184985 -1015815 -443701 -132459 -559985 -1250730 -1478670
$$ [...]
##END NTUPLES=NMR SPECTRUM
##END=
