##TITLE=31Pdec_LR-678-RM2
 , 24 sc
 24.6.2019
##JCAMPDX= 6.0         $$ Bruker NMR JCAMP-DX V2.0
##DATA TYPE= NMR SPECTRUM
##DATA CLASS= NTUPLES
##ORIGIN= UXNMR, Bruker Analytische Messtechnik GmbH
##OWNER= root
$$ XWIN-NMR		Version 3.5
$$ Mon Jun 24 14:07:50 2019 Russian Standard Time (UT+4h)  she@DPX200
##.OBSERVE FREQUENCY= 81.013821
##.OBSERVE NUCLEUS= ^31P
##.ACQUISITION MODE= SIMULTANEOUS
##.ACQUISITION SCHEME= undefined
##.AVERAGES= 24
##.DIGITISER RES= 17
##SPECTROMETER/DATA SYSTEM= spect
##.PULSE SEQUENCE= zgpg30
##.SOLVENT NAME= D2O
##.SHIFT REFERENCE= (INTERNAL, D2O, 0, 182.463)
##AUDIT TRAIL= $$ (NUMBER, WHEN, WHO, WHERE, WHAT)
$$ ##TITLE= Audit trail, XWIN-NMR		Version 3.5
$$ ##JCAMPDX= 5.01
$$ ##ORIGIN= Bruker BioSpin GmbH
$$ ##OWNER= she
$$ F:/spectra/data/she/nmr/P31/1/pdata/1/auditp.txt
$$ ##AUDIT TRAIL=  $$ (NUMBER, WHEN, WHO, WHERE, WHAT)
(   1,<2019-06-24 14:06:47.03 +0400>,<she>,<DPX200>,
      <created by zg, POWCHK disabled, PULCHK disabled
       configuration hash MD5:
       00 E9 B6 7A A2 85 ED C7 34 08 36 98 17 FE 4E 26
       data hash MD5: 32K
       95 59 4A 7C 85 EC BD 50 18 05 5B 47 AA 48 DA C8>)
(   2,<2019-06-24 14:06:49.26 +0400>,<she>,<DPX200>,
      <Start of raw data processing
       efp BC_mod = 2 LB = 1 FT_mod = 6 PKNL = 1 PHC0 = -2601.803 PHC1 = 220.399 SI = 64K 
       data hash MD5: 64K
       4A 16 CC 9E FA 47 F5 F0 B2 9C CE 79 5B 66 D2 A0>)
(   3,<2019-06-24 14:07:11.40 +0400>,<she>,<DPX200>,
      <pk PHC0 = 6.442672 PHC1 = -19.8 
       data hash MD5: 64K
       7E ED A7 5C F8 65 E8 01 B6 1E 45 D9 99 5D 70 A0>)
(   4,<2019-06-24 14:07:14.54 +0400>,<she>,<DPX200>,
      <abs ABSG = 5 
       data hash MD5: 64K
       E5 84 FE 9E C7 BB CC CE 34 7E F1 4A C8 E8 69 EE>)
$$ ##END=
$$ 
$$ hash MD5
$$ CD E6 0A 46 CA 89 76 87 ED 83 28 A8 87 A1 DB 66
##$RELAX= 
##$RELAX= 
##$RELAX= 
##$RELAX= 
##$RELAX= 
##$RELAX= 
##$RELAX= 
##$RELAX= 
$$ Bruker specific parameters
$$ --------------------------
##$DU= <F:/spectra>
##$EXPNO= 1
##$NAME= <P31>
##$PROCNO= 1
##$TYPE= <nmr>
##$USER= <she>
##$AMP= (0..31)
100 100 100 100 100 100 100 100 100 100 100 100 100 100 100 100 100 100 
100 100 100 100 100 100 100 100 100 100 100 100 100 100 
##$AQSEQ= 0
##$AQ_mod= 1
##$AUNM= <au_zg>
##$AUTOPOS= <>
##$BF1= 81.014009
##$BF2= 200.13
##$BF3= 200.13
##$BF4= 200.13
##$BF5= 200.13
##$BF6= 200.13
##$BF7= 200.13
##$BF8= 200.13
##$BYTORDA= 1
##$CFDGTYP= 0
##$CFRGTYP= 5
##$CHEMSTR= <none>
##$CNST= (0..31)
1 1 145 1 1 1 1 1 1 1 1 1 1 1 1 1 1 1 1 1 1 1 1 1 1 1 1 1 1 1 1 1 
##$CPDPRG= <waltz16>
##$CPDPRG1= <>
##$CPDPRG2= <waltz16>
##$CPDPRG3= <>
##$CPDPRG4= <mlev>
##$CPDPRG5= <mlev>
##$CPDPRG6= <mlev>
##$CPDPRG7= <mlev>
##$CPDPRG8= <mlev>
##$CPDPRGB= <>
##$CPDPRGT= <>
##$D= (0..31)
0 1 0 0 0 0 0 0 0 0 0 0.03 2e-05 3e-06 0 0 0 0 0 0 0 0 0 0 0 0 0 0 0 0 
0 0 
##$DATE= 1561370806
##$DBL= (0..7)
120 120 120 11 120 120 24 19 
##$DBP= (0..7)
150 150 150 150 150 150 150 150 
##$DBP07= 0
##$DBPNAM0= <>
##$DBPNAM1= <>
##$DBPNAM2= <>
$$ [...]
##$SUBNAM3= <"">
##$SUBNAM4= <"">
##$SUBNAM5= <"">
##$SUBNAM6= <"">
##$SUBNAM7= <"">
##$SUBNAM8= <"">
##$SUBNAM9= <"">
##$SW= 369.568048894756
##$SWIBOX= (0..15)
0 1 3 0 0 0 0 0 0 0 0 0 0 0 0 0 
##$SW_h= 29940.119760479
##$TD= 32768
##$TD0= 1
##$TE= 0
##$TE2= 300
##$TE3= 300
##$TEG= 300
##$TL= (0..7)
0 120 53 12 22 120 120 120 
##$TP= (0..7)
150 150 150 150 150 150 150 150 
##$TP07= 0
##$TPNAME0= <>
##$TPNAME1= <>
##$TPNAME2= <>
##$TPNAME3= <>
##$TPNAME4= <>
##$TPNAME5= <>
##$TPNAME6= <>
##$TPNAME7= <>
##$TPOAL= (0..7)
0.5 0.5 0.5 0.5 0.5 0.5 0.5 0.5 
##$TPOFFS= (0..7)
0 0 0 0 0 0 0 0 
##$TUNHIN= 0
##$TUNHOUT= 0
##$TUNXOUT= 0
##$USERA1= <user>
##$USERA2= <user>
##$USERA3= <user>
##$USERA4= <user>
##$USERA5= <user>
##$V9= 5
##$VALIST= <valist>
##$VCLIST= <CCCCCCCCCCCCCCC>
##$VD= 0
##$VDLIST= <DDDDDDDDDDDDDDD>
##$VPLIST= <PPPPPPPPPPPPPPP>
##$VTLIST= <TTTTTTTTTTTTTTT>
##$WBST= 1024
##$WBSW= 4
##$XGAIN= (0..3)
0 0 0 0 
##$XL= 0
##$YL= 0
##$YMAX_a= 115686
##$YMIN_a= -150253
##$ZGOPTNS= <>
##$ZL1= 120
##$ZL2= 120
##$ZL3= 120
##$ZL4= 120
##$ABSF1= 182.463
##$ABSF2= -187.1042
##$ABSG= 5
##$ABSL= 3
##$ALPHA= 0
##$AQORDER= 0
##$ASSFAC= 0
##$ASSFACI= 0
##$ASSFACX= 0
##$ASSWID= 0
##$AUNMP= <proc_1d>
##$AZFE= 0.1
##$AZFW= 0.5
##$BCFW= 0
##$BC_mod= 2
##$BYTORDP= 0
##$COROFFS= 0
##$CY= -3
##$DATMOD= 1
##$DC= 0
##$DFILT= <>
##$DTYPP= 0
##$F1P= 0
##$F2P= 0
##$FCOR= 1
##$FTSIZE= 65536
##$FT_mod= 6
##$GAMMA= 0
##$GB= 0
##$INTBC= 1
##$INTSCL= 5.30512e-09
##$ISEN= 30
##$LB= 1
##$LEV0= 0
##$LPBIN= 0
##$MAXI= 10000
##$MC2= 0
##$MEAN= 0
##$ME_mod= 0
##$MI= 50
##$NCOEF= 0
##$NC_proc= -5
##$NLEV= 6
##$NOISF1= 182.463
##$NOISF2= 159.3651
##$NSP= 0
##$NTH_PI= 0
##$NZP= 0
##$OFFSET= 182.463
##$PC= 4
##$PHC0= -2595.36
##$PHC1= 200.599
##$PH_mod= 1
##$PKNL= yes
##$PPARMOD= 0
##$PSCAL= 0
##$PSIGN= 0
##$REVERSE= no
##$SF= 81.0140089999434
##$SI= 65536
##$SIGF1= 159.3651
##$SIGF2= -187.1042
##$SINO= 113.3802
##$SIOLD= 16384
##$SREGLST= <1H.CDCl3>
##$SSB= 0
##$STSI= 65536
##$STSR= 0
##$SW_p= 29940.119760479
##$SYMM= 0
##$S_DEV= 0
##$TDeff= 32768
##$TDoff= 0
##$TI= <>
##$TILT= no
##$TM1= 0
##$TM2= 0
##$TOPLEV= 0
##$USERP1= <user>
##$USERP2= <user>
##$USERP3= <user>
##$USERP4= <user>
##$USERP5= <user>
##$WDW= 1
##$XDIM= 65536
##$YMAX_p= 386126555
##$YMIN_p= -19050817
$$ End of Bruker specific parameters
$$ ---------------------------------
##NTUPLES= NMR SPECTRUM
##VAR_NAME=  FREQUENCY,     SPECTRUM/REAL,   SPECTRUM/IMAG
##SYMBOL=    X,             R,               I
##VAR_TYPE=  INDEPENDENT,   DEPENDENT,       DEPENDENT
##VAR_FORM=  AFFN,          ASDF,            ASDF
##VAR_DIM=   65536,         65536,           65536
##UNITS=     HZ,            ARBITRARY UNITS, ARBITRARY UNITS
##FACTOR=    0.456856943014862, 1,           1
##FIRST=     14782.0589164792, 0,            0
##LAST=      -15158.0608439998, 0,           0
##MIN=       -15158.0608439998, -19050817,   0
##MAX=       14782.0589164792, 386126555,    0
$$ Real data points
##PAGE= N=1
##DATA TABLE= (X++(R..R)), XYDATA
$$ [...]
$$ plain form
45710 2627866 2235738 1984956 2084745 2774448 3793738 4609929 5080306 5449429 5830422
45701 5830422 6118940 6275740 6273349 5919711 5163137 4395382 3979216 3649553 2928219 2001640
45691 2001640 1550632 1708495 1841605 1517579 1106877 1162950 1675423 2230151 2532740 2492600
45681 2492600 2127388 1684723 1573950 1878078 2181932 2171138 2126258 2447030 2913268 2907836
45671 2907836 2316396 1714106 1551585 1577165 1302244 723986 250429 75921 16027 -30618
45661 -30618 171531 783839 1456774 1603932 1082605 382898 133375 602698 1652196 2858901
45651 2858901 3580702 3278826 2131724 1128224 1128440 1878907 2359112 2097257 1645445 1601787
45641 1601787 1732497 1519968 1157824 1296645 1896950 2075169 1320964 284565 -49982
$$ packed form
45710B627866l92128k50782R9789O89703J019290Q16191M70377L69123L80993
45701E830422K88518J56800k391l53638p56574p67755m16166l29663p21334r26579
45691B001640m51008J57863J33110l24026m10702N6073N12473N54728L02589m0140
45681B492600l65212m42665j10773L04128L03854j0794m4880L20772M66238n432
45671B907836n91440o02290j62521K5580k74921n78258m73557j74508n9894m6645
45661c0618K02149O12308O72935J47158n21327o99707k49523M69323J049498J206705
45651B858901P21801l01876j147102j003500K16P50467M80205k61855m51812m3658
45641A601787J30710k12529l62144J38821O00305J78219p54205j036399l34547
$$ plain form
45632 -49982 430008 1047214 1314475 1274035 1013580 493625 -41447 -54468 587271 1291159
45622 1291159 1433698 1099839 818951 797529 787528 619139 513050 800861 1494150 2167725
45612 2167725 2279182 1751615 1237098 1499024 2431897 3075379 2816656 2153913 1929318
45603 1929318 2259853 2719396 3120858 3417080 3199163 2212127 1212084 1278237 2176913
45594 2176913 2455357 1481067 362220 288830 912604 1179365 996677 1064380 1533182 1903786
45584 1903786 2070991 2473631 3175947 3635773 3519036 3080324 2642527 2325720 2354069 2935119
45574 2935119 3669818 3780291 3220321 2935453 3624269 4756498 5275032 4883619 4181517
45565 4181517 3813001 3933709 4325009 4620040 4521460 4128269 3959080 4378184 5107457 5563728
$$ packed form
45632d9982M79990O17206K67261m0440k60455n19955n35072j3021O41739P03888
45622A291159J42539l33859k80888k1422j0001j68389j06089K87811O93289O73575
45612B167725J11457n27567n14517K61926R32873O43482k58723o62743k24595
45603A929318L30535M59543M01462K96222k17917r87036j000043O6153Q98676
45594B176913K78444r74290j118847p3390O23774K66761j82688O7703M68802L70604
45584A903786J67205M02640P02316M59826j16737m38712m37797l16807K8349N81050
45574B935119P34699J10473n59970k84868O88816J132229N18534l91413p02102
45565D181517l68516J20708L91300K95031r8580l93191j69189M19104P29273M56271
$$ plain form
45555 5563728 5536520 5231610 4793298 4198207 3604043 3362444 3526608 3679781 3485806 3158029
45545 3158029 3079106 3137562 2887065 2396205 2435654 3464028 4758231 5113005 4347646 3532906
45535 3532906 3592171 4290011 4949214 5546873 6430195 7356770 7705324 7582840 7859698 8902152
45525 8902152 10015083 10499606 10630586 11101886 11994111 12863382 13546045 14312464 15374354
45516 15374354 16715788 18323011 20172395 22054504 23770776 25448449 27343475 29419197
45508 29419197 31435598 33306232 34934376 35781492 35137426 32955264 30029943 27209308
45500 27209308 24748652 22521955 20439521 18418039 16291636 14085967 12180922 10923724
45492 10923724 10235144 9821429 9569087 9440785 9179432 8512433 7568776 6698966 5920813
$$ packed form
45555E563728k7208l04910m38312n95091n94164k41599J64164J53173j93975l27777
45545C158029p8923N8456k50497m90860L9449J028374J294203L54774p65359q14740
45535C532906N9265O97840O59203N97659Q83322R26575L48554j22484K76858J042454
45525H902152J112931M84523J30980M71300Q92225Q69271O82663P66419J061890
45516A5374354J341434J607223J849384J882109J716272J677673J895026K075722
45508B9419197K016401J870634J628144Q47116o44066k182162k925321k820635
45500B7209308k460656k226697k082434k021482k126403k205669j905045j257198
45492A0923724o88580m13715k52342j28302k61353o66999r43657q69810p78153
$$ plain form
45483 5920813 4995649 4083228 3743656 4026178 4126308 3476439 2745866 2999831 4041930
45474 4041930 4485647 3630821 2397207 1944659 2151210 2195984 2030437 2223134 2590823
45465 2590823 2163744 741676 -521153 -597238 103600 520757 439814 451072 788308 1036150
45455 1036150 917700 657379 461824 210412 -153876 -368196 -225335 76647 167618 -75011
45445 -75011 -450801 -640330 -435001 92516 621664 904559 1005430 1083840 1084648 914116
45435 914116 797823 1067874 1602666 1895184 1757820 1537234 1468395 1257665 623932 -102170
45425 -102170 -352180 -89351 261407 585890 1277840 2498257 3632824 3861275 3156857
45416 3156857 2365545 2195309 2389873 2159673 1314903 600328 777671 1684632 2493183
$$ packed form
45483E920813r25164r12421l39572K82522J00130o49869p30573K53965J042099
45474D041930M43717q54826j233614m52548K06551M4774j65547J92697L67689
45465B590823m27079j422068j262829p6085P00838M17157q0943J1258L37236K47842
45455A036150j18450k60321j95555k51412l64288k14320J42861L01982R0971k42629
45445g5011l75790j89529K05329N27517N29148K82895J00871P8410Q08j70532
45435I14116j16293K70051N34792K92518j37364k20586o8839k10730o33733p26102
45425a02170k50010K62829L50758L24483O91950J220417J134567K28451p04418
45416C156857p91312j70236J94564k30200q44770p14575J77343R06961Q08551
$$ plain form
45407 2493183 2702014 2477353 2074739 1413647 424054 -550592 -1040614 -992693 -735784 -471594
45397 -471594 -70302 602717 1388553 1990458 2318219 2527037 2702488 2636850 2070793 1162582
45387 1162582 528690 659262 1383504 2073017 2275285 1945278 1210256 323920 -141607
45378 -141607 397932 1722817 2695772 2439551 1428672 910454 1341399 1997377 2224987
45369 2224987 2382268 3055998 3859271 3815316 2848094 2034839 2064410 2189587 1372622 -31892
45359 -31892 -662754 -75930 736550 957421 1033776 1560326 2012305 1615398 895827 1126438
45349 1126438 2402342 3493755 3692594 3556553 3481396 2841827 1320020 -25010 -112045
45340 -112045 502854 518422 -63854 -55191 994182 2263283 3056156 3484659 3562208 2862006
$$ packed form
45407B493183K08831k24661m02614o61092r89593r74646m90022M7921K56909K64190
45397d71594M01292O73019P85836O01905L27761K08818J75451o5638n66057r08211
45387A162582o33892J30572P24242O89513K02268l30007p35022q86336m65527
45378a41607N39539J324885R72955k56221j010879n18218M30945O55978K27610
45369B224987J57281O73730Q03273m3955r67222q13255K9571J25177q16965j404514
45359c1892o30862N86824Q12480K20871P6355N26550M51979l96907p19571K30611
45349A126438J275904J091413J98839j36041p5157o39569j521807j345030q7035
45340a12045O14899J5568n82276Q663J049373J269101P92873M28503P7549p00202
$$ plain form
45330 2862006 1564905 762555 1045756 1665815 1791815 1756594 2194392 2678945 2306356
45321 2306356 1216082 459500 542913 1060649 1632782 2208854 2475989 2040309 1386717
45312 1386717 1630248 2933617 4094494 4191529 3758384 3678259 3746523 3242205 2339073 1891789
45302 1891789 2076571 2244981 2085289 2018456 2344661 2825572 3310433 4011595 4875453 5394764
45292 5394764 5415017 5457107 5790197 5858381 5253018 4640285 4850760 5430433 5133621 3824767
45282 3824767 2872797 3360501 4753807 5837607 6261614 6452108 6466388 5836113 4520654
45273 4520654 3265329 2764087 2920532 3163859 3135168 2832138 2405944 2114014 2227052
45264 2227052 2658350 2867619 2468603 1778718 1390682 1345232 1226163 1010686 1163077 1709925
$$ packed form
45330B862006j297101q02350K83201O20059J26000l5221M37798M84553l72589
45321B306356j090274p56582Q3413N17736N72133N76072K67135m35680o53592
45312A386717K43531J303369J160877R7035m33145q0125O8264n04318r03132m47284
45302A891789J84782J68410j59692o6833L26205M80911M84861P01162Q63858N19311
45292E394764K0253M2090L33090O8184o05363o12733K10475N79673k96812j308854
45282C824767r51970M87704J393306J083800M24007J90494J4280o30275j315459
45273D520654j255325n01242J56445K43327k8691l03030m26194k91930J13038
45264B227052M31298K09269l99016o89885l88036m5450j19069k15477J52391N46848
$$ plain form
45254 1709925 1932364 1449942 1010287 1484304 2467633 2753596 2070319 1440959 1704808
45245 1704808 2538581 3219989 3536558 3505664 2996042 2270944 2215553 3195310 4192301 4002028
45235 4002028 2957079 2465541 2994642 3577129 3394877 2797798 2435027 2333531 2357910
45226 2357910 2780151 3700811 4447103 4259618 3294594 2392303 2073473 2214385 2477932
45217 2477932 2612638 2489676 2228335 2169307 2485761 3019680 3640209 4371462 4985009 5048649
45207 5048649 4736943 4912245 5814062 6371022 5685071 4595461 4603677 5580701 5893392 4849720
45197 4849720 3672685 3662365 4596949 5570574 6346501 7022302 7186470 6455262 5413021
45188 5413021 5084611 5692454 6671872 7642336 8554712 9074444 8753083 7903249 7495515
$$ packed form
45254A709925K22439m82422m39655M74017R83329K85963o83277o29360K63849
45245A704808Q33773O81408L16569l0894n09622p25098n5391R79757R96991j90273
45235D002028j044949m91538N29101N82487j82252n97079l62771j01496K4379
45226B357910M22241R20660P46292j87485r65024r02291l18830J40912K63547
45217B477932J34706j22962k61341n9028L16454N33919O20529P31253O13547O3640
45207E048649l11706J75302R01817N56960o85951j089610Q216R77024L12691j043672
45197D849720j177035j0320R34584R73625P75927O75801J64168p31208j042241
45188E413021l28410O07843R79418R70464R12376N19732l21361q49834m07734
$$ plain form
45179 7495515 7941702 8637098 9012420 9446126 10661348 12570747 14203305 14681097 13985410
45170 13985410 12854019 12160705 12329430 13126864 13967747 14469373 14684326 14804267 14791434
45161 14791434 14416613 13583086 12496519 11527477 10960556 10833454 10916660 10814110 10176642
45152 10176642 8988825 7730750 7110526 7404449 8074652 8280305 7801160 7168952 6805094
45143 6805094 6451777 5783308 5199322 5403799 6279262 6821188 6393491 5543470 5207337
45134 5207337 5454857 5509712 4908412 4145689 4008206 4589756 5265696 5529622 5513776 5569263
45124 5569263 5609090 5185837 4152940 2911781 1938438 1383312 1266802 1698362 2598793
45115 2598793 3493653 3965836 4110767 4162538 3936146 3216214 2524682 2712450 3651877 4101270
$$ packed form
45179G495515M46187O95396L75322M33706J215222J909399J632558M77792o95687
45170A3985410j131391o93314J68725P97434Q40883N01626K14953J19941j2833
45161A4791434l74821q33527j086567r69042n66921j27102Q3206j02550o37468
45152A0176642j187817j258075o20224K93923O70203K05653m79145o32208l63858
45143F805094l53317o68469n83986K04477Q75463N41926m27697q50021l36133
45134E207337K47520N4855o01300p62723j37483N81550O75940K63926j5846N5487
45124E569263L9827m23253j032897j241159r73343n55126j16510M31560R00431
45115B598793Q94860M72183J44931N1771k26392p19932o91532J87768R39427M49393
$$ plain form
45105 4101270 3269111 1917942 1402778 2053974 3065501 3652648 3714050 3526627 3369954
45096 3369954 3423075 3599004 3543153 3156755 2928114 3269425 3742762 3582365 2861201 2385123
45086 2385123 2417619 2361298 1925284 1736447 2323607 3252989 3882376 4298459 4735342 4648606
45076 4648606 3412681 1710078 1138078 2265558 3921207 4689243 4426693 3968215 3934541
45067 3934541 4300273 4758109 5052350 5102830 5050119 5044408 4916657 4343768 3429775 2758136
45057 2758136 2703902 3041451 3389269 3651240 3831666 3851959 3802532 3933432 4123045 3875202
45047 3875202 3216873 3015289 3825844 4922986 5177977 4505415 3662994 2955421 2073700
45038 2073700 1070957 492786 451063 476315 447521 772104 1423579 1765732 1709686 2034643
$$ packed form
45105D101270q32159j351169n15164O51196J011527N87147O1402j87423j56673
45096C369954N3121J75929n5851l86398k28641L41311M73337j60397p21164m76078
45086B385123L2496n6321m36014j88837N87160R29382O29387M16083M36883q6736
45076D648606j235925j702603n72000J127480J655649P68036k62550m58478l3674
45067C934541L65732M57836K94241N0480n2711n711j27751n72889r13993o71639
45057B758136n4234L37549L47818K61971J80426K0293m9427J30900J89613k47843
45047C875202o58329k01584Q10555J097142K54991o72562q42421p07573q81721
45038B073700j002743n78171m1723K5252k8794L24583O51475L42153n6046L24957
$$ plain form
45028 2034643 2941955 3274874 2117615 414276 -165860 456471 829694 230546 -399784
45019 -399784 -70552 785585 1074653 562543 -83469 -393037 -540163 -780719 -1006002 -1005300
45009 -1005300 -856261 -827815 -969644 -972386 -524628 261096 950044 1335989 1655645 2116122
44999 2116122 2485770 2467404 2271220 2369454 2743345 2870796 2551788 2249778 2357291 2543636
44989 2543636 2239298 1515836 1024509 1131397 1528896 1749721 1697061 1516915 1254341 898605
44979 898605 590632 490843 509725 456619 441308 791051 1466375 1912771 1757872 1383454
44969 1383454 1432145 1908218 2198927 1941149 1419737 1051156 909786 908802 1032983 1149694
44959 1149694 925875 233239 -554125 -869676 -423838 650916 1810848 2266798 1673087
$$ packed form
45028B034643R07312L32919j157259j703339n80136O22331L73223n99148o30330
45019c99784L29232Q56137K89068n12110o46012l09568j47126k40556k25283P02
45009a005300J49039K8446j41829k742M47758P85724O88948L85945L19656M60477
44999B116122L69648j8366j96184R8234L73891J27451l19008l02010J07513J86345
44989B543636l04338p23462m91327J06888L97499K20825n2660j80146k62574l55736
44979H98605l07973r9789J8882n3106j5311L49743O75324M46396j54899l74418
44969A383454M8691M76073K90709k57778n21412l68581j41370r84J24181J16711
44959A149694k23819o92636p87364l15551M45838J074754J159932M55950n93711
$$ plain form
44950 1673087 802034 914159 2150029 3215501 3137763 2608804 2824916 3615128 3761832
44941 3761832 2852290 1701992 1013499 704308 678871 1187294 2055411 2478825 2078109
44932 2078109 1447680 1201671 1135499 808075 331484 53613 -2602 132773 672732 1533916
44922 1533916 2012752 1648998 997629 880628 1257101 1571303 1881471 2729189 3964238
44913 3964238 4616055 4167784 3286368 2963400 3376290 3882742 3821568 3075305 2061728
44904 2061728 1371433 1313078 1729879 2282254 2771832 3044346 2831389 2074095 1272014 1042405
44894 1042405 1315938 1409138 985286 501073 486012 764770 754577 330317 -5703 175118
44884 175118 675150 994322 1043910 1255963 1916977 2646613 2801128 2282085 1615568 1240089
$$ packed form
44950A673087q71053J12125J235870J065472p7738n28959K16112P90212J46704
44941C761832r09542j150298o88493l09191k5437N08423Q68117M23414m00716
44932B078109o30429k46009o6172l27424m76591k77871n6215J35375N39959Q61184
44922A533916M78836l63754o51369j17001L76473L14202L10168Q47718J235049
44913C964238O51817m48271q81416l22968M12890N06452o1174p46263j013577
44904B061728o90295n8355M16801N52375M89578K72514k12957p57294q02081k29609
44894A042405K73533R3200m23852m84213j5061K78758j0193m24260l36020J80821
44884A75118N00032L19172M9588K12053O61014P29636J54515n19043o66517l75479
$$ plain form
44874 1240089 1091354 977042 939602 1016471 1025134 919651 1039088 1601502 2210598 2326463
44864 2326463 2048101 1925582 2085241 2095466 1774805 1611086 2101096 2985097 3459673 3076225
44854 3076225 2231258 1739008 1994739 2637148 3063464 3133208 3142902 3199040 3022732 2487750
44844 2487750 1959856 1862938 2187504 2603772 2753920 2333828 1372887 608279 930653 2098765
44834 2098765 2738152 2189687 1583328 2218890 3584801 4137612 3566666 2948301 2879320
44825 2879320 2911424 2894671 3372864 4261677 4575281 4121945 4142298 5352731 6517001 6118807
44815 6118807 4575294 3520628 3506833 3742820 3737111 3783206 3827437 3212438 1932036 1077210
44805 1077210 1431727 2332695 2558856 1928371 1423383 1896484 3121268 4153161 4359044
$$ packed form
44874A240089j48735j14312l7440P6869Q663j05483J19437N62414O09096J15865
44864B326463k78362j22519J59659J0225l20661j63719M90010Q84001M74576l83448
44854C076225q44967m92250K55731O42409M26316O9744R694N6138j76308n34982
44844B487750n27894r6918L24566M16268J50148m20092r60941p64608L22374J168112
44834B098765O39387n48465o06359O35562J365911N52811n70946o18365o8981
44825B879320L2104j6753M78193Q88813L13604m53336K0353J210433J164270l98194
44815F118807j543513j054666j3795K35987n709M6095M4231o14999j280402q54826
44805A077210L54517R00968K26161o30485n04988M73101J224784J031893K05883
$$ plain form
44796 4359044 3971201 3691010 3871311 4227598 4343530 4212977 4133033 4291735 4701781 5338599
44786 5338599 6018332 6284806 5837584 5087631 4895209 5599708 6590671 7054115 6944604
44777 6944604 6919870 7377127 7947488 8155822 8240740 8793596 9661363 9926060 9290687 8806921
44767 8806921 9571153 11180641 12313561 12528702 12539310 12886182 13459734 14358515 15947816
44758 15947816 17734530 18489814 18155135 18434239 20592715 23735741 26360683 28650172
44750 28650172 31855602 36126535 40543698 44985751 50370294 57011212 64180662 71514837
44742 71514837 79471612 87882045 95138175 99411868 99919608 96675067 90000258 80893318
44734 80893318 71059358 61807755 53332901 45503009 38739040 33515126 29473987 25725992
$$ packed form
44796D359044l87843k80191J80301L56287J15932j30553p9944J58702M10046O36818
44786E338599O79733K66474m47222p49953j92422P04499R90963M63444j09511
44777F944604k4734M57257N70361K08334Q4918N52856Q67767K64697o35373m83766
44767H806921P64232J609488J132920K15141J0608L46872N73552Q98781J589301
44758A5947816J786714P55284l34679K79104K158476L143026K624942K289489
44750B8650172L205430M270933M417163M442053N384543O640918P169450P334175
44742G1514837P956775Q410433P256130M273693N07740l244541o674809r106940
44734H0893318r833960r251603q474854p829892o763969n223914m041139l747995
$$ plain form
44726 25725992 21862354 18258578 15547971 14070260 13615125 13485820 13026749 12185125 11280596
44717 11280596 10285569 8868741 7175226 5865519 5161066 4538260 3696261 3142998 3349751
44708 3349751 3908143 4065529 3653162 3006226 2387034 1945517 1839937 1957853 1928931 1796181
44698 1796181 2137483 3051891 3658177 3288006 2619224 2757278 3572647 3914047 3323826
44689 3323826 2591246 2518000 2954399 3305107 3355739 3257137 3076282 2679097 1942317 988615
44679 988615 234287 53578 323435 615532 971783 1963405 3628531 4971463 5171475
44670 5171475 4789266 4959557 5765363 6341726 6314673 6049305 5556449 4382368 2832448
44661 2832448 2115199 2696229 3487209 3424406 3080163 3783343 5603481 7184869 7490677
$$ packed form
44726B5725992l863638l603776k710607j477711m55135j29305m59071q41624r04529
44717A1280596r95027j416828j693515j309707p04453o22806q41999n53263K06753
44708C349751N58392J57386m12367o46936o19192m41517j05580J17916k8922j32750
44698A796181L41302R14408O06286l70171o68782J38054Q15369L41400n90221
44689C323826p32580p3246M36399L50708N0632r8602j80855l97185p36780r53702
44679I88615p54328j80709K69857K92097L56251R91622J665126J342932K00012
44670E171475l82209J70291Q05806N76363k7053k65368m92856j174081j549920
44661B832448p17249N81030P90980o2803l44243P03180J820138J581388L05808
$$ plain form
44652 7490677 6894411 6385091 6294100 6165228 5623052 4982590 4860710 5309986 5644647 5300055
44642 5300055 4579993 4173542 4165463 4108021 3970741 4252057 4982030 5390968 4981856 4278702
44632 4278702 3986775 3994649 3860853 3780514 4221179 4879974 4937833 4357012 4054550 4552407
44622 4552407 5194672 5104488 4345203 3621634 3219013 2829396 2280944 1862329 1811790 1886242
44612 1886242 1676265 1154634 681221 520917 542470 431798 98709 -192147 -72484 546821
44602 546821 1301272 1619347 1267084 660349 481428 917495 1438558 1430204 857005 144968
44592 144968 -353262 -483817 -93619 837664 1890866 2470151 2455311 2223653 1975465 1518238
44582 1518238 889184 637248 1062596 1586431 1436792 750522 416041 865731 1572106
$$ packed form
44652G490677n96266n09320r0991j28872n42176o40462j21880M49276L34661l44592
44642E300055p20062m06451q079n7442j37280K81316P29973M08938m09112p03154
44632D278702k91927P874j33796q0339M40665O58795N7859n80821l02462M97857
44622D552407O42265r0184p59285p23569m02621l89617n48452m18615n0539P4452
44612A886242k09977n21631m73413j60304K1553j10672l33089k90856J19663O19305
44602E46821P54451L18075l52263o06735j78921M36067N21063q354n73199p12037
44592A44968m98230j30555L90198R31283J053202N79285j4840k31658k48188m57227
44582A518238o29054k51936M25348N23835j49639o86270l34481M49690P06375
$$ plain form
44573 1572106 1841204 1625158 1328523 1185960 1141267 1115752 1081958 978743 819462 812438
44563 812438 1093174 1353435 1070860 238009 -446730 -399796 54622 128692 -273052 -388869
44553 -388869 233202 949711 868110 120956 -324413 -19279 423956 234004 -592087 -1441393
44543 -1441393 -1745877 -1309570 -367534 469525 669215 368870 198830 414166 660094
44534 660094 752841 1065052 1738138 2122047 1630632 720684 314551 555302 881912 1108091
44524 1108091 1553266 2132505 2230622 1715366 1290696 1452139 1712181 1333693 387575 -388576
44514 -388576 -495064 -52023 486617 684170 397863 -37688 -122985 115464 60308 -626765
44504 -626765 -1446446 -1741193 -1588042 -1530258 -1666886 -1575161 -1054033 -404414 67023 359839
$$ packed form
44573A572106K69098k16046k96635j42563m4693k5515l3794j03215j59281p024
44563H12438K80736K60261k82575q32851o84739M6934M54418P4070m01744j15817
44553c88869O22071P16509q1601p47154m45369L05134M43235j89952q26091q49306
44543a441393l04484M36307R42036Q37059J99690l00345j70040K15336K45928
44534F60094R2747L12211O73086L83909m91415r09948m06133K40751L26610K26179
44524A108091M45175N79239R8117n15256m24670J61443K60042l78488r46118p76151
44514c88576j06488M43041N38640J97553k86307m35551q5297K38449n5156o87073
44504f26765q19681k94747J53151N7784j36628R1725N21128O49619M71437K92816
$$ plain form
44494 359839 522408 527997 556308 983899 1826337 2475497 2306304 1423552 561452 287969
44484 287969 488849 632940 403362 -7678 -198050 -49244 211111 446779 872721 1649285
44474 1649285 2374100 2366220 1525111 570441 222964 371618 311055 -313234 -1079977 -1334892
44464 -1334892 -951551 -436227 -345850 -704799 -1031855 -904589 -395506 120878 487944 881348
44454 881348 1379243 1676583 1452481 907148 638947 915733 1293184 1143323 451218 -150848
44444 -150848 -146684 325524 832549 1285483 1881441 2504478 2633186 1998651 991099 189637
44434 189637 -210587 -253972 106899 740247 1040312 549047 -234232 -352354 269582 709868
44424 709868 429581 -39737 -149146 -243462 -794622 -1463428 -1774546 -2117152 -2995616 -3689788
$$ packed form
44494C59839J62569N589K8311M27591Q42438O49160j69193q82752q62100k73483
44484B87969K00880J44091k29578m11040j90372J48806K60355K35668M25942P76564
44474A649285P24815p880q41109r54670l47477J48654o0563o24289p66743k54915
44464a334892L83341N15324R0377l58949l27056J27266N09083N16384L67066L93404
44454H81348M97895K97340k24102n45333k68201K76786L77451j49861o92105o02066
44444a50848M164M72208N07025M52934N95958O23037J28708o34535j007552q01462
44434A89637m00224m3385L60871O33348L00065m91265p83279j18122O21936M40286
44424G09868k80287m69318j09409r4316n51160o68806l11118l42606q78464o94172
$$ plain form
44414 -3689788 -2967803 -1092933 228400 192047 -118913 325965 865090 463430 -345573
44405 -345573 -220459 791694 1260741 542321 -339520 -253368 657380 1596813 2226076 2535340
44395 2535340 2295352 1427116 594769 680427 1670040 2591363 2686916 2299614 2374660 3214019
44385 3214019 3966888 3509066 1785046 24014 -536830 85727 897620 1205843 1141258
44376 1141258 1029523 865515 566618 256165 86060 161884 735835 1929740 3082711
44367 3082711 3067361 1727390 399734 337704 1061273 1089488 67902 -772315 -377305
44358 -377305 751107 1340010 950398 284725 123564 398074 379963 -358861 -1277276 -1291750
44348 -1291750 18696 1807533 2805560 2621078 1877726 1235048 798622 499252 435449
$$ packed form
44414c689788P21985J874870J321333l6353l10960M44878N39125m01660q09003
44405c45573J25114J012153M69047p18420q81841Q6152R10748R39433O29263L09264
44395B535340k39988q68236q32347Q5658R89613R21323R5553l87302P5046Q39359
44385C214019P52869m57822j724020j761032n60844O22557Q11893L08223o4585
44376A141258j11735j64008k98897l10453j70105P5824N73951J193905J152971
44367C082711j5350j339971j327656o2030P23569K8215j021586q40217L95010
44358c77305J128412N88903l89612o65673j61161K74510j8111p38824r18415j4474
44348a291750J310446J788837R98027j84482p43352o42678m36426k99370o3803
$$ plain form
44339 435449 560731 499053 56540 -382466 -336949 113809 509965 673425 806426 1011431
44329 1011431 1096201 897588 511417 132170 -113343 -116537 195183 663672 903553 702897
44319 702897 376857 545301 1485220 2767188 3601564 3527827 2722256 1697734 870240
44310 870240 450362 515123 940641 1364794 1498965 1480252 1668459 2098664 2452083 2619824
44300 2619824 2874701 3259005 3244885 2482412 1603676 1633679 2609399 3426607 3252102 2471983
44290 2471983 1842965 1295732 317737 -796768 -1051912 -251452 500733 312990 -165177
44281 -165177 317236 1760567 2908421 2991858 2550188 2323142 2205249 1784312 1226158
44272 1226158 962061 942681 870199 850157 1130555 1443205 1359821 1163505 1528773 2309016
$$ packed form
44339D35449J25282o1678m42513m39006M5517M50758L96156J63460J33001K05005
44329A011431Q4770j98613l86171l79247k45513l194L11720M68489K39881k00656
44319G02897l26040J68444R39919J281968Q34376p3737q05571j024522q27494
44310H70240m19878O4761M25518M24153J34171j8713J88207M30205L53419J67741
44300B619824K54877L84304j4120p62473q78736L0003R75720Q17208j74505p80119
44290B471983o29018n47233r77995j114505k55144Q00460P52185j87743m78167
44281a65177M82413J443331J147854Q3437m41670k27046j17893m20937n58154
44272A226158k64097j9380p2482k0042K80398L12650q3384j96316L65268P80243
$$ plain form
44262 2309016 2536133 1884610 1281379 1569701 2289425 2457871 2028637 1767433 1951288
44253 1951288 2022100 1546556 832620 417561 446298 767030 1260474 1836015 2339120 2641050
44243 2641050 2674303 2336631 1590174 718635 225107 347923 876108 1517892 2180146 2743149
44233 2743149 2875542 2389288 1617450 1118119 1069651 1250692 1559072 2153940 2970500 3484970
44223 3484970 3299329 2761448 2600438 2963682 3216307 2842207 2191168 2015615 2468754
44214 2468754 2957342 2956181 2573965 2189929 1881512 1508267 1175724 1230532 1728196 2183401
44204 2183401 2071399 1487589 1057903 1120371 1235193 778915 -83826 -435077 265616 1477288
44194 1477288 2293108 2505232 2493337 2325275 1667235 625738 -21347 238951 979689
$$ packed form
44262B309016K27117o51523o03231K88322P19724J68446m29234k61204J83855
44253A951288P0812m75544p13936m15059K8737L20732M93444N75541N03105L01930
44243B641050L3253l37672p46457q71539m93528J22816N28185O41784O62254N63003
44233B743149J32393m86254p71838m99331m8468J81041L08380N94868Q16560N14470
44223C484970j85641n37881j61010L63244K52625l74100o51039j75553M53139
44214B468754M88588j161l82216l84036l08417l73245l32543N4808M97664M55205
44204B183401j12002n83810m29686O2468J14822m56278q62741l51251P00693J211672
44194A477288Q15820K12124j1895j68062o58040j041497o47085K60298P40738
$$ plain form
44185 979689 1473220 1611281 1747899 1932679 1854469 1477019 1244091 1535183 2194589 2716152
44175 2716152 2758566 2422802 2081867 1950889 1875371 1660315 1496267 1723184 2176969 2244068
44165 2244068 1739765 1239149 1217151 1340963 1077558 582761 399567 569586 672081 558478
44155 558478 446219 442808 578208 1127427 2210797 3214716 3383173 2915533 2646399 2672740
44145 2672740 2282068 1350443 687178 610667 304797 -763406 -1800584 -1886817 -1325282
44136 -1325282 -835900 -230557 916243 1926690 1771268 846151 532536 1014747 1026753
44127 1026753 46428 -716265 -164134 1086686 1818582 1944660 2115789 2330535 2091291
44118 2091291 1574937 1533902 2088842 2552247 2545714 2498124 2817350 3218801 3211284 2819693
$$ packed form
44185I79689M93531J38061J36618J84780p8210l77450k32928K91092O59406N21563
44175B716152M2414l35764l40935j30978p5518k15056j64048K26917M53785O7099
44165B244068n04303n00616k1998J23812k63405m94797j83194J70019J02495j13603
44155E58478j12259l411J35400N49219J083370J003919J68457m67640k69134K6341
44145B672740l90672r31625o63265p6511l05870j068203j037178q6233N61535
44136a325282M89382O05343J146800J010447j55422r25117l13615M82211J2006
44127A026753r80325p62693N52131J250820P31896J26078J71129K14746k39244
44118B091291n16354m1035N54940M63405o533m7590L19226M01451p517l91591
$$ plain form
44108 2819693 2488236 2491106 2683740 2756006 2631399 2609733 2987720 3470234 3268327 2067300
44098 2067300 586454 -260987 -474813 -642748 -767511 -286317 708417 1228125 752964
44089 752964 23728 -90899 194757 255376 354230 1257050 2759552 3649876 3315487 2540742
44079 2540742 2348547 2718485 2938058 2734936 2461694 2375452 2304434 2068828 1842782 1939758
44069 1939758 2411342 2988014 3378882 3569323 3783060 4135009 4415776 4347224 3969601 3547322
44059 3547322 3117456 2461949 1651010 1269397 1776375 2817584 3552006 3641869 3542599 3681949
44049 3681949 3712945 2971711 1570088 541132 653396 1424010 1762706 1436327 1271244
44040 1271244 1793702 2389734 2310832 1916920 2089473 2706285 2716965 1836377 1170516 1689306
$$ packed form
44108B819693l31457K870J92634P2266j24607k1666L77987M82514k01907j201027
44098B067300j480846q47441k13826j67935j24763M81194R94734N19708m75161
44089G52964p29236j14627K85656O0619R8854R02820J502502Q90324l34389p74745
44079B540742j92195L69938K19573k03122k73242q6242p1018k35606k26046R6976
44069A939758M71584N76672L90868J90441K13737L51949K80767o8552l77623m22279
44059C547322m29866o55507q10939l81613N06978J041209P34422Q9863r9270J39350
44049C681949L0996p41234j401623j028956J12264P70614L38696l26379j65083
44040A271244N22458N96032p8902l93912J72553O16812J0680q80588o65861N18790
$$ plain form
44030 1689306 2850648 3409729 3076096 2626579 2652232 2919759 2930884 2542192 1976106 1603070
44020 1603070 1696745 2072571 2064958 1249835 108596 -441755 -134597 446200 718700 690589
44010 690589 639996 674219 796858 1077654 1524928 1960543 2165228 2071696 1819171 1709367
44000 1709367 1987837 2502318 2753590 2512543 2154210 2077502 2107717 1945074 1886352 2409023
43990 2409023 3208453 3456984 3025851 2600799 2436728 1927227 829371 53742 524450
43981 524450 1801301 2569997 2208141 1269086 647483 805740 1637800 2578683 2941434
43972 2941434 2554353 1985562 1859261 2154374 2471500 2678497 2852696 2854186 2509306 2102266
43962 2102266 2150919 2672786 3090121 2934138 2368642 1986042 2245475 3027611 3624027 3389195
$$ packed form
44030A689306J161342N59081l33633m49517K5653K67527J1125l88692n66086l73036
44020A603070R3675L75826p613q15123j141239n50351L07158N80797K72500k8111
44010F90589n0593L4223J22639K80796M47274M35615K04685r3532k52525j09804
44000A709367K78470N14481K51272k41047l58333p6708L0215j62643n8722N22671
43990B409023P99430K48531m31133m25052j64071n09501j097856p75629M70708
43981E24450J276851P68696l61856r39055o21603J58257Q32060R40883L62751
43972B941434l87081n68791j26301K95113L17126K06997J74199J490l44880m07040
43962B102266M8653N21867M17335j55983n65496l82600K59433P82136N96416k34832
$$ plain form
43952 3389195 2567870 2154485 2692519 3609070 4069007 4005541 3798857 3434520 2737936 2117820
43942 2117820 2198316 2803898 3128175 2907723 2628424 2522695 2244094 1771451 1775664 2614387
43932 2614387 3599680 3795044 3127342 2293763 1938819 2290921 3229346 4270873 4746547
43923 4746547 4397846 3668556 3161497 2990759 2878594 2656762 2401592 2215449 2097316
43914 2097316 1979024 1818048 1711796 1822583 2029989 1904457 1398629 1270287 2173360
43905 2173360 3508377 4017162 3519541 3090791 3309215 3401087 2640654 1583260 1119521
43896 1119521 1133215 1020305 874941 1143716 1597899 1702630 1650269 1963086 2342328 2046703
43886 2046703 1282112 1035301 1495274 1828009 1695742 1769916 2331968 2583794 2061656 1693926
$$ packed form
43952C389195q21325m13385N38034R16551M59937o3466k06684l64337o96584o20116
43942B117820Q0496O05582L24277k20452k79299j05729k78601m72643M213Q38723
43932B614387R85293J95364o67702q33579l54944L52102R38425J041527M75674
43923D746547l48701p29290n07059j70738j12165k21832k55170j86143j18133
43914B097316j18292j60976j06252J10787K07406j25532n05828j28342R03073
43905B173360J335017N08785m97621m28750K18424R1872p60433j057394m63739
43896A119521J3694j12910j45364K68775M54183J04731n2361L12817L79242k95625
43886B046703p64591k46811M59973L32735j32267P4174N62052K51826n22138l67730
$$ plain form
43876 1693926 2475173 3789053 4104606 2997991 1553738 912321 1239866 2113204 3150827
43867 3150827 4033093 4409683 4122672 3397576 2723748 2563488 3009065 3579924 3582351 2905220
43857 2905220 2245106 2278167 2853625 3355768 3632405 4091346 4956693 5881078 6327356 5996838
43847 5996838 4897209 3370089 2101432 1719726 2199811 2872998 3135472 2987551 2852627
43838 2852627 3083333 3695376 4367855 4625467 4218001 3442095 2976541 3300534 4281441
43829 4281441 5290988 5685314 5306735 4634818 4296752 4317524 4133797 3563605 3318068
43820 3318068 4002819 4954420 4895163 3681955 2503015 2186442 2299757 2351144 2823674
43811 2823674 4124551 5335090 5263951 4362759 4234808 5209442 5761243 4807197 3395410
$$ packed form
43876A693926P81247J313880L15553j106615j444253o41417L27545Q73338J037623
43867C150827Q82266L76590k87011p25096o73828j60260M45577N70859K427o77131
43857B905220o60114L3061N75458N02143K76637M58941Q65347R24385M46278l30518
43847E996838j099629j527120j268657l81706M80085O73187K62474j47921j34924
43838B852627K30706O12043O72479K57612m07466p75906m65554L23993R80907
43829D281441J009547L94326l78579o71917l38066K0772j83727n70192k45537
43820C318068O84751R51601n9257j213208j178940l16573J13315N1387M72530
43811B823674J300877J210539p1139r01192j27951R74634N51801r54046j411787
$$ plain form
43802 3395410 3236488 4341304 5164231 4749133 3738799 3256740 3627379 4464424 5429465
43793 5429465 6466141 7502481 8262715 8431349 7964425 7229188 6752541 6766486 7089791
43784 7089791 7473176 7837067 8083346 8000573 7599755 7246370 7140381 6956175 6403275 5861707
43774 5861707 5922291 6478210 6873282 6859250 6762257 6715605 6438254 5893048 5453643 5202348
43764 5202348 4788247 4306641 4550814 5841690 7252848 7672779 7148865 6492692 6005864
43755 6005864 5405778 4701224 4257631 4100247 3956680 3952235 4486551 5406604 6071838 6295404
43745 6295404 6435808 6483609 5974327 5055062 4666876 5166624 5636765 5232891 4463025 4313536
43735 4313536 4726621 4929399 4892743 5392729 6675907 8000713 8636718 8575570 8119804
$$ packed form
43802C395410j58922J104816Q22927m15098j010334m82059L70639Q37045R65041
43793E429465J036676J036340P60234J68634m66924p35237m76647J3945L23305
43784G089791L83385L63891K46279q2773m00818l53385j05989j84206n52900n41568
43774E861707O0584N55919L95072j4032r6993m6652k77351n45206m39405k51295
43764E202348m14101m81606K44173J290876J411158M19931n23914o56173m86828
43755F005864o00086p04554m43593j57384j43567m445N34316R20053O65234K23566
43745F295404J40404M7801n09282r19265l88186M99748M70141m03874p69866j49489
43735D313536M13085K02778l6656M99986J283178J324806O36005o1148m55766
$$ plain form
43726 8119804 7475302 6951340 6910531 7244975 7442597 7396000 7566262 8087131 8372053 8055308
43716 8055308 7705730 7975467 8513787 8490218 7921571 7644742 8008594 8410015 8326612 8095387
43706 8095387 8266452 8709404 8874371 8643706 8420748 8493367 8744670 8981184 9177407 9317973
43696 9317973 9268976 8926681 8360308 7783166 7506055 7831940 8714228 9527513 9557914 8890819
43686 8890819 8472435 8987207 9918397 10116945 9197295 7959168 7403686 7702653 8251316
43677 8251316 8426017 8107907 7655478 7502438 7663185 7649939 7124522 6564803 6804718 7810352
43667 7810352 8506313 8157423 7340792 6998450 7067169 6856114 6403606 6405848 6853381 6868162
43657 6868162 6187109 5753397 6263008 7021904 7016337 6409918 6087955 6247983 6420846 6529796
$$ packed form
43726H119804o44502n23962m0809L34444J97622m6597J70262N20869K84922l16745
43716H055308l49578K69737N38320k3569n68647k76829L63852M01421q3403k31225
43706H095387J71065M42952J64967k30665k22958P2619K51303K36514J96223J40566
43696I317973m8997l42295n66373n77142k77111L25885Q82288Q13285L0401o67095
43686H890819m18384N14772R31190J98548r19650j238127n55482K98967N48663
43677H251316J74701l18110m52429j53040J60747j3246n25417n59719K39915J005634
43667G810352O95961l48890q16631l42342O8719k11055m52508K242M47533J4781
43657F868162o81053m33712N09611P58896n567o06419l21963J60028J72863J08950
$$ plain form
43647 6529796 6875204 7233095 7060168 6648014 7014146 8387640 9746957 10214707 10028019
43638 10028019 9698040 9124855 8216996 7617146 7950430 8823388 9361973 9391962 9346272 9323719
43628 9323719 9038989 8522017 8109090 7840618 7546853 7395517 7628939 7880849 7578180
43619 7578180 6999214 7045577 7849488 8526508 8591421 8709641 9558987 10743040 11464961 11644959
43609 11644959 11686787 11668449 11530958 11672740 12508140 13625616 14219881 14352722 15001654
43600 15001654 16700164 18844004 20695937 22515725 25167152 28903270 33155370 37595222
43592 37595222 42883618 49837959 57784272 64111678 65912760 62235052 54702420 46092748
43584 46092748 38538940 32835085 28709088 25347931 22037760 18771097 16160441 14575514
$$ packed form
43647F529796L45408L57891j72927m12154L66132J373494J359317M67750j86688
43638A0028019l29979n73185r07859n99850L33284Q72958N38585K9989m5690k2553
43628I323719k84730n16972m12927k68472k93765j51336K33422K51910l02669
43619G578180n78966M6363Q03911O77020O4913J18220Q49346J184053P21921J79998
43609A1644959M1828j8338j37491J41782Q35400J117476N94265J32841O48932
43600A5001654J698510K143840J851933J819788K651427L736118M252100M439852
43592C7595222N288396O954341P946313O327406J801082l677708p532632q609672
43584D6092748p553808n703855m125997l361157l310171l266663k610656j584927
$$ plain form
43576 14575514 13604350 12587777 11386934 10309521 9554359 9097895 8891666 8772655 8381424
43567 8381424 7583848 6797471 6488979 6545741 6594040 6690621 7079490 7411770 6978018 5843644
43557 5843644 5067147 5463124 6607960 7391544 7239046 6539730 6123763 6506656 7442803
43548 7442803 8124174 8033185 7587465 7600112 8112659 8259892 7456084 6238436 5623504 5964186
43538 5964186 6763137 7370175 7544438 7454879 7369093 7320083 7049769 6414838 5793911 5794191
43528 5794191 6522302 7447867 8024809 8132437 7912301 7593141 7527893 7944213 8571166 8984599
43518 8984599 9355218 10206860 11306518 11631078 10855301 10059280 10283262 11055064 11193224
43509 11193224 10545089 9925344 9636432 9178117 8456621 8191138 8730634 9298646 8986972
$$ packed form
43576A4575514r71164j016573j200843j077413p55162m56464k06229j19011l91231
43567H381424p97576p86377l08492N6762M8299R6581L88869L32280m33752j134374
43557E843644p76497L95977J144836P83584j52498o99316m15967L82893R36147
43548G442803O81371r0989m45720J2647N12547J47233q03808j217648o14932L40682
43538E964186P98951O07038J74263q9559q5786m9010k70314o34931o20927K80
43528E794191P28111R25565N76942J07628k20136l19160o5248M16320O26953M13433
43518H984599L70619Q51642J099658L24560p75777p96021K23982P71802J38160
43509A1193224o48135o19745k88912m58315p21496k65483N39496N68012l11674
$$ plain form
43500 8986972 7999034 7358272 7655175 8539883 9315647 9643976 9659002 9651441 9755859 9894892
43490 9894892 9958086 9951374 9938196 9957819 10115079 10619024 11531397 12528557 13103612 13023304
43480 13023304 12507043 12010788 11897095 12201344 12629324 12879768 12978127 13106388 13153211 12820827
43470 12820827 12244449 12013895 12364410 12846771 13084036 13267103 13467918 13137661 12018204
43461 12018204 11002849 11152283 12178004 12884356 12919414 13026042 13598503 14137094 14336565
43452 14336565 14609997 15140805 15442064 15394608 15766108 16993274 18264434 18631555 18383200
43443 18383200 18455511 19023276 19596744 20081820 20716347 21191519 20922694 20234723 20293767 21614174
43433 21614174 23428569 24832577 25829203 26844175 27855080 28580170 29157651 30084808 31628791
$$ packed form
43500H986972r87938o40762K96903Q84708P75764L28329J5026p561J04418J39033
43490I894892O3194o712j3178J9623J57260N03945R12373R97160N75055q0308
43480A3023304n16261m96255j13693L04249M27980K50444R8359J28261M6823l32384
43470A2820827n76378k30554L50515M82361K37265J83067K00815l30257j119457
43461A2018204j015355J49434J025721P06352L5058J06628N72461N38591J99471
43452A4336565K73432N30808L01259m7456L71500J227166J271160L67121k48355
43443A8383200P2311N67765N73468M85076O34527M75172k68825o87971N9044J320407
43433B1614174J814395J404008R96626J014972J010905P25090N77481R27157J543983
$$ plain form
43424 31628791 33656833 35882129 37962210 39572076 40800796 42367885 45009547 48642931
43416 48642931 52522133 56241484 60132199 64535262 69212097 73870501 78854493 84707696
43408 84707696 91252311 97778642 104102909 110628207 117120410 122268088 125068597 126024127
43400 126024127 126175509 125404068 122674977 117804867 111940660 106118330 100276047 94037404
43392 94037404 87618223 81408805 75340609 69344760 63962295 59773522 56481009 53234679
43384 53234679 49770111 46649865 44384563 42804035 41373073 39765928 38033183 36444953
43376 36444953 35240729 34396174 33638982 32769144 31857465 31047420 30339308 29677538 29023444
43367 29023444 28206368 26987160 25474312 24184881 23430289 22920794 22276908 21643553 21403206
$$ packed form
43424C1628791K028042K225296K080081J609866J228720J567089K641662L633384
43416D8642931L879202L719351L890715M403063M676835M658404M983992N853203
43408H4707696O544615O526331O324267O525298O492203N147678K800509R55530
43400A26024127J51382p71441k729091m870110n864207n822330n842283o238643
43392I4037404o419181o209418o068196n995849n382465m188773l292513l246330
43384E3234679l464568l120246k265302j580528j430962j607145j732745j588230
43376C6444953j204224q44555p57192q69838r11679q10045p08112o61770o54094
43367B9023444q17076j219208j512848j289431p54592n09495o43886o33355k40347
$$ plain form
43358 21403206 21484223 21390239 20862396 20183803 19829028 19992733 20404033 20532368 20156894 19749267
43348 19749267 19948272 20628870 21026945 20907453 20882854 21247737 21348794 20728078 20043453
43339 20043453 19951885 19848724 18921791 17887602 18197644 19718487 20760130 20552843 20147976
43330 20147976 20397837 20553637 19762868 18749504 18831579 20000946 21093166 21429850 21309402
43321 21309402 21138014 20971493 20846207 20876017 21026736 21240089 21642844 22246605 22685735
43312 22685735 22671893 22453010 22438827 22695376 23167166 23907419 24604401 24501927 23534906 22937320
43302 22937320 23682886 24755306 24257117 22121713 20322086 20139266 20629886 20457293 19972144
43293 19972144 20378841 21685525 22780631 23191766 23525190 24121297 24343537 23553071 22060717
$$ packed form
43358B1403206Q1017r3984n27843o78593l54775J63705M11300J28335l75474m07627
43348A9749267J99005O80598L98075j19492k4599L64883J01057o20716o84625
43339B0043453r1568j03161r26933j034189L10042J520843J041643k07287m04867
43330B0147976K49861J55800p90769j013364Q2075J169367J092220L36684j20448
43321B1309402j71388j66521j25286K9810J50719K13353M02755O03761M39130
43312B2685735j3842k18883j4183K56549M71790P40253O96982j02474r67021n97586
43302B2937320P45566J072420m98189k135404j799627j82820M90620j72593m85149
43293A9972144M06697J306684J095106M11135L33424N96107K22240p90466j492354
$$ plain form
43284 22060717 20734371 20188934 20659151 22082528 23803889 24647397 23981749 22620234 22071044
43275 22071044 22818164 23836855 23992714 23480083 23514615 24842196 26956919 28754530 29619255
43266 29619255 29771837 29791315 30021169 30442817 30975914 31701962 32679213 33685624 34439665
43257 34439665 35074705 36024300 37295864 38284765 38662457 39086006 40484506 42823311 45168248
43248 45168248 46940492 48516016 50508993 53057239 56022429 59359700 62981719 66680820
43240 66680820 70497937 74819084 79846054 85341369 91148748 97527182 104628232 112087651
43232 112087651 119594106 127494826 136293798 145742170 154856738 162654236 168533246 172264345
43224 172264345 174086883 174564617 173882704 171559058 167307405 161781459 155814564 149321260
$$ packed form
43284B2060717j326346n45437M70217J423377J721361Q43508o65648j361515n49190
43275B2071044P47120J018691J55859n12631L4532J327581K114723J797611Q64725
43266B9619255J52582J9478K29854M21648N33097P26048R77251J006411P54041
43257C4439665O35040R49595J271564R88901L77692M23549J398500K338805K344937
43248D5168248J772244J575524J992977K548246K965190L337271L622019L699101
43240F6680820L817117M321147N026970N495315N807379O378434P101050P459419
43232A12087651P506455P900720Q798972R448372R114568P797498N879010L731099
43224A72264345J822538M77734o81913k323646m251653n525946n966895o493304
$$ plain form
43216 149321260 141851166 134019638 127314885 122332642 118142817 113730433 109259610 105486720
43208 105486720 102603532 100178064 97767198 95148347 92338339 89751469 87964393 86998542
43200 86998542 86206503 85143183 84100844 83451325 82940546 82085224 80883221 79665823 78559000
43191 78559000 77528666 76668265 76002769 75255978 74212681 73067834 72062490 71077594 69961252
43182 69961252 68891607 67958820 66767046 65016109 63160103 61865223 61059248 60151526
43174 60151526 58964075 57743255 56430860 54733045 52910663 51735130 51525166 51825707
43166 51825707 52091668 52098142 51727507 51108452 50975693 51992971 53552045 54212602 53677830
43157 53677830 53309234 54093546 55142089 55197258 54829543 55785926 58367507 60738241 61131384
$$ packed form
43216A49321260p470094p831528o704753m982243m189825m412384m470823l772890
43208A05486720k883188k425468k410866k618851k810008k586870j787076r65851
43200H6998542p92039j063320j042339o49519n10779q55322j202003j217398j106823
43191G8559000j030334q60401o65496p46791j043297j144847j005344r84896j116342
43182F9961252j069645r32787j191774j750937j856006j294880q05975r07722
43174F0151526j187451j220820j312395j697815j822382j175533k09964L00541
43166E1825707K65961O474l70635o19055j32759J017278J559074O60557n34772
43157E3677830l68596P84312J048543N5169l67715R56383K581581K370734L93143
$$ plain form
43148 61131384 59840162 58545945 58229103 58288664 57575676 55897059 54296771 53840020 54367432
43139 54367432 54855021 54916639 55218977 56137541 56880359 56716353 56372764 57064513 58470029
43130 58470029 59003117 58201585 57534565 58299365 59780421 60293940 59325277 57767379 56515594
43121 56515594 55702445 55113913 54583126 53964666 53259836 52753220 52588619 52290730 51183629
43112 51183629 49266490 47228782 45572958 44145509 42621677 41058879 39754937 38763435
43104 38763435 37747752 36317743 34522244 32992283 32396791 32647582 32895976 32517865 31814689
43095 31814689 31434618 31407814 31226278 30683683 30095239 29757116 29715505 30038333 30728569 31296370
43085 31296370 31049683 30073089 29385998 29757342 30764720 31435602 31511972 31612877 32290923
$$ packed form
43148F1131384j291222j294217l16842N9561p12988j678617j600288m56751N27412
43139E4367432M87589O1618L02338R18564P42818j64006l43589O91749J405516
43130E8470029N33088q01532o67020P64800J481056N13519r68663j557898j251785
43121E6515594q13149n88532n30787o18460p04830n06616j64601k97889j107101
43112E1183629j917139k037708j655824j427449j523832j562798j303942r91502
43104C8763435j015683j430009j795499j529961n95492K50791K48394l78111p03176
43095C1814689l80071k6804j81536n42595n88444l38123m1611L22828O90236N67801
43085C1296370k46687r76594o87091L71344J007378O70882P6370J00905O78046
$$ plain form
43076 32290923 33376906 34295354 34729768 34871740 35150472 35798048 36670022 37491696 38219434
43067 38219434 39050997 40137815 41479403 43092436 45060712 47378641 49950287 52769396
43059 52769396 55860902 58989349 61673308 63570921 64623730 64781262 63933283 62324671
43051 62324671 60775631 60167730 60705989 61793497 62625914 62931942 63228187 64342183 66652169
43042 66652169 69916252 73834754 78368200 83293416 88033139 92510631 97681789 104406467
43034 104406467 112188283 120055504 128368801 138391657 150096644 162024010 173765267
43027 173765267 186927360 202666780 219635099 235494135 249165101 260168499 266967623
43020 266967623 267948941 263552162 255684162 245364760 232670264 218707812 205602111
$$ packed form
43076C2290923J085983R18448M34414J41972K78732O47576Q71974Q21674P27738
43067C8219434Q31563J086818J341588J613033J968276K317929K571646K819109
43059E2769396L091506L128447K683959J897613J052809J57532q47979j608612
43051F2324671j549040o07901N38259J087508Q32417L06028K96245J113996K309986
43042F6652169L264083L918502M533446M925216M739723M477492N171158O724678
43034A04406467P781816P867221Q313297J0022856J1704987J1927366J1741257
43027A73765267J3162093J5739420J6968319J5859036J3670966J1003398O799124
43020B66967623R81318m396779p868000j0319402j2694496j3962452j3105701
$$ plain form
43013 205602111 194220912 183641889 173306118 164102085 156781291 150863824 145887473
43006 145887473 142412435 140978034 141232103 142845080 146120383 150941913 156376281 162269225
42998 162269225 170035818 180772296 193711844 207776737 223559811 242256197 263459461
42991 263459461 285612706 308002708 330551292 351900563 369400106 381055049 386126555
42984 386126555 383951681 373922183 357096683 336424473 314644467 292797238 271111770
42977 271111770 250244201 230988904 213548046 197718891 183339904 170260869 158447433
42970 158447433 148329916 140377336 134096525 128198177 122089154 116503199 112282190 109195058
42962 109195058 106386849 103426937 100501459 98040372 96456763 95781398 95365493 94517738
$$ packed form
43013B05602111j1381199j0579023j0335771r204033p320794n917467m976351
43006A45887473l475038j434401K54069J612977L275303M821530N434368N892944
42998A62269225P766593J0736478J2939548J4064893J5783074J8696386K1203264
42991B63459461K2153245K2390002K2548584K1349271J7499543J1654943N071506
42984C86126555k174874j0029498j6825500k0672210k1780006k1847229k1685468
42977B71111770k0867569j9255297j7440858j5829155j4378987j3079035j1813436
42970A58447433j0117517p952580o280811n898348o109023n585955m221009l087132
42962A09195058k808209k959912k925478k461087j583609o75365m15905q47755
$$ plain form
42954 94517738 93565593 93526610 94502933 95281945 94921157 93835706 92814094 91915107 91054295
42945 91054295 90750644 91321492 92072530 92353737 92822053 94473782 96838640 98414751 98744603
42936 98744603 98808664 99320259 99885478 100177718 100807439 102390956 104520059 106301331 107424455
42927 107424455 108154145 108641028 108762067 108442825 107718498 106527645 104685489 102094825 99026008
42918 99026008 96281807 94827344 94811427 95061588 94115661 91807604 89286642 87420634 85907571
42909 85907571 84231643 82688165 81802994 81275582 80311651 78792034 77362524 76386026 75470397
42900 75470397 74152645 72487677 70743000 68960072 67086079 65195793 63304278 61234937
42892 61234937 58954121 56792870 55021133 53407094 51563434 49571873 47824143 46311754
$$ packed form
42954I4517738r52145l8983R76323P79012l60788j085451j021612q98987q60812
42945I1054295l03651N70848P51038K81207M68316J651729K364858J576111L29852
42936I8744603O4061N11595N65219K92240O29721J583517K129103J781272J123124
42927A07424455P29690M86883J21039l19242p24327j190853j842156k590664l068817
42918I9026008k744201j454463j5917K50161r45927k308057k520962j866008j513063
42909H5907571j675928j543478q85171n27412r63931j519617j429510r76498r15629
42900G5470397j317752j664968j744677j782928j873993j890286j891515k069341
42892F1234937k280816k161251j771737j614039j843660j991561j747730j512389
$$ plain form
42884 46311754 44582467 42478742 40413849 38735649 37346604 36262531 35948251 36480809
42876 36480809 36819385 35766687 33558693 31677770 31007911 30967161 30664358 30064525 29554271
42867 29554271 29108157 28559635 28161825 28150042 28126505 27620024 26978735 26925425 27374640 27484487
42857 27484487 26875354 26051121 25532895 25289199 25178687 25259722 25403043 25237913 24824100
42848 24824100 24811848 25531432 26406396 26718993 26569736 26611745 27131427 27859389 28493885 28984468
42838 28984468 29407993 29889579 30541218 31249013 31713582 31935019 32386887 33391327 34592607
42829 34592607 35439171 35933613 36427220 36868348 36844433 36347885 35916696 35851862 35741084 35000345
42819 35000345 33619561 32190245 31365875 31350835 31704367 31618982 30648778 29202325 28063215
$$ packed form
42884D6311754j729287k103725k064893j678200j389045j084073l14280N32558
42876C6480809L38576j052698k207994j880923o69859m0750l02803n99833n10254
42867B9554271m46114n48522l97810j1783k3537n06481o41289n3310M49215J09847
42857B7484487o09133q24233n18226k43696j10512Q1035J43321j65130m13813
42848B4824100j2252P19584Q74964L12597j49257M2009N19682P27962O34496M90583
42838B8984468M23525M81586O51639P07795M64569K21437M51868J004440J201280
42829C4592607Q46564M94442M93607M41128k3915m96548m31189o4834j10778p40739
42819C5000345j380784j429316q24370j5040L53532q5385r70204j446453j139110
$$ plain form
42810 28063215 27446735 26896915 26114286 25343821 24732263 23876820 22504585 21206178 20852770
42801 20852770 21419698 21998576 21990583 21708051 21655210 21781253 21767542 21600581 21417095 21091858
42791 21091858 20486632 19929801 19885914 20156224 19959654 18957736 17711025 16867313 16351208
42782 16351208 15750899 15136347 14932994 15128888 15176955 14736395 14041687 13416240 12855901
42773 12855901 12306989 11964807 11948637 11915034 11380238 10385320 9560983 9478347 10054705 10610954
42763 10610954 10480605 9631036 8699177 8289549 8261657 7969146 7228744 6639794 6710196 7071970
42753 7071970 6989421 6351779 5632250 5053861 4441588 3886492 3851035 4389091 4877713 4900013
42743 4900013 4888870 5418921 6263582 6725660 6636005 6404807 6230743 5937636 5605786 5648444
$$ packed form
42810B8063215o16480n49820p82629p70465o11558q55443j372235j298407l53408
42801B0852770N66928N78878p993k82532n2841J26043j3711j66961j83486l25237
42791B1091858o05226n56831m3887K70310j96570j001918j246711q43712n16105
42782A6351208o00309o14552k03353J95894M8067m40560o94708o25447n60339
42773A2855901n48912l42182j6170l3603n34796r94918q24337q2636N76358N56249
42763A0610954j30349q49569r31859m09628k7892k92511p40402n88950P0402L61774
42753G071970q2549o37642p19529n78389o12273n55096l5457N38056M88622K2300
42743D900013j1143N30051Q44661M62078q9655k31198j74064k93107l31850M2658
$$ plain form
42733 5648444 6023955 6016120 5247564 4456016 4704762 6041109 7451953 8062203 7918126
42724 7918126 7595466 7482544 7586327 7729293 7749640 7644708 7582179 7659874 7708085 7521348
42714 7521348 7201037 6991170 6860955 6646452 6596181 7270519 8719054 10211570 11070768
42705 11070768 11396597 11665941 12028746 12448852 13193209 14559473 16216691 17389292 17766108
42696 17766108 17807798 18080806 18640534 19133035 19167551 18504409 17177492 15549286 14058353
42687 14058353 12893950 12066623 11628583 11494911 11224440 10476830 9622668 9344204 9621344
42678 9621344 9742243 9430005 9245292 9571040 9911507 9718131 9313646 9317857 9584437 9490906
42668 9490906 9069177 9032909 9649637 10308713 10424081 10184309 10059805 9976609 9447445 8414429
$$ packed form
42733E648444L75511p835p68556p91548K48746J336347J410844O10250j44077
42724G918126l22660j12922J03783J42966K0347j04932o2529P7695M8211j86737
42714G521348l20311k09867j30215k14503n0271O74338J448535J492516Q59198
42705A1070768L25829K69344L62805M20106P44357J366264J657218J172601L76816
42696A7766108M1690K73008N59728M92501L4516o63142j326917j628206j490933
42687A4058353j164403q27327m38040j33672k70471p47610q54162k78464K77140
42678I621344J20899l12238j84713L25748L40467j93376m04485M211K66580r3531
42668I490906m21729l6268O16728O59076J15368k39772j24504q3196n29164j033016
$$ plain form
42658 8414429 7559472 7601208 8408790 9047741 8829408 8153434 8013974 8704199 9417407 9283361
42648 9283361 8388226 7445694 6793852 6186622 5435857 4787385 4589028 4849175 5187429
42639 5187429 5124464 4499430 3686679 3239589 3245195 3281985 3081384 2826733 2648493 2364884
42629 2364884 2039945 2194828 2951961 3553159 3396281 2983991 2997755 2983277 2105781 873726
42619 873726 728354 1878122 2925385 2984271 2839923 3383942 4109566 4068898 3393254 2839369
42609 2839369 2492049 1952566 1358339 1205853 1425919 1540260 1553081 1839989 2281245 2348216
42599 2348216 2025127 1842774 1926945 1768360 1124110 493727 415579 770952 1059154 1010428
42589 1010428 700681 326662 58813 -32817 19461 242907 793382 1704658 2738045 3684835
$$ packed form
42658H414429q54957M1736Q07582O38951k18333o75974j39460O90225P13208j34046
42648I283361q95135r42532o51842o07230p50765o48472j98357K60147L38254
42639E187429o2965o25034q12751m47090N606L6790k00601k54651j78240k83609
42629B364884l24939J54883P57133O01198j56878m12290J3764j4478q77496j232055
42619H73726j45372J149768J047263N8886j44348N44019P25624m0668o75644n53885
42609B839369l47320n39483n94227j52486K20066J14341J2821K86908M41256O6971
42599B348216l23089j82353Q4171j58585o44250o30383p8148L55373K88202m8726
42589A010428l09747l74019k67849r1630N2278K23446N50475R11276J033387R46790
$$ plain form
42579 3684835 4561241 5223092 5161167 4189421 3049752 2697960 3134706 3560251 3531251 3245390
42569 3245390 2797537 2054044 1366193 1463918 2293438 2812514 2443521 1971098 2339594 3178052
42559 3178052 3325752 2465584 1451162 1164489 1713921 2675327 3494920 3641246 2938745
42550 2938745 1897689 1315073 1432752 1778945 1842876 1557393 1105353 653620 389889
42541 389889 473445 794677 1058677 1236401 1658329 2513178 3515196 4232433 4488203 4264193
42531 4264193 3530536 2506437 1849094 2116871 3054093 3770296 3664689 2876034 1852251
42522 1852251 927899 436461 703694 1544535 2147744 1950924 1392946 1294062 1703103 1996245
42512 1996245 2013064 2298428 3066180 3732301 3878609 3959921 4463955 4971616 4813639 4238001
$$ packed form
42579C684835Q76406O61851o1925r71746j139669l51792M36746M25545k9000k85861
42569C245390m47853p43493o87851R7725Q29520N19076l68993m72423L68496Q38458
42559C178052J47700q60168j014422k86673N49432R61406Q19593J46326p02501
42550B938745j041056n82616J17679L46193O3931k85483m52040m51733k63731
42541C89889Q3556L21232K64000J77724M21928Q54849J002018P17237K55770k24010
42531D264193p33657j024099o57343K67777R37222P16203j05607p88655j023783
42522A852251r24352m91438K67233Q40841O03209j96820n57978r8884M09041K93142
42512A996245J6819K85364P67752O66121J46308Q1312N04034N07661j57977n75638
$$ plain form
42502 4238001 4051059 4300776 4213031 3442041 2542880 2056097 1909235 1979337 2468604 3264261
42492 3264261 3582803 2906621 1915271 1852254 3090980 4812350 6036818 6525999 6601363
42483 6601363 6455060 5934943 4983315 4059397 3839823 4400984 4987315 4910214 4470854 4527984
42473 4527984 5242731 5817530 5558815 4648374 3673438 2912406 2371939 2084324 2022790 2046176
42463 2046176 2194549 2707025 3517039 4123685 4233333 4118194 4044364 3811588 3266830 2839960
42453 2839960 3062550 3854379 4720223 5325996 5448434 4780654 3420709 2269657 2247502
42444 2247502 3194824 4103575 4335904 4087302 3773729 3576907 3606873 3962331 4511002 4961618
42434 4961618 5164491 5074771 4603350 3894009 3511957 3827517 4386395 4469584 4131680 4029871
$$ packed form
42502D238001j86942K49717q7745p70990q99161m86783j46862P0102M89267P95657
42492C264261L18542o76182r91350o3017J238726J721370J224468M89181P5364
42483F601363j46303n20117r51628r23918k19574N61161N86331p7101m39360N7130
42473D527984P14747N74799k58715r10441r74936p61032n40467k87615o1534K3386
42463B046176J48373N12476Q10014O06646J09648j15139p3830k32776n44758m26870
42453B839960K22590P91829Q65844O05773J22438o67780j359945j151052k2155
42444B247502R47322R08751K32329k48602l13573j96822K9966L55458N48671M50616
42434D961618K02873q9720m71421p09341l82052L15560N58878Q3189l37904j01809
$$ plain form
42424 4029871 4304678 4371646 3910434 3363280 3234734 3468202 3771476 4116128 4675823 5546484
42414 5546484 6568140 7147357 6473107 4495316 2557001 2278331 3701873 5230202 5536182
42405 5536182 4844924 4169865 4047340 4334884 4573746 4195713 2978519 1607622 1158806
42396 1158806 1728999 2284841 2204088 2131366 2762752 3615881 3813401 3473644 3427279 3922830
42386 3922830 4447377 4618504 4529422 4342149 4148087 4129072 4367749 4632539 4730579 4822549
42376 4822549 5017345 5011803 4558970 3892362 3238747 2413829 1451338 1048256 1634585 2516389
42366 2516389 2800437 2707024 2999211 3520252 3427113 2642036 1903880 1490325 1088291 892649
42356 892649 1492468 2477933 2551070 1508740 846525 1705185 3328694 4362693 4672169
$$ packed form
42424D029871K74807O6968m61212n47154j28546K33468L03274L44652N59695Q70661
42414E546484J021656N79217o74250j977791j938315k78670J423542J528329L05980
42405E536182o91258o75059j22525K87544K38862l78033j217194j370897m48816
42396A158806N70193N55842q0753p2722O31386Q53129J97520l39757m6365M95551
42386C922830N24547J71127q9082j87273j94062j9015K38677K64790R8040R1970
42376D822549J94796n542m52833o66608o53615q24918r62491m03082N86329Q81804
42366B516389K84048r3413K92187N21041r3139p85077p38156m13555m02034j95642
42356H92649N99819R85465P3137j042330o62215Q58660J623509J033999L09476
$$ plain form
42347 4672169 4894679 5023769 4597035 3824965 3445056 3638796 3939866 4060882 4080722 3981171
42337 3981171 3701427 3514508 3687286 3901444 3664590 3151593 2925084 2915848 2486654 1581103
42327 1581103 993894 1206780 1644852 1545334 1082018 1096735 1951848 3128143 3917681 4151316
42317 4151316 4145294 4140824 3999190 3502901 2857321 2668835 3273106 4210718 4621386 4197018
42307 4197018 3555744 3548156 4271384 4920077 4677758 3661182 2792825 2716653 3122807 3339938
42297 3339938 3267533 3278467 3430688 3436164 3401699 3850115 4773932 5397790 5308411 5156435
42287 5156435 5646692 6409985 6633699 6393462 6487519 7143885 7754507 7882146 7756244 7686732
42277 7686732 7678197 7746202 7978490 8160283 7977670 7720577 8068557 8939810 9312611 8640206
$$ packed form
42347D672169K22510J29090m26734p72070l79909J93740L01070J21016J9840r9551
42337C981171k79744j86919J72778K14158k36854n12997k26509r236m29194r05551
42327A581103n87209K12886M38072r9518m63316J4717Q55113J176295P89538K33635
42317D151316o022m470j41634m96289o45580j88486O04271R37612M10668m24368
42307D197018o41274p588P23228O48693k42319j016576q68357p6172M06154K17131
42297C339938p2405J0934J52221N476l4465M48416R23817O23858q9379j51976
42287E156435M90257P63293K23714k40237R4057O56366O10622J27639j25902o9512
42277G686732q535O8005K32288J81793j82613k57093L47980Q71253L72801o72405
$$ plain form
42267 8640206 7797673 8024625 9359477 10705632 11139946 10595300 9480475 8229100 7208284
42258 7208284 6617627 6375650 6283719 6236184 6144985 5882206 5512608 5336514 5450845 5555561
42248 5555561 5515561 5786390 6796250 8111059 8764823 8390714 7575457 7100787 7245687
42239 7245687 7829434 8502149 8905402 8895782 8693468 8552187 8335019 7769193 7029783 6556490
42229 6556490 6267379 5553930 4268770 3156982 2929711 3331411 3559009 3308835 2969227
42220 2969227 2966781 3325699 3757437 3858925 3363416 2529044 2126227 2645788 3603952 4021647
42210 4021647 3537561 2643639 1865153 1225848 659873 447684 862696 1616522 2013276
42201 2013276 1643097 770256 69689 47460 636064 1291879 1537674 1389220 1177126 1094897
$$ packed form
42267H640206q42533K26952J334852J346155M34314n44646j114825j251375j020816
42258G208284n90657k41977r1931m7535r1199k62779l69598j76094J14331J04716
42248E555561m0000K70829J009860J314809O53764l74109q15257m74670J44900
42239G245687N83747O72715M03253r620k02314j41281k17168n65826p39410m73293
42229F556490k89111p13449j285160j111788k27271M01700K27598k50174l39608
42220B969227k446L58918M31738J01488m95509q34372m02817N19561R58164M17695
42210D021647m84086q93922p78486o39305n65975k12189M15012P53826L96754
42201B013276l70179q72841p00567k2229N88604O55815K45795j48454k12094q2229
$$ plain form
42191 1094897 1158704 1462584 2049855 2553988 2489737 2039723 1994272 2603014 3041757 2530364
42181 2530364 1517670 1064534 1338942 1534935 1219983 902129 1056100 1372349 1418520
42172 1418520 1458251 2035749 3074831 3922898 4131981 3794138 3251718 2845332 2809129 3041276
42162 3041276 3084287 2694507 2318806 2584308 3359446 3788109 3348550 2469031 1913060 1889154
42152 1889154 2023245 1989226 1865910 1906318 2152787 2356346 2267470 1975026 1832692 1950234
42142 1950234 1918432 1292998 281293 -364512 -173997 598227 1401238 1947640 2231288
42133 2231288 2310667 2310686 2430564 2711049 2909953 2768935 2290452 1669818 1156615 1062793
42123 1062793 1573315 2328493 2544573 1925035 1203152 1353109 2429187 3606510 4192937
$$ packed form
42191A094897O3807L03880N87271N04133o4251m50014m5451O08742M38743n11393
42181B530364j012694m53136K74408J95993l14952l17854J53971L16249M6171
42172A418520L9731N77498J039082Q48067K09083l37843n42420m06386l6203K32147
42162C041276M3011l89780l75701K65502P75138M28663m39559q79519n55971k3906
42152A889154J34091l4019j23316M0408K46469K03559q8876k92444j42334J17542
42142A950234l1802o25434j011705o45805J90515P72224Q03011N46402K83648
42133B231288P9379J9J19878K80485J98904j41018m78483o20634n13203r3822
42123A062793N10522P55178K16080o19538p21883J49957J076078J177323N86427
$$ plain form
42114 4192937 4098435 3474073 2575522 2003065 2313871 3132898 3336818 2535816 1763130 2145315
42104 2145315 3406021 4371753 4576950 4563344 4773119 5008094 5065725 5163858 5503741 5968237
42094 5968237 6426912 6806489 6744583 5847851 4541906 3927607 4333522 4683726 3930096
42085 3930096 2549295 1853031 2226773 2917558 3331543 3611000 3927218 4080249 3997460
42076 3997460 3922288 3891738 3655988 3311851 3347819 3781482 3918333 3357649 2633382 2393815
42066 2393815 2492136 2416596 2125188 1843136 1449420 764493 180053 293541 1036491 1790234
42056 1790234 2268356 2655380 2923256 2698117 1939763 1197588 996599 1357826 2003164
42047 2003164 2608238 2782955 2283566 1415975 838249 813444 1007293 1098934 1150382 1242818
$$ packed form
42114D192937r4502o24362q98551n72457L10806Q19027K03920q01002p72686L82185
42104B145315J260706R65732K05197j3606K09775K34975N7631R8133L39883M64496
42094E968237M58675L79577o1906q96732j305945o14299M05915L50204p53630
42085C930096j380801o96264L73742O90785M13985K79457L16218J53031q2789
42076C997460p5172l0550k35750l44137L5968M33663J36851n60684p24267k39567
42066B393815R8321p5540k91408k82052l93716o84927n84440J13488P42950P53743
42056A790234M78122L87024K67876k25139p58354p42175k00989L61227O45338
42047B003164O05074J74717m99389q67591n77726k4805J93849R1641N1448R2436
$$ plain form
42037 1242818 1232233 1104852 1150938 1511381 1918916 2147933 2343957 2622384 2737667 2515693
42027 2515693 2244931 2183609 1978771 1137481 -36746 -528024 264257 1806987 2931608
42018 2931608 2857531 1744251 485621 18417 634083 1803792 2624131 2442055 1233267
42009 1233267 -334157 -1241505 -938068 22738 522491 236585 39808 767656 2034006
42000 2034006 2777288 2642916 2215832 2060790 2168671 2324581 2412314 2248941 1649964 851129
41990 851129 444255 680812 1164771 1417738 1451720 1590520 1968523 2401696 2605652 2438319
41980 2438319 2062102 1868083 2034814 2199968 1868899 1136108 623618 646310 862679 912267
41970 912267 969095 1359673 1943262 2229337 1976111 1436930 1117906 1399943 2186621 2800569
$$ packed form
42037A242818j0585j27381M6086L60443M07535K29017J96024K78427J15283k21974
42027B515693k70762o1322k04838q41290j174227m91278P92281J542730J124621
42018B931608p4077j113280j258630m67204O15666J169709Q20339j82076j208788
42009A233267j567424r07348L03437R60806M99753k85906j96777P27848J266350
42000B034006P43282j34372m27084j55042J07881J55910Q7733j63373n98977p98835
41990H51129m06874K36557M83959K52967L3982J38800L78003M33173K03956j67333
41980B438319l76217j94019J66731J65154l31069p32791n12490K2692K16369M9588
41970I12267N6828L90578N83589K86075k53226n39181l19024K82037P86678O13948
$$ plain form
41960 2800569 2512213 1381910 330804 162425 758319 1434990 1758629 1698734 1319915
41951 1319915 786631 473133 592421 814136 678481 300576 217753 596499 1074073 1386637
41941 1386637 1630872 1804464 1634574 1124899 813927 1110108 1672648 1844154 1513725
41932 1513725 1175825 1223598 1538539 1801178 1926114 2076809 2392482 2809527 3124974 3183532
41922 3183532 2960919 2457104 1634134 622716 -96122 -12705 819357 1728473 2058004
41913 2058004 1684245 917794 239413 221583 1234228 2889161 4147947 4408300 4177905
41904 4177905 4195698 4237506 3521256 2119399 1055886 854637 885564 557095 331495 872128
41894 872128 1811006 2252091 2170191 2369456 3097222 3595711 3254166 2485483 2090924 2264787
$$ packed form
41960B800569k88356j130303j051106j68379N95894O76671L23639n9895l78819
41951A319915n33284l13498J19288K21715j35655l77905q2823L78746M77574L12564
41941A386637K44235J73592j69890n09675l10972K96181N62540J71506l30429
41932A513725l37900M7773L14941K62639J24936J50695L15673M17045L15447N8558
41922C183532k22613n03815q22970j011418p18838Q3417Q32062R09116L29531
41913B058004l73759p66451o78381j7830J012645J654933J258786K60353k30395
41904D177905J7793M1808p16250j401857j063513k01249L0927l28469k25600N40633
41894H72128R38878M41085q1900J99265P27766M98489l41545p68683l94559J73863
$$ plain form
41884 2264787 2600613 2692610 2357806 1555703 466516 -493515 -984497 -966774 -545871 123244
41874 123244 674117 677623 199455 -173548 -154996 -178499 -595305 -918042 -486507 445669
41864 445669 1044202 1150681 1375486 1901491 2056156 1367420 314639 -392367 -673049
41855 -673049 -738551 -470744 213366 779389 599586 -105510 -523338 -387077 -201284 -284309
41845 -284309 -258412 241307 874520 998524 471229 -253366 -618248 -331797 489236 1254319
41835 1254319 1203860 149365 -1170154 -1763181 -1361756 -496124 252145 702618 865909
41826 865909 783046 719074 1073024 1790142 2185396 1739446 863677 424202 583276 613416
41816 613416 -30744 -923531 -1242666 -806134 -145809 283020 523833 735201 805377 588527
$$ packed form
41884B264787L35826R1997l34804q02103j089187r60031m90982J7723M20903O69115
41874A23244N50873L506m78168l73003J8552k3503m16806l22737M31535R32176
41864D45669N98533J06479K24805N26005J54665o88736j052781p07006k80682
41855f73049o5502K67807O84110N66023j79803p05096m17828J36261J85793q3025
41845b84309K5897M99719O33213J24004n27295p24595l64882K86451Q21033P65083
41835A254319n0459j054495j319519n93027M01425Q65632P48269M50473J63291
41826H65909q2863o3972L53950P17118L95254m45950q75769m39475J59074L0140
41816F13416o44160q92787l19135M36532O60325M28829K40813K11368P0176k16850
$$ plain form
41806 588527 304826 403933 1027664 1795925 2198106 2099464 1782903 1570727 1556671 1715588
41796 1715588 2064673 2527046 2741414 2279350 1110519 -319955 -1496616 -2113553 -1978028
41787 -1978028 -1046351 222821 922375 537631 -408509 -937093 -755114 -430020 -474739
41778 -474739 -716638 -690451 -279964 236495 554427 617698 688249 1151755 1998029 2522608
41768 2522608 1969797 598111 -338724 44684 1257764 2097500 2027367 1537539 1351795
41759 1351795 1673770 2136252 2189359 1586819 692737 197670 365087 763864 943823 1064139
41749 1064139 1507341 2174769 2665158 2981117 3531165 4498652 5689058 6914399 7981253
41740 7981253 8365236 7592050 6070524 4865236 4367059 3834243 2664317 1504797 1431332
$$ packed form
41806E88527k83701R9107O23731P68261M02181r8642l16561k12176j4056J58917
41796A715588L49085M62373K14368m62064j168831j430474j176661o16937J35525
41787a978028R31677J269172O99554l84744r46140n28584J81979L25094m4719
41778d74739k41899K6187M10487N16459L17932O3271P0551M63506Q46274N24579
41768B522608n52811j371686r36835L83408J213080Q39736p0133m89828j85744
41759A351795L21975M62482N3107o02540q94082m95067J67417L98777J79959J20316
41749A064139M43202O67428M90389L15959N50048R67487J190406J225341J066854
41740G981253L83983p73186j521526j205288m98177n32816j169926j159520p3465
$$ plain form
41731 1431332 2357063 2985632 2346744 860898 -236948 -211512 560762 1140452 1090184
41722 1090184 914129 1286686 1992500 2145230 1551893 1160383 1679704 2389788 2121395
41713 2121395 1027878 407231 858725 1632645 1977818 2118956 2427066 2522702 1976818
41704 1976818 1300220 1343403 1995397 2323588 1936057 1427724 1361461 1487799 1276832 754300
41694 754300 436779 650613 1176635 1490616 1257504 653831 166295 -27272 -282548 -828722
41684 -828722 -1146407 -553882 666924 1397357 1064754 241988 -379636 -887825 -1524447
41675 -1524447 -1841047 -1275972 -200564 442434 380456 112617 -122265 -599316 -1229303
41666 -1229303 -1323432 -623279 125988 115345 -512376 -1025424 -1036841 -632140 10006 610741
$$ packed form
41731A431332R25731O28569o38888j485846j097846K5436P72274N79690n0268
41722A090184j76055L72557P05814J52730n93337l91510N19321P10084k68393
41713B121395j093517o20647M51494P73920L45173J41138L08110R5636n45884
41704A976818o76598M3183O51994L28191l87531n08333o6263J26338k10967n22532
41694G54300l17521K13834N26022L13981k33112o03673m87536j93567k55276n46174
41684h28722l17685N92525J220806P30433l32603q22766o21624n08189o36622
41675a524447l16600N65075J075408O42998o1978k67839k34882m77051o29987
41666a229303r4129P00153P49267j0643o27721n13048j1417M04701O42146O00735
$$ plain form
41656 610741 745936 354462 56848 463785 1367162 2076745 2304151 2191415 1756057 1003911
41646 1003911 423357 568401 1119763 1123260 320051 -458503 -444470 170530 739714 899653
41636 899653 511780 -405747 -1242622 -1022554 295069 1364230 1072883 97480 -59296
41627 -59296 808111 1508420 1331984 893306 922028 1252084 1430027 1458758 1380368 834514
41617 834514 -290172 -1276447 -1371999 -870761 -746820 -1362206 -2101085 -2204574 -1484345 -269155
41607 -269155 902064 1540487 1547640 1322084 1278870 1371739 1362959 1337931 1517091 1732264 1607397
41596 1607397 1165143 729711 330307 -171755 -421803 167086 1337223 1990345 1637478
41587 1637478 1098189 1240665 1716568 1645799 1005416 493153 353118 229257 42268 130490
$$ packed form
41656F10741J35195l91474k97614M06937R03377P09583K27406j12736m35358p52146
41646A003911n80554J45044N51362L497q03209p78554J4033O15000N69184J59939
41636H99653l87873r17527q36875K20068J317623J069161k91347r75403j56776
41627e9296Q67407P00309j76436m38678K8722L30056J77943K8731p8390n45854
41617H34514j124686r86275r5552N01238J23941o15386p38879j03489P20229J215190
41607b69155J171219O38423P153k25556m3214R2869q780k5028J79160K15173j24867
41596A607397m42254m35432l99404n02062k50048N88889J170137O53122l52867
41587A637478n39289J42476M75903p0769o40383n12263j40035j23861j86989Q8222
$$ plain form
41577 130490 478065 610620 428864 435179 888642 1359844 1396274 1051568 478600 -373787
41567 -373787 -1252741 -1400743 -459356 837378 1472314 1338340 1036917 804219 401950
41558 401950 -37720 97077 959931 1860934 2133628 1871196 1462425 898550 57360 -656314
41548 -656314 -583305 325481 1420630 2158066 2527627 2609225 2261641 1577802 1180506 1507880
41538 1507880 2027283 1782956 722378 -140679 -70163 465490 579427 185634 -121901
41529 -121901 -88234 -9000 19224 374771 1201075 1889344 1636874 373180 -1076924 -1725268
41519 -1725268 -1316756 -585010 -521852 -1257246 -1859923 -1482320 -425892 318283 286383 -259645
41509 -259645 -1053058 -1927474 -2316853 -1635005 -338221 325911 -27936 -406520 5208
$$ packed form
41577A30490L47575J32555j81756O315M53463M71202L6430l44706n72968q52387
41567c73787q78954j48002R41387J296734O34936j33974l01423k32698m02269
41558D01950m39670J34797Q62854R01003K72694k62432m08771n63875q41190p13674
41548f56314P3009R08786J095149P37436L69561Q1598l47584o83839l97296L27374
41538A507880N19403k44327j060578q63057P0516N35653J13937l93793l07535
41529a21901L3667P9234K8224L55547Q26304O88269k52470j263694j450104o48344
41519a725268M08512P31746O3158p35394o02677L77603J056428P44175l1900n46028
41509b59645p93413q74416l89379O81848J296784O64132l53847l78584M11728
$$ plain form
41500 5208 709595 927552 848381 1030619 1348839 1480605 1745891 2395576 2667768 1782371
41490 1782371 452454 71320 608833 695768 -212081 -1157580 -1373758 -1278237 -1336242 -1197746
41480 -1197746 -635360 -295636 -741175 -1522103 -1884208 -1729675 -1296625 -597620 207162
41471 207162 576204 393058 374662 1025524 1816989 2059996 1900557 1707734 1234052 341724
41461 341724 -136504 542387 1592163 1630152 803582 602615 1524888 2323271 1943894 948110
41451 948110 349320 66181 -574254 -1465192 -1821596 -1389973 -752763 -457210 -456612 -493495
41441 -493495 -530629 -575575 -407773 186491 991218 1473297 1404755 1135709 1050478 966977
41431 966977 433904 -494441 -1253258 -1529750 -1480688 -1114854 -165127 1121313 1813944 1478954
$$ packed form
41500E208P04387K17957p9171J82238L18220J31766K65286O49685K72192q85397
41490A782371j329917l81134N37513Q6935r07849r45499k16178R5521n8005J38496
41480a197746N62386L39724m45539p80928l62105J54533M33050O99005Q04782
41471B07162L69042j83146j8396O50862P91465K43007j59439j92823m73682q92328
41461C41724m78228O78891J049776L7989q26570k00967R22273P98383l79377r95784
41451I48110n98790k83139o40435q90938l56404M31623O37210K95553N98l6883
41441d93495l7134m4946J67802N94264Q04727M82079o8542k69046q5231q3501
41431I66977n33073r28345p58817k76492M9062L65834R49727J286440O92631l34990
$$ plain form
41421 1478954 881952 823479 889342 259584 -739215 -1013759 -403622 186120 361860 740018
41411 740018 1574653 2017796 1355568 164591 -430694 -117044 532865 896657 736778
41402 736778 175499 -350022 -405930 -106708 1454 -223093 -271557 218365 955458 1517300
41392 1517300 1774937 1534736 504185 -933966 -1669811 -1227372 -527349 -589989 -1116781
41383 -1116781 -1204931 -871980 -799164 -946969 -623377 176138 673097 660287 834318 1468529
41373 1468529 1788730 1196484 271971 -81867 139755 331593 287228 232839 198113 49260
41363 49260 -22086 314940 885217 1092619 710524 158191 -89028 6405 231136 442843
41353 442843 538886 395346 60577 -186667 -199153 -236686 -620835 -1191805 -1426121 -1159219
$$ packed form
41421A478954n97002n8473O5863o29758r98799k74544O10137N89742J75740L78158
41411G40018Q34635M43143o62228j190977n95285L13650O49909L63792j59879
41402G36778n61279n25521n5908K99222J08162k24547m8464M89922P37093N61842
41392A517300K57637k40201j030551j438151p35845M42439P00023o2640n26792
41383a116781q8150L32951P2816j47805L23592P99515M96959j2810J74031O34211
41373A468529L20201n92246r24513l53838K21622J91838m4365n4389l4726j48853
41363D9260p1346L37026N70277K07402l82095n52333k47219R5433K24731K11707
41353D42843R6043j43540l34769k47244j2486l7533l84149n70970k34316K66902
$$ plain form
41343 -1159219 -872991 -1015808 -1250385 -796849 437939 1490870 1393680 365498 -417898
41334 -417898 -195965 600798 1035586 796521 386892 342933 573166 558672 62342 -523062
41324 -523062 -606678 -143467 212515 -153282 -1021816 -1559468 -1366224 -962592 -995332 -1268259
41314 -1268259 -1047353 -253585 245014 -206949 -1074159 -1314602 -810082 -500018 -1027370
41305 -1027370 -1833102 -1948575 -1313579 -794554 -964976 -1350587 -1097748 -129600 699375
41296 699375 638730 -15329 -263062 357891 1215230 1450823 1074514 762839 772044 681246
41286 681246 264083 -65716 31200 278816 402603 713532 1450361 2003009 1593348 497092
41276 497092 -219003 -91041 380522 716215 960795 1110219 906754 474695 360907 585544
$$ packed form
41343a159219K86228j42817k34577M53536J234788J052931r7190j028182p83396
41334d17898K21933P96763M34788k39065m09629m3959K30233j4494m96330n85404
41324e23062q3616M63211L55982l65797q68534n37652J93244M03632l2740k72927
41314a268259K20906P93768M98599m51963q67210k40443N04520L10064n27352
41305a027370q05732j15473O34996N19025j70422l85611K52839R68148Q28975
41296F99375o0645o54059k47733O20953Q57339K35593l76309l11675R205r0798
41286F81246m17163l29799R6916K47616J23787L10929P36829N52648m09661j096256
41276D97092p16095J27962M71563L35693K44580J49424k03465m32059j13788K24637
$$ plain form
41266 585544 429891 -359117 -908258 -411159 630413 1111102 827086 495176 566581 829369
41256 829369 1074902 1388389 1700232 1667722 1180692 569596 177042 22846 -42643 -117030
41246 -117030 -239717 -450009 -841958 -1549782 -2437469 -2812530 -2002943 -474431 303415
41237 303415 -311761 -1056443 -383035 1284856 2036171 1093009 -252518 -571327 -58869
41228 -58869 208962 -85292 -392954 -336008 -87966 104290 222814 340738 484713 552097
41218 552097 258411 -534441 -1305109 -1169524 -36712 977429 786162 -335265 -1169546
41209 -1169546 -1049137 -360370 239880 435917 111750 -707655 -1587509 -1908697 -1612544
41200 -1612544 -1274802 -1218014 -1057812 -476114 76809 22565 -367323 -339620 150986 377321
$$ packed form
41266E85544j55653p89008n49141M97099J041572M80689k84016l31910P1405K62788
41256H29369K45533L13487L11843l2510m87030o11096l92554j54196o5489p4387
41246a17030j22687k10292l91949p07824q87687l75061Q09587J528512P77846
41237C03415o15176p44682O73408J667891P51315r43162j345527l18809N12458
41228e8869K67831k94254l07662N6946K48042J92256J18524J17924J43975O7384
41218E52097k93686p92852p70668J35585J132812J014141j91267j121427q34281
41209a169546J20409O88767O00250J96037l24167q19405q79854l21188K96153
41200a612544L37742N6788J60202N81698N52923n4244l89888K7703M90606K26335
$$ plain form
41190 377321 -914 -490339 -696086 -906395 -1296553 -1318393 -631160 -48410 -577499 -1824622
41180 -1824622 -2404000 -1834280 -925988 -221456 683073 1834695 2217072 1217489 -167094
41171 -167094 -627518 -313887 -200780 -311793 69857 730812 540400 -737022 -1927692
41162 -1927692 -2090852 -1581601 -1061853 -506919 195190 569997 278174 -106620 194901
41153 194901 1093524 1892526 2237844 2216103 1890404 1394530 1199490 1606734 2136615 2040269
41143 2040269 1311899 607388 248783 -49140 -433523 -554715 -192688 257926 270934 -139756
41133 -139756 -537185 -650495 -542958 -293227 155951 731352 1040053 706652 -94615 -676270
41123 -676270 -560685 -21997 295026 170099 -70923 -154005 -162944 -151656 124092 784172
$$ packed form
41190C77321l78235m89425k05747k10309l90158k1840O87233N82750n29089j247123
41180a824622n79378N69720R08292P04532R04529J151622L82377r99583j384583
41171a67094m60424L13631J13107j11013L81650O60955j90412j277422j190670
41162a927692j63160N09251N19748N54934P02109L74807k91823l84794L01521
41153A94901Q98623P99002L45318k1741l25699m95874j95040M07244N29881r6346
41143B040269p28370p04511l58605k97923l84383j21192L62027M50614J3008m10690
41133a39756l97429j13310J07537K49731M49178N75401L08701l33401q01267n81655
41123f76270J15585N38688L17023j24927k41022q3082q939J1288K75748O60080
$$ plain form
41113 784172 1402340 1392560 759889 168780 221123 854834 1516887 1782860 1669877 1381426
41103 1381426 956104 365786 -126287 -47883 703365 1638610 2235244 2460087 2526703 2478633
41093 2478633 2361355 2450985 2819435 2972144 2491336 1761059 1382435 1149586 464725 -416433
41083 -416433 -605777 -72416 219592 -118572 -383129 -249454 -478613 -1387476 -1837357 -903460
41073 -903460 395227 424226 -623902 -1122239 -573492 -218332 -926975 -1916399 -2110391
41064 -2110391 -1654362 -1322844 -1200526 -804329 -116835 290079 100035 -339005 -554189
41055 -554189 -563332 -772803 -1378927 -2055310 -2324961 -2155535 -1981616 -2104446 -2298255 -2133907
41045 -2133907 -1512170 -763517 -373193 -624854 -1274525 -1621688 -1299428 -938164 -1420505
$$ packed form
41113G84172O18168r780o32671n91109N2343O33711O62053K65973j12983k88451
41103A381426m25322n90318m92073P8404P51248R35245N96634K24843O6616m8070
41093B478633j17278Q9630L68450J52709m80808p30277l78624k32849o84861q81158
41083d16433j89344N33361K92008l38164k64557J33675k29159r08863m49881R33897
41073i03460J298687K8999j048128m98337N48747L55160p08643r89424j93992
41064b110391M56029L31518J22318L96197O87494M06914j90044m39040k15184
41055e54189r143k09471o06124o76383k69651J69426J73919j22830j93809J64348
41045b133907O21737P48653L90324k51661o49671l47163L22260L61264m82341
$$ plain form
41036 -1420505 -2410174 -2469778 -1021659 663902 1089428 406065 -135975 16539 439050
41027 439050 786225 1053583 988187 262136 -783899 -1424343 -1551846 -1626930 -1732203 -1527119
41017 -1527119 -1090225 -917241 -1039935 -987556 -689960 -612610 -932938 -1365864 -1812509 -2345496
41007 -2345496 -2590546 -2104106 -1390397 -1441560 -2115937 -2158547 -1157072 -264193 -449131 -1186787
40997 -1186787 -1580525 -1727137 -2110530 -2527273 -2540819 -2293549 -1972715 -1124891 526052
40988 526052 2084860 2320550 1240186 -4703 -580605 -621004 -605609 -762158 -999621
40979 -999621 -988168 -490378 99537 -10093 -877022 -1544528 -1414350 -1197867 -1752828 -2643248
40969 -2643248 -2822929 -2240977 -1696201 -1454154 -1154082 -893161 -1188859 -1816579 -1845907 -1096001
$$ packed form
41036a420505r89669n9604J448119J685561M25526o83363n42040J52514M22511
41027D39050L47175K67358o5396p26051j046035o40444j27503p5084j05273K05084
41017a527119M36894J72984j22694N2379K97596P7350l20328m32926m46645n32987
41007b345496k45050M86440P13709n1163o74377m2610J001475Q92879j84938p37656
40997a186787l93738j46612l83393m16743j3546K47270L20834Q47824J650943
40988E26052J558808K35690j080364j244889n75902m0399J5395j56549k37463
40979i99621J1453M97790N89915j09630q66929o67506J30178K16483n54961q90420
40969b643248j79681N81952N44776K42047L00072K60921k95698o27720k9328P49906
$$ plain form
40959 -1096001 -537971 -857422 -1488015 -1567527 -1154493 -930537 -1163303 -1488391 -1466539 -1006169
40949 -1006169 -424513 -293960 -995299 -2231344 -3161383 -3152426 -2296294 -1211439 -504669
40940 -504669 -341331 -328985 52642 695540 800165 -74590 -1205978 -1510430 -959893 -543132
40930 -543132 -859442 -1423835 -1492693 -1004267 -485458 -430765 -923415 -1550982 -1654121 -978661
40920 -978661 -37327 506353 628222 658614 497978 -141711 -874487 -953076 -525809 -610206
40910 -610206 -1505232 -2163357 -1659223 -458585 446508 960064 1588704 2205277 2089668
40901 2089668 1126863 149246 -76968 338769 800278 1024685 1212396 1617741 2179690
40892 2179690 2610832 2785772 2894064 3065673 2980101 2179143 786366 -430681 -829875
$$ packed form
40959a096001N58030l19451o30593p9512M13034K23956k32766l25088K1852M60370
40949a006169N81656J30553p01339j236045r30039Q957Q56132J084855P06770
40940e04669J63338J2346L81627O42898J04625q74755j131388l04452N50537M16761
40930e43132l16310n64393o8858M88426N18809N4693m92650o27567j03139O75460
40920i78661R41334N43680J21869L0392j60636o39689p32776p8589M27267q4397
40910f10206q95026o58125N04134J200638R05093N13556O28640O16573j15609
40901B089668r62805r77617k26214M15737M61509K24407J87711M05345N61949
40892B179690M31142J74940J08292J71609q5572q00958j392777j217047l99194
$$ plain form
40883 -829875 -455121 215820 722106 736720 182651 -533746 -766744 -348903 251780 663501
40873 663501 1062534 1610616 1908591 1486977 558188 -181988 -345699 -104065 158726 119461
40863 119461 -337853 -919269 -1088916 -758119 -525046 -858851 -1378928 -1434596 -1088104 -903857
40853 -903857 -984856 -932776 -673680 -562724 -624491 -476330 -202277 -503194 -1570751 -2528298
40843 -2528298 -2588920 -2204538 -2316819 -2842294 -2797015 -1874195 -1014095 -1110605 -1807985 -2043059
40833 -2043059 -1373611 -288415 543565 818252 491843 -331272 -1259678 -1731496 -1516111
40824 -1516111 -955132 -576113 -589369 -827219 -1008627 -984476 -886862 -1077096 -1712110 -2326872
40814 -2326872 -2227326 -1477700 -1051687 -1610467 -2517376 -2645226 -1916082 -1321987 -1461287 -1852651
$$ packed form
40883h29875L74754O70941N06286J4614n54069p16397k32998M17841O00683M11721
40873F63501L99033N48082K97975m21614r28789p40176j63711K41634K62791l9265
40863A19461m57314n81416j69647L30797K33073l33805n20077n5668L46492J84247
40853i03857q0999N2080K59096J10956o1767J48161K74053l00917j067557r57547
40843b528298o0622L84382j12281n25475M5279R22820Q60100r6510o97380k35074
40833b043059O69448J085196Q31980K74687l26409q23115r28406m71818K15385
40824a516111N60979L79019j3256k37850j81408K4151R7614j90234o35014o14762
40814b326872R9546P49626M26013n58780r06909j27850P29144N94095j39300l91364
$$ plain form
40804 -1852651 -1931639 -1972787 -2494047 -3255899 -3517643 -3094702 -2580114 -2520522 -2809642 -2964526
40794 -2964526 -2670903 -1945031 -992643 -71002 571606 716385 231680 -753717 -1755857
40785 -1755857 -2262984 -2264347 -2212154 -2316232 -2192799 -1506355 -662212 -379700 -691996 -895921
40775 -895921 -557886 -78717 -56439 -514296 -1088274 -1638926 -2203443 -2509530 -2124482 -1222185
40765 -1222185 -700194 -1154392 -2021989 -2216635 -1521663 -828029 -872886 -1266425 -1143586 -405150
40755 -405150 236224 297628 22328 -225465 -488624 -856593 -1022420 -654416 -9432 272697
40745 272697 -22657 -420051 -348775 273782 1140915 1953837 2479294 2376731 1356668 -330868
40735 -330868 -1791736 -2175434 -1498271 -601490 -260628 -524873 -976391 -1350257 -1665291
$$ packed form
40804a852651p8988m1148n21260p61852k61744M22941N14588N9592k89120j54884
40794b964526K93623P25872R52388R21641O42608J44779m84705r85397j002140
40785a755857n07127j363N2193j04078J23433O86444Q44143K82512l12296k03925
40775h95921L38035M79169K2278m57857n73978n50652n64517l06087L85048R02297
40765a222185N21991m54198q67597j94646O94972O93634m4857l93539J22839P38436
40755d05150O41374O1404k75300k47793k63159l67969j65827L68004O44984K82129
40745B72697k95354l97394P1276O22557Q67133Q12922N25457j02563j020063j687536
40735c30868j460868l83698O77163Q96781L40862k64245m51518l73866l15034
$$ plain form
40726 -1665291 -1925591 -2005569 -1824506 -1432279 -910149 -317190 270629 742060 937604 683240
40716 683240 28030 -564522 -614153 -317255 -407816 -1106482 -1728430 -1724052 -1529658 -1751062
40706 -1751062 -2036811 -1665293 -917828 -806389 -1508094 -2140583 -2195422 -2111593 -2154221 -1829253
40696 -1829253 -935793 -225872 -338042 -853838 -1073312 -987120 -791054 -207635 851241
40687 851241 1606699 1355688 580612 163548 -30864 -739568 -1862256 -2604598 -2826515
40678 -2826515 -3013494 -2977039 -1931106 -101375 1041432 708692 -107229 -126146 541412
40669 541412 1000786 1088080 1286959 1584304 1459714 933401 697600 1010016 1188683 612064
40659 612064 -255567 -383489 409598 1069345 529099 -982374 -2198674 -2278434 -1597026
$$ packed form
40726a665291k60300p9978J81063L92227N22130N92959N87819M71431J95544k54364
40716F83240o55210n92552m9631K96898r0561o98666o21948M378J94394k21404
40706a751062k85749L71518P47465J11439p01705o32489n4839Q3829m2628L24968
40696a829253Q93460P09921j12170n15796k19474Q6192J96066N83419J058876
40687H51241P55458k51011p75076m17064j94412p08704j122688p42342k21917
40678b826515j86979L6455J045933J829731J142807l32740q15921j8917O67558
40669E41412M59374Q7294J98879K97345j24590n26313k35801L12416J78667n76619
40659F12064q67631j27922P93087O59747n40246j511473j216300p9760O81408
$$ plain form
40650 -1597026 -996578 -716896 -437689 -53509 157014 100909 103170 396867 697035 504127
40640 504127 -284340 -1188523 -1558133 -1192555 -571453 -358353 -659837 -1001074 -1065682 -1049616
40630 -1049616 -1087732 -856913 -226689 142952 -437593 -1541137 -1990195 -1358671 -413095
40621 -413095 40530 78437 185359 431213 503569 234762 -226311 -618446 -793844 -849137
40611 -849137 -1012035 -1238700 -1089722 -323719 564467 838565 428636 -130222 -522029 -830986
40601 -830986 -1008178 -869214 -658748 -883124 -1420549 -1497388 -790465 90179 474571 356325
40591 356325 -24627 -642105 -1338119 -1623832 -1263179 -570652 176623 1017239 1672094 1413779
40581 1413779 152581 -1048878 -1287369 -1074349 -1458765 -2358972 -2709008 -2041741 -1034545
$$ packed form
40650a597026O00448K79682K79207L84180K10523n6105K261K93697L00168j92908
40640E04127p88467r04183l69610L65578O21102K13100l01484l41237o4608J6066
40630a049616l8116K30819O30224L69641n80545j103544m49058O31524R45576
40621d13095M53625L7907J06922K45854P2356k68807m61073l92135j75398n5293
40611h49137j62898k26665J48978P66003Q88186K74098m09929n58858l91807l08957
40601h30986j77192J38964K10466k24376n37425p6839P06923Q80644L84392j18246
40591C56325l80952o17478o96014k85713L60653O92527P47275Q40616O54855k58315
40581A413779j261198j201459k38491K13020l84416r00207l50036O67267J007196
$$ plain form
40572 -1034545 -524159 -712503 -1310137 -1784323 -1504143 -334222 891624 1143228 483424
40563 483424 -55245 80267 365964 213706 -188905 -443005 -699105 -1283546 -1949373 -2077158
40553 -2077158 -1482999 -608907 6100 128468 -179259 -620934 -762624 -401824 123667
40544 123667 279961 36445 -106734 62406 -8898 -910312 -2281608 -3089930 -2905555 -2341418
40534 -2341418 -2036073 -1807492 -1264496 -708960 -696648 -1009700 -918446 -390310 -150339 -405777
40524 -405777 -400436 391549 1403764 1829263 1707169 1558121 1419063 902634 -43606 -975358
40514 -975358 -1384630 -973939 176588 1384146 1739975 1139132 485575 411490 361875 -381785
40504 -381785 -1337220 -1421088 -567302 295024 754477 1319784 2182618 2636429 2178024 1402831
$$ packed form
40572a034545N10386j88344n97634m74186K80180J169921J225846K51604o59804
40563D83424n38669J35512K85697j52258m02611k54100k56100n84441o65827j27785
40553b077158N94159Q74092O15007J22368l07727m41675j41690L60800N25491
40544A23667J56294k43516j43179J69140p1304r01414j371296q08322J84375N64137
40534b341418L05345K28581N42996N55536J2312l13052R1254N28136K39971k55438
40524d05777N341P91985J012215M25499j22094j49048j39058n16429r46240r31752
40514i75358m09272M10691J150527J207558L55829o00843o53557p4085m9615p43660
40504c81785r55435q3868Q53786Q62326M59453N65307Q62834M53811m58405p75193
$$ plain form
40494 1402831 1245174 1824319 2520040 2818211 2634828 2046256 1118481 -14841 -1077165
40485 -1077165 -1662921 -1428735 -479588 539763 1044605 1117232 1186773 1274443 1073174 684667
40475 684667 605610 859552 801903 92801 -680010 -749176 -145543 463766 614947 351542
40465 351542 -73601 -421130 -519530 -409642 -368258 -570375 -814899 -785244 -505837 -338384
40455 -338384 -532898 -929282 -1160489 -1110146 -1079967 -1386866 -1829948 -1832736 -1238856 -621542
40445 -621542 -490293 -533313 -172993 365628 267741 -571458 -1217232 -952728 -236112 39300
40435 39300 -243481 -506317 -470865 -452032 -678997 -834864 -469809 369759 1100991 1122760
40425 1122760 321438 -857722 -1777246 -2086966 -1921429 -1657300 -1453231 -1043967 -110683
$$ packed form
40494A402831j57657N79145O95721K98171j83383n88572r27775j133322j062324
40485a077165n85756K34186R49147J019351N04842P2627O9541Q7670k01269l88507
40475F84667p9057K53942n7649p09102p72811o9166O03633O09309J51181k63405
40465C51542m25143l47529r8400J09888M1384k02117k44524K9655K79407J67453
40455c38384j94514l96384k31207N0343L0179l06899m43082k788N93880O17314
40445f21542J31249m3020L60320N38621r7887q39199o45774K64504P16616K75412
40435C9300k82781k62836L5452J8833k26965j55867L65055Q39568P31232K1769
40425A122760q01322j179160r19524l09720J65537K64129K04069M09264R33284
$$ plain form
40416 -110683 1093692 1727212 1241223 107535 -739422 -1056793 -1323098 -1672891 -1621001
40407 -1621001 -1086069 -799644 -1147613 -1401397 -840073 64501 447055 379103 395526 324224
40397 324224 -177599 -457105 250146 1073698 385381 -1532494 -2537110 -1758880 -836343
40388 -836343 -1224777 -2059706 -1940556 -1302230 -1398461 -2039303 -2114732 -1685267 -1770407 -2362630
40378 -2362630 -2340802 -1386039 -510639 -473519 -925662 -1385596 -1899566 -2378076 -2342156 -1809427
40368 -1809427 -1545578 -1931070 -2339309 -2145542 -1650560 -1428056 -1362465 -1008987 -485584 -291965
40358 -291965 -428571 -343315 214587 768066 702418 22031 -664047 -836342 -597979 -429506
40348 -429506 -477934 -336670 321741 1148773 1508728 1358915 1313420 1753178 2256192 2141621
$$ packed form
40416a10683J204375O33520m85989j133688q46957l17371k66305l49793N1890
40407a621001N34932K86425l47969k53784N61324R04574L82554o7952J6423p1302
40397C24224n01823k79506P07251Q23552o88317j917875j004616P78230R22537
40388h36343l88434q34929J19150O38326r6231o40842p5429M29465q5140n92223
40378b362630K1828R54763Q75400L7120m52143m59934n13970m78510L5920N32729
40368a809427K63849l85492m08239J93767M94982K22504O5591L53478N23403J93619
40358b91965j36606Q5256N57902N53479o5648o80387o86078j72295K38363J68473
40348d29506m8428J41264O58411Q27032L59955j49813m5495M39758N03014j14571
$$ plain form
40338 2141621 1354266 549424 360587 759322 1155953 1039997 462939 -102137 -296743
40329 -296743 -177526 -18916 35624 91808 374930 968981 1579371 1672272 1089827 404599
40319 404599 290692 625633 719718 427528 363787 820134 1194647 942420 445297 309098
40309 309098 318150 -127803 -850477 -1019797 -401930 259392 240368 -335668 -831713 -841618
40299 -841618 -438938 14809 155294 -124789 -606147 -953785 -933501 -462193 290584 832269
40289 832269 761428 337894 196415 423970 540579 524415 988712 1947911 2364264 1607725
40279 1607725 481411 -45275 -231064 -652548 -823834 -128506 597768 104625 -1061267
40270 -1061267 -1200048 -199929 285461 -368886 -747188 157623 1269373 1227623 404770
$$ packed form
40338B141621p87355q04842j88837L98735L96631j15956n77058n65076j94606
40329b96743J19217J58610N4540N6184K83122N94051O10390R2901n82445o85228
40319D04599j13907L34941R4085k92190o3741M56347L74513k52227m97123j36199
40309C09098R052m45953p22674j69320O17867O61322j9024n76036m96045r905
40299h41618M02680M53747J40485k80083m81358l47638K0284M71308P52777N41685
40289H32269p0841m23534j41479K27555J16609j6164M64297R59199M16353p56539
40279A607725j126314n26686j85789m21484j71286O95328P26274m93143j165892
40270a061267j38781J000119M85390o54347l78302R04811J111750m1750q22853
$$ plain form
40261 404770 -52120 -47101 -188775 -505956 -680491 -872956 -1246433 -1268117 -493802 493796
40251 493796 879167 803258 821821 769815 244885 -279600 -29303 682163 840033 376922
40241 376922 266453 907328 1467725 1070978 -168888 -1472340 -2093664 -1670200 -590675
40232 -590675 -15139 -735892 -1971125 -2147454 -1026019 -137028 -765881 -2368064 -3504752
40223 -3504752 -3622323 -3213926 -2720453 -2076047 -1209337 -338730 336417 845000 1205715
40214 1205715 1213719 648286 -336204 -1153197 -1263118 -754826 -297398 -391677 -839231 -1136438
40204 -1136438 -1165337 -1137039 -1003529 -439287 507679 1216383 1230479 925451 1114362 2068256
40194 2068256 3181616 3636448 3223486 2412723 1737897 1335895 1128197 1153753 1413114
$$ packed form
40261D04770m56890N019j41674l17181j74535j92465l73477k1684P74315R87598
40251D93796L85371p5909J8563n2006n24930n24485K50297P11466J57870m63111
40241C76922j10469O40875N60397l96747j239866j303452o21324M23464J079525
40232e90675N75536p20753j235233j76329J121435Q88991o28853j602183j136688
40223c504752j17571M08397M93473O44406Q66710Q70607O75147N08583L60715
40214A205715Q004n65433r84490q16993j09921N08292M57428r4279m47554k97207
40204a136438k8899K8298J33510N64242R46966P08704J4096l05028J88911R53894
40194B068256J113360M54832m12962q10763o74826m02002k07698K5556K59361
$$ plain form
40185 1413114 1543816 1100773 202629 -522186 -753936 -817269 -1015825 -1119563 -874746 -608093
40175 -608093 -829745 -1483864 -2068049 -2324032 -2348661 -2149146 -1589384 -793664 -192386 -62702
$$ packed form
40185A413114J30702m43043q98144p24815k31750o3333j98556j03738K44817K66653
40175f08093k21652o54119n84185k55983k4629J99515N59762P95720O01278J29684
$$ [...]
##END NTUPLES=NMR SPECTRUM
##END=
