##TITLE=31Pdec_LR-678-CR2-2
 CDCl3, 24 sc
 24.11.2020
##JCAMPDX= 6.0         $$ Bruker NMR JCAMP-DX V2.0
##DATA TYPE= NMR SPECTRUM
##DATA CLASS= NTUPLES
##ORIGIN= UXNMR, Bruker Analytische Messtechnik GmbH
##OWNER= root
$$ XWIN-NMR		Version 3.5
$$ Tue Nov 24 10:25:00 2020 Russian Standard Time (UT+4h)  she@DPX200
##.OBSERVE FREQUENCY= 81.013821
##.OBSERVE NUCLEUS= ^31P
##.ACQUISITION MODE= SIMULTANEOUS
##.ACQUISITION SCHEME= undefined
##.AVERAGES= 24
##.DIGITISER RES= 17
##SPECTROMETER/DATA SYSTEM= spect
##.PULSE SEQUENCE= zgpg30
##.SOLVENT NAME= DMSO
##.SHIFT REFERENCE= (INTERNAL, DMSO, 0, 182.463)
##AUDIT TRAIL= $$ (NUMBER, WHEN, WHO, WHERE, WHAT)
$$ ##TITLE= Audit trail, XWIN-NMR		Version 3.5
$$ ##JCAMPDX= 5.01
$$ ##ORIGIN= Bruker BioSpin GmbH
$$ ##OWNER= she
$$ F:/spectra/data/she/nmr/P31/1/pdata/1/auditp.txt
$$ ##AUDIT TRAIL=  $$ (NUMBER, WHEN, WHO, WHERE, WHAT)
(   1,<2020-11-24 10:23:13.82 +0400>,<she>,<DPX200>,
      <created by zg, POWCHK disabled, PULCHK disabled
       configuration hash MD5:
       00 E9 B6 7A A2 85 ED C7 34 08 36 98 17 FE 4E 26
       data hash MD5: 32K
       BD A5 BC 21 F2 DB 69 90 6F 3A 5B FE 3D 48 12 86>)
(   2,<2020-11-24 10:23:19.42 +0400>,<she>,<DPX200>,
      <Start of raw data processing
       efp BC_mod = 2 LB = 1 FT_mod = 6 PKNL = 1 PHC0 = -2410.786 PHC1 = 139.2008 SI = 64K 
       data hash MD5: 64K
       04 A0 5B AB A9 91 27 AF 74 1D AF F8 4A CC B4 25>)
(   3,<2020-11-24 10:23:47.64 +0400>,<she>,<DPX200>,
      <pk PHC0 = 6.51058 PHC1 = 0 
       data hash MD5: 64K
       77 B4 E0 33 57 2F 90 49 51 E9 BF BD ED 66 FE C1>)
(   4,<2020-11-24 10:23:53.15 +0400>,<she>,<DPX200>,
      <abs ABSG = 5 
       data hash MD5: 64K
       9B 52 A0 0B 85 35 59 D6 D9 67 CB E6 38 66 DA 60>)
$$ ##END=
$$ 
$$ hash MD5
$$ A5 68 B6 83 61 51 A5 B3 55 74 47 C2 A5 02 93 F0
##$RELAX= 
##$RELAX= 
##$RELAX= 
##$RELAX= 
##$RELAX= 
##$RELAX= 
##$RELAX= 
##$RELAX= 
$$ Bruker specific parameters
$$ --------------------------
##$DU= <F:/spectra>
##$EXPNO= 1
##$NAME= <P31>
##$PROCNO= 1
##$TYPE= <nmr>
##$USER= <she>
##$AMP= (0..31)
100 100 100 100 100 100 100 100 100 100 100 100 100 100 100 100 100 100 
100 100 100 100 100 100 100 100 100 100 100 100 100 100 
##$AQSEQ= 0
##$AQ_mod= 1
##$AUNM= <au_zg>
##$AUTOPOS= <>
##$BF1= 81.014009
##$BF2= 200.13
##$BF3= 200.13
##$BF4= 200.13
##$BF5= 200.13
##$BF6= 200.13
##$BF7= 200.13
##$BF8= 200.13
##$BYTORDA= 1
##$CFDGTYP= 0
##$CFRGTYP= 5
##$CHEMSTR= <none>
##$CNST= (0..31)
1 1 145 1 1 1 1 1 1 1 1 1 1 1 1 1 1 1 1 1 1 1 1 1 1 1 1 1 1 1 1 1 
##$CPDPRG= <waltz16>
##$CPDPRG1= <>
##$CPDPRG2= <waltz16>
##$CPDPRG3= <>
##$CPDPRG4= <mlev>
##$CPDPRG5= <mlev>
##$CPDPRG6= <mlev>
##$CPDPRG7= <mlev>
##$CPDPRG8= <mlev>
##$CPDPRGB= <>
##$CPDPRGT= <>
##$D= (0..31)
0 1 0 0 0 0 0 0 0 0 0 0.03 2e-05 3e-06 0 0 0 0 0 0 0 0 0 0 0 0 0 0 0 0 
0 0 
##$DATE= 1606198993
##$DBL= (0..7)
120 120 120 11 120 120 24 19 
##$DBP= (0..7)
150 150 150 150 150 150 150 150 
##$DBP07= 0
##$DBPNAM0= <>
##$DBPNAM1= <>
##$DBPNAM2= <>
$$ [...]
##$SUBNAM3= <"">
##$SUBNAM4= <"">
##$SUBNAM5= <"">
##$SUBNAM6= <"">
##$SUBNAM7= <"">
##$SUBNAM8= <"">
##$SUBNAM9= <"">
##$SW= 369.568048894756
##$SWIBOX= (0..15)
0 1 3 0 0 0 0 0 0 0 0 0 0 0 0 0 
##$SW_h= 29940.119760479
##$TD= 32768
##$TD0= 1
##$TE= 0
##$TE2= 300
##$TE3= 300
##$TEG= 300
##$TL= (0..7)
0 120 53 12 22 120 120 120 
##$TP= (0..7)
150 150 150 150 150 150 150 150 
##$TP07= 0
##$TPNAME0= <>
##$TPNAME1= <>
##$TPNAME2= <>
##$TPNAME3= <>
##$TPNAME4= <>
##$TPNAME5= <>
##$TPNAME6= <>
##$TPNAME7= <>
##$TPOAL= (0..7)
0.5 0.5 0.5 0.5 0.5 0.5 0.5 0.5 
##$TPOFFS= (0..7)
0 0 0 0 0 0 0 0 
##$TUNHIN= 0
##$TUNHOUT= 0
##$TUNXOUT= 0
##$USERA1= <user>
##$USERA2= <user>
##$USERA3= <user>
##$USERA4= <user>
##$USERA5= <user>
##$V9= 5
##$VALIST= <valist>
##$VCLIST= <CCCCCCCCCCCCCCC>
##$VD= 0
##$VDLIST= <DDDDDDDDDDDDDDD>
##$VPLIST= <PPPPPPPPPPPPPPP>
##$VTLIST= <TTTTTTTTTTTTTTT>
##$WBST= 1024
##$WBSW= 4
##$XGAIN= (0..3)
0 0 0 0 
##$XL= 0
##$YL= 0
##$YMAX_a= 10821
##$YMIN_a= -19912
##$ZGOPTNS= <>
##$ZL1= 120
##$ZL2= 120
##$ZL3= 120
##$ZL4= 120
##$ABSF1= 182.463
##$ABSF2= -187.1042
##$ABSG= 5
##$ABSL= 3
##$ALPHA= 0
##$AQORDER= 0
##$ASSFAC= 0
##$ASSFACI= 0
##$ASSFACX= 0
##$ASSWID= 0
##$AUNMP= <proc_1d>
##$AZFE= 0.1
##$AZFW= 0.5
##$BCFW= 0
##$BC_mod= 2
##$BYTORDP= 0
##$COROFFS= 0
##$CY= -3
##$DATMOD= 1
##$DC= 0
##$DFILT= <>
##$DTYPP= 0
##$F1P= 0
##$F2P= 0
##$FCOR= 1
##$FTSIZE= 65536
##$FT_mod= 6
##$GAMMA= 0
##$GB= 0
##$INTBC= 1
##$INTSCL= 5.30512e-09
##$ISEN= 30
##$LB= 1
##$LEV0= 0
##$LPBIN= 0
##$MAXI= 10000
##$MC2= 0
##$MEAN= 0
##$ME_mod= 0
##$MI= 50
##$NCOEF= 0
##$NC_proc= -8
##$NLEV= 6
##$NOISF1= 182.463
##$NOISF2= 159.3651
##$NSP= 0
##$NTH_PI= 0
##$NZP= 0
##$OFFSET= 182.463
##$PC= 4
##$PHC0= -2404.275
##$PHC1= 139.2008
##$PH_mod= 1
##$PKNL= yes
##$PPARMOD= 0
##$PSCAL= 0
##$PSIGN= 0
##$REVERSE= no
##$SF= 81.014009
##$SI= 65536
##$SIGF1= 159.3651
##$SIGF2= -187.1042
##$SINO= 113.3802
##$SIOLD= 16384
##$SREGLST= <1H.CDCl3>
##$SSB= 0
##$STSI= 65536
##$STSR= 0
##$SW_p= 29940.119760479
##$SYMM= 0
##$S_DEV= 0
##$TDeff= 32768
##$TDoff= 0
##$TI= <>
##$TILT= no
##$TM1= 0
##$TM2= 0
##$TOPLEV= 0
##$USERP1= <user>
##$USERP2= <user>
##$USERP3= <user>
##$USERP4= <user>
##$USERP5= <user>
##$WDW= 1
##$XDIM= 65536
##$YMAX_p= 379313697
##$YMIN_p= -77312985
$$ End of Bruker specific parameters
$$ ---------------------------------
##NTUPLES= NMR SPECTRUM
##VAR_NAME=  FREQUENCY,     SPECTRUM/REAL,   SPECTRUM/IMAG
##SYMBOL=    X,             R,               I
##VAR_TYPE=  INDEPENDENT,   DEPENDENT,       DEPENDENT
##VAR_FORM=  AFFN,          ASDF,            ASDF
##VAR_DIM=   65536,         65536,           65536
##UNITS=     HZ,            ARBITRARY UNITS, ARBITRARY UNITS
##FACTOR=    0.456856943014862, 1,           1
##FIRST=     14782.0589164895, 0,            0
##LAST=      -15158.0608439895, 0,           0
##MIN=       -15158.0608439895, -77312985,   0
##MAX=       14782.0589164895, 379313697,    0
$$ Real data points
##PAGE= N=1
##DATA TABLE= (X++(R..R)), XYDATA
$$ [...]
45624D330287k326482l842259n498456l034421L698508Q458784O117299j123675
45616F779585o951842p915425n540462l131603k004141p41231K026114M590924
45608a2888081L579360j095832m902431l802375J071697N256705N674023K360024
45600d746910k198321m148205j353861L128896L621266o13110l880170j908935
45592a2099350K908587O298212P312684N920496R81211n281623o615205j779345
45584b354333J691348r97750l253928J666532P443865M157976l990899m417282
45576e4471K465095L218630n602982j0397008k365826P949054P240962j031793
45568A421661m865641k721598j872427l300304j120776M792400P119454K844078
$$ y = [4330287, 2003805, -1838454, -7336910, -10371331, -6672823, 1785961, 7903260, 6779585, -172257, -8087682, -13628144, -16759747, -18763888, -19505119, -17479005, -12888081, -9308721, -10404553, -15306984, -19109359, -18037662, -12780957, -7106934, -4746910, -6945231, -11093436, -12447297, -9318401, -5697135, -6310245, -10190415, -12099350, -9190763, -2892551, 4420133, 10340629, 11321840, 6040217, -574988, -2354333, -662985, -1660735, -4914663, -3248131, 4195734, 8353710, 4362811, -54471, 2410624, 5629254, 26272, -10370736, -12736562, -4787508, 2453454, 1421661, -3443980, -6165578, -8038005, -11338309, -12459085, -7666685, -547231, 2296847]
45560B296847k307090k878837k16062J691299J331730p57156l019334k746849
45552f605452R63932M111609K146986k693383l540473J192591N542620M988320
45544F106750K154810R20986n0544l640975p587451o660785o62727M212228L124789
45535b082919j131370j788192K873517O708561L302093n129865r371444m150348
45527a0769967N467938J0212953O592311j312921p312377p360450r54311P442663
45519B005839R952937L052919o728864r512186m211440J075265R82170r33065
45511d316425K21729L078928L874959K962724K612084J991410l58523j769251
45503H297635R99730M932387L557321l437251r054413q500019m706690k488688
$$ y = [2296847, -10243, -2889080, -3105142, -1413843, -82113, -839269, -3858603, -6605452, -5641520, -1529911, 617075, -2076308, -5616781, -4424190, 1118430, 6106750, 8261560, 9182546, 9132002, 5491027, -2096424, -8757209, -9419936, -5207708, -2082919, -3214289, -5002481, -2128964, 4579597, 7881690, 2751825, -6619619, -10769967, -5302029, 4910924, 11503235, 10190314, 2877937, -4482513, -5436824, 2005839, 11958776, 15011695, 8282831, -1229355, -5440795, -4365530, -3383360, -4316425, -4094696, -1015768, 2859191, 5821915, 8433999, 10425409, 10066886, 8297635, 9297365, 14229752, 17787073, 14349822, 5295409, -3204610, -7911300, -10399988]
45495a0399988j899307m17495J838494K723745J901015J018471J239331K649561
45487a346173M652570N249362K097294l462548n846131j803315M466704O373472
45479A0381235L359732K2510j790557m557935q559781r430031m393966L192583
45471a1776210P878223P496894K914937l767594q606190p429168j190069L560986
45463a0918191K588322q83795j919786q19722k77357M15029K937571M867898L100257
45454i09774O4229K71947K571476K546597Q63581J403981K212564k304012r447295
45445b726706q868202J388158R292001N120955m969246q918863n432028k091574
45437a7205505j681519J53230N417441J0098622J0027020M851524l089856r327272
$$ y = [-10399988, -12299295, -12716790, -10878296, -8154551, -6253536, -5235065, -3995734, -1346173, 3306397, 8555759, 10653053, 7190505, 1344374, -458941, 4007763, 10381235, 13740967, 13763477, 11972920, 7414985, -1144796, -10574827, -14968793, -11776210, -3897987, 3598907, 6513844, 2746250, -5859940, -13289108, -14479177, -10918191, -8329869, -9213664, -11133450, -11953172, -12230529, -11815500, -8877929, -4010031, -909774, -845545, -573598, 1997878, 4544475, 5408056, 6812037, 9024601, 6720589, -2726706, -11594908, -10206750, -914749, 4206206, -763040, -9681903, -15113931, -17205505, -18887024, -18733794, -13316353, -3217731, 6809289, 11660813, 8570957, -756315]
45429g56315q759185j688085M044209K399095k331313k611205L45499L8204k733226
45420a2052322j160255M452425O110523K065206j07059K384722K063700m493305
45412g36365q286840k512592M368222J491995n909814m301549N815965R788745
45404b82233J327099q388538q052706j338751J856182O64182J408853N513124
45396g292788P745718N083707N26330k301139l314652l605535k727363k84601
45388f170323K028139K087274K81046q06872K35590J746499J348674l23381J01197
45379E27843M071688Q295660Q169669L100406l311471p514036q299031n746590
45371g05862j059574K328072R32634l891611n980164j609079N093401O636308
$$ y = [-756315, -9515500, -11203585, -7159376, -4760281, -7091594, -9702799, -9357300, -9319096, -12052322, -13212577, -8760152, -2649629, -584423, -691482, 1693240, 3756940, -736365, -9023205, -11535797, -7167575, -5675580, -11585394, -15886943, -10070978, -282233, 1044866, -7343672, -15396378, -16735129, -14878947, -14214765, -12805912, -7292788, 452930, 5536637, 6062967, 3761828, 447176, -3158359, -5885722, -6170323, -4142184, -2054910, -1773864, -2580736, -2345146, -598647, 750027, 426646, 527843, 4599531, 12895191, 21064860, 24165266, 20853795, 13339759, 5040728, -705862, -1765436, 562636, 1495270, -2396341, -8376505, -9985584, -4892183, 1744125]
45363A744125J279976m898097n329309l83203L741469K772957p39858j410979
45355c222919J231638K055632j509323m312918n11772O596660P811661J192022
45347I330681m619609k704121K733604L834124P56577m68525J612963K820928
45339A3296622J374525j56350r59638l135545n712648m447684J12023J209662
45331A580967l685399p405830l542618K974735L020263k365526l295226L622741
45323i095893R621159O309624k451804n994780p07502O558802P975311L328017
45315A5542934j846444l762681l592443l930306m629055l573692l96536K672341
45307c515882L675233K883102J679437J244490K398332M463873M231869o87792
$$ y = [1744125, 3024101, -1873996, -7203305, -7586508, -3845039, -1072082, -1811940, -3222919, -1991281, 64351, -1444972, -5757890, -6269662, 326998, 8138659, 9330681, 4711072, 2006951, 4740555, 8574679, 9331256, 8862731, 10475694, 13296622, 14671147, 14514797, 13555159, 10419614, 4706966, 259282, 371305, 1580967, -2104432, -9510262, -13052880, -10078145, -7057882, -9423408, -12718634, -9095893, 525266, 6834890, 4383086, -1611694, -2319196, 4239606, 12214917, 15542934, 13696490, 9933809, 6341366, 2411060, -2217995, -5791687, -6188223, -3515882, 159351, 3042453, 4721890, 5966380, 8364712, 12828585, 17060454, 16372662]
45299A6372662o885430p779326k917904M00075j961518m131582N8491N833529
45291a011003M390193k266062l740874K020757N489296J363073l305047j875611
45283A064722J075856o14740k865800P94036N684091K061801q056246j2083696
45275a2939976n090109M042216O767788N145061M196941L217625M18907j263571
45267D494882J27014q1189n574994j0314133o009465M185163Q667164L943832
45259e61726q81636J539742O388750N546967L05897j846705M28729Q82275l849989
45250G952304r061614r043881m333507P57904M143104O265903O898779N175988
45242H754980J859093j167381l095077l809112k397640J246856M095310K620329
$$ y = [16372662, 9487232, 1707906, -1209998, -809923, -2771441, -6903023, -6844532, -1011003, 3379190, 1113128, -2627746, -606989, 4882307, 6245380, 2940333, 1064722, 2140578, 1525838, -1339962, -545926, 5138165, 7199966, -856280, -12939976, -18030085, -13987869, -7220081, -2075020, 2121921, 5339546, 5758453, 4494882, 4621896, 4540707, -1034287, -11348420, -17357885, -13172722, -4505558, -561726, -1443362, 96380, 6485130, 12032097, 12337994, 10491289, 10920018, 11802293, 7952304, -1109310, -10153191, -14486698, -13728794, -9585690, -3319787, 3578992, 8754980, 10614073, 9446692, 6351615, 2542503, 144863, 1391719, 5487029, 8107358]
45234H107358j906550l999863j083004K772558K281943j864182l938934p90054
45226d20728L890147L827703k322273r066883j0119205n344920m8678K258139
45218a7346698L344036N304634N891618K506202j863268k001419J311004K303338
45210e50553k94383j095375K705412O173087M371799j2860j564608n45226r62954
45201H224339l039283l318819r60401J288424K006323K520969L320012K854359
45193A2895923N12079j979060k662631j270175O55795N51257k772840o430778
45185e00430n668315m23923L447715J785932k544358m636734l792240j469844
45177a3802197K236341N674307M384785j559146m304444P56066O252095L730835
$$ y = [8107358, 6200808, 2200945, 1117941, 3890499, 6172442, 4308260, 369326, -420728, 3469419, 7297122, 4974849, -4092034, -14211239, -19556159, -19604837, -17346698, -14002662, -8698028, -2806410, -300208, -2163476, -4164895, -2853891, -550553, -844936, -1940311, 765101, 6938188, 11309987, 11297127, 9732519, 9187293, 8224339, 5185056, 1866237, 905836, 2194260, 4200583, 6721552, 10041564, 12895923, 13408002, 11428942, 8766311, 7496136, 8151931, 8703188, 5930348, -500430, -6168745, -6592668, -3144953, -1359021, -3903379, -8540113, -12332353, -13802197, -11565856, -5891549, -1506764, -3065910, -7370354, -6614288, -362193, 3368642]
45169C368642k304472k211571J791560K52158m607106r78095J0408266J3486681
45161A9206063J685730j0434143r124351j014105M31422l764339l624941J414527
45153e224137L776435K436835L224724O772107P375890K904257k983290p098340
45145A1184481p988506m022552K409138L192637m397423r898760l358441Q051067
45137d828359R646829J698671k435739Q91920J222984n420173q259507n34628
45129h018002P912783O000053k033663n516754l753157k818875k783078N90240
45121a0420453N329899N051421k08421l783581k656648n49831n01588q24549L77574
45112h186177J766607J561765L71177k52731K4537N98761J174846K102079L563227
$$ y = [3368642, 1064170, -1147401, 644159, 896317, -3710789, -4688884, 5719382, 19206063, 20891793, 10457650, 1333299, 319194, 750616, -3013723, -6638664, -5224137, -1447702, 989133, 4213857, 10985964, 18361854, 21266111, 18282821, 11184481, 3195975, -826577, 1582561, 4775198, 377775, -9520985, -12879426, -4828359, 4818470, 6517141, 4081402, 4973322, 6196306, 776133, -7483374, -8018002, -105219, 5894834, 3861171, -1655583, -5408740, -8227615, -11010693, -10420453, -5090554, -39133, -247554, -4031135, -6687783, -7237614, -7739202, -8563751, -8186177, -6419570, -4857805, -4486628, -4739359, -4714822, -4116061, -2941215, -839136, 2724091]
45103B724091M376252K656880r14050k169411J068063M160461J141827n684704
45095G359409p760242k489718L324692M135695K474012J783660j0521m347607
45087D469380o192713j595441L879482K321677l994495n349386J373753Q762132
45079C674389R229812L328342l063066n242075k692059R86368J102570k596574
45071D727707m687387j189490M279047N267423J188690l237555n244001n649177
45063d544743m767107k229866k01697j275588l191103r47797N201312Q801379
45055c155210N594893j089921m904854l528634J73941K085054R75806o96741n08848
45046e054514j5080j970608l841418K016P642368Q882330K88445p011692k829857
$$ y = [2724091, 7100343, 9757223, 8843173, 6673762, 7741825, 11902286, 13044113, 7359409, -400833, -2890551, 434141, 4569836, 7043848, 8827508, 8816987, 4469380, -1723333, -3318774, 560708, 2882385, -1112110, -6461496, -5087743, 3674389, 12904201, 16232543, 13169477, 7927402, 5235343, 6221711, 7324281, 4727707, 40320, -1149170, 3129877, 8397300, 9585990, 6348435, 1104434, -4544743, -9311850, -11541716, -11743413, -13019001, -16210104, -17157901, -11956589, -3155210, 2439683, 1349762, -3555092, -7083726, -6909785, -4824731, -3848925, -4545666, -5054514, -5069594, -7040202, -10881620, -10879604, -3237236, 5645094, 5933539, -1078153, -3908010]
45037c908010N967029N968065j675655m421534J06613J351762m183924n970312
45029f765966K136422J0261331P431961k515597q673713q259364n475174k307835
45021a4167935Q22184R23424k677978l954020J569384Q399357Q438546K906245
45013B259207n99396L43452J748029R39327j317253m117891n804974k880940M355108
45004e075331Q317527L054966o137901q926375l359368L479016N585797K207140
44996h54529m857558j0719831p665257N312588J6092511J2290844j269059q267478
44988F2231l121350L700759L262138o70974j284313Q37881J734654N05233k540833
44979B485426p245978r989273n990384K028823N483792K977314K428336O447572
$$ y = [-3908010, 2059019, 8027084, 6351429, 1929895, 2036508, 3388270, -795654, -6765966, -4629544, 5631787, 13063748, 10548151, 1874438, -6384926, -11860100, -14167935, -13345751, -12422327, -15100305, -19054325, -17484941, -9085584, -647038, 2259207, 1659811, 2003263, 3751292, 4690619, 3373366, -744525, -6549499, -9430439, -5075331, 3242196, 6297162, 159261, -8767114, -12126482, -8647466, -3061669, -854529, -5712087, -16431918, -24097175, -18784587, -2692076, 9598768, 8329709, 62231, -3059119, 641640, 3903778, 3232804, 1948491, 2786372, 4521026, 5026259, 2485426, -4760552, -14749825, -20740209, -18711386, -13227594, -10250280, -7821944, -1374372]
44971a374372O415073k265384r554627n056704N371789Q400789K745076j783153
44963B898487j047151l40147k353397k780714M22106K734523R40341j799132j678335
44954c003419M83244K220420L003869K649845K83299k971080l751261r10030K603295
44945F08182L863463L385369K989905K627269J089340j479328l261427k792765
44937G030008j052480j149542m574055p814858n558269J559010N911427K281513
44929c367246m903450p326513l090970K807934O007257O108293M038317R14936
44921A188558r99164j94303J724330K590096K934763L474800K164448j778621
44913A1104907m060668j347582J852619n10974n323455m554652J089543K789100
$$ y = [-1374372, 5040701, 2775317, -6779310, -11836014, -6464225, 1936564, 4681640, 2898487, 1851336, 1511189, -842208, -3622922, -3200816, -466293, 474048, -1325084, -3003419, -2520175, -299755, 2704114, 5353959, 5637258, 2666178, -1085083, -1995113, 608182, 4471645, 7857014, 10846919, 13474188, 14563528, 13084200, 9822773, 7030008, 5977528, 4827986, 253931, -7560927, -13119196, -11560186, -5648759, -3367246, -8270696, -15597209, -18688179, -15880245, -9872988, -3764695, 273622, 1188558, 189394, -4909, 1719421, 4309517, 7244280, 10719080, 12883528, 11104907, 7044239, 5696657, 7549276, 7038302, 1714847, -2839805, -1750262, 1038838]
44905A038838j505952l583358O38397L911308M40097l675060o42071N693624N835723
44896H151546o73915n586723m576483j334089J58640L21482N06476M25570r585
44887b617081j89172n75520j936701k982496j468761K653387P130680R498244
44879I512580Q044006K983308j901001k211206N49534j8139m899280o411622k92899
44870E355281N494244K049790n733741o186835O14977L592779m47702k023673
44862B715120L556796O967082N79349p272814m349481O029907R396812J193717
44854A8816488p876136q058726k287996J346423J156293R35017K291984L301185
44846I624532K810908J704827L16597k047578m561949m436778l86638M781610
$$ y = [1038838, -467114, -4050472, -3412075, 499233, 939330, -2735730, -3377801, 2315823, 8151546, 7477631, 1890908, -2685575, -4019664, -3861024, -3539542, -3033066, -2607496, -2617081, -2806253, -3381773, -5318474, -8300970, -9769731, -7116344, 14336, 9512580, 17556586, 20539894, 18638893, 16427687, 16977221, 16959082, 12059802, 5648180, 5355281, 10849525, 12899315, 7165574, 978739, 1593716, 5186495, 4738793, 2715120, 6271916, 13238998, 13818347, 6545533, 2196052, 8225959, 17622771, 18816488, 10940352, 2881626, 593630, 1940053, 3096346, 4031363, 6323347, 9624532, 12435440, 14140267, 14456864, 12409286, 7847337, 3410559, 3023921, 7805531]
44838G805531O623933L855760n24659l000452l103842k570411k314718j834380
44830D936762r82312n28979r00838j716716k553968k928886j870163Q46903L373616
44821b324581L654095K335609J553590J254150j48421j588059j19262K996203
44813G613324J875888n298720j1546081r515542j449759M451400N270424M972457
44805c626609N939032N664989K695932m31500k182008m258401o241549l819586
44797f259700L606875Q911395O327841K50570j557170j35057k670531r239599
44789g65376j1396691n380985J958541M065088L818809O295233Q767623N340243
44781A2702485k313359o676255n233325k408837j168769K82601K600257K743918
$$ y = [7805531, 14429464, 18285224, 17760565, 14760113, 11656271, 9085860, 6771142, 4936762, 3954450, 3425471, 2524633, 807917, -1746051, -4674937, -6545100, -5698197, -2324581, 1329514, 3665123, 5218713, 6472863, 6324442, 4736383, 4617121, 7613324, 9489212, 4190492, -7355589, -16871131, -18320890, -13869490, -8599066, -3626609, 2312423, 7977412, 10673344, 10241844, 8059836, 3801435, -2440114, -6259700, -2652825, 6258570, 12586411, 12836981, 11279811, 11144754, 8474223, -765376, -12162067, -17543052, -15584511, -11519423, -7700614, -1405381, 7362242, 12702485, 10389126, 3712871, -1520454, -3929291, -5098060, -4815459, -2215202, 528716]
44773E28716l38689k777789j356957K052824M106607M265184L093731J38756l637301
44764F075082m807323k059296J168778J724260J343148K729963M099100K105898
44756A2379610j832398k955857j30822K799553K502299m36260l542939n001281
44748C781905m246852k363393j428216j583749k40259L430476N476283K373829
44740E200024k627291l122834J335199M734306L224972o69096l161901l738283
44732A175096l130084j090553J763200L291008K784890J579756l53474m550936
44724A468903r169228q452653m03165Q380003R488208K450620n649840q722028
44716a0609180o455389j736015K839635N436273N013610K498412O66337J529280
$$ y = [528716, 190027, -2587762, -3944719, -1891895, 2214712, 6479896, 9573627, 9712383, 6075082, 1267759, -791537, 377241, 2101501, 3444649, 6174612, 10273712, 12379610, 10547212, 7591355, 7460533, 10260086, 12762385, 12326125, 8783186, 3781905, -464947, -2828340, -4256556, -5840305, -6080564, -2650088, 2826195, 5200024, 2572733, -550101, 785098, 5519404, 8744376, 8075280, 4913379, 1175096, -1954988, -3045541, -1282341, 2008667, 4793557, 6373313, 6019839, 1468903, -7700325, -16152978, -16556143, -8176140, 1312068, 3762688, -1887152, -10609180, -17064569, -18800584, -15960949, -10524676, -5511066, -3012654, -2346317, -817037]
44708h17037M026186N023700K774132j210368m356763o337817q345907r299485
44700a8543359o024900J229812O872393O721440L898376L836444N660894L816408
44692G467508k684656q245914q301931m099072P17476L773629L740573J013062
44684f619325q89494R29915L686762K713095l39399J68136L521910L126675j403058
44675D895217k371777K302526L796367l031382r354565n388138M064475P278637
44667B191360L214311N71979K735902M591028L013154N21322j499020m429216
44659A0910820o903047n574168j814947l22416r69572M70119L503874L043002
44651B343665q79308j994329J655519M129196J441315k233950j660003K234172
$$ y = [-817037, 3209149, 8232849, 11006981, 9796613, 5439850, -897967, -9243874, -18543359, -24568259, -23338447, -16466054, -9744614, -5846238, -2009794, 3651100, 7467508, 4782852, -3463062, -11764993, -15864065, -15146589, -11372960, -7632387, -6619325, -7508819, -6578904, -2892142, -179047, -518446, -350310, 3171600, 6298275, 4895217, 2523440, 4825966, 8622333, 5590951, -3763614, -9151752, -5087277, 2191360, 5405671, 5977650, 8713552, 13304580, 16317734, 16839056, 15340036, 10910820, 4007773, -1566395, -3381342, -3703758, -4673330, -4203211, -699337, 2343665, 1464357, -529972, 1125547, 5254743, 6696058, 4462108, 2802105, 5036277]
44643E036277N362895N390831J413261n561920r977141o112241K657336O064033
44635D273331J132512l643755k027214P04855j838189n673816l651477K027665
44627h696088L922003K051212K754428O528528O434296n01740p913266q322185
44619c742812j593294O487370J0068433O710518j083853o619556m604590K600918
44611H223134O696411K498472o369259j1511756q383758o17824L828644J228887
44603d407049l638187l605071J230697M011024J736277l83279J866101M110802
44595I21315N86500n566133o222655l2286O624674Q890454O851117J094475p266761
44586E880700j2249881p401188L402512P832516J451758n525590k983916M758566
$$ y = [5036277, 10399172, 15790003, 17203264, 11641344, 1664203, -4448038, -1790702, 4273331, 5405843, 1762088, -265126, 439729, -1398460, -7072276, -10723753, -8696088, -4774085, -2722873, 31555, 6560083, 12994379, 12492639, 4579373, -3742812, -5336106, 1151264, 11219697, 17930215, 16846362, 10226806, 5622216, 8223134, 14919545, 17418017, 11048758, -462998, -8846756, -9464580, -5635936, -4407049, -8045236, -11650307, -10419610, -6408586, -4672309, -5055588, -3189487, 921315, 1507815, -4058318, -10280973, -10313259, -3688585, 5201869, 12052986, 13147461, 5880700, -6369181, -13770369, -10367857, -2535341, -1083583, -6609173, -9593089, -4834523]
44578d834523O713835J810292j615232l10524O7438l469100n264233p91637M729122
44569b964562L551364l095271p152949n164786j190795J106257K872757N149508
44561f888477N257624J409424k951416l255360R50K487680J827017p35117k914237
44552e761912k997444n60896J857120Q3598n580517q410034l725303L486511N103913
44543a6504964J752161R73981M533653N993939K142455j731582j242646K12174
44535c870829j250509k582587K90852M279731L317352k551257p868998q924769
44527a9161014n540616J276047Q630286J1519339Q160947L110681R46216Q6763
44519I028649k717885n796592o019308n000184n478150m996234k53492N290703
$$ y = [-4834523, 1879312, 3689604, 2074372, 1763848, 1831286, -1637814, -6902047, -7693684, -2964562, 586802, -2508469, -9661418, -14826204, -16016999, -14910742, -12037985, -6888477, -1630853, -221429, -3172845, -6428205, -6427255, -3939575, -2112558, -2847675, -5761912, -8759356, -9320252, -7463132, -7379534, -12960051, -21370085, -25095388, -21608877, -16504964, -14752803, -13778822, -9245169, -3251230, -1108775, -2840357, -4083003, -3870829, -5121338, -7703925, -7413073, -3133342, 184010, -2367247, -10236245, -19161014, -24701630, -23425583, -14795297, -3275958, 4884989, 7995670, 8941886, 9028649, 6310764, 514172, -5505136, -10505320, -15983470, -20979704, -21233196, -15942493]
44511a5942493N918877L347212L653424O321669N258831r7406l931841m352840
44503A75433m966263n212403M89584J0841930J4898796O674928n274802q965321
44495H661882l765661J698890J663312k312651n536740m248701J719066P099152
44487D978549N291985k967899q961495o750396k40395L494647L151950J752485
44479b50569R10296R23562K634172M869727L675809j667251n468740k889703K898460
44470E635763N166763K203886k585470n887976n780603j454907L982267M193564
44462E473287k115784p412138n023621J337222L690005J494736J34737Q79675
44454a541881M26824j327612j209938K49998l77442j837038N61813N574999O248700
$$ y = [-15942493, -10023616, -6676404, -3022980, 3298689, 8557520, 8460114, 4528273, 175433, -4790830, -10003233, -9513649, 1328281, 16227077, 22902005, 17627203, 8661882, 4896221, 6595111, 8258423, 5945772, 409032, -3839669, -2120603, 4978549, 10270534, 7302635, -1658860, -8409256, -8649651, -5155004, -2003054, -250569, 659727, 1583289, 4217461, 9087188, 12762997, 11095746, 5627006, 2737303, 5635763, 10802526, 13006412, 10420942, 4532966, -1247637, -2702544, 1279723, 5473287, 3357503, -4054635, -9078256, -7741034, -4051029, -2556293, -2421556, -1541881, -1115057, -2442669, -3652607, -3402609, -3780051, -5617089, -5055276, 519723, 6768423]
44445F768423J291090k065140K20383K294368j606579p078998o031947R48490
44437e259910N619525L779007j59583n78140K023403K905635j42055m027882m228512
44428f8512l48467L333977L096539J349k287365k167015n09316J806993L763768
44419F621951L090563q58485l942873j305983N401433R196523O584818R16654
44411B5704601l542935o018033o600739m630995k001401k867565o774647o946079
44403a3677793K73214Q501026R105081K773359k480511k811304j730520k369094
44395b416542l011436j841637q17879j964394l350557j864900J982289M595081
44387h689975L631530J77808k550600j719032K629927O630967N738767J05318
$$ y = [6768423, 8059513, 5994373, 6214756, 8509124, 6902545, -176453, -6208400, -5259910, 359615, 4138622, 3979039, 3400899, 5424302, 8329937, 8187882, 4160000, -68512, -416979, 2916998, 6013537, 6014886, 3727521, 1560506, 1051190, 2858183, 6621951, 9712514, 8854029, 4911156, 3605173, 9006606, 18203129, 24787947, 25704601, 22161666, 16143633, 9542894, 4911899, 2910498, 42933, -6731714, -13677793, -13404579, -4903553, 4201528, 6974887, 4494376, 1683072, -47448, -2416542, -5427978, -7269615, -8087494, -10051888, -13402445, -15267345, -13285056, -8689975, -5058445, -4880637, -7431237, -9150269, -6520342, 110625, 5849392, 5954710]
44379E954710m843101m832702j883265n61430q74510J098519N734804P737464
44371G530489L543302k819129m650642j134213K693374L225514J586725o3750
44363I911670j471444k579137k338298r46967o91745k656941m479047l220870
44355h472779P26820L977875L608978j24461l453975j967703M042915P901412
44347F239082L815332m430026o998516j246710M429031K899521j628096j188322
44339A891296L188453L688809j526745n454548k703586L305525N601849K149115
44331A0140168k904336m262625p59275L315725K709994k070413m762298j807006
44323d00066K573240K928714M25928n95032m28178k212654m757937l955834j05820
$$ y = [5954710, 1111609, -3721093, -5604358, -6165788, -7040298, -5941779, -206975, 7530489, 11073791, 8254662, 3604020, 2469807, 5163181, 8388695, 9975420, 9911670, 8440226, 5861089, 3522791, 2575824, 1884079, -772862, -5251909, -8472779, -7745959, -3768084, -159106, -283567, -3737542, -5705245, -1662330, 6239082, 10054414, 5624388, -1374128, -2620838, 1808193, 4707714, 3079618, 1891296, 5079749, 8768558, 7241813, 1787265, -916321, 2389204, 7991053, 10140168, 7235832, 2973207, 2213932, 5529657, 8239651, 6169238, 1406940, -400066, 2173174, 5101888, 5527816, 4932784, 4504606, 2291952, -2465985, -6421819, -6527639]
44314f527639K667993L209418L023114Q13169m856184q678502l745225O133781
44306g960075R272806L114824j958756P81852M708971K397776k158526j866920
44298F331952J146145Q14281j371408R7594L775685L439161r71665l376367j579368
44289H306010M86225K77601n21571r57989k452639m634048m541915j083735L224039
44280a898022N323997L932651k02474l874687l339524M23045J332790l199523
44272a501747o970528l440176L954929O485966K723175q13870m13627R39256O58781
44263A622159M30466J507828K081006J243054Q06362J521850J543989j13789k162861
44254H480064l665295m626205m049397j216881J439920Q99113j494859k020658
$$ y = [-6527639, -3859646, -650228, 2372886, 3186055, -1670129, -10348631, -14093856, -7960075, 1312731, 4427555, 2468799, 3250651, 7959622, 10357398, 8198872, 6331952, 7478097, 8292378, 6920970, 7018564, 10794249, 14233410, 13261745, 9885378, 8306010, 8792235, 9069836, 8548265, 7590276, 5137637, 503589, -4038326, -5122061, -1898022, 3425975, 7358626, 7156152, 3281465, -58059, 364986, 1697776, -1501747, -8472275, -11912451, -7957522, -1471556, 1251619, 437749, 24122, 963378, 1622159, 2052625, 3560453, 5641459, 6884513, 7690875, 9212725, 10756714, 10642925, 8480064, 4814769, 188564, -3860833, -5077714, -3637794, -2738681, -4233540, -6254198]
44246f254198p44869o68828j472190N6901L497962M868958L606327L180126M010935
44237A0081124K462957j675266l630294j931657j520098n247970q408423n859667
44229a5729294L81471M724871N053632K664308q98945l612408l156349j94939
44221a0767653J897373K393205L907938O156938M853705m85935l972967k330676
44213A651928m7722r42977j299524K448951N567801K430917k956328k732965J965353
44204F085434L244368m59324l086417k212592j863225k883501k21093O614908
44196E218558R128705J916281p137208o207956M089844J1134785O820163k836628
44188B2126544o741096k529379K803908L634105J705619P80696M39424j320643
$$ y = [-6254198, -6999067, -7667895, -9140085, -9083184, -5585222, -716264, 2890063, 6070189, 10081124, 12544081, 10868815, 7238521, 5306864, 3786766, -1461204, -9869627, -15729294, -15347823, -10622952, -5569320, -2905012, -3803957, -7416365, -10572714, -10767653, -8870280, -6477075, -2569137, 3587801, 8441506, 7955571, 3982604, 1651928, 1604206, 661229, -638295, 1810656, 7378457, 9809374, 6853046, 4120081, 6085434, 9329802, 8870478, 5784061, 3571469, 1708244, -1175257, -1396350, 5218558, 14347263, 16263544, 9126336, 2918380, 7008224, 18143009, 24963172, 22126544, 15385448, 12856069, 15659977, 19294082, 20999701, 21780397, 22219821, 20899178]
44180B0899178k964638k047382q85618l421580p089793n076323K097990N228529
44172F740363K95147m101261N86801R087807R434219q4775r784546j2432315r659325
44163i917885n038872O32001N637974O468199L437171J356753K065345J862744
44155F503430q50446j448136K823260N888367P55667q314849r419056L80648R313374
44146E632259O107394m204061o977914J158224P320251J569803p841204o981131
44138d216379K098551M746601k716286p293964j043224N707561J778256o168599
44130g107483n106095K643222M237596j670450l733388J855002N505566J595629
44122a780401k373381K88423M202903K195414k370965k021600K410194L962834
$$ y = [20899178, 17934540, 15887158, 15001540, 11579960, 4490167, -586156, 1511834, 6740363, 7035510, 2934249, 3521050, 12608857, 22043076, 21958301, 12173755, -258560, -9917885, -14956757, -14324756, -8686782, -2218583, 1218588, 2575341, 4640686, 6503430, 5652984, 4204848, 7028108, 12916475, 13672142, 5357293, -4061763, -3681115, 5632259, 11739653, 7535592, 557678, 1715902, 9036153, 10605956, 2764752, -4216379, -2117828, 2628773, -87513, -7381477, -8424701, -2717140, -938884, -7107483, -12213578, -9570356, -5332760, -7003210, -10736598, -8881596, -3376030, -1780401, -4153782, -3865359, 337544, 2532958, 161993, -1859607, 550587, 4513421]
44114D513421K78709m584531o552634m679545j18965M183384M932336K355801
44106C27976K96666J067376L576726O907691J0413555R817036Q08151j1369373
44098B1845804j4693417o921698m06026m243970j0585257p360384L137169R236010
44090i991769P904207N732003M877043O07350o909574r857432m631480K398368
44082i871284M247252J527114j420697k398772p95917L134402N907368L023974
44074C353440l922514p377639l619830K463769N068732M778984M520560L122197
44066H387699j683527o718585n808788J285927O932312M288819m346465r773613
44058g436221o124869K564394P029766L317497l513526o614713n221442l154042
$$ y = [4513421, 4792130, 207599, -6345035, -11024580, -11143545, -6960161, -2027825, 327976, 624642, 1692018, 5268744, 12176435, 22589990, 32407026, 33215177, 21845804, 7152387, 230689, -175337, -4419307, -15004564, -22364948, -19227779, -9991769, -2087562, 3644441, 8521484, 9128834, 2219260, -7638172, -12269652, -9871284, -5624032, -4096918, -5517615, -7916387, -8712304, -5577902, 329466, 3353440, -569074, -7946713, -11566543, -9102774, -4034042, 744942, 5265502, 8387699, 6704172, -14413, -5823201, -4537274, 2395038, 6683857, 2337392, -7436221, -13561090, -10996696, -3966930, -649433, -4162959, -10777672, -15999114, -19153156]
44050a9153156k261748j056587J528455M699892P399515Q200913M828777k484608
44042A701453q279861o944254j21730N302347O252808N581409N131106K648059
44034A1271337k491862n837861l514551K185112N912574N448953K369097j179332
44026A4163467m002097n630352o113789n168636j818516L055343N007391R84780
44018D77591m448429l318391M251050Q670243L803596m270651n720416J21814
44010d33593N421452M728708J28912l367104l496440j952700k167680n166181
44002f304626o807124j903174P510679J2190073P052863j608246m629886j845144
43994C655415J81325q67835j455362k60531l28512k394108k836142k69864J734656
$$ y = [-19153156, -21414904, -22471491, -20943036, -16243144, -8843629, -642716, 4186061, 1701453, -6578408, -13522662, -13644392, -8342045, -2089237, 3492172, 8623278, 11271337, 8779475, 2941614, -572937, 1612175, 7524749, 12973702, 15342799, 14163467, 10161370, 4531018, -1582771, -6751407, -8569923, -5514580, -507189, 477591, -3970838, -7289229, -3038179, 5632064, 9435660, 5165009, -555407, -433593, 4987859, 9716567, 9845479, 6478375, 2981935, 1029235, -1138445, -6304626, -13111750, -15014924, -7504245, 4685828, 11738691, 10130445, 5500559, 3655415, 3836740, 2968905, 1513543, 1253012, 924500, -1469608, -4305750, -4575614, -2840958]
43985b840958J121925J041930L584183M814304Q28003m961395o150217k769945
43977e332170n08251j258360p15920L208948N463026J235028n576259o509438
43969i993396P6459O776618O920186K221980j280967j269722J25308J159010J901311
43960F636787J641508j032477m923243o303680l593138N00824K693711K694902
43952a684806J838086N65229q54399j052564P58383L048105L856822L404414K996166
43943A2875436K368560K81312k794605m759033m676758l641272k543556p07957
43935c597873K318426M817881M345275J204141r82345M60283L095134J870291
43927A3531213l522611o696545k655881M347569N325874j518631q068266o764186
$$ y = [-2840958, -1719033, -677103, 2907080, 7721384, 8549387, 3587992, -2562225, -5332170, -5840421, -7098781, -7814701, -4605753, 857273, 2092301, -3483958, -9993396, -9916937, -3140319, 3779867, 6001847, 4720880, 3451158, 3576466, 4735476, 6636787, 8278295, 7245818, 2322575, -3981105, -7574243, -7073419, -4379708, -1684806, 153280, 718509, -135890, -1188454, -430071, 2618034, 6474856, 9879270, 12875436, 15243996, 15525308, 12730703, 7971670, 3294912, -346360, -2889916, -3597873, -1279447, 3538434, 7883709, 9087850, 8105505, 8565788, 11660922, 13531213, 10008602, 3312057, 656176, 5003745, 10329619, 8810988, 742722, -6021464]
43919f021464M18330N978899O453443M425863K985730K096839M60839j750817
43911A5047662l013191k406967r56321p38774k218254l252055k109777l69893
43903a7570l24053n97837J757840N196532M811867N43580j518999J242271K873425
43894A3967056j932971q443846q104457j074309M454121M190464K016285J954696
43886G027039K438743O93080k374890m615009o222285p824744p715553m209826
43878b2803445Q09092L676430L623949L059334L217638K281524q14185l005651
43870i955314o85501L917246M145981j588453n993911k539797M711692O925944
43862a062113L628343J945414L361406J273682n544593p611538N32599R189828
$$ y = [-6021464, -5603134, 375765, 6829208, 11255071, 14240801, 16337640, 16798479, 15047662, 12034471, 9627504, 8671183, 7932409, 5714155, 2462100, 352323, -17570, -341623, -939460, 818380, 6014912, 10826779, 11370359, 9851360, 11093631, 13967056, 12034085, 3590239, -4514218, -5588527, -1134406, 3056058, 5072343, 7027039, 9465782, 10158862, 7783972, 3168963, -3053322, -10878066, -18593619, -22803445, -21994353, -18317923, -14693974, -11634640, -8417002, -6135478, -6949663, -9955314, -10640815, -6723569, -2577588, -4166041, -10159952, -12699749, -7988057, -1062113, 2566230, 4511644, 7873050, 9146732, 3602139, -4009399, -3476800, 5713028]
43854E713028O475262l882537q412882l729857R80083J08701j315470J366903
43846b696769M483780L321006j8086q02099J229719K930275K380350l52149m054478
43837F421549o038612l894074J063719M795090N385672L795757L15094n090192
43829F754003q856327n931942K467587Q204510N890965n34923l325207j14876
43821D553790M490339M595061q66250o576635o083534O1601M099492J719492j377138
43812D616218J205302N406068L118289l691679n680302j589474M46511k308085
43804A522848l190408K94050J170513l527453n433743J644106J0517324J1218271
43796A4215508N037646k36018k330079l549136l724597k167792j734446l805878
$$ y = [5713028, 12188290, 8305753, -107129, -3836986, -2856903, -2748202, -4063672, -2696769, 1787011, 5108017, 5089931, 4287832, 5517551, 8447826, 10828176, 10476027, 6421549, 382937, -3511137, -2447418, 2347672, 7733344, 11529101, 11844195, 6754003, -2102324, -8034266, -5566679, 2637831, 8528796, 7993873, 4668666, 4553790, 9044129, 13639190, 12772940, 6196305, 112771, 174372, 4273864, 5993356, 4616218, 5821520, 11227588, 14345877, 10654198, 4973896, 3384422, 3830933, 1522848, -1667560, -1373510, -202997, -3730450, -9164193, -7520087, 2997237, 14215508, 19253154, 19017136, 16687057, 13137921, 9413324, 7245532, 5511086, 1705208]
43788A705208m269747r74367R58917j691329k806910K740900Q257698N006709
43780H927079k999010n239993j140075J518614J119939K700360N813395M425648
43772A5125957j185591m006676k431115k064563m436926m383287k27599L277182
43764c32618L844812M117811L991550K90327m493651l599555J792780K663933
43756H275389k646942m857994L38030M588731J415608k863070j057463K083031
43748E275320r34745o416644n950955r84090P74413j41111L782461J2013494J3975245
43739B1393388M801785o252563q045467j888466K070556o93331m463346l055542
43731C867014J207227J700866k130583m071078j248721J092565j433724m089618
$$ y = [1705208, -2564539, -3538906, -2579989, -4271318, -7078228, -4337328, 3920370, 8927079, 5928069, 688076, -451999, 1066615, 2186554, 4886914, 10700309, 15125957, 13940366, 9933690, 7502575, 5438012, 1001086, -3382201, -3609800, -332618, 3512194, 7630005, 11621555, 11911882, 7418231, 3818676, 5611456, 8275389, 5628447, 770453, 1108483, 5697214, 7112822, 4249752, 3192289, 5275320, 4340575, -2076069, -8027024, -9011114, -8236701, -8377812, -4595351, 7418143, 21393388, 26195173, 19942610, 11897143, 10008677, 12079233, 11385902, 6922556, 3867014, 5074241, 6775107, 4644524, 573446, -675275, 417290, -1016434, -5106052]
43723e106052j85126P182228Q714513K698813l324444m506394l454893k138682
43715a20037J503598O225291O044533K37768l847573k587951j914544n654267
43707a13182p158183n40406P648722P639659J431469j564075M55447J460660k96678
43698H963433m44327J997663K846843R55698j85322K42499o90307k491349r04612
43689A0290219L417499L650479k516621p723489n033001J932611M203418k82000
43681G939115m864561l653351J534473M599372K801172r61426k653623j591158
43673C150013M85937K581309L977609K288054l530850q524889n779534L354507
43665a997844Q993939N700617k23922q78219J722175P60462l462355m840339k315740
$$ y = [-5106052, -5291178, 1891050, 10605563, 13304376, 9979932, 5473538, 2018645, -120037, 1383561, 7608852, 13653385, 13891153, 10043580, 7455629, 5541085, -113182, -7271365, -7811771, -163049, 7476610, 8908079, 7344004, 7799451, 9260111, 8963433, 8519106, 10516769, 13363612, 14319310, 14133988, 14376487, 13686180, 11194831, 10290219, 13707718, 17358197, 14841576, 7118087, 2085086, 4017697, 8221115, 7939115, 3074554, -578797, 955676, 5555048, 8356220, 7394794, 4741171, 3150013, 3635950, 6217259, 10194868, 12482922, 8952072, 427183, -5352351, -1997844, 6996095, 12696712, 12472790, 11594571, 13316746, 14077208, 10614853, 5774514, 3458774]
43656C458774j246557m205841p384348o841604k858772K273772O018078N574240
43648e212258J156989j521603K253347Q008751P054834m49967n036182j982459
43640D271452K140428O06609l033233j614165L467420L961964k874094r986160
43632c059779r705199k963500K992663L799395J862258J276266K109473J983832
43624a704591J041714J210405J265441k099433p301303p807172j786989L947846
43616a3234082L792650J459804K649078N019951K979672j552088j894408J913975
43608A134552L099031p98979m769412m607931j490622J914886L622058J306070
43600e90347m046331m813835M492455J5866886J5132367J637897r645272q333869
$$ y = [3458774, 2212217, -1993624, -9377972, -16219576, -19078348, -16804576, -10786498, -5212258, -4055269, -5576872, -3323525, 4685226, 11740060, 11290093, 6253911, 4271452, 6411880, 7018489, 3985256, 2371091, 5838511, 9800475, 6926381, -3059779, -12764978, -15728478, -12735815, -8936420, -7074162, -5797896, -3688423, -1704591, -662877, 547528, 1812969, -286464, -7587767, -15394939, -17181928, -13234082, -9441432, -7981628, -5332550, -312599, 2667073, 1114985, -779423, 1134552, 4233583, 3434604, -1334808, -5942739, -7433361, -5518475, -1896417, -590347, -4636678, -9450513, -4958058, 10908828, 26041195, 27679092, 18033820, 9699951]
43592I699951o95365K712673J522686J346974L262797M864260N952801O467599
43584C5134376L542973l264621q109674o046008m40823K035956M14174j479166
43576B1787187j744809j571145k175329m098490o873206p177159j460063P329348
43568D016334J0903813O346294j19849k977344l990708n139791l362583J735168
43560G411334L418783j068319l081625L928066J0959473N779465o728449j0644081
43552I974647k987162L171035K68975l713079r90903L310515J533913l276025
43544G291916l322959J093474L280118J125968j248587j171237k53661K08329
43536G003361J249182K662004J712059k344912n254190k552296L451800N298980
$$ y = [9699951, 9004586, 11717259, 13239945, 14586919, 17849716, 22713976, 28666777, 35134376, 38677349, 35412728, 27303054, 21257046, 20816223, 22852179, 23266353, 21787187, 20042378, 18471233, 16295904, 12197414, 5324208, -1852951, -3313014, 4016334, 14920147, 21266441, 21146592, 18169248, 14178540, 9038749, 5676166, 7411334, 10830117, 9761798, 6680173, 10608239, 21567712, 27347177, 20618728, 9974647, 6987485, 10158520, 10427495, 6714416, 5723513, 9034028, 10567941, 7291916, 3968957, 5062431, 8342549, 9468517, 8219930, 7048693, 6795032, 7003361, 8252543, 10914547, 12626606, 10281694, 5027504, 2475208, 5927008, 11225988]
43528A1225988M33362m127962j189914N319472M993967l495654r434546n187284
43520a462571L586480P715311P166775O870599O167825J565780m031906m774154
43512B2804139k603725m773348j1050385j2887281o330474K907204Q780696J1052707
43504G899533J0263998N146912j747454l822142p7682J948821k552232p915399
43496I144355o807238j079646K336417K010683J802030K688278J478144k654932
43488H918091n555552l171342L435055Q945425Q592235K377964m855019q139732
43480A0547125p106750n009037m042804l766801l007949m66766N074268J1362840
43472C584126J1564236K308819q465634r204269o21247M486559m63925o651623
$$ y = [11225988, 11659350, 7531388, 6341474, 11660946, 16654913, 13159259, 3724713, -1462571, 2123909, 9839220, 17005995, 23876594, 30044419, 31610199, 27578293, 22804139, 20200414, 15427066, 4376681, -8510600, -14841074, -11933870, -3153174, 7899533, 18163531, 23310443, 21562989, 17740847, 17663165, 19611986, 17059754, 9144355, 2337117, 1257471, 3593888, 5604571, 7406601, 10094879, 11573023, 8918091, 3362539, 191197, 3626252, 12571677, 21163912, 23541876, 18686857, 10547125, 3440375, -1568662, -5611466, -9378267, -12386216, -12852982, -7778714, 3584126, 15148362, 17457181, 8991547, -212722, -833969, 3652590, 3188665, -3462958]
43464c462958l798838M784381Q388387M423539l74777j003354J197792L429856
43456A3584028M279737K379841k046783m708057j614980M088962M768897j487427
43448A9244218p899756p858574k988905K37847l91080o55092K801033O098610
43440H588301K667998o136163j0163532l591911N814471O876162Q81765j595656
43432C341435J937877L164151q40221j497565N368715R784667L413792n136896
43424A9535955l268962M851844M931665m264656r720457n558383o65291k247216
43416C594499n168726k872427K086869M642008N505485O643472N945080K468431
43408B2844691L83540J894039K665115J65776l68028M417929P049295n64866j2493337
$$ y = [-3462958, -7261796, -2477415, 5910972, 10334511, 9959734, 8956380, 10154172, 13584028, 17863765, 20243606, 18196823, 13488766, 11873786, 15962748, 20731645, 19244218, 11344462, 3485888, 496983, 734830, 343750, -311342, 2489691, 8588301, 11256299, 5120136, -5043396, -8635307, -2820836, 4055326, 4937091, 3341435, 5279312, 8443463, 7603242, 6105677, 11474392, 21259059, 24672851, 19535955, 16266993, 21118837, 26050502, 21785846, 12065389, 6507006, 5841715, 3594499, -1574227, -4446654, -2359785, 2282223, 7787708, 14431180, 20376260, 22844691, 23228231, 25122270, 27787385, 27953161, 27585133, 32003062, 39052357, 38487491, 25994154]
43399B5994154j4990032n632901M000647N172152J814858J102341K866055L104442
43391B3431716J724161J137041Q92389j023244l526250l605789j333934K2124
43383A7718214j107971k560540j950122j03510K44446j664637l198506j248659
43375F128715L706852P499902P030582L995679K020093J088168j713200n590249
43367B4166542m907451K212321Q143153M293401o165355j0751755l955847N335166
43359A8370175O081438p44373n659467m381538r05100J576842M849502R229924
43351B8417403J0005371M255500l607981p448481o952633n267112k584625K247485
43343A9064927N944621L489822l151409n601848o16888M651927K914440k287968
$$ y = [25994154, 11004122, 5371221, 9371868, 14544020, 16358878, 17461219, 20327274, 23431716, 25155877, 26292918, 27185307, 26162063, 22635813, 19030024, 17696090, 17718214, 16610243, 14049703, 12099581, 11996071, 12240517, 10575880, 7377374, 6128715, 9835567, 17335469, 24366051, 28361730, 30381823, 31469991, 29756791, 24166542, 19259091, 21471412, 29614565, 33907966, 27742611, 16990856, 13035009, 18370175, 24451613, 23707240, 18047773, 13666235, 12761135, 14337977, 19187479, 28417403, 38422774, 42678274, 39070293, 31621812, 24669179, 19402067, 16817442, 19064927, 25009548, 28499370, 25347961, 19746113, 19129225, 23781152, 26695592, 24407624]
43335B4407624j800790N082766Q818536L175106n664468p836586l401495q69520
43327B1911173l564042m956740J81486O765765O850073J460268j990215j622429
43319B5035339k370944n431797m982859J659078P934536O878133O42679l863205
43311B5500960m285249k403073J312027O227303P800518K526367m963576o737334
43303B4977943k705826M4518j177857j407931K333348N721500M703955K053475
43295C4543125K016492L247127J828918j995980m644608m554564k877431n03515
43287B7059564K173694L777470L201308J414503j84915j797852l386574k717449
43279B9539749J610246O398487O681108K232787j933571k201807o58580j257229
$$ y = [24407624, 22606834, 27689600, 36508136, 39683242, 34018774, 26182188, 22780693, 21911173, 18347131, 13390391, 13571877, 20337642, 27187715, 28647983, 26657768, 25035339, 22664395, 17232598, 12249739, 13908817, 21843353, 28721486, 29364165, 25500960, 21215711, 18812638, 20124665, 26351968, 34152486, 36678853, 31715277, 24977943, 22272117, 22316635, 21138778, 19730847, 22064195, 27785695, 32489650, 34543125, 36559617, 39806744, 41635662, 39639682, 34995074, 30440510, 27563079, 27059564, 29233258, 33010728, 36212036, 37626539, 37441624, 35643772, 32257198, 29539749, 31149995, 37548482, 44229590, 46462377, 44528806, 42326999, 41668419, 40411190]
43271D0411190l789605m233846p22688L380332L685211M69021k079685j703860
43263C5416070l12186K7056O0998P80956J132894P42245J747524M694392N795554
43254E0085503K411966j861157k628283j978516l853701n201403m37807O841247
43246D3377849P078461N15286j525069N404596J0916099O078363k605349m260664
43238F4979572l02885L34181l429906n206886l075389n81745J630354N105935
43230E9453231O585438K074976l486236j438052O204931Q905147M711880K969057
43222H5980372P390020R195116K656569m183273k344738L959938N266317J754375
43214A09674696M53635K544543L128377Q74484o90653m1726J295595L229662O451809
$$ y = [40411190, 36621585, 32387739, 31665051, 35045383, 38730594, 39199615, 37119930, 35416070, 35103884, 35130940, 35191938, 35972894, 37105788, 37848033, 39595557, 44289949, 50085503, 52497469, 50636312, 48008029, 46029513, 42175812, 36974409, 36536602, 43377849, 50456310, 50971596, 49446527, 54851123, 65767222, 71845585, 69240236, 64979572, 64676687, 65010868, 61580962, 56374076, 53298687, 52716942, 54347296, 59453231, 66038669, 68113645, 64627409, 63189357, 69394288, 78299435, 83011315, 85980372, 93370392, 102565508, 105222077, 101038804, 98694066, 102654004, 107920321, 109674696, 110128331, 112672874, 115801251, 116675735, 115985082, 115943356, 117238951, 120468613, 126920422]
43205A26920422Q744453P570332M742458L535382L600306L643249N309554Q381118
43197A72447274P025685r30165n941305J096146J2272400J1691632j35232o180244
43189A91346191Q89175Q824634P918993O178258J1640216J4852828M924090q041454
43181B38532931n692553R168307J5977817Q202655J674236P299873J4478537J0836348
43173C00478151K796612L535455J1270769J3853436Q723905M332469M345854L340098
43165C52676749j408131m767306k667069K231597O202554Q754071R050739M823082
43157C74896286k216931n830900l384798O42744K236401L267841N387867M315187
43149C79313697l610228j3124477j5425120j0205224n511258n805188o942825
$$ y = [126920422, 135664875, 143235207, 147977665, 151513047, 155113353, 158756602, 164066156, 172447274, 179472959, 178542794, 172601489, 173697635, 185970035, 197661667, 197526435, 191346191, 192235366, 201060000, 208978993, 215157251, 226797467, 241650295, 246574385, 238532931, 232840378, 242008685, 257986502, 266189157, 267863393, 275163266, 289641803, 300478151, 303274763, 306810218, 318080987, 331934423, 340658328, 344990797, 349336651, 352676749, 351268618, 346501312, 343834243, 346065840, 352268394, 361022465, 370073204, 374896286, 372679355, 366848455, 363463657, 364106401, 366342802, 369610643, 374998510, 379313697, 375703469, 362578992, 347153872, 336948648, 331437390, 325632202, 318689377]
43142C18689377m730532k205968m242056q955541r898202n641616k175795m663213
43134B76176454j0578255j3608672j2054543r797841r517749q981937n664862
43127B05972595j719953j083390l405002m724253l820205l939084p181298j0556164
43119A69543246r725374m618116O24790K056946r32432n512913p566004n614155
43111A38255988l303768n647307j1740391j4257605q495343P80189M761295J163337
43103A01516395m039008m529792o7882M735667N254924M20242o296042r452272
43095H7542232o926885k190298K13771Q1557J09325O48132m97882l518578n510380
43086F9950994m429877j354571J453459K279494J25865l890293n811775l038185
$$ y = [318689377, 313958845, 311752877, 307510821, 298555280, 288657078, 283015462, 280839667, 276176454, 265598199, 251989527, 239934984, 230137143, 220619394, 211637457, 205972595, 204252642, 203169252, 199764250, 195039997, 191219792, 187280708, 180099410, 169543246, 159817872, 155199756, 155824546, 157881492, 156949060, 151436147, 143870143, 138255988, 134952220, 129304913, 117564522, 103306917, 94811574, 95591763, 100353058, 101516395, 97477387, 92947595, 92879713, 97615380, 102870304, 103290546, 96994504, 87542232, 80615347, 78425049, 78638820, 78720377, 78829702, 79477834, 78979952, 75461374, 69950994, 65521117, 64166546, 65620005, 67899499, 68025364, 64135071, 58323296, 55285111]
43078E5285111J175452J525796j407245k229077L996J28297l422863m358463J322391
43069D8023395O967430L836361n740779j1068187p176713O78269N921591P204398
43061D8645765N430347R07951m065926m929526m31854M746677N492228J832215
43053E7627877k795186o049996p368400o555742m049351j215256R76437K274875
43045C2845258J963868j81985j651726M45785M026344L551911j301237l685044
43037C6013174L34112N007446L490544j371103j948344J551472J953100k204294
43029D2826107m089716n04190K486533O5394k996174q08807L057475J584445l084264
43020C8536803k450296L917290O372710j31294p727573o903955J9520L160421
$$ y = [55285111, 56460563, 57986359, 56579114, 54350037, 54354033, 54482330, 51059467, 46701004, 48023395, 54990825, 58827186, 53086407, 42018220, 34841507, 35519776, 41441367, 48645765, 54076112, 54984063, 50918137, 45988611, 45556757, 50303434, 55795662, 57627877, 54832691, 48782695, 41414295, 34858553, 30809202, 29593946, 30570383, 32845258, 34809126, 34627141, 32975415, 33421200, 37447544, 40999455, 39698218, 36013174, 36347286, 41354732, 44845276, 43474173, 41525829, 43077301, 45030401, 42826107, 38736391, 38232201, 40718734, 40784128, 37787954, 36979147, 40036622, 41621067, 38536803, 36086507, 40003797, 46376507, 46245213, 38517640, 31613685, 31633205, 34793626]
43012C4793626o49726m872298l759136O13955L206252K744441Q26148k016984
43004C0886278n718982q067980o349539j306220L196464M641384M136436M174471
42996B5592312N716452P471967O762634J688278n846322j0234426p972572k723281
42988B0455042j171165m036335n549379k588424Q73846Q27934n08612M69447K204874
42979A0977228J490302j72612K66693R24025j504373m093123j440777M129404
42971A0576767M801470j27011l014612p53886P44046j901659l333862O0938K810761
42962I862952L94884j903975J407130N171616K291316k872557j111029N822317
42954A9062654P901131L052147j189197j492410k337977m984111m395321K92969
$$ y = [34793626, 34143900, 29271602, 25512466, 26126421, 29332673, 32077114, 32903262, 30886278, 25167296, 17099316, 10749777, 9443557, 12640021, 17281405, 21417841, 25592312, 31308764, 38780731, 45543365, 47231643, 41385321, 31150895, 23178323, 20455042, 19283877, 15247542, 9698163, 7109739, 7983585, 8811519, 8302907, 8772354, 10977228, 12467530, 12294918, 12561611, 13485636, 11981263, 7888140, 6447363, 10576767, 15378237, 15251226, 12236614, 11482728, 12226774, 10325115, 6991253, 7052191, 9862952, 10257836, 8353861, 9760991, 14932607, 17223923, 14351366, 13240337, 19062654, 26963785, 30015932, 28826735, 27334325, 24996348, 20012237, 15616916, 15909885]
42946A5909885K721505M8941k691108k300603k126233l361565j316621M720150
42938A1604351P208594J956469m463814n288295l325967l104549j653106L977038
42930F910721P329836J355872q324832r919104k483492L864433L442474R13026
42922C088934J450257L736403M459630L132184O74945j911773k625980k67014
42914A1737586K888623L719943K374617L19650l011807p039559o944308j43204
42906C901541O905281N844209j267058m578277o47687M022002L987635J448731
42898A9616377J47035l27672j616584l265347m285096l959749p70044M956780
42890A0495700Q001348L618591m530701q183169n828524l149513k279981Q77951
$$ y = [15909885, 18631390, 18680331, 15989223, 13688620, 11562387, 8200822, 6884201, 11604351, 18812945, 20769414, 16305600, 11017305, 7691338, 4586789, 2933683, 6910721, 14240557, 15596429, 7271597, -2647507, -5130999, -1266566, 2175908, 3088934, 4539191, 8275594, 12735224, 15867408, 16542353, 14630580, 12004600, 11737586, 14626209, 18346152, 20720769, 21040419, 18028612, 10989053, 4044745, 3901541, 10806822, 16651031, 15383973, 10805696, 10158009, 14180011, 18167646, 19616377, 19763412, 19435740, 17819156, 14553809, 10268713, 6308964, 5538920, 10495700, 18497048, 22115639, 17584938, 9401769, 3573245, 423732, -1856249, -978298]
42882i78298P029672R739271M839319l196036p818364p703908m762349n15530
42874c366223K883442L249861K046010K485241L349980R55985k711990j986667
42866F905639J830334J568782k521761j977943M047488M923535l284048q734042
42858B757984k350427O285274L761967n934003r036325m016243r16989k558239
42850a2007001j739972L376985N344633J057589k594724k38517M248573N204405
42842B651971K940599P69317J05205Q08266J688995K2127m649972p012040k208767
42833d884299N538387P551713L035444r99968j452213j744117k463222M15239
42825D996964N617062N102809k967875q870163m871028L365277N631383J380041
$$ y = [-978298, 6051374, 15790645, 20629964, 17433928, 9615564, 1911656, -2850693, -3366223, -482781, 2767080, 4813090, 7298331, 10648311, 11604296, 8892306, 6905639, 8735973, 10304755, 7782994, 5805051, 9852539, 14776074, 11492026, 2757984, 407557, 6692831, 10454798, 4520795, -4515530, -8531773, -9448762, -12007001, -13746973, -10369988, -5025355, -3967766, -6562490, -6801007, -2552434, 2651971, 5592570, 6361887, 6467092, 7275358, 8964353, 8986480, 4336508, -2675532, -4884299, 654088, 8205801, 11241245, 10241277, 8789064, 7044947, 4581725, 4996964, 10614026, 15716835, 12748960, 3878797, -992231, 2373046, 8004429, 9384470]
42817I384470k161741j693437j98031J42185O94165K302662L163400J292093l155223
42808I770543p662560q535124m136909K154493M783576K727823L35009O98829
42800A35680K131386K391128J789927K95557l253309o381406l249996N945320
42792a95713J1345114N420516n379124q267447j349286M547907J525336n275178
42784B372125o118944R8995N594253M324070j345436m626151k089360L690866
42776A900418P630664O585747J057021n368528q023121m915750M57014K258432
42768A581897m66453k509695l44385K437204J108560k395969k941190p09901M9440
42759d190492r51404j99138K305581L206904K989659N164930Q026511N968120
$$ y = [9384470, 7222729, 5529292, 5331261, 5473446, 6167611, 8470273, 11633673, 12925766, 9770543, 2107983, -6427141, -10564050, -8409557, -3625981, -898158, -563149, 135680, 2267066, 4658194, 6448121, 6743678, 3490369, -2891037, -6141033, -195713, 11149401, 16569917, 11190793, 2923346, 1574060, 6121967, 7647303, 2372125, -3746819, -3647824, 1946429, 6270499, 4925063, 298912, -1790448, 1900418, 9531082, 16116829, 17173850, 11805322, 3782201, -1133549, -676535, 1581897, 1115444, -1394251, -1738636, 698568, 1807128, -588841, -3530031, -4239932, -4190492, -5141896, -5341034, -3035453, 171451, 3161110, 8326040, 16352551, 22320671]
42751B2320671J43612j917849L56388j393822q710070j0487562o62171R343265
42743H992462O697208l208433n952598l33489K805203J68144p02349K708757L353501
42734A4528406j485029m695510k042161Q97340l10328j313974J466678L002243
42726A0047665r75563m678028j271515M709179L637332m048129q553956n271351
42718f404366K21769K038111R91645J2200p62614j535866p04185J742631K773883
42709a626792J331113J118751M841052Q785198P521304J967731k073005k509866
42701A9355486k815240m862322n618181l455984k471899n893466r080422n321018
42693b0163046L219777P261235L441491j222891j44282L837307M299173J047170
$$ y = [22320671, 22464283, 20546434, 20902822, 19509000, 10798930, 311368, -350803, 8992462, 15689670, 12481237, 6528639, 6195150, 9000353, 9168497, 8466148, 11174905, 14528406, 13043377, 8347867, 6305706, 7203046, 6892718, 5578744, 7045422, 10047665, 9072102, 4394074, 3122559, 7831738, 11469070, 7420941, -1133015, -6404366, -6182597, -4144486, -3152841, -3140641, -3903255, -5439121, -6143306, -4400675, -1626792, -295679, 823072, 5664124, 14449322, 21970626, 23938357, 21865352, 19355486, 16540246, 11677924, 6059743, 2603759, 131860, -5761606, -14842028, -20163046, -16943269, -9682034, -6240543, -7463434, -7607716, -3770409, 528764, 1575934]
42685A575934j240748r13454k57007k56531J85043M87433j172117l557129l018507
42676h167083P72003L608712K465559p60327k506310j847812j65191J238832J637957
42667c723660N68633j477589k743580j524245K243514O590356Q575099O601677
42659A5110205K233045j347082l081750m488513n817682m624238O6043N038732
42651C088760O885007O116652M553254J583786l336677p267418p242274m932728
42643e51638l512325k354797K72658K105219N67501j076975J422544M466286J406295
42634B744768m927619m871450K014498M886899q63518n525907j007772N607193
42626a942908L806698l184172m261874J567885M871470J460511k801943l298763
$$ y = [1575934, 335186, -578268, -835275, -1091806, -906763, -419330, -1591447, -5148576, -8167083, -7395080, -3786368, -1320809, -2081136, -4587446, -6435258, -6600449, -5361617, -3723660, -3155027, -4632616, -7376196, -8900441, -6656927, -66571, 8508528, 15110205, 17343250, 15996168, 12914418, 8425905, 2608223, -2016015, -1949972, 3088760, 9973767, 16090419, 20643673, 22227459, 18890782, 11623364, 4381090, -551638, -4063963, -6418760, -6146102, -4040883, -3473382, -4550357, -3127813, 1338473, 2744768, -2182851, -7054301, -5039803, -152904, -1016422, -6542329, -7550101, -1942908, 1863790, -1320382, -5582256, -4014371, 857099, 2317610, -484333, -3783096]
42618c783096k775915l821701l561819L77805M661781M985064K065976k86435
42610b138340l43540N72906L14293k040424m662639l767743J612916O609100N828142
42601A984671Q46912j933509k55758K322149L437984M369547M629821J091885
42593A6493702m919865o451368q84752M962205M586078R71594J17895Q25577j386933
42584A4314133m392356k751029J259919K5111n824157o537157J312806Q199172
42576E606442N499129k308942n923709m774485m197716m298541j129287L648187
42568g878922L919236l60753k560023j93469J878953Q68946M77059K724629L228312
42559B103968n94463l489394n88931L849583K776532k544901m799420j480665
$$ y = [-3783096, -6559011, -10380712, -13942531, -13564726, -8902945, -3917881, -1851905, -2138340, -2481880, -1908974, -1594681, -3635105, -8297744, -12065487, -10452571, -3843471, 1984671, 2831583, 898074, 642316, 2964465, 6402449, 10771996, 15401817, 16493702, 11573837, 5122469, 4237717, 9199922, 13786000, 14757594, 14875489, 15701066, 14314133, 9921777, 7170748, 8430667, 8455778, 2631621, -3905536, -2592730, 5606442, 11105571, 8796629, 2872920, -1901565, -6099281, -10397822, -11527109, -7878922, -3959686, -4320439, -6880462, -7073931, -5194978, -4326032, -3848973, -1124344, 2103968, 1509505, -1979889, -2568820, 1280763, 4057295, 1512394, -3287026, -4767691]
42551d767691L082663M964123M028033J405077j121198p54897K291110K756163
42543A1883383k222072o893867n111610j133930k892256p234480l772962O843567
42535a0534227J1844442O271735M22526J826657L359726j787481n920039j88736
42527E294603P744315M545452o369797r363154j107010N400532K323408k578404
42519E889945j155723K512576J277114l169439m640000j757547K911672P102267
42511H970865P589476R82258r453058j4050211q882637j468599P83311Q42267
42503a4686328M119249P251150L879710l242741n811855k909830q21503j440230
42495a3662378m87527K762220L493031P80212M26224N252676R598158P249610
$$ y = [-4767691, -1685028, 3279095, 7307128, 8712205, 7591007, 6836110, 9127220, 11883383, 9661311, 2767444, -2344166, -3478096, -6370352, -13604832, -17377794, -10534227, 1310215, 7581950, 8004476, 9831133, 13190859, 11403378, 5483339, 5294603, 13038918, 17584370, 11214573, 1851419, 744409, 6144941, 8468349, 5889945, 4734222, 7246798, 8523912, 5354473, 714473, -1043074, 1868598, 8970865, 16560341, 17542599, 8089541, -5960670, -14843307, -16311906, -15528595, -14686328, -10567079, -3315929, 563781, -2678960, -8490815, -11400645, -12222148, -13662378, -14149905, -11387685, -7894654, -7114442, -6688218, -1435542, 8162616, 15412226]
42487A5412226m13542p374879r675578o840352j078799K879444J591620j817405
42479g317265r79406L944454N861402J826752k676642l513585l953934o170127
42471a2978351m984473K632716R112203O513190m05424j532269K468291K756594
42463C582477j565205k529756J517660K596593k388485n712735k100021K694488
42455c904984K531120N53954J161842J011691l475898o894377k817097M248171
42447g585578M859302p65123l852670q60383L057756L606994J895930n10744l308418
42438c462934m049939m47007L694937K354573k500787k705652K907574N884115
42430A674880J659092k949749q60987L923587K945259l469490o925261l109080
$$ y = [15412226, 14998684, 7623805, -2051773, -8892125, -9970924, -7091480, -5499860, -7317265, -8296671, -4352217, 1509185, 3335937, 659295, -2854290, -6808224, -12978351, -17962824, -15330108, -6217905, 295285, -110139, -1642408, 825883, 3582477, 2017272, -512484, 1005176, 3601769, 1213284, -4499451, -6599472, -3904984, -1373864, -819910, 341932, 1353623, -2122275, -9016652, -11833749, -7585578, -2726276, -3491399, -7344069, -8204452, -5146696, -1539702, 356228, -154516, -3462934, -7512873, -7959880, -4264943, -1910370, -4411157, -7116809, -4209235, 1674880, 3333972, 384223, -476764, 3446823, 6392082, 2922592, -4002669, -7111749]
42422g111749K930669M013247n76320m907519l368403K916096P106839M620424
42414E623284j521046n232266m944987l063404l70078L434775N282765J874756
42406A083799l026118k118057L788414N812698O57487m401092l548993p57572
42398b509434j170339k437650r13743Q68576l7101l45421K813553M746462R49642
42389A964545l565794j795765L114531L050313j364027k531075R52518L255634
42381C080880K347243J957026K600625M17278m156453n627738k788144n92103
42373b761386j417344k379854k335836l192121l141959K197066R809310J0113414
42365F891290J434585n530563k668000M364903N694474P80054m039166n661335
$$ y = [-7111749, -4181080, -167833, -744153, -5651672, -9020075, -6103979, 1002860, 5623284, 4102238, -1130028, -6075015, -9138419, -9508497, -6073722, -790957, 1083799, -1942319, -4060376, -271962, 5540736, 6198223, 1797131, -1751862, -2509434, -3679773, -6117423, -7031166, -6162590, -6199691, -6545112, -3731559, 1014903, 1964545, -1601249, -3397014, -282483, 2767830, 1403803, -1127272, -174754, 3080880, 5428123, 7385149, 9985774, 10403052, 6246599, 618861, -2169283, -2761386, -4178730, -6558584, -8894420, -12086541, -15228500, -13031434, -3222124, 6891290, 8325875, 2795312, 127312, 4492215, 10186689, 10966743, 6927577, 1266242]
42357A266242n194849l202793k05460J211291j15396j089208J023667M236896
42349b069610N430937M624677K667586q12120l927252k383199L069981M772523
42341A1373523j017596p049080n235988J160083L016092r56175m243678l662274
42333f615093j919969j68015L576246P990116P929795K178111m139969o663990
42325B167232o350079n374580l365216k6886K341545J669921p53871j828276o050
42316a1526260L491531N546529L550264j370744m355591k247748J968066K920913
42308b023040J44065j708126L52523M039192N427818L406881j49454k480199j811296
42299E198364J025360K774169J249677j702255k652216j452448j194390l272832
$$ y = [1266242, -3928607, -7131400, -7336860, -6125569, -6240965, -7330173, -6306506, -2069610, 3361327, 7986004, 10653590, 9841470, 5914218, 3531019, 6601000, 11373523, 10355927, 3306847, -1929141, -769058, 2247034, 1290859, -2952819, -6615093, -8535062, -8703077, -5126831, 2863285, 10793080, 12971191, 8831222, 2167232, -4182847, -9557427, -12922643, -12949529, -10607984, -8938063, -9691934, -11520210, -11526260, -8034729, -2488200, 1062064, -308680, -4664271, -6912019, -4943953, -2023040, -1878975, -3587101, -3234578, 804614, 6232432, 9639313, 9489859, 7009660, 5198364, 6223724, 8997893, 10247570, 8545315, 5893099, 4440651, 3246261, -26571]
42291b6571m975760k992589K057330N719450M324272p24873m091761k816405q4988
42282c611895k28214j560997Q73216N611738M790345l274912q590893k650063
42274h641675Q095674R876298K36559r211350q658448j246806L650402K404958
42266c494388r81359j521640J582997N405686O998635O124761M109306R74475
42258A9198473l660351p020636n120097J61913J494163l022938n473893j58269
42250c601635O055446L595122m196374n592700J374552O327401K822370l299324
42242C484858m746298k560796n57892K001256O336592Q802982N997866J303367
42234B0061935L68191K419489J548071m104848r047892p374703m57283M234830
$$ y = [-26571, -5002331, -7994920, -5937590, -218140, 4106132, 3381259, -710502, -3526907, -3611895, -3840109, -5401106, -4527890, 1083848, 5874193, 2599281, -5991612, -8641675, -546001, 9330297, 9566856, 355506, -8302942, -9549748, -5899346, -3494388, -4475747, -5997387, -4414390, 991296, 7989931, 14114692, 18223998, 19198473, 15538122, 8517486, 3397389, 3559302, 5053465, 2030527, -3443366, -3601635, 2453811, 6048933, 1852559, -3740141, -2365589, 3961812, 6784182, 3484858, -1261440, -3822236, -4380128, -2378872, 3957720, 12760702, 18758568, 20061935, 20430126, 22849615, 24397686, 20292838, 11244946, 3870243, 3412960, 7647790]
42226G647790J974239l319840m311519m19879J970531L83868N53297N700888Q709541
42217A8888916K522921p470008j0862910p445694m326753j996443L757499Q697797
42209A765325M249557n185773n562027L490971O198926k891452q481727m14665
42201f830865Q037386K376022q123636o037891N147053Q297071J687734q90301
42193C662573L919190M736072j632677l682116L159742P040025K46757o733200
42185A0716366k724943N392088M383578l940277o869989j420289K686623k84363
42177G938794m310431k970488P07434O08979k238860j893448K429695M501866
42169D773541L04928n453833n492184j83006L103608O29860k914377k030026J964015
$$ y = [7647790, 9622029, 6302189, 1990670, 1570791, 3541322, 3925190, 4478487, 10179375, 18888916, 21411837, 13941829, 3078919, -4366775, -8693528, -10689971, -6932472, 1765325, 6014882, 829109, -4732918, -1241947, 4956979, 2065527, -6416200, -6830865, 1206521, 3582543, -4541093, -10578984, -5431931, 2865140, 4552874, 3662573, 7581763, 12317835, 10685158, 7003042, 10162784, 17202809, 17449566, 10716366, 7991423, 13383511, 17767089, 13826812, 6956823, 5536534, 8223157, 7938794, 3628363, 657875, 1365309, 1974288, -264572, -2158020, 271675, 4773541, 5078469, -375364, -5867548, -6050554, -2946946, -2317086, -5231463, -7261489, -5297474]
42160e297474M234769L543750K094374J197253R45393J619861J989782n82664
42152I745044m804031m586507J653920N783136P93368p611454q756886k899664
42144a0683074O26489o24145N28091O619901R769219M207873m470329p774090
42136a800065n149649j364502J245566K923155L205602J971930Q17338M78989
42128B328364k45126j485155j908077k257005m537341o687479l829016L333995
42120a5286840P410978M344838j084511k775461r50184R35875J821168K074681
42112c509456J272929j2820m6228O37035R358n05684K161756N391285L162904
42103H561079k837514l706744K099263M970870j68423n050440j991161L577529
$$ y = [-5297474, -1062705, 2481045, 4575419, 5772672, 6718065, 8337926, 10327708, 9745044, 4941013, 354506, 2008426, 7791562, 8584930, 973476, -7783410, -10683074, -10056585, -10680730, -10152639, -3532738, 6236481, 10444354, 5974025, -1800065, -6949714, -8314216, -7068650, -4145495, -939893, 1032037, 1849375, 2328364, 2083238, 598083, -1309994, -3566999, -8104340, -14791819, -18620835, -15286840, -7875862, -3531024, -4615535, -7390996, -8341180, -7405305, -5584137, -3509456, -2236527, -2249347, -2295575, -1658540, -1649182, -2154866, 6890, 5398175, 8561079, 5723565, 2016821, 4116084, 9086954, 8918531, 3868091, 1876930, 5454459]
42095E454459L322620n87531k288751l599596p211877o840545K443757J1013688
42087A706224O971054l394293l928494N432947Q808120O64639o293180l374052
42079F592965J261596r18658m722270k940240M87430n74517k679169o92534J388753
42070b796644j268830k931800L445843J1478092R339172q51197n516371q42591
42062A0055674K362318k552914p598273m390678J893201J465973m426062o531564
42054i722325k459799J150465N59718J14843L510449P059101N561007r657m873589
42045H90213o942848o725278l774203J787863O173801N649883K285037P58682
42037A03150M94286k662554p172721n992475K023911Q623313P706915L245375
$$ y = [5454459, 8777079, 8189548, 5900797, 2301201, -4910676, -11751221, -9307464, 1706224, 8677278, 5282985, 1354491, 6787438, 15595558, 16260197, 9967017, 6592965, 7854561, 6935903, 2213633, -726607, -239177, -813694, -3492863, -4185397, -2796644, -4065474, -6997274, -3551431, 7926661, 17265833, 16414636, 10898265, 10055674, 12417992, 9865078, 2266805, -2123873, -230672, 1235301, -3190761, -9722325, -12182124, -11031659, -10471941, -10357098, -6846649, 212452, 5773459, 5763802, 890213, -6052635, -12777913, -16552116, -14764253, -8590452, -2940569, -655532, 103150, 597436, -2065118, -9237839, -15230314, -13206403, -4583090, 3123825, 6369200]
42029F369200J051364j50279l253853n186723k758890n49347l878830q183434
42021a6540792n293366K677297O224475L518778J587104K847859K017697k124550
42013e085498l414655n699J447336k078892l819174Q56485N593008L337263k314789
42004e484615l902123j784331r11428j236208J95718J618606m63545l319502j224417
41995a6511845M696732P286772L652736j666897l824060k580801n0323J879126
41987g118560J834951L59794L66977K911006M232102J038334l317395l070941
41979b763732Q90646J950600k341096o797956o032865p60584M712098P364202
41971c778687O211213J671529l487769m835398m24550O326950R386609N894349
$$ y = [6369200, 7420564, 7270285, 4016432, -1170291, -3929181, -4478528, -8357358, -16540792, -21834158, -19156861, -12932386, -9413608, -7826504, -4978645, -2960948, -5085498, -8500153, -8505852, -7058516, -9137408, -12956582, -12100097, -6507089, -3169826, -5484615, -9386738, -11171069, -12082497, -13318705, -13122987, -11504381, -11967926, -15287428, -16511845, -11815113, -4528341, -875605, -2542502, -6366562, -8947363, -8997686, -7118560, -5283609, -4923815, -4556838, -1645832, 2586270, 3624604, 307209, -2763732, -1873086, 77514, -2263582, -9061538, -15094403, -15854987, -11142889, -3778687, 2432526, 4104055, 616286, -4219112, -4643662, 1683288, 11069897, 16964246]
41963A6964246j151913o022093n891378k878617m53986N40065R75653O57165o69738
41954B069404j188581L89006J530434m02903k776555j652351N49363j203406m264533
41945f950122j327596N839124P078288J041036j022934N459260Q541794j036992
41937A7621858j2688272j1140970K20031N972064K411404r16423N4620m59543
41929A074769m194790n272490k142813l11722j014931J143825O795604Q949615
41921E027067M384046j745078m885704n541388l645320J581768N268880J208059
41913A652330o368052o872991m18012K107493k142025l680547J060596K954534
41905a1706674j979759l750896L540354R643482N308221j990054k101937L67439
$$ y = [16964246, 15812333, 9790240, 3898862, 1020245, 566259, 1106324, 2081977, 2739142, 2069404, 880823, 1269829, 2800263, 2397360, -379195, -2031546, -1482183, -2685589, -6950122, -8277718, -2438594, 4639694, 5680730, 4657796, 10117056, 18658850, 17621858, 4933586, -6207384, -5987353, -15289, 2396115, 1479692, 1534312, 1074769, -3120021, -8392511, -10535324, -10847046, -11861977, -10718152, -3922548, 5027067, 9411113, 7666035, 2780331, -2761057, -6406377, -4824609, 444271, 1652330, -4715722, -11588713, -12006725, -9899232, -12041257, -15721804, -14661208, -11706674, -13686433, -17437329, -13896975, -4253493, 1054728, -935326, -3037263, -2669824]
41897b669824l042355p185002k759596N206804N069602j229330k262589K766418
41889f105872M397534P85621r12648K37483j749366n234049j721078O969568Q044118
41880D711311j622100q755994l739391N302642O043619p63496n833406n414134
41872a0070949k664714j18452K278547M481124O095343O592574M270605j318419
41864I545659n722736l984249J002385J443528l150277m707798M25640N740602
41856E92754N208615J440763j151916l286246n425232l245647M378210R267674
41848G778975M164234n230559p048301K8638N076295K42680q941716j0865509
41840a4795263j718739J0390000J4247112P247097k518475o276743m509915l858445
$$ y = [-2669824, -5712179, -12897181, -15656777, -10449973, -5380371, -6609701, -8872290, -6105872, -1708338, -922717, -1835365, -1597882, -3347248, -8581297, -10302375, -3332807, 4711311, 3089211, -5666783, -9406174, -4103532, 1940087, 1176591, -4656815, -10070949, -12735663, -12854115, -10575568, -6094444, 899, 6593473, 10864078, 9545659, 3822923, -161326, 841059, 2284587, -865690, -5573488, -5147848, 592754, 5801369, 7242132, 6090216, 2803970, -2621262, -5866909, -1488699, 7778975, 11943209, 6712650, -335651, -307013, 4769282, 5011962, -3929754, -14795263, -16514002, -6124002, 8123110, 15370207, 12851732, 6574989, 2065074, -1793371]
41832a793371o021168n478817R77653Q199080R055035L123160l613219n241472
41824g93119p33146N235782N969745Q2537n749300n191376j323010j310584m235659
41815h048130k924826K786069N126263K144425R47138L599969J954708o895048
41807a309432j1708808l336389R598267J2494651N141883j404178k737658l338912
41799C399424m256209j479514L713269M190441j688155p119070o809831k463330
41791a2512975K558596O918308Q696159N761396M8505l853481m707561m392487
41783a483540k803669J137988M661210L939750P74121j93486L52913j542903m264583
41774E77801k608335J799270J667955l415271n425763j183384K476329M63912
$$ y = [-1793371, -7814539, -13293356, -12315703, -4116623, 4938412, 8061572, 4448353, -793119, -1526265, 3709517, 9679262, 9761799, 4012499, -1178877, -2501887, -3812471, -8048130, -10972956, -8186887, -3060624, -916199, 30939, 3630908, 5585616, -1309432, -13018240, -16354629, -6756362, 5738289, 10880172, 9475994, 6738336, 3399424, -856785, -2336299, 1376970, 5567411, 3879256, -3239814, -10049645, -12512975, -9954379, -3036071, 5660088, 11421484, 11469989, 7616508, 2908947, -1483540, -4287209, -3149221, 1511989, 5451739, 6225860, 6032374, 6385287, 4842384, 577801, -2030534, -231264, 1436691, -1978580, -7404343, -8587727, -6111398, -5647486]
41766e647486k722428j734414J156672J873484J784035L247181L903347J345978
41758C206369j541207j428496q8339N423P81310L798272N086332R61254m749782
41749F031136n476422j014484L630290N525195M572418L39905n787111q251638
41741d30711l739212K347975K572874j491009k405125N12858O59227l298238l897896
41732i169257K604944Q592824N868065k004750n299923k311527j1245j747335
41724c478204k580797J025262M127419J105973m168994l103153M161208P736444
41716D825158K239266m973930m491512J567952L490898j289249n219177k601655
41708f452249K635519L637228k70200m408600n023404j847049K828975N354688
$$ y = [-5647486, -8369914, -10104328, -8947656, -7074172, -5290137, -2042956, 1860391, 3206369, 1665162, 236666, 148327, 153750, 935060, 4733332, 9819664, 10780918, 6031136, 554714, -459770, 3170520, 8695715, 13268133, 13608038, 7820927, -430711, -4169923, -1821948, 750926, -740083, -3145208, -2632350, -1973123, -5271361, -9169257, -6564313, 2028511, 7896576, 5891826, 591903, -1719624, -1730869, -3478204, -6059001, -5033739, -906320, 199653, -3969341, -7072494, -2911286, 4825158, 7064424, 2090494, -2401018, -833066, 2657832, 1368583, -3850594, -6452249, -3816730, -179502, -449702, -4858302, -9881706, -11728755, -8899780, -3545092]
41700c545092L492787k56384p56802K864405N534827L216161j670164l978091
41692D901647k080600J821411M923169N222392K195843k049141m472369m798735
41684E663617m646133l046595K219285Q048433P256796q10886p292477n555440
41676A836600J8540J903688J79623p19328o12223j569767j561093J932772N125033
41667F533845K981965j243777j70122N255055O346676L7977o683403p182137k831333
41658C044746J538277L485034K376049j369049m647481m133587j373323p23845
41650a803179k300725k666484k128236m213779p492492n937787R04363O156364
41642a9481955O392867N961362P425968O403101M74239n177528o583268p163239
$$ y = [-3545092, -52305, -308689, -1065491, 1798914, 7333741, 10549902, 8879738, 4901647, 2821047, 4642458, 9565627, 14788019, 16983862, 14934721, 10462352, 5663617, 1017484, -2029111, 190174, 8238607, 15495403, 14684517, 7392040, 1836600, 1855140, 3758828, 3938451, 3219123, 2606900, 1037133, -523960, 1408812, 6533845, 9515810, 8272033, 8101911, 13356966, 19703642, 19741619, 13058216, 5876079, 3044746, 4583023, 8068057, 10444106, 9075057, 4427576, 293989, -1079334, -1803179, -4103904, -6770388, -8898624, -13112403, -20604895, -26542682, -25638319, -19481955, -13089088, -7127726, 298242, 6701343, 7175582, 1998054, -4585214, -11748453]
41634a1748453q628523m573551P783189J7318718J2202354j643846p881650k953147
41626a24909J265558j971170m791337J46550O928609O169205o52525m742141k876442
41617f48602P24083K355732J896866m39636m247614o171601k462639M795627Q313461
41608D115677M175619l139050o181027k985635J834641L243918Q29790k305287
41600d11354l690107l070533p23296L442053Q035845R327313M822834k559796
41592A5172959o539885m539248m67024Q70050k10041k94059R30275L81703k590876
41583B713854m197969j780945J895000K699511J015806Q6016L11970m21188j553290
41574G68765j45465K981603K830512j824230n196848k713209K168300L867514
$$ y = [-11748453, -20376976, -24950527, -17167338, 151380, 12353734, 10709888, 2828238, -124909, 1140649, -830521, -5621858, -5475308, 1453301, 7622506, 6969981, 2227840, -648602, 75481, 2431213, 4328079, 3888443, -359171, -6530772, -8993411, -4197784, 4115677, 8291296, 5152246, -1028781, -4014416, -2179775, 1064143, 1893933, -411354, -4101461, -7171994, -7895290, -4453237, 3582608, 12909921, 17732755, 15172959, 8633074, 4093826, 3626802, 4496852, 4286811, 3992752, 4923027, 5304730, 2713854, -1484115, -3265060, -1370060, 1329451, 2345257, 2431273, 2743243, 2322055, 768765, 623300, 3604903, 6435415, 4611185, -585663, -3298872, -1130572, 2736942]
41566B736942K976092K706208J116509m888166r981962m945679P947418J3963277
41558A1630639M831389r330786j3164786n084280L863155N687556K104306k271426
41550a734233n349264n821600k576326K274254M230800J988285j073396k035154
41542a0096634j819918k080468j710860J292823N954375Q283105N241885j618736
41534C445572o770079n867768n46473L444692L278277J672896J399969R23499
41526I80585j392203k342231J700079P478627Q002357K675848j752900j330999
41518A4019163Q3415j481323l037003N1513N304792N387855j667402r238264j0039916
41509f17170m150908K301357M432566K774494J026071J529518L509954M695445
$$ y = [2736942, 5713034, 8419242, 9535751, 4647585, -5334377, -10280056, -2332638, 11630639, 16462028, 7131242, -6033544, -11117824, -7254669, -1567113, 537193, -1734233, -7083497, -12905097, -15481423, -13207169, -8976369, -6988084, -8061480, -10096634, -11916552, -13997020, -15707880, -14415057, -8460682, -177577, 5064308, 3445572, -3324507, -9192275, -9738748, -6294056, -3015779, -1342883, 57086, 980585, -411618, -2753849, -1053770, 6424857, 14427214, 17103062, 15350162, 14019163, 14102578, 12621255, 9584252, 9635765, 14940557, 20328412, 18661010, 9422746, -617170, -4768078, -2466721, 1965845, 4740339, 5766410, 7295928, 10805882, 15501327]
41501A5501327L499515r8825m482470o921337n549671j602080J411933J553994
41493C312386L74093K43891J221279J693218O99750j712453n005639p533290o889469
41484a3596234k588753K795047O431485P552782O072105J836543k871913l683504
41476A947558j77320J942921j103990m474217j677691M648663O148539J658018
41468H912481j271724J406710M193685J055644n672975r057874n969268J176085
41460e227236P484042Q396710L273604k171766j179966M850770P275020J964470
41452B4665648n405159q225523p037107n200694k660068Q78461J767625k422797
41444c639614p076209n727667J187609P546855R241131O586484J763017k121240
$$ y = [15501327, 19000842, 18902017, 14419547, 7498210, 1948539, 346459, 1758392, 3312386, 3686479, 3930370, 5151649, 6844867, 7544617, 5832164, 826525, -6706765, -13596234, -16184987, -13389940, -6958455, 594327, 6666432, 8502975, 5631062, 1947558, 1770238, 3713159, 2609169, -1865048, -3542739, 1105924, 7254463, 8912481, 7640757, 9047467, 13241152, 14296796, 8623821, -434053, -6403321, -5227236, 2256806, 10653516, 13927120, 11755354, 10575388, 15426158, 22701178, 24665648, 19260489, 11034966, 3997859, -1202835, -3862903, -2984442, -1216817, -3639614, -10715823, -16443490, -15255881, -7709026, 1532105, 8118589, 9881606, 7760366]
41436G760366k285222l21787j502920o454894q359257l168632K971683K912644
41428h448019l48843K99935L713536L604450M83195J12140K151897J054058k715417
41419i3068l216616n17195l00308j640266K288190R362245Q111025l086798j0030921
41410H76288l612992N668777M228550m079788o166027o76451K590269j90925l187687
41401d549986k582303o83370J027346L124979L027813k000221o996190m208624
41393a3840556L764199N952532j51015m228005N64184O857367M992006k162991
41385A747721m328872R64781O239452N168209q58665o897731r830511q788261
41377a6583877m085485K523763Q082726J0002426P450166J938496l013094m087094
$$ y = [7760366, 5475144, 5153357, 3650437, -2804457, -11163714, -14332346, -11360663, -8448019, -8796862, -8496927, -4783391, -1178941, -695746, -583606, 1568291, 2622349, -93068, -3309684, -3826879, -4127187, -5767453, -3479263, 5882982, 13994007, 10907209, 876288, -2736704, 2932073, 7160623, 3080835, -3085192, -3761643, -1171374, -1362299, -4549986, -7132289, -7815659, -6788313, -3663334, -635521, -2635742, -9631932, -13840556, -10076357, -4123825, -4274840, -8502845, -7938661, -1081294, 3910712, 1747721, -2581151, -1616370, 4623082, 9791291, 8932626, 2034895, -7795616, -16583877, -20669362, -18145599, -10062873, -60447, 7389719, 9328215, 6315121, 2228027]
41369B228027j254550J911612J823771j540635m906014n078092j994550J293751
41361g516680K021672J053350J434439L359517L209470q99141n557311o629527
41353i524211m505063j609949J993652O039084O516539J046770m592630k888741
41345g524549L553729N020221j67539k842146K193114P759833N494197k323790
41337A1163070p932205q691541o508448k338748K305007L195782p58082l685511
41329a3250676q73521L759659M638197L799903N484956O594505K132034l818143
41321H466914l509608N44570r04053p064964o916007K147845Q513189M261846
41313E539732k799117k391807K627060K952670j893199m576803k118313J533551
$$ y = [2228027, 973477, 2885089, 4708860, 3168225, -1737789, -6815881, -8810431, -7516680, -5495008, -4441658, -3007219, 352298, 3561768, 2662627, -2894684, -9524211, -14029274, -15639223, -13645571, -7606487, -1089948, -43178, -4635808, -7524549, -3970820, 1049401, 881862, -1960284, 232830, 7992663, 13486860, 11163070, 3230865, -5460676, -11969124, -14307872, -12002865, -8807083, -9565165, -13250676, -14124197, -10364538, -5726341, -1926438, 3558518, 10153023, 12285057, 8466914, 4957306, 5501876, 4597823, -2467141, -9383148, -7235303, 1277886, 5539732, 2740615, 348808, 2975868, 5928538, 4035339, -541464, -2659777, -1126226]
41305a126226K802924J522217j425407m021100l135160M82904Q28009m259757
41297h331596p113492o92226R044492J0436451L304814j639715p6847P22212l541289
41288B112804n844079j90616O902721N869617r76988l444579O05002K845089j898397
41279E980574q023326p801067j489395M848045P257673N579213M36726o526896
41271B61547j0764812q265070j466265K549123J250017m7677L340871P823507
41263e318759O992496J795553j081211r5583q88421n917467r230910n606023R93505
41254a8356820L567104K213042J922267L645952M475397M453617N661133N600995
41246A3182687k19006q440755r187285k26965P851636N359853l738444q452688
$$ y = [-1126226, 1676698, 3198915, 1773508, -2247592, -5382752, -4899848, -4071839, -8331596, -15445088, -16137314, -7092822, 3343629, 6648443, 5008728, 4931881, 5654093, 2112804, -3731275, -3921891, 2980830, 8850447, 7873459, 4428880, 5033882, 7878971, 5980574, -2042752, -9843819, -11333214, -6485169, 772504, 6351717, 6788443, 261547, -10503265, -18768335, -20234600, -17685477, -16435460, -16483137, -13142266, -5318759, 1673737, 3469290, 2388079, 2292496, 1404075, -4513392, -13744302, -19350325, -18356820, -14789716, -12576674, -10654407, -7008455, -2533058, 1920559, 7581692, 13182687, 12963681, 4522926, -4664359, -4891324, 2960312, 8320165, 4581721, -3870967]
41238c870967n367469k08948J960466J209716j271638m919301o943333l562356
41230b2973830L763052P693240L704843l250362m274862K231963Q365323O777342
41222B036709J55642k437055K199101P170629N343814p21021l177689o54275O38435
41213A0554290k626706n923807m469076m6158L077671M202346M218184J970137
41205A0956881k571632n097947k450362J231782k80612n562384p148241k411221
41197a3333736L342557N391270N267312N753643N378712J622213l559488n512290
41189D350193l203121n39945r62403k829470j801692K601994N049800R52608o319237
41180b701273q366310k318706N493613P994863N294680J580183j398257l637589
$$ y = [-3870967, -9238436, -9447384, -7486918, -6277202, -7548840, -12468141, -19411474, -22973830, -19210778, -11517538, -7812695, -11063057, -15337919, -13105956, -4740633, 2036709, 2192351, -244704, 1954397, 9125026, 14468840, 13747819, 10570130, 9915855, 10554290, 7927584, 2003777, -2465299, -2511457, 566214, 4768560, 8986744, 10956881, 8385249, 3287302, 836940, 2068722, 1788110, -3774274, -10922515, -13333736, -9991179, -4599909, 667403, 6421046, 11799758, 13421971, 9862483, 4350193, 1147072, 607127, -355276, -3184746, -4986438, -2384444, 2665356, 3617964, -2701273, -11067583, -13386289, -7892676, 102187, 5396867, 6977050, 5578793, 1941204]
41172A941204l757257j761520j513477m645282n286912K006543J1579391J2415963
41164A0978653L758270l892190m097275j780024k838943n198982m518566j699954
41156i289011K38013J310011K240190J848923L78709L83823J186741j504214o903051
41147a0109866p254657K56346P088803N680814J234837K539376O980152N300965
41139A1716770k337095o488426l623514j99080l78698J37898M670767Q237106
41131A1735728M556456m712488j1743432j0589785j716344Q386004J1527788N476115
41123A2920042k550601l981495K78595K336079l54564k385318p69571K53645k188406
41114C558406l738875m41867L689399K560387k577432n349968l444445l96562
$$ y = [1941204, -1816053, -3577573, -5091050, -9736332, -15023244, -13016701, -1437310, 10978653, 14736923, 10844733, 6747458, 4967434, 2128491, -3070491, -7589057, -9289011, -9050998, -7740987, -5500797, -3651874, -3273165, -2889342, -1702601, -3206815, -10109866, -17364523, -17108177, -10019374, -4338560, -3103723, -564347, 6415805, 11716770, 9379675, 2891249, -732265, -931345, -1310043, -1172145, 3498622, 11735728, 16292184, 11579696, -163736, -10753521, -12469865, -4083861, 7443927, 12920042, 10369441, 6387946, 6666541, 9002620, 8648056, 6262738, 5493167, 5746812, 3558406, -180469, -622336, 3067063, 5627450, 3050018, -2299950, -5744395, -6140957]
41106f140957N02373k34792m44708R38599L055884L423848J17161n006665o833479
41097a0622736k393833N321027J0002003P704304Q3973o486168n882948J168239
41089a106139O505174L731467l532112o925314m871503k451495j181349K370563
41081g460708O907827N187952l649029r578787n444253K377170L964469N0102
41073g645257j610556R37962L066874K604747J920814K407331K886559K319744
41065F888218K5546m196130o944731l112760N014026P163727m70925p600730m645918
41056g879677K612085L640236Q14607K830013O339916Q11739j0610194j2860090
41048a4301365k990563M690219J597220l287940p81615M571346O088623O495900
$$ y = [-6140957, -5638584, -5873376, -6318084, -5379485, -2323601, 1100247, 1217408, -3789257, -10622736, -13016569, -7695542, 2306461, 10010765, 10094738, 3608570, -2274378, -1106139, 5399035, 9130502, 5598390, -1326924, -6198427, -8649922, -9831271, -7460708, -552881, 4635071, 986042, -8592745, -14036998, -11659828, -7695359, -7645257, -9255813, -8317851, -5250977, -2646230, -725416, 1681915, 4568474, 6888218, 6913764, 2717634, -4227097, -7339857, -2325831, 4837896, 4366971, -3233759, -7879677, -5267592, -1627356, -812749, 2017264, 8357180, 9168919, -1441275, -14301365, -17291928, -12601709, -11004489, -14292429, -15074044, -10502698, -4414075, 2081825]
41040B081825Q347944N852703k775483o735851R68005R082013M218008p393099
41032A3646065r913908k918387P45154j831670q52003N711965O880905j726306
41024I741815q587833l974213N060105O018964j331503p304172o655667k640309
41016i672813J49154N38834l90383j085264o55679K14969Q30811K691992O919150
41007d59229R976730O805203j394344p670188q280307n684618k148218K818503
40999f036468P217788O476235J514898p71505J227131N31619n263198o890025
40991a993525K003846J1457702Q060906m242045r606090m161182M4340l822562
40983b258610p122772k331044L281985L38497n935623l966997M609148O798593
$$ y = [2081825, 10429769, 16282472, 13506989, 6771138, 7739143, 16821156, 21039164, 13646065, 3732157, 813770, 1558924, -272746, -1124749, 4587216, 11468121, 9741815, 1153982, -2820231, 2239874, 8258838, 6927335, -376837, -7032504, -9672813, -9523659, -8984825, -9375208, -10460472, -11116151, -10901182, -10070371, -7378379, -459229, 9517501, 16322704, 14928360, 7258172, -1022135, -6706753, -8854971, -6036468, 1181320, 7657555, 9172453, 8400948, 9628079, 10159698, 4896500, -1993525, 10321, 11468023, 19528929, 15286884, 5680794, 1519612, 1563952, -2258610, -9381382, -11712426, -8430441, -8091944, -14027567, -17994564, -13385416, -6586823]
40975f586823j387755q808044o139926J461490M053498J329411J50102K626984
40967a3301063M515827L490482J834455Q64788j207452m539803n758031k880688
40959a6981485J538296M151541M546232L462619O36347l175110m991161l323005
40951a4135726p80997k16398n38025O43498K525401K861962K214251K361456K069181
40942b995397q54480m202701l279833J773536N806924O483288O625358P094781
40934A6451476L662374n027003j1802549r361011j216336K343360j761738n937780
40926a2649207l333988L183951O365144M511809J895114J465612J600669Q3004
40918C122108k212641k948552j628450J64651P83264k52771k144314l071328j621538
$$ y = [-6586823, -7974578, -16782622, -22922548, -21461058, -17407560, -16078149, -15928047, -13301063, -8785236, -5294754, -3460299, -2595511, -3802963, -8342766, -14100797, -16981485, -15443189, -11291648, -6745416, -3282797, -2646450, -5821560, -10812721, -14135726, -14916723, -15133121, -15671146, -15027648, -12502247, -9640285, -7426034, -5064578, -2995397, -3849877, -8052578, -11332411, -9558875, -3751951, 2731337, 9356695, 16451476, 20113850, 15086847, 3284298, -6076713, -7293049, -4949689, -6711427, -12649207, -15983195, -12799244, -6434100, -1922291, -27177, 1438435, 3039104, 3122108, 909467, -2039085, -3667535, -3502884, -2719620, -2972391, -5116705, -8188033, -9809571]
40909i809571J001353J510777j117000l247456j086504L447361M859113J955893
40901b486034o35925N5860J027587o93649k074730J097403O171283O185116j48453
40892H498458o296682o481572k065850J890689K787028J468627j71557p85317
40884a156176m13100n80707k070470k808437m15768L295987L630807n16128m639455
40875e673447m337945m31717K932108L091298O72765j577341j134447J518199
40867d940527K821574J035178k49186K576371N765142K398733n773625q308443
40859d674783j006011O416104L347067o570232j0719513m787190L163310N232832
40851i598416K827806J546657K865153M333644M508996L909526K452460o59453
$$ y = [-9809571, -8808218, -7297441, -8414441, -11661897, -12748401, -9301040, -4441927, -2486034, -3121959, -3066099, -2038512, -2732161, -4806891, -3709488, 2461795, 8646911, 8498458, 2201776, -4279796, -6345646, -4454957, -1667929, -199302, -370859, -1156176, -1569276, -2149983, -4220453, -7028890, -7444658, -4148671, -517864, -1033992, -5673447, -10011392, -10443109, -7511001, -4419703, -3746938, -5324279, -6458726, -4940527, -2118953, -1083775, -1332961, 1243410, 7008552, 9407285, 3633660, -4674783, -5680794, 735310, 4082377, -2487855, -13207368, -17994558, -14831248, -9598416, -6770610, -5223953, -2358800, 1974844, 6483840, 10393366, 12845826, 12186373]
40843A2186373m097464m176957K54289L976704L63311q661623j2178760l834745
40835a6168872Q000462J0167443K452513l205351j022358J529960j773403m922463
40827d942069m88516O876790P250227M64424n235155o063395m864114k879345
40819i881153J012220L904013J192407m468979n335058m47003L177922K351999
40811h493632J834511M416843N753447K850143j68692O60070K852093L033764
40803A2738547K388173J811860j753330q275637j0206220k598129P129228Q009174
40795I243666J183133k173146K300679O406332K408524n852852r109980m986083
40787e79727P59766K892466J878053N65841m68550k407680m832407n331521k625164
$$ y = [12186373, 8088909, 3911952, 4166241, 8142945, 8506256, -155367, -12334127, -16168872, -8168410, 1999033, 4451546, 1246195, 223837, 1753797, -19606, -4942069, -5430585, 1446205, 8696432, 9160856, 3925701, -2137694, -7001808, -9881153, -8868933, -4964920, -3772513, -8241492, -13576550, -14023553, -10845631, -8493632, -6659121, -2242278, 3511169, 6361312, 6192620, 6852690, 9704783, 12738547, 15126720, 16938580, 15185250, 6909613, -3296607, -5894736, 1234492, 9243666, 10426799, 8253653, 10554332, 16960664, 19369188, 13516336, 4406356, -579727, 180039, 3072505, 4950558, 5516399, 5047849, 2640169, -2192238, -7523759, -10148923]
40778a0148923J574717M481225M788321K820970j83295k129261j529686r1974
40770d17906j068110l408641j697142M767297P877388J879378n802678l932780
40762a803194M734445O189585l524036j1708454q042629R74321L939083J448777
40754g792102J386307M133122L547795p90200k809364l19637K671362L597824
40746C625107L505009J997159k275792o020630l838728K815761O340152L698652
40738I846690m79482k570778m221670n976643m450658N85004L297972M51642l055998
40729f573921k087378R22012J476057J115646L380558N712395K984435k962717
40721C967087m865768q33567L132391K226204j407578l476371k934533n65034
$$ y = [-10148923, -8574206, -4092981, 695340, 3516310, 3333015, 1203754, -325932, -417906, -1486016, -4894657, -6591799, -1824502, 6052886, 7932264, 2129586, -1803194, 2931251, 9120836, 5596800, -6111654, -14154283, -13179962, -9240879, -7792102, -6405795, -2272673, 1275122, 484922, -2324442, -2644079, 27283, 3625107, 7130116, 9127275, 6851483, 830853, -3007875, -192114, 6148038, 9846690, 9367208, 6796430, 2574760, -3401883, -7852541, -7267537, -3969565, -3517923, -6573921, -8661299, -7739287, -6263230, -5147584, -1767026, 3945369, 6929804, 3967087, -898681, -1732248, 1400143, 3626347, 2218769, -1257602, -4192135, -4757169]
40713d757169L266311O809960O618400K036665k717300l695512k065456j180350
40705D315549j290514n56624N06179m05211k956459m072836k629164j113876j744943
40696i947899l383636l377432q06107K745853M435575K501652j028852j221875
40688a0082721L258249O118894R40473p838505q421987J864260J1121446Q678616
40680E638725m93778m284844q36771J782451M260j618757o63508k92640q42887
40671a607749K156491Q199707R187965J496197p249887r046111o039165m104563
40663g007115k861085M37956L041948J392079p60337K043448O462509M769615
40655G519018k301921o674071n912982n236015o221129l827246K870463O761230
$$ y = [-4757169, -1490858, 5319102, 11937502, 13974167, 11256867, 7561355, 5495899, 4315549, 3025035, 2468411, 2974590, 2569379, -387080, -4459916, -7089080, -8202956, -9947899, -13331535, -16708967, -17515074, -14769221, -10333646, -7831994, -8860846, -10082721, -6824472, -705578, 234895, -7603610, -16025597, -14161337, -3039891, 5638725, 5144947, 860103, 23332, 1805783, 1810043, 191286, -472222, -764862, -1607749, 548742, 8748449, 17936414, 19432611, 12182724, 3136613, -2902552, -7007115, -9868200, -9430244, -6388296, -4996217, -5756554, -3713106, 2749403, 7519018, 5217097, -1456974, -7369956, -12605971, -18827100, -22654346, -19783883, -13022653]
$$ [...]
##END NTUPLES=NMR SPECTRUM
##END=
