##TITLE=31Pdec_1H_LR-678-CR2
 CDCl3, 24 sc
 23.11.2020
##JCAMPDX= 6.0         $$ Bruker NMR JCAMP-DX V2.0
##DATA TYPE= NMR SPECTRUM
##DATA CLASS= NTUPLES
##ORIGIN= UXNMR, Bruker Analytische Messtechnik GmbH
##OWNER= root
$$ XWIN-NMR		Version 3.5
$$ Mon Nov 23 13:55:53 2020 Russian Standard Time (UT+4h)  she@DPX200
##.OBSERVE FREQUENCY= 81.013821
##.OBSERVE NUCLEUS= ^31P
##.ACQUISITION MODE= SIMULTANEOUS
##.ACQUISITION SCHEME= undefined
##.AVERAGES= 124
##.DIGITISER RES= 17
##SPECTROMETER/DATA SYSTEM= spect
##.PULSE SEQUENCE= zgpg30
##.SOLVENT NAME= D2O
##.SHIFT REFERENCE= (INTERNAL, D2O, 0, 182.463)
##AUDIT TRAIL= $$ (NUMBER, WHEN, WHO, WHERE, WHAT)
$$ ##TITLE= Audit trail, XWIN-NMR		Version 3.5
$$ ##JCAMPDX= 5.01
$$ ##ORIGIN= Bruker BioSpin GmbH
$$ ##OWNER= she
$$ F:/spectra/data/she/nmr/P31/1/pdata/1/auditp.txt
$$ ##AUDIT TRAIL=  $$ (NUMBER, WHEN, WHO, WHERE, WHAT)
(   1,<2020-11-23 13:54:26.75 +0400>,<she>,<DPX200>,
      <continue with go, POWCHK disabled, PULCHK disabled
       configuration hash MD5:
       00 E9 B6 7A A2 85 ED C7 34 08 36 98 17 FE 4E 26
       data hash MD5: 32K
       62 4F 08 BF 4F DC 4C 40 40 71 04 7E 02 1E CF 3C>)
(   2,<2020-11-23 13:54:28.89 +0400>,<she>,<DPX200>,
      <Start of raw data processing
       efp BC_mod = 2 LB = 1 FT_mod = 6 PKNL = 1 PHC0 = -2401.53 PHC1 = 139.2008 SI = 64K 
       data hash MD5: 64K
       3E 77 50 FA 0A B2 87 1A 0C 1C 55 00 99 B7 E8 D1>)
(   3,<2020-11-23 13:54:50.95 +0400>,<she>,<DPX200>,
      <pk PHC0 = -9.255647 PHC1 = 0 
       data hash MD5: 64K
       12 18 A1 1F DF 02 35 60 96 F6 63 56 90 F6 B0 BE>)
$$ ##END=
$$ 
$$ hash MD5
$$ C3 F3 F0 BC 3B 45 B6 BC 09 51 6E AD 99 53 19 44
##$RELAX= 
##$RELAX= 
##$RELAX= 
##$RELAX= 
##$RELAX= 
##$RELAX= 
##$RELAX= 
##$RELAX= 
$$ Bruker specific parameters
$$ --------------------------
##$DU= <F:/spectra>
##$EXPNO= 1
##$NAME= <P31>
##$PROCNO= 1
##$TYPE= <nmr>
##$USER= <she>
##$AMP= (0..31)
100 100 100 100 100 100 100 100 100 100 100 100 100 100 100 100 100 100 
100 100 100 100 100 100 100 100 100 100 100 100 100 100 
##$AQSEQ= 0
##$AQ_mod= 1
##$AUNM= <au_zg>
##$AUTOPOS= <>
##$BF1= 81.014009
##$BF2= 200.13
##$BF3= 200.13
##$BF4= 200.13
##$BF5= 200.13
##$BF6= 200.13
##$BF7= 200.13
##$BF8= 200.13
##$BYTORDA= 1
##$CFDGTYP= 0
##$CFRGTYP= 5
##$CHEMSTR= <none>
##$CNST= (0..31)
1 1 145 1 1 1 1 1 1 1 1 1 1 1 1 1 1 1 1 1 1 1 1 1 1 1 1 1 1 1 1 1 
##$CPDPRG= <waltz16>
##$CPDPRG1= <>
##$CPDPRG2= <waltz16>
##$CPDPRG3= <>
##$CPDPRG4= <mlev>
##$CPDPRG5= <mlev>
##$CPDPRG6= <mlev>
##$CPDPRG7= <mlev>
##$CPDPRG8= <mlev>
##$CPDPRGB= <>
##$CPDPRGT= <>
##$D= (0..31)
0 1 0 0 0 0 0 0 0 0 0 0.03 2e-05 3e-06 0 0 0 0 0 0 0 0 0 0 0 0 0 0 0 0 
0 0 
##$DATE= 1606125070
##$DBL= (0..7)
120 120 120 11 120 120 24 19 
##$DBP= (0..7)
150 150 150 150 150 150 150 150 
##$DBP07= 0
##$DBPNAM0= <>
##$DBPNAM1= <>
##$DBPNAM2= <>
##$DBPNAM3= <>
##$DBPNAM4= <>
##$DBPNAM5= <>
##$DBPNAM6= <>
##$DBPNAM7= <>
##$DBPOAL= (0..7)
0.5 0.5 0.5 0.5 0.5 0.5 0.5 0.5 
##$DBPOFFS= (0..7)
$$ [...]
##$SUBNAM2= <"">
##$SUBNAM3= <"">
##$SUBNAM4= <"">
##$SUBNAM5= <"">
##$SUBNAM6= <"">
##$SUBNAM7= <"">
##$SUBNAM8= <"">
##$SUBNAM9= <"">
##$SW= 369.568048894756
##$SWIBOX= (0..15)
0 1 3 0 0 0 0 0 0 0 0 0 0 0 0 0 
##$SW_h= 29940.119760479
##$TD= 32768
##$TD0= 1
##$TE= 0
##$TE2= 300
##$TE3= 300
##$TEG= 300
##$TL= (0..7)
0 120 53 12 22 120 120 120 
##$TP= (0..7)
150 150 150 150 150 150 150 150 
##$TP07= 0
##$TPNAME0= <>
##$TPNAME1= <>
##$TPNAME2= <>
##$TPNAME3= <>
##$TPNAME4= <>
##$TPNAME5= <>
##$TPNAME6= <>
##$TPNAME7= <>
##$TPOAL= (0..7)
0.5 0.5 0.5 0.5 0.5 0.5 0.5 0.5 
##$TPOFFS= (0..7)
0 0 0 0 0 0 0 0 
##$TUNHIN= 0
##$TUNHOUT= 0
##$TUNXOUT= 0
##$USERA1= <user>
##$USERA2= <user>
##$USERA3= <user>
##$USERA4= <user>
##$USERA5= <user>
##$V9= 5
##$VALIST= <valist>
##$VCLIST= <CCCCCCCCCCCCCCC>
##$VD= 0
##$VDLIST= <DDDDDDDDDDDDDDD>
##$VPLIST= <PPPPPPPPPPPPPPP>
##$VTLIST= <TTTTTTTTTTTTTTT>
##$WBST= 1024
##$WBSW= 4
##$XGAIN= (0..3)
0 0 0 0 
##$XL= 0
##$YL= 0
##$YMAX_a= 38787
##$YMIN_a= -26896
##$ZGOPTNS= <>
##$ZL1= 120
##$ZL2= 120
##$ZL3= 120
##$ZL4= 120
##$ABSF1= 0
##$ABSF2= 0
##$ABSG= 0
##$ABSL= 0
##$ALPHA= 0
##$AQORDER= 0
##$ASSFAC= 0
##$ASSFACI= 0
##$ASSFACX= 0
##$ASSWID= 0
##$AUNMP= <proc_1d>
##$AZFE= 0.1
##$AZFW= 0.5
##$BCFW= 0
##$BC_mod= 2
##$BYTORDP= 0
##$COROFFS= 0
##$CY= -3
##$DATMOD= 1
##$DC= 0
##$DFILT= <>
##$DTYPP= 0
##$F1P= 0
##$F2P= 0
##$FCOR= 1
##$FTSIZE= 65536
##$FT_mod= 6
##$GAMMA= 0
##$GB= 0
##$INTBC= 1
##$INTSCL= 5.30512e-09
##$ISEN= 30
##$LB= 1
##$LEV0= 0
##$LPBIN= 0
##$MAXI= 10000
##$MC2= 0
##$MEAN= 0
##$ME_mod= 0
##$MI= 50
##$NCOEF= 0
##$NC_proc= -8
##$NLEV= 6
##$NOISF1= 182.463
##$NOISF2= 159.3651
##$NSP= 0
##$NTH_PI= 0
##$NZP= 0
##$OFFSET= 182.463
##$PC= 4
##$PHC0= -2410.786
##$PHC1= 139.2008
##$PH_mod= 1
##$PKNL= yes
##$PPARMOD= 0
##$PSCAL= 0
##$PSIGN= 0
##$REVERSE= no
##$SF= 81.014009
##$SI= 65536
##$SIGF1= 159.3651
##$SIGF2= -187.1042
##$SINO= 113.3802
##$SIOLD= 16384
##$SREGLST= <1H.CDCl3>
##$SSB= 0
##$STSI= 65536
##$STSR= 0
##$SW_p= 29940.119760479
##$SYMM= 0
##$S_DEV= 0
##$TDeff= 32768
##$TDoff= 0
##$TI= <>
##$TILT= no
##$TM1= 0
##$TM2= 0
##$TOPLEV= 0
##$USERP1= <user>
##$USERP2= <user>
##$USERP3= <user>
##$USERP4= <user>
##$USERP5= <user>
##$WDW= 1
##$XDIM= 65536
##$YMAX_p= 510090924
##$YMIN_p= -81463768
$$ End of Bruker specific parameters
$$ ---------------------------------
##NTUPLES= NMR SPECTRUM
##VAR_NAME=  FREQUENCY,     SPECTRUM/REAL,   SPECTRUM/IMAG
##SYMBOL=    X,             R,               I
##VAR_TYPE=  INDEPENDENT,   DEPENDENT,       DEPENDENT
##VAR_FORM=  AFFN,          ASDF,            ASDF
##VAR_DIM=   65536,         65536,           65536
##UNITS=     HZ,            ARBITRARY UNITS, ARBITRARY UNITS
##FACTOR=    0.456856943014862, 1,           1
##FIRST=     14782.0589164895, 0,            0
##LAST=      -15158.0608439895, 0,           0
##MIN=       -15158.0608439895, -81463768,   0
##MAX=       14782.0589164895, 510090924,    0
$$ Real data points
##PAGE= N=1
##DATA TABLE= (X++(R..R)), XYDATA
$$ [...]
45413F811224q853480j0511939R16751Q741807K232102r538785j1048281N20972
$$ 6811224 -2042256 -12554195 -11637444 -2895637 -663535 -10202320 -21250601 -20729629
45405b0729629J3659514J6172631P147771l646604o590403j369412N239548Q153348
$$ -20729629 -7070115 9102516 16250287 12603683 6013280 4643868 9883416 18036764
45397A8036764O540545o4238j0428114j6165822p746170R929053J8153971P882225
$$ 18036764 24577309 24513071 14084957 -2080865 -9827035 102018 18255989 26138214
45389B6138214p064441j0234104o526490j1192986k1357460j8138242J880834
$$ 26138214 19073773 8839669 2313179 -8879807 -30237267 -48375509 -46494675
45382d6494675J7025995J0535812n584477r028331J760238R927614P402337L524940
$$ -46494675 -29468680 -18932868 -24517345 -33545676 -31785438 -21857824 -14455487 -10930547
45374a0930547O464361J0435042O712689k542229q610516q442054n528348k054142
$$ -10930547 -4466186 5968856 12681545 10139316 1528800 -6913254 -12441602 -14495744
45366a4495744K686294P097796P178675K680200k034716n022474r092899j3917237
$$ -14495744 -11809450 -4711654 2467021 5147221 3112505 -1909969 -11002868 -24920105
45358b4920105j1948718J021464J5348445J6859790N905648k820546j158733K654723
$$ -24920105 -36868823 -35847359 -20498914 -3639124 2266524 -554022 -1712755 941968
45350I41968j46181m470837k287249J642441j601561o837720j350579J1968976
$$ 941968 795787 -3675050 -5962299 -4319858 -5921419 -12759139 -14109718 -2140742
45342b140742J5400082L350874q338544p249009k785504q132724j6822772j2880876
$$ -2140742 13259340 16610214 8271670 1022661 -1762843 -9895567 -26718339 -39599215
45334c9599215L437800J6220523J6671970J0507920M184817j848460n811838m392538
$$ -39599215 -36161415 -19940892 -3268922 7238998 11423815 9575355 3763517 -629021
45326f29021j809467n878728j2473882q059612P668002J6700852Q420098l858982
$$ -629021 -2438488 -8317216 -20791098 -28850710 -21182708 -4481856 3938242 79260
45318G9260l616497M145073M006394l399938l972993N238969J2193461J0401048
$$ 79260 -3537237 607836 4614230 1214292 -2758701 2480268 14673729 25074777
45310B5074777O357603M112252j244445r706682j1643305m826255j705157r007503
$$ 25074777 31432380 35544632 34300187 24593505 12950200 8123945 6418788 -2588715
45302b588715j3334705j600140J4677189J3987742j611972q358805K476568J0555065
$$ -2588715 -15923420 -17523560 -2846371 11141371 9529399 1170594 3647162 14202227
45294A4202227j832073k1345299k2456390m345117R690693O915889K98087M087785
$$ 14202227 12370154 -8975145 -31431535 -35776652 -26085959 -19170070 -18871983 -14784198
45286a4784198J0804247M980660j0082258j5394804m053548R341040J0658232
$$ -14784198 -3979951 1000709 -9081549 -24476353 -28529901 -19188861 -8530629
45279h530629M452829K333667L692895n2597p942755r815878l265436K308854
$$ -8530629 -4077800 -1744133 1948762 1896165 -6046590 -15862468 -19127904 -16819050
45271a6819050J017321r62473L418484J1233953J5319735J3632034P661656j486745
$$ -16819050 -15801729 -16764202 -13345718 -2111765 13207970 26840004 34501660 33014915
45263C3014915r621854r086892Q00738Q774082N221710l966283n854852J041107
$$ 33014915 23393061 14306169 15106907 23880989 29102699 25136416 19281564 20322671
45255B0322671O376970M146288n63440j276513J778424M629805M187136q65664
$$ 20322671 26699641 30845929 30282489 29005976 30784400 35414205 39601341 38735677
45247C8735677q419417j2713273j1240545r900949j4202609j7847905r935662
$$ 38735677 30316260 17602987 6362442 -3538507 -17741116 -35589021 -45524683
45240d5524683P042528J7679030J4387566O747424N567267P662715L683867o228932
$$ -45524683 -38482155 -20803125 -6415559 331865 5899132 13561847 17245714 11016782
45232A1016782j2887693j0538081k431416M310954N335127K066291J55412L014340
$$ 11016782 -1870911 -12408992 -14840408 -10529454 -5194327 -3128036 -2972624 41716
45224D1716O900392O018523J328727j679166k794288o282165j0365403p954825
$$ 41716 6942108 12960631 14289358 12610192 9815904 3533739 -6831664 -14786489
45216a4786489q284L173632j642886m401357J627065Q184242N509108k584444
$$ -14786489 -14794773 -11621141 -13264027 -17665384 -16038319 -7854077 -2344969 -4929413
45208d929413o924060p191644p124681l969589M906966J1857712Q753071J583359
$$ -4929413 -11853473 -19045117 -26169798 -30139387 -25232421 -13374709 -4621638 -3038279
45200c038279J579881O093695L044894q034401j4619233j0676593l059077K694398
$$ -3038279 -1458398 4635297 7680191 -354210 -14973443 -25650036 -28709113 -26014715
45192b6014715Q721293J4276198J2621908L510090k894433l41609M846907M749122
$$ -26014715 -17293422 -3017224 9604684 13114774 10220341 9878732 14725639 19474761
45184A9474761P82083j564981j253682J3604J434095J049621l665178j0045429
$$ 19474761 20256844 18691863 17438181 17451785 18885880 19935501 16270323 6224894
45176F224894j1370594n979739J339058P846816J4188953J6636248R301327l102126
$$ 6224894 -5145700 -11125439 -9786381 -1939565 12249388 28885636 38186963 35084837
45168C5084837p182567r16799Q50499j0812417k2354516j5549668O167693K1566795
$$ 35084837 27902270 26985471 27835970 17023553 -5330963 -20880631 -14712938 6853857
45160F853857J7828295K565416q194603o083367L871185Q046221k434797j9202696
$$ 6853857 24682152 27247568 19052965 12969598 16840783 24887004 22452207 3249511
45152C249511k2868947o759551J2266090J3832486j184011j4320820j3195651
$$ 3249511 -19619436 -26378987 -14112897 -280411 -1464422 -15785242 -28980893
45145b8980893k379681O724156Q435549N619912N179057R956970J3443647P116571
$$ -28980893 -31360574 -24636418 -16200869 -10580957 -5401900 4555070 17998717 25115288
45137B5115288n505996j0526885l118803M930893L381122k106821k973765l403718
$$ 25115288 19609292 9082407 5963604 10894497 14275619 12168798 9195033 5791315
45129E791315r935185j5271411q224296O528898J4221801J1099224N227691R05983
$$ 5791315 -4143870 -19415281 -27639577 -21110679 -6888878 4210346 9438037 10344020
45121A0344020k614205j506944P090089J3746113P985245k957730m889740j478708
$$ 10344020 7729815 6222871 13312960 27059073 35044318 32086588 27196848 25718140
45113B5718140o252263j3436273m230958J6315903J9338662k338739j9100232
$$ 25718140 19465877 6029604 1798646 18114549 37453211 35114472 16014240
45106A6014240r934539N704274K501571r760614p130953O033139O723315o061147
$$ 16014240 6079701 11783975 14285546 4524932 -2606021 3427118 10150433 4089286
45098D089286j1449987k537124O614740Q484859R828918J0824861K497282j1023634
$$ 4089286 -7360701 -9897825 -3283085 5201774 15030692 25855553 28352835 17329201
45090A7329201j2625078j244463L238805o710102j2223146q19747R995182J796522
$$ 17329201 4704123 3459660 6698465 -11637 -12234783 -13054530 -3059348 -1262826
45082a262826j1257427l784559J7582648K1238066j369277k2691997k0127157
$$ -1262826 -12520253 -16304812 1277836 22515902 21146625 -1545372 -21672529
45075b1672529n462364k17730j644044O487473K1110627K2215573O375732n474211
$$ -21672529 -27134893 -27352623 -28996667 -22509194 -1398567 20817006 27192738 21718527
45067B1718527o18127N612436l365850j5105919n904455J9490649L0654069J4588299
$$ 21718527 21100400 26712836 23346986 8241067 2336612 21827261 52481330 67069629
45059F7069629p838399j5631580j4990993j9116007k0962715p310806J3058787
$$ 67069629 59231230 43599650 28608657 9492650 -11470065 -18780871 -5722084
45052e722084J9056378Q999939o8970j926058o760577j6126218j5968630j392296
$$ -5722084 13334294 22334233 22265263 20339205 13578628 -2547590 -18516220 -19908516
45044a9908516J2258125J2493061O010649J901369l712844j3362765j5325667
$$ -19908516 -7650391 4842670 10853319 12754688 9041844 -4320921 -19646588
45037a9646588j850152J2927079J1963282K197978K442595J1496886J0497088
$$ -19646588 -21496740 -8569661 3393621 5591599 8034194 19531080 30028168
45030C0028168n003278j7533300j5398691p715599m747470j003617J0825258K2237002
$$ 30028168 25024890 7491590 -7907101 -15622700 -20370170 -21373787 -10548529 11688473
45022A1688473J8884744J591913j3994187j5809441n594836O399767J0239339
$$ 11688473 30573217 32165130 18170943 2361502 -3233334 3166433 13405772
45015A3405772K385458j0808205j7082428j0419404K186311R269779P379325J546100
$$ 13405772 15791230 4983025 -12099403 -22518807 -20332496 -11062717 -3683392 -2137292
45007b137292k974247m513529l486956k200602l663160n893728j343381J1265518
$$ -2137292 -5111539 -9625068 -13112024 -15312626 -18975786 -24869514 -26212895 -14947377
44999a4947377J8890723Q764815j0238625j4404155K559902J7647587Q890510
$$ -14947377 3943346 12708161 2469536 -11934619 -9374717 8272870 17163380
44992A7163380j3310790k0236986m647423J1390345R495529k174439o527717k434415
$$ 17163380 3852590 -16384396 -21031819 -9641474 -145945 -2320384 -8848101 -11282516
44984a1282516O22808J370035M406291N977123o34606q585202m670074O458981
$$ -11282516 -10659708 -9289673 -4883382 1093741 459135 -8126067 -12796141 -6337160
44976f337160N032139j1454732j8818527j149351K2314609K2911254K883135j0712539
$$ -6337160 -1305021 -12759753 -31578280 -32727631 -10413022 12498232 15381367 4668828
44968D668828n725544L676936M716583L116679O283089P637835r86959j2872573
$$ 4668828 -1056716 2620220 7336803 10453482 16736571 24374406 23387447 10514874
44960A0514874j4038157j773901J2718229J6927011P743715o483669j2142899
$$ 10514874 -3523283 -5297184 7421045 24348056 32091771 25608102 13465203
44953A3465203l923679O593985L451761j1415004j8734030p915974R293988J6857580
$$ 13465203 9541524 16135509 19587270 8172266 -10561764 -18477738 -9183750 7673830
44945G673830J3584769N850516n644239j9037486k2403902q142157J0590637J4679729
$$ 7673830 21258599 27109115 21464876 2427390 -19976512 -28118669 -17528032 -2848303
44937b848303O072782K925743J0154444J3403571L905168q588737j2666710r423391
$$ -2848303 3224479 6150222 16304666 29708237 33613405 25024668 12357958 2934567
44929B934567l528192N400425J4575760J4202968J605425j0895172j1585543m455930
$$ 2934567 -593625 4806800 19382560 33585528 35190953 24295781 12710238 8254308
44921H254308m69522k281102o092948j0251368j2877648q868085J462263Q575860
$$ 8254308 7784786 5503684 -589264 -10840632 -23718280 -32586365 -31124102 -22548242
44913b2548242P769625P942878J5464931J9537312Q399913q566702j2908238n494835
$$ -22548242 -14778617 -6835739 8629192 28166504 36566417 27999715 15091477 9596642
44905I596642k805229p411065m532462R154511J5777860M439068r772781p985560
$$ 9596642 6791413 -619652 -5152114 4002397 19780257 24219325 14446544 6460984
44897F460984N149235J0569386J767737j0897812j6565770j2439947n77455J2669899
$$ 6460984 11610219 22179605 23947342 13049530 -3516240 -15956187 -16533642 -3863743
44889c863743J6846601P064418p647006j3274061o769956K919488P105632M210244
$$ -3863743 12982858 20047276 12400270 -873791 -7643747 -4724259 2381373 6591617
44881F591617k980986r931468j1406429n665676K864917Q419146R259111N984165
$$ 6591617 3610631 -6320837 -17727266 -23392942 -20528025 -12108879 -2849768 3134397
44873C134397p80837p506733q277801k883303J344263M48010m09265K528132M220476
$$ 3134397 2353560 -5153173 -13430974 -16314277 -14970014 -14522004 -14931269 -12403137 -8182661
44864h182661J513296J174569O696336P438738m543868j5951159r207002P659674
$$ -8182661 -6669365 -5494796 1201540 8640278 4096410 -11854749 -21061751 -13402077
44856a3402077R831374o104545j5504536k768974J5605146J5837135r27209j3866854
$$ -13402077 -3570703 -9675248 -25179784 -27948758 -12343612 3493523 2566314 -11300540
44848a1300540r902526M996478J5405517J0166435p465789j9737685j2506587
$$ -11300540 -21203066 -16206588 -801071 9365364 1899575 -17838110 -30344697
44841c0344697N035124J0595054L82388o101447J994402J0046075M421715l914485
$$ -30344697 -25309573 -14714519 -14332131 -20433578 -18439176 -8393101 -3971386 -7885871
44833g885871J99374Q500544L918407q830329j1190150k298939K090622p69012
$$ -7885871 -7686497 814047 4732454 -4097875 -15288025 -17586964 -15496342 -16265354
44825a6265354K542376J3249488J3807941k576495j7450339j3892905o94401M017880
$$ -16265354 -13722978 -473490 13334451 10757956 -6692383 -20585288 -21279689 -17261809
44817a7261809J92938J059681Q567066R958836j570036j5214785j5856847k810048
$$ -17261809 -17068871 -16009190 -7442124 2516712 946676 -14268109 -30124956 -32935004
44809c2935004R959224J1303304N713342M743737Q805793O844437m097230j1266440
$$ -32935004 -22975780 -11672476 -5959134 -1215397 7590396 14434833 10337603 -928837
44801i28837o107967L90779m207106j0881705l308715J1813685J2000231m024287
$$ -928837 -7036804 -6646025 -10853131 -21734836 -25043551 -13229866 -1229635 -5253922
44793e253922j1689701O93568J2512852L211686j5260430j5781479O098667K8146861
$$ -5253922 -16943623 -16250055 -3737203 -525517 -15785947 -31567426 -25468759 2678102
44785B678102K9029482Q099107j7063157k4920651q852784J2343215J2753230
$$ 2678102 31707584 39806691 22743534 -2177117 -11029901 1313314 14066544
44778A4066544o713223j7351811l651716J3535376R818123n287726o359640O092941
$$ 14066544 7353321 -9998490 -13650206 -114830 9703293 4415567 -1944073 4148868
44770D148868R422936j557790p494451J262689R419105L436887p522111p957005
$$ 4148868 13571804 12014014 4519563 5782252 15201357 18638244 11116133 3159128
44762C159128J967299J1010739J2109081M574596r243029k1762893k2634986j0396594
$$ 3159128 5126427 16137166 28246247 32820843 23577814 1814921 -20820065 -31216659
44754c1216659L996419R648607O349811P35334j454694K116550Q294744Q219615
$$ -31216659 -27220240 -17571633 -11221822 -10486488 -11941182 -9824632 -1529888 6689727
44746F689727k691537j4892732j4782597m224224K106959o08427j789848M357995
$$ 6689727 3998190 -10894542 -25677139 -29901363 -27794404 -28402831 -30192679 -25834684
44738b5834684Q888927N136112Q37410L456223O116660l877r065330q722618J895862
$$ -25834684 -16945757 -11809645 -10972235 -7516012 -1399352 -1403229 -10468559 -19191177 -17295315
44729a7295315J3342923J9225206J8298550Q888586p595782k0767790j9205884
$$ -17295315 -3952392 15272814 33571364 42459950 34864168 14096378 -5109506
44722e109506l918247J2404716J8073994J0569558l386662j1401927m833753R896759
$$ -5109506 -9027753 3376963 21450957 32020515 28633853 17231926 12398173 22294932
44714B2294932J5318462L801130j2038999j5591251n603231P009839J3368811
$$ 22294932 37613394 41414524 29375525 13784274 8181043 15190882 28559693
44707B8559693J0128793k240765j5471978j6475977m335142M651138k58617p111293
$$ 28559693 38688486 36447721 20975743 4499766 164624 4815762 4557145 -2554148
44699b554148j098958R393635N899374q407710j2648262j799878O437824J005534
$$ -2554148 -3653106 5740529 11639903 3232193 -9416069 -11215947 -4778123 -3772589
44691c772589p359150o493616n0961L640513M625852N062320L185733Q86868M551605
$$ -3772589 -11131739 -17625355 -17676316 -14035803 -9409951 -4347631 -1161898 -275030 4276575
44682D276575J1521523R226475m477108j4053475q580146K465782O219738N089635
$$ 4276575 15798098 25024573 20547465 6493990 -2086156 379626 6599364 11688999
44674A1688999N452869J889453j0030224j6709453l333429J8519511K2179075
$$ 11688999 17141868 19031321 9001097 -7708356 -11041785 7477726 29656801
44667B9656801L922230j1471745o844741N284735N263748n256414j0154580m151230
$$ 29656801 33579031 22107286 15262545 20547280 25811028 20554614 10400034 6248804
44659F248804K380245M43022o642523r777774m880151M003000Q875930N117437
$$ 6248804 8629049 9072071 2429548 -7348226 -12228377 -8225377 650553 5767990
44651E767990l121317o334195j195940L762671j019747j0842455r828887P349903
$$ 5767990 2646673 -3687522 -4883462 -1120791 -2140538 -12982993 -22811880 -15461977
44643a5461977K3857126J9192277l589338j9923439j4801623m71316L381856l502773
$$ -15461977 8395149 27587426 23998088 4074649 -10726974 -11198290 -7816434 -11319207
44635a1319207o424915M11063R182802J4104799J6057712J2451366l52964j2607996
$$ -11319207 -17744122 -17333059 -8150257 5954542 22012254 34463620 34110656 21502660
44627B1502660q187324Q209803J1200056p212018k0518820o028954J8260701J9266868
$$ 21502660 13315336 21525139 32725195 25513177 4994357 -1034597 17226104 36492972
44619C6492972j563077j2900689k580278Q121762K215180r071840r878375l941616
$$ 36492972 34929895 22029206 19448928 27570690 29785870 20714030 10835655 6894039
44611F894039j735604j521641K152301N123716K979805J819576N741777M821075
$$ 6894039 5158435 3636794 5789095 10912811 13892616 15712192 21453969 26275044
44603B6275044q883796k2795332j8992919k141036O000520j922961j0499010o505616
$$ 26275044 17391248 -5404084 -24397003 -26538039 -20537519 -22460480 -32959490 -39465106
44595c9465106L886381Q484423O823491O300290Q651238Q797408L878890k678332
$$ -39465106 -35578725 -27094302 -20270811 -13970521 -5319283 3478125 7357015 4678683
44587D678683n651091l875967j438967k701246n712018l539499N274849J1784843
$$ 4678683 -972408 -4848375 -6287342 -8988588 -14700606 -18240105 -12965256 -1180413
44579a180413P557988k824999p371547k975721J857649M55174l867240m673795
$$ -1180413 6377575 3552576 -3818971 -6794692 -4937043 -4481869 -8349109 -13022904
44571a3022904n93904N455468R573677Q016692P57476n211706k699196M505843
$$ -13022904 -13616808 -8161340 1412337 9429029 10186505 4974799 2275603 6781446
44563F781446M905809m319604j2835345j2549660q106190o071062l030372O086536
$$ 6781446 11687255 7367651 -5467694 -18017354 -26123544 -32194606 -35224978 -29138442
44555b9138442J4808939J2092893m55958r750814r370606n997123n981956n477935
$$ -29138442 -14329503 -2236610 -2692568 -12443382 -21813988 -27811111 -33793067 -39271002
44547c9271002J276283J1132750J5760282J2622190P160298N401991P491554Q080855
$$ -39271002 -37994719 -26861969 -11101687 1520503 8680801 14082792 21574346 29655201
44539B9655201K336684p375498j2034749o563724J722171J397424o615450r419481
$$ 29655201 31991885 24616387 12581638 6017914 7740085 9137509 2522059 -6897422
44531f897422j621476N531815J589019n710563k393456Q031342Q288996n014694
$$ -6897422 -8518898 -2987083 -1398064 -7108627 -9502083 -1470741 6818255 1803561
44523A803561j3587034l848174J2350514J4591876K348335o972832l924567L272288
$$ 1803561 -11783473 -15631647 -3281133 11310743 13659078 6686246 2761679 6033967
44515F033967M908381K284266N3461k806916p509764q787782j841737Q247129
$$ 6033967 10942348 13226614 13280075 10473159 2963395 -5824387 -7666124 581005
44507E81005J1359954M860673m073978p503842m168096Q67979J089300n109467
$$ 581005 11940959 16801632 12727654 5223812 1055716 1923695 3012995 -2096472
44499b096472j0821469o783449O115325J5042323J0232641k845262j1713601j2228954
$$ -2096472 -12917941 -19701390 -13586065 1456258 11688899 8843637 -2869964 -15098918
44491a5098918q411691j879124Q156865J6552096J5518979P275567K727338N162365
$$ -15098918 -23510609 -25389733 -17232868 -680772 14838207 22113774 24841112 30003477
44483C0003477N844851l06489n621983k896886K047400J40969n871062o561792
$$ 30003477 35848328 35541839 29919856 27022970 29070370 29211339 23340277 16778485
44475A6778485j540373O25497l470824p785336p145472l702190j221890O69568
$$ 16778485 15238112 15863609 12392785 4607449 -2538023 -6240213 -7462103 -6792535
44467f792535L750541O749067O303686J003852o241881r747610o796933k307924
$$ -6792535 -3041994 3707073 10010759 11014611 4772730 -4974880 -11771813 -14079737
44459a4079737l920884j0964122j3777774p108709K386859P003529Q908452J2471303
$$ -14079737 -18000621 -28964743 -42742517 -49851226 -47464367 -40460838 -31552386 -19081083
44451a9081083J3068242M862991n220328m643738N448756J1385809P416539J677459
$$ -19081083 -6012841 -1149850 -6370178 -11013916 -5565160 5820649 13237188 14914647
44443A4914647M76132O62327Q04634N234946J1172556O592433j0003925k0988672
$$ 14914647 15390779 16053106 16857740 22092686 33265242 39857675 29853750 8865078
44435H865078j2416357N509117J3700588J0555357Q191294R279295M717538p545833
$$ 8865078 -3551279 1957838 15658426 26213783 34405077 43684372 48401910 40856077
44427D0856077j7272970j7338550j1905972o899814k874479L98775J790283L246454
$$ 40856077 23583107 6244557 -5661415 -12561229 -15435708 -15036933 -13246650 -10000196
44419a0000196P316564Q972584K36791j4568277j9509653q245599N638711O871762
$$ -10000196 -2683632 6288952 6525743 -8042534 -27552187 -35797786 -30159075 -23287313
44411b3287313j192236l464191N232711J5031284J5351679N968146o267949j4807908
$$ -23287313 -24479549 -27943740 -22711029 -7679745 7671934 13640080 7372131 -7435777
44403g435777j5579928o986265P913461K0113067J9583286N046324j1543827j5037140
$$ -7435777 -23015705 -30001970 -22088509 -1975442 17607844 22654168 11110341 -3926799
44395c926799m309174N208901J069516r244507r457316J023725O238304j670837
$$ -3926799 -8235973 -3027072 -1957556 -11202063 -20659379 -19635654 -13397350 -15068187
44387a5068187j0458515o889378L444719N688664k041493p473637k367843Q364114
$$ -15068187 -25526702 -32416080 -28971361 -23282697 -25324190 -32797827 -35165670 -26801556
44379b6801556J5537652J5308830Q719985j466963j0736941j3900572r317415
$$ -26801556 -11263904 4044926 12764911 11297948 561007 -13339565 -22656980
44372b2656980j118501L664639O51853p352666j1319441m954746O550923J1588810
$$ -22656980 -23775481 -20110842 -19458989 -26811655 -38131096 -43085842 -36534919 -24946109
44364b4946109P591489M913990J1484352K0766724K1461325J2706387J320317
$$ -24946109 -17354620 -12440630 -956278 19810446 41271771 53978158 55298475
44357E5298475j0139133k1706067k6672209j7411015k33931Q908183O030937L691616
$$ 55298475 45159342 23453275 -3218934 -20629949 -20863880 -11955697 -5924760 -2233144
44349b233144R605785J3897304N990641p165732j1426942o168103j739401j173502
$$ -2233144 7372641 21269945 27260586 20094854 8667912 2499809 760408 -413094
44341d13094J354647N363563K574210o241573p096909O719699K1047169J8559973
$$ -413094 941553 6305116 8879326 2637753 -4459156 2260543 23307712 41867685
44333D1867685K778054p924008o256109k135404k882590k188880N165478J0263383
$$ 41867685 44645739 36721731 30465622 28330218 25447628 23258748 28424226 38687609
44325C8687609K736954j1152844j5723372p971506j26021j56954j785781K615564
$$ 38687609 41424563 30271719 14548347 6576841 6450820 6293866 4508085 7123649
44317G123649R468145J0466105M560414k887648q218578j1252412j2454162j2587096
$$ 7123649 16591794 27057899 31618313 28730665 20512087 9259675 -3194487 -15781583
44309a5781583j1980444p547210M305441J8684644K3143542J3216343L54351k984718
$$ -15781583 -27762027 -35309237 -31003796 -12319152 10824390 24040733 24395084 21410366
44301B1410366j8978k172342r921946j2661074n989412K377559N028755L055899
$$ 21410366 21391388 19219046 9297100 -3363974 -9353386 -6975827 -1947072 1108827
44293A108827m61644n765100j1192131j0500044r20708J0996043J6292341J3223500
$$ 1108827 647183 -5117917 -16310048 -26810092 -27730800 -16734757 -442416 12781084
44285A2781084O791349J719472r29920k071956k387950j949459j557790l476535
$$ 12781084 19572433 21291905 20361985 18290029 15902079 13952620 12394830 8918295
44277H918295q080958r711494j479233J3019884J9644599J1001185k995412r361357
$$ 8918295 837337 -8874157 -10353390 2666494 22311093 33312278 30316866 20955509
44269B0955509r335334j0908922j1755241m837902L635761J91193j2212833j5210838
$$ 20955509 11620175 711253 -11043988 -15881890 -12246129 -12054936 -24267769 -39478607
44261c9478607k974890R244695J0166355P513222R327925Q556016j085447r787518
$$ -39478607 -42453497 -33208802 -23042447 -15529225 -6201300 2354716 1269269 -8518249
44253h518249p341177j158741k602982o383159p34288J0693489J4873640J0652564
$$ -8518249 -15859426 -17018167 -19621149 -26004308 -26738596 -16045107 -1171467 9481097
44245I481097O340696J609120r517873k0704657j7425155M91593J6841840K0628674
$$ 9481097 15821793 17430913 7913040 -12791617 -30216772 -29725179 -12883339 7745335
44237G745335J5307507O927364j640239m806615J195016P165137Q82779j0981682
$$ 7745335 23052842 29980206 28339967 23533352 24728368 31893505 32776284 21794602
44229B1794602r418451N823014J2141201k346796k1013333k4170009j3961186
$$ 21794602 12376151 18199165 30340366 27993570 6980237 -17189772 -31150958
44222c1150958k289717Q439614J8119007J8427545O687575k403332L274683J2190016
$$ -31150958 -33440675 -25001061 -6882054 11545491 18233066 15829734 19104417 31294433
44214C1294433O699764p601575j1061115k325535J325572n623777r372160l104255
$$ 31294433 37994197 30392622 19331507 17005972 18331544 12707767 3335607 231352
44206B31352Q72462o278568j3331654o913299P168278J3358467Q244882O38919
$$ 231352 1103814 -5174754 -18506408 -25419707 -18251429 -4892962 3351920 3990839
44198C990839m322765q819831j2300829q997621K491163J4164363J6397808Q022244
$$ 3990839 -331926 -9151757 -21452586 -30450207 -27959044 -13794681 2603127 10625371
44190A0625371k829568o827536k296600L727487M073210J01287j194462K057225
$$ 10625371 7795803 968267 -1328333 2399154 6472364 6573651 5379189 7436414
44182G436414M239928J945827n99821k039j202361r058380j6621511j1884769
$$ 7436414 11676342 13622169 13022348 13020309 11817948 2759568 -13861943 -25746712
44174b5746712L814670J4206101Q553160m663286j0312225n830667N227K067915
$$ -25746712 -21932042 -7725941 827219 -3836067 -14148292 -19978959 -19973732 -17905817
44166a7905817K405648J490188k536254n771105j899568L939986j677429j7057476
$$ -17905817 -15500169 -14009981 -16546235 -22317340 -24216908 -20276922 -21954351 -39011827
44158c9011827j9569664M312837L4382023L8699202J4289586j1025940j4674137
$$ -39011827 -58581491 -54268654 -19886631 18812571 33102157 22076217 7402080
44151G402080n13267J4928377J9865657R670073j0314026k1257407q375923J3678868
$$ 7402080 6888813 21817190 41682847 51352920 41038894 19781487 11405564 25084432
44143B5084432J3218654j3464297l2021254j7513108J0884905K1217756J3528566
$$ 25084432 38303086 24838789 -7182465 -24695573 -13810668 7407088 20935654
44136B0935654Q199086O670533m678758k0131394j7574837L549637J7017131Q126899
$$ 20935654 29134740 35805273 31126515 10995121 -6579716 -3030079 13987052 22113951
44128B2113951q132393j4144022j1384688o582024J541586J0877941J1353258
$$ 22113951 13981558 -162464 -11547152 -18129176 -16587590 -5709649 5643609
44121E643609L487047K802944J3303180J5630407k729892k3145287k1056545j854048
$$ 5643609 9130656 11933600 25236780 40867187 38137295 14992008 -6064537 -7918585
44113g918585R387432M670180j703867K57190M673230M651312K292597J673648
$$ -7918585 1468847 6139027 4435160 4692350 9365580 14016892 16309489 17983137
44105A7983137L169349N695039O415783J56858j3023295k3268513k1937065j2512367
$$ 17983137 21152486 26847525 33263308 33420166 20396871 -2871642 -24808707 -37321074
44097c7321074k870935O162116J5084863J7339750R354767J092175K279491N588887
$$ -37321074 -40192009 -34029893 -18945030 -1605280 7749487 8841662 11121153 16710040
44089A6710040l65227q723083m679692P062233P597434m495125j0094892j125337
$$ 16710040 16344813 7621730 2942038 10004271 17601705 13106580 3011688 1886351
44081A886351P798098N990592L007370P766277J0931470K263569r601101j0088024
$$ 1886351 9684449 15675041 18682411 26448688 37380158 39643727 30042626 19954602
44073A9954602r98990M133907k35887q340176j3749799j3701093p702673P08092
$$ 19954602 18955612 23089519 22853632 14513456 763657 -12937436 -20640109 -19932017
44065a9932017N586456O551025Q347135R630011K926745r703819j4032282m187715
$$ -19932017 -14345561 -7794536 552599 10182610 13109355 3405536 -10626746 -14814461
44057a4814461P062018P552967K126664n66994l465098r829193j0503214M34325
$$ -14814461 -7752443 -199476 1927188 1360194 -2104904 -11934097 -22437311 -22002986
44049b2002986Q951843k39703j6838911j7908823k085372J1044129J2829387J3623121
$$ -22002986 -13051143 -13290846 -30129757 -48038580 -50123952 -39079823 -26250436 -12627315
44041a2627315J7782662J4269168n13047j0816142m166626Q719847R343623k688399
$$ -12627315 5155347 19424515 18911468 8095326 3928700 12648547 21992170 19303771
44033A9303771j1151508n769018O514549J2070234O577454j335778k087912J284712
$$ 19303771 8152263 2383245 8897794 20968028 27545482 26209704 24121792 25406504
44025B5406504k441239j3242918j5635297j988525J1328283N771758r979169j1673545
$$ 25406504 22965265 9722347 -5912950 -7901475 3426808 9198566 -780603 -12454148
44017a2454148L508055J3264749N020484o804537n040059O637438J3526949R709509
$$ -12454148 -8946093 4318656 9339140 2534603 -2505456 4131982 17658931 27368440
44009B7368440m24332r758817j1715958n988490l550244j3479741k4141309j4900624
$$ 27368440 26944108 17185291 5469333 -519157 -4069401 -17549142 -41690451 -56591075
44001e6591075J0729230K4916957J5576249L788160Q985784J9316752J4722900
$$ -56591075 -45861845 -20944888 -5368639 -1580479 7405305 26722057 41444957
43994D1444957K33978n932042l317212m849049j0831497j0067181j882247L179048
$$ 41444957 41678935 35746893 32429681 27580632 16749135 6681954 4799707 7978755
43986G978755J872995N06215J479661K178260L248246M756651M95654j0221873
$$ 7978755 9851750 10357965 11837626 14015886 17264132 22020783 22516437 12294564
43978A2294564j3989823k709828Q442963K041264j2176885j2023381Q89928O229196
$$ 12294564 -1695259 -4405087 4037876 6079140 -6097745 -18121126 -17231198 -11002002
43970a1002002J564048M311600J6660157J8973298M316110q755432p467078k942593
$$ -11002002 -9437954 -5126354 11533803 30507101 34823211 26067779 18600701 15658108
43962A5658108n507266o428379J571654P990041M727244K324563Q724148J0780710
$$ 15658108 10150842 3722463 5294117 13284158 18011402 20335965 29060113 39840823
43954C9840823l034476j7677398j1822178Q240169J7514139Q076445n035741r620880
$$ 39840823 36806347 19128949 7306771 15546940 33061079 41137524 36101783 26480903
43946B6480903q470237o749664m141895r86044L01072N79449J238289j649460
$$ 26480903 18010666 11261002 7119107 6133063 6434135 7013584 8251873 6602413
43938F602413j0428619j6700026j0932516J290000N506803K35275o86021J0091705
$$ 6602413 -3826206 -20526232 -31458748 -30168748 -24661945 -24426670 -25112691 -15020986
43930a5020986K1543424J9972537P750073j402935j525368o67529p197589j6293478
$$ -15020986 6522438 26494975 34245048 32842113 31316745 30649216 23451627 7158149
43922G158149j6087197n342137L713849L157799J62633K469342L625155l838591
$$ 7158149 -8929048 -14271185 -10557336 -7399537 -7236904 -4767562 -1142407 -4980998
43914d980998r617296P03199J8192623J9489135K561197j0772091j0488397r637692
$$ -4980998 -14598294 -13895095 4297528 23786663 26347860 15575769 5087372 -4550320
43906d550320j3647662q150960R716924J7671318M669627p064867P89717J0723465
$$ -4550320 -18197982 -26348942 -16632018 1039300 5708927 -1355940 -566223 10157242
43898A0157242K444953q220586K051741J8507236J1389511j1148124j6434090
$$ 10157242 12602195 4381609 6433350 24940586 36330097 25181973 8747883
43891H747883l862291k475009j5244115j3298048R067459K0010914L933547j2453129
$$ 8747883 4885592 2410583 -12833532 -26131580 -17064121 2946793 6880340 -5572789
43883e572789o357835O107056L349181n703643l658352M272874N968253O185211
$$ -5572789 -11930624 -5823568 -2474387 -8178030 -11836382 -7563508 -1595255 4589956
43875D589956J1055234J0021168l236308j1977379k931053P332243j138236j5743440
$$ 4589956 15645190 25666358 22430050 10452671 7521618 14853861 13715625 -2027815
43867b027815j0725064J0065609J9395100Q205157o707343j2365765j1648359
$$ -2027815 -12752879 -2687270 16707830 24912987 18205644 5839879 -5808480
43860e808480p794948l4094N831029K832340j951279L473442J3382112J0685009
$$ -5808480 -13603428 -13637522 -7806493 -4974153 -6925432 -3451990 9930122 20615131
43852B0615131m467712j2625931l904246R558467J3872553R577294K677555n628972
$$ 20615131 16147419 3521488 -382758 9175709 23048262 32625556 35303111 29674139
43844B9674139j3795798j6094283j0573318l128306P23826K138209M618243Q421584
$$ 29674139 15878341 -215942 -10789260 -13917566 -13193740 -11055531 -6437288 1984296
43836A984296J0614231P887776O47739m523125j814518L253127j60528r225389
$$ 1984296 12598527 20486303 21134042 16610917 14796399 18049526 17888998 8663609
43828H663609q737573K822404O828748m615173j1769655O86179J4660500O737954
$$ 8663609 -73964 2748440 9577188 4962015 -6807640 -6121461 8539039 15276993
43820A5276993j1495655j1800171L951630R732185J654552J361387J3263964J6122623
$$ 15276993 3781338 -8018833 -4067203 5664982 7319534 8680921 21944885 38067508
43812C8067508L679202k802506N705903Q257437p453274k0406256j1281498N070527
$$ 38067508 41746710 38944204 44650107 52907544 45454270 25048014 13766516 18837043
43804A8837043N814103m060856o773666l223906m069392n622723l55550K288244
$$ 18837043 24651146 20590290 13816624 10592718 6523326 900603 545053 2833297
43796B833297q302822j9072454j1607785L982880K694657j3145195j5862951K817200
$$ 2833297 -5469525 -24541979 -36149764 -32166884 -29472227 -42617422 -58480373 -55663173
43788e5663173J8748964J3636577n1836l488307J278727K895853K484366P003002
$$ -55663173 -36914209 -23277632 -23329468 -26817775 -25539048 -22643195 -20158829 -13155827
43780a3155827J1407479M503661j0836463j7125217l816603J8469952K8559132
$$ -13155827 -1748348 2755313 -8081150 -25206367 -29022970 -10553018 18006114
43773A8006114J6980527m230778j4356956o352392O089261N758232p231807j6714257
$$ 18006114 34986641 30755863 16398907 10046515 16135776 21894008 14662201 -2052056
43765b052056j0802601M921008J5179363J1516536n86587q800375o696267Q42591
$$ -2052056 -12854657 -7933649 7245714 18762250 18175663 9375288 2679021 3521612
43757C521612N263922M774079K820227j055832r596618j6575864r495294J0463296
$$ 3521612 8785534 13559613 16379840 15324008 5727390 -10848474 -20343768 -9880472
43749i880472K2617732J1048607j3427462k6222761j7407549L197132K1961373
$$ -9880472 12737260 23785867 10358405 -15864356 -33271905 -30074773 -8113400
43742h113400K9545159J9656772l764027k0551709j2603338J0294321J8573703
$$ -8113400 21431759 41088531 37324504 16772795 4169457 14463778 33037481
43735C3037481O38082k1979027k3323473m177698J3738598J4980738K817883r006430
$$ 33037481 33675563 11696536 -11626937 -15804635 -2066037 12914701 15732584 6726154
43727F726154q912047L870716J7173597J6019450n06672j6513303j7619748p463105
$$ 6726154 -2185893 1684823 18858420 34877870 34371198 17857895 238147 -7224958
43719g224958o83852l085566n393315L074720J8901639K5831600J2888095r947880
$$ -7224958 -7908810 -10994376 -16387691 -13312971 5588668 31420268 44308363 34360483
43711C4360483j9698930p484087Q874803P399890q592237j6340510o464814O383936
$$ 34360483 14661553 7177466 16052269 23452159 14859922 -1480588 -7945402 -1561466
43703a561466Q647097O314861R068685J1087344K203848j1598264j5059392o318817
$$ -1561466 7085631 13400492 22469177 33556521 35760369 24162105 9102713 2783896
43695B783896K246441L679363K736223K802303M32280m799416p231526n005310
$$ 2783896 5030337 8709700 11445923 14248226 14680506 9881090 2649564 -2355746
43687b355746k030843K227669J2065964K0901479J2999679j1113331k6083394
$$ -2355746 -4386589 -2158920 9907044 30808523 43808202 32694871 6611477
43680F611477j3196781J1177229J6840557J788294q508626j469617O881439J969666
$$ 6611477 -6585304 4591925 21432482 23220776 14712150 13242533 20123972 22093638
43672B2093638o158195k509809P431214Q694435J673755j655623N08027q54135
$$ 22093638 15935443 13425634 20856848 29551283 31225038 29569415 30077442 29223307
43664B9223307p341635r938147m177411L983993P790693N314132k562512r843772
$$ 29223307 21881672 11943525 7766114 11750107 19540800 24854932 22292420 12448648
43656A2448648n727282J0015468J7698129J201507k3168646k3340798K264075
$$ 12448648 6721366 16736834 34434963 35636470 12467824 -10872974 -8608899
43649h608899J9712604P789990j3098036j3665989L636079J4906550J0278534
$$ -8608899 11103705 18893695 5795659 -7870330 -4234251 10672299 20950833
43642B0950833m28539p649616r640827o095901J236920O149935O333048P080179
$$ 20950833 20522294 12872678 3231851 -2864050 -1627130 4522805 10855853 17936032
43634A7936032Q897236L503002q126184r704113M036567J2112207k091582k1013420
$$ 17936032 26833268 30336270 22210086 12505973 16542540 28654747 26563165 5549745
43626E549745j7812247K445287J4027365J2166739J2320195J4709322M247541
$$ 5549745 -12262502 -9817215 4210150 16376889 28697084 43406406 47653947
43619D7653947j4417798j6677661J241589J3298194M662005q040611q658065m949901
$$ 47653947 33236149 16558488 17800077 31098271 35760276 27719665 19061600 14111699
43611A4111699o313211n303034K315240M167415m411456o540306O577279J5705856
$$ 14111699 7798488 2495454 4810694 8978109 4566653 -1973653 4603626 20309482
43603B0309482N393801o658569J655264J7843740J4632765m755819j2813597k126837
$$ 20309482 25703283 19044714 20699978 38543718 53176483 48420664 35607067 33480230
43595C3480230P027884K084602o190500o284815j538115J338172J704426n04186
$$ 33480230 40508114 42592716 36402216 30117401 28579286 29917458 31621884 31117698
43587C1117698n454856p539625j785691N243420M296597l0886L250675J0984238
$$ 31117698 25662842 18123217 16337526 21580946 25877543 25846657 29097332 40081570
43579D0081570R941211m92249p535581o602391o047241r458484j0285068n916620
$$ 40081570 50022781 49530532 41994951 35392560 29345319 19886835 9601767 3685147
43571C685147j220798L140090J0056580J3645494N434089o621833n359014P016961
$$ 3685147 2464349 5604439 15661019 29306513 34740602 28118769 22759755 29776716
43563B9776716R511645l281429j0866184q03925J0010337L240752j1342937j3149157
$$ 29776716 39288361 36006932 25140748 24336823 34347160 37587912 26244975 13095818
43555A3095818k917615K788426l82178k005348K646727P247014P538892N287141
$$ 13095818 10178203 12966629 12584451 10579103 13225830 20472844 28011736 33298877
43547C3298877L60403q427869j5322009j2010820k27479R562407J1828011R730396
$$ 33298877 33659280 25231411 9909402 -2101418 -2328897 7233510 19061521 28791917
43539B8791917O236627Q72708m364621m871517j149134N38358k516999n210273
$$ 28791917 35028544 35901252 31536631 26665114 25515980 26054338 23537339 18327066
43531A8327066k026086N502848J0697891Q428272o60275j0148527j2365033n678025
$$ 18327066 16300980 21803828 32501719 40929991 40269716 30121189 17756156 12078131
43523A2078131K902633M699421j478434q787083r619513j782051J0261052J7683391
$$ 12078131 14980764 19680185 18201751 9414668 -204845 -1986896 8274156 25957547
43515B5957547J3214731j405582j4792376j6017160n278407P383832J2928697
$$ 25957547 39172278 37766696 22974320 6957160 1678753 9062585 21991282
43508B1991282J0525274N010731M31672k880515o372437r910627j0978377p305019
$$ 21991282 32516556 37527287 37958959 35078444 28706007 18795380 7817003 511984
43500E11984K54854P685219R957770M055741p029145j3182484n502337J1171530
$$ 511984 766838 8452057 18409827 22465568 15436423 2253939 -3248398 7923132
43492G923132J9716854J0259128o668013j3606132q287744k986864m908310q510029
$$ 7923132 27639986 37899114 31231101 17624969 9337225 6350361 1442051 -7067978
43484g067978p206485j733552M839917J0620988J1663860N031801l153412l131241
$$ -7067978 -14274463 -16008015 -11168098 -547110 11116750 16148551 12995139 9863898
43476I863898L143248L867595k659218l884414N600499J3193603Q096851j466814
$$ 9863898 13007146 16874741 14215523 10331109 15931608 29125211 37222062 35755248
43468C5755248k891641O05565j261178o130886m143157L151948N468751K295539
$$ 35755248 32863607 33469172 32207994 26077108 21933951 25085899 30554650 32850189
43460C2850189K626547O830713M554980o811492j5498508j1887370p58616P807007
$$ 32850189 35476736 42307449 46862429 40050937 24552429 12665059 11906443 19713450
43452A9713450J0545520R201788M774673r79310m488554n543233q208375j2592993
$$ 19713450 30258970 39460758 44235431 43256121 38767567 33224334 25015959 12422966
43444A2422966j1566167j119817J0619993J1594149J475391p035286l620779P377532
$$ 12422966 856799 -263018 10356975 21951124 23426515 16391229 12770450 20147982
43436B0147982J2925026P198868k649213o984436n128140k644573j253692J606070
$$ 20147982 33073008 40271876 37622663 30638227 25510087 22865514 21611822 23217892
43428B3217892M619549K621108l569400n684006j09557N931383M926655q65179
$$ 23217892 27837441 30458549 26889149 21205143 21095586 27026969 31953624 31088445
43420C1088445m753763m572294j569398K711965L847018k735159j1101942p485729
$$ 31088445 26334682 21762388 20192990 22904955 26751973 24016814 12914872 5429143
43412E429143Q690971J8502426R375664n207340p016578j981120p201333j8012892
$$ 5429143 14120114 32622540 41998204 36790864 29774286 27793166 20591833 2578941
43404B578941j3772027N635915J6091096O548177n177068k898535M986338N814191
$$ 2578941 -11193086 -5557171 10533925 17082102 11905034 9006499 13992837 19807028
43396A9807028M510511Q054197O288873j0412829k6951865k0461028M326258J8753424
$$ 19807028 24317539 32371736 38660609 28247780 1295915 -19165113 -14838855 3914569
43388C914569Q682114r724753j4950763m824261P882900J1683875L701461q923589
$$ 3914569 12596683 2871930 -12078833 -16903094 -9020194 2663681 6365142 -2558447
43380b558447j1555987M125711K5844583L0746555J3672725n492518q311724r9179
$$ -2558447 -14114434 -9988723 15855860 46602415 60275140 54782622 46470898 46371719
43372D6371719L231546p6909J22189M810892L314375p391119j5488001j1786927
$$ 46371719 49603265 49526356 49648545 54459437 57773812 50382693 34894692 23107765
43364B3107765k916418O54284O50093N007033J2095870J2867930O414442J333941
$$ 23107765 20191347 20845631 21495724 26502757 38598627 51466557 57880999 59214940
43356E9214940Q31177j762451q943908j1698367l244017Q599200J1618633N688202
$$ 59214940 60046117 58283666 49339758 37641391 34397374 42996574 54615207 60303409
43348F0303409k58681l162919p161232j1797012r958491J82059R592778Q954448
$$ 60303409 60044728 56881809 49720577 37923565 27965074 28147133 37739911 46694359
43340D6694359K4640p157131n943732N51002M204904K166990R81297P670358J7766805
$$ 46694359 46718999 39561868 33618136 34169138 38374042 40541032 41522329 49192687 66959492
43331F6959492J8620879O354979q088521j3754294j2246977r736866n824711N48649
$$ 66959492 85580371 91935350 83846829 70092535 57845558 48108692 42283981 42832630
43323D2832630K918715k975656q198032k672857P323414Q130889O36711k479961
$$ 42832630 45751345 42775689 34577657 31904800 39228214 47359103 47995814 45515853
43315D5515853J720380M427990K983235L469810N872899M285523J756643O074591
$$ 45515853 47236233 51664223 54647458 58117268 63990167 68275690 70032333 76106924
43307G6106924J0932556L112205j0319798p552265J0348033J5866172n93146j2779972
$$ 76106924 87039480 90151685 79831887 72279622 82627655 98493827 97900681 85120709
43299H5120709k067324J0614385Q92149j6720883j3707413M350832R178298k448459
$$ 85120709 83053385 93667770 94559919 77839036 64131623 68482455 77660753 75212294
43291G5212294p694674O88152N837377L92629k831553J806288L137222k350348
$$ 75212294 67517620 68205772 74043149 74435778 71604225 73410513 76547735 74197387
43283G4197387k280586O761383R810694o29393j0336343o465996L419566P080882
$$ 74197387 71916801 78678184 88488878 87859485 77523142 71057146 74476712 81557594
43275H1557594O003301O231808N284618J97621l451492j383291J098444l86419
$$ 81557594 87560895 93792703 99077321 99274942 95823450 94440159 95538603 95152184
43267I5152184j188220K024456M000517J515676m66497l20846m332956j2001639
$$ 95152184 93963964 95988420 99988937 101504613 101038116 100717270 96384314 84382675
43259H4382675j1352534J197092J0928206O574021k013871j210594M831923N046377
$$ 84382675 73030141 74227233 85155439 91729460 89715589 88504995 93336918 98383295
43251I8383295J606869K612300N165217L200091K923073J1821018K0016060J2765392
$$ 98383295 99990164 102602464 107767681 110967772 113890845 125711863 145727923 158493315
43243A58493315l378488p501466M466769J5149629J2654845L646715k505204n361998
$$ 158493315 155114827 147613361 152080130 167229759 179884604 183531319 181026115 175664117
43235A75664117n524683n32848O686650Q255115M074788K267017M440966L338811
$$ 175664117 170139434 169606586 176293236 184548351 188623139 190890156 195331122 198669933
43227A98669933j958185k041830P050104J6638999J9182484J7712105J6427453
$$ 198669933 196711748 194669918 201720022 218359021 237541505 255253610 271681063
43220B71681063J3255999P443906L841635L785998J730061l674618n386350l03166
$$ 271681063 284937062 292380968 296222603 300008601 301738662 298064044 292677694 292374528
43212B92374528M672337M552968L549607M693777L831363O40681L010761J1822980
$$ 292374528 297046865 301599833 305149440 309843217 313674580 314315261 317326022 329149002
43204C29149002J4115967K266515j1779751j3672553p129728l876492l801151
$$ 329149002 343264969 345531484 333751733 320079180 312949452 309072960 305271809
43197C05271809r49195j27245r076988j9807212j6870583k094878O855790K346788
$$ 305271809 304322614 304195369 295118381 275311169 258440586 256345708 263201498 265548286
43189B65548286n424410p012035m089256r8477L766700J975826r536974j9257170
$$ 265548286 260123876 253111841 249022585 248924108 252690808 254666634 245129660 225872490
43181B25872490r994055J3149196K4053627J1790352m117130m861518J074645
$$ 225872490 215878435 229027631 253081258 264871610 260754480 255892962 256967607
43174B56967607k330781r962858o692845N047305J0319949P039605N329465N582353
$$ 256967607 254636826 244673968 237981123 243028428 253348377 260387982 265717447 271299800
43166B71299800j968883j6090666k2625913j6653848r268572p816214n448367
$$ 271299800 269330917 253240251 230614338 213960490 204691918 196875704 191427337
43159A91427337L210043J0524167Q662680K428778J09902O12609j302996m512833
$$ 191427337 194637380 205161547 213824227 216253005 216362907 216975516 215672520 211159687
43151B11159687n227186n081617o696386o187979O85443Q316655O578649m650186
$$ 211159687 205932501 200850884 194154498 187966519 188651962 196968617 203547266 198897080
43143A98897080j4325983j3817520n018841N373597J2826189J4458772Q282971
$$ 198897080 184571097 170753577 165734736 171108333 183934522 198393294 206676265
43136B06676265k519606q788556m583726M373628P198931K687641N92105N322109
$$ 206676265 204156659 195368103 190784377 195158005 202356936 205044577 205636682 210958791
43128B10958791P017937k566056j2221878l935402J7976677K7966491J4612059
$$ 210958791 217976728 215410672 203188794 199253392 217230069 245196560 259808619
43121B59808619l087838n560382q98263n549588j2275429k620216J7306290K2571734
$$ 259808619 256720781 251160399 250262136 244712548 232437119 229816903 247123193 269694927
43113B69694927R922843L083976J2440321J8639613P855690m106490m74600P418275
$$ 269694927 279617770 282701746 295142067 313781680 321637370 317530880 317056280 324474555
43105C24474555J736784r985918r325424L32837J481623n723668m949753P180711
$$ 324474555 326211339 316225421 306899997 307232834 308714457 302990789 298041036 305221747
43097C05221747J7271395J9331608K0917236K4253375K1314537J0400823K13711
$$ 305221747 322493142 341824750 362741986 386995361 408309898 418710721 418924432
43090D18924432n026867q521452p656219M980316K4288272L2859674K3297812
$$ 418924432 413897565 405376113 397719894 402700210 426988482 459848156 483145968
43083D83145968O616934m911305r604065q629950j442678O955549Q001506K989768
$$ 483145968 489762902 484851597 475247532 466617582 465174904 472130453 480131959 483121727
43075D83121727J990538O863879Q742874M406513O66700L90810p24555j900454
$$ 483121727 485112265 491976144 500719018 505125531 505792231 506183041 505458486 503558032
43067E03558032J723456M809436k676012j4468611j4268331n167018p099666j9936038
$$ 503558032 505281488 510090924 507414912 492946301 478677970 473510952 466411286 446475248
43059D46475248j9290181j06149Q271153j0233565k7051884j2443250J6059455
$$ 446475248 427185067 427078918 435350071 425116506 398064622 385621372 401680827
43052D01680827K1250677K300569j1952750j1658675j1306410j4413236r387185
$$ 401680827 422931504 425232073 413279323 401620648 390314238 375901002 366513817
43045C66513817J023033q0974j1898699j4779187m739722m04707j0031611j8949665
$$ 366513817 367536850 367455876 355557177 340777990 336038268 335633561 325601950 306652285
43037C06652285j6893118j1857774q697941L30580J3643395J4243321j576604
$$ 306652285 289759167 277901393 269203452 269534032 283177427 297420748 295844144
43030B95844144j2937382o613228J660671m369286j2531695l895286J2512333
$$ 295844144 282906762 276293534 277954205 273584919 261053224 257157938 269670271
43023B69670271J2060079o441591j8393641r335744O606250Q125708p136809k3536053
$$ 269670271 281730350 275288759 256895118 247559374 254165624 262291332 255154523 231618470
43015B31618470k6770903j7060333n348260K76265J422744J507305k503271j2234928
$$ 231618470 204847567 187787234 182438974 182715239 184137983 185645288 183142017 170907089
43007A70907089j7410292p441685Q082839P772314r879719k1551988j2903244
$$ 170907089 153496797 146055112 154137951 161910265 152030546 130478558 117575314
43000A17575314J024824P65579q797979j0328924k126579L533443K589791K335296
$$ 117575314 118600138 119365717 110567738 100238814 98112235 101645678 104235469 106570765
42992A06570765N406176N402609j376247j0138633j3909365r602965R0481O916900
$$ 106570765 111976941 117379550 116003303 105864670 91955305 82352340 82442821 89359721
42984H9359721M235150k633843j345100Q335478J1986523L788003j614473P978285
$$ 89359721 93594871 90961028 89615928 97951406 109937929 113725932 112111459 120089744
42976A20089744K0290089J4819531p663760k7224457l0136364j8675956k210139
$$ 120089744 140379833 155199364 147535604 120311147 90174783 71498827 69288688
42969F9288688Q247725L858836j0003598j3639811O61889J2371788P96839k0962686
$$ 69288688 77536413 81395249 71391651 57751840 58413729 70785517 71582356 50619670
42961E0619670k3334242m650476Q362712K803788n102172o96855Q769538J2328296
$$ 50619670 27285428 22634952 30997664 33801452 28699280 28002425 36771963 49100259
42953D9100259J1595061R696883L463718m276898l061157N853714P216643k221446
$$ 49100259 60695320 70392203 73855921 69579023 66517866 72371580 79588223 77366777
42945G7366777n829021L524564P866629o230881k2493372j9344772k943791N903151
$$ 77366777 71537756 75062320 82928949 76698068 54204696 34859924 31916133 37819284
42937C7819284M249127L253892K907826m401717j2098694o826648N529815O168292
$$ 37819284 42068411 45322303 48230129 43828412 31729718 24903070 30432885 36601177
42929C6601177m878112q145704K035178Q853466L155954k557598J61223j46320
$$ 36601177 31723065 23577361 25612539 34466005 37621959 35064361 35225584 35079264
42921C5079264j0989041j7773590p764464N789821N029838j185660P624219K5765748
$$ 35079264 24090223 6316633 -1447831 4341990 9371828 8186168 15810387 41576135
42913D1576135K6317995L241953j7574181j5282327J06422Q388020O746572M050828
$$ 41576135 67894130 71136083 53561902 38279575 38385997 46774017 53520589 57571417
42905E7571417K558036j88897j689115l09029k103841q995447r432813M087161
$$ 57571417 60129453 59940556 58251441 57942412 55838571 46843124 37410311 41497472
42897D1497472J6959779J0637689p269242j2991484m293447k709321j4302150
$$ 41497472 58457251 69094940 61825698 48834214 44540767 41831446 27529296
42890B7529296j6133119M505051K2663623J0528567j7824316k4661451l656630
$$ 27529296 11396177 15901228 38564851 49093418 31269102 6607651 2951021
42883B951021J2794955L205422j3244490p916949J6015110L0000113J7999188
$$ 2951021 15745976 18951398 5706908 -2210041 13805069 43805182 61804370
42876F1804370p319941k3383533k0950808p303213N723838J2101976J2160097
$$ 61804370 54484429 31100896 10150088 2846875 8570713 20672689 32832786
42869C2832786P831468J258877l070536r27236M525344M170548m510300j2678351
$$ 32832786 40664254 41923131 38852595 37925359 42450703 46621251 42110951 29432600
42861B9432600j3052697r920549q970073o158194K253143P398053P01075p830939
$$ 29432600 16379903 6459354 -2510719 -8668913 -6415770 982283 1683358 -6147581
42853f147581k727484R720776Q920051n681150j1602509M44315J1732396P198125
$$ -6147581 -8875065 845711 9765762 4084612 -7517897 -7073582 4658814 11856939
42845A1856939j300326J175162O177821n53274j1007806p514987O515421J1409901
$$ 11856939 10556613 11731775 17909596 17356322 6348516 -1166471 5348950 16758851
42837A6758851J815422q132999p863624n75831P790475J3308409J0010145k653620
$$ 16758851 18574273 10441274 2577650 2001819 9792294 23100703 33110848 30457228
42829C0457228j1140140l928246O976234R07996j6906305j9706960j030844J3600171
$$ 30457228 19317088 15388842 22365076 23273072 6366767 -13340193 -14371037 -770866
42821g70866O085247p696901n901741N869794R242715N113930P518955J4703789
$$ -770866 5314381 -2382520 -8284261 -2414467 6828248 11942178 19461133 34164922
42813C4164922J0641000o377014j8017314j2053046K136229Q807658L766556p365749
$$ 34164922 44805922 38428908 20411594 8358548 10494777 19302435 23068991 15703242
42805A5703242j7466290j9437763r183176P079377J5848436J1633149K694766
$$ 15703242 -1763048 -21200811 -30383987 -23304610 -7456174 4176975 6871741
42798F871741k243534m820021q821109r721280k134308P538324P426291j792842
$$ 6871741 4628207 -191814 -9012923 -18734203 -20868511 -13330187 -5903896 -7696738
42790g696738o302043P66060Q609280M596263o345806p890562M382014J6215585
$$ -7696738 -13998781 -13232721 -4623441 -27178 -6372984 -14263546 -9881532 6334053
42782F334053J4164373L276002j824467J697991K737161m406444r508482j861198
$$ 6334053 20498426 23774428 21949961 23647952 26385113 21978669 12470187 10608989
42774A0608989J1240588J2251690k032682j4899111j2242259j073521K168214
$$ 10608989 21849577 34101267 32068585 17169474 4927215 3853694 6021908
42767F021908m551783p439369J832233J3922186J4702886L282201q222770r282632
$$ 6021908 1470125 -5969244 -4137011 9785175 24488061 27770262 19547492 10264860
42759A0264860q06910P732038Q045017J196950l182382J179305O545161n92207
$$ 10264860 9457950 17189988 25235005 26431955 23249573 24428878 30974039 30381832
42751C0381832j8487484k6866990j2053109J2673826K2926439J4192224L449575
$$ 30381832 11894348 -14972642 -27025751 -14351925 8574514 22766738 26216313
42744B6216313J898129K163650l509161p874842j785098P709588N448570r554856
$$ 26216313 28114442 30278092 26768931 18894089 17108991 24818579 30267149 20712293
42736B0712293k1576753j8348141m973491N113805P059060P297333J0969366J2647479
$$ 20712293 -864460 -19212601 -24186092 -19072287 -12013227 -4715894 6253472 18900951
42728A8900951M554783q203944j0026129L033464J3103086L437943j5280051j7367169
$$ 18900951 23455734 15251790 5225661 8259125 21362211 24800154 9520103 -7847066
42720g847066J124539J6380135J1158440l051794o816950N41650P227887Q725585
$$ -7847066 -6722527 9657608 20816048 17764254 10947304 11488954 18716841 27442426
42712B7442426P281205J866290p123230j1267621n672322O09632j281907m398959
$$ 27442426 34723631 36589921 29466691 18199070 12526748 13136380 11854473 7455514
42704G455514P87701P249195L550717l439827N04299R245163L967250j3211099
$$ 7455514 8243215 15492410 19043127 15603300 16107599 25352762 29320012 16108913
42696A6108913j9532993q835512k187028j2400553k2250100j2430776Q316697
$$ 16108913 -3424080 -12259592 -14446620 -26847173 -49097273 -61528049 -53211352
42689e3211352J8235247J3794584Q533377R559044J1173249P802811J285186l156540
$$ -53211352 -34976105 -21181521 -12648144 -3089100 8084149 15886960 17172146 14015606
42681A4015606j902702L091426L369803n868700j4296620p173438J0534266J6538954
$$ 14015606 12112904 15204330 18574133 12705433 -1591187 -8764625 1769641 18308595
42673A8308595L110961j0938936r169805l25584O26489l211649k190736p99714
$$ 18308595 21419556 10480620 1310815 985231 1611720 -1599929 -3790665 -4590379
42665d590379p155148j3622571q600487J460290K541621k160549N79699Q282430
$$ -4590379 -11745527 -25368098 -33968585 -32508295 -29966674 -32127223 -31547524 -23265094
42657b3265094O907126l069597p609615m201687l056550m135334K722558J3573703
$$ -23265094 -16357968 -19427565 -27037180 -31238867 -34295417 -38430751 -35708193 -22134490
42649b2134490J2110186m5529j575887J1831521J6427925n68583j7268818j1607317
$$ -22134490 -10024304 -10069833 -11645720 185801 16613726 16045143 -1223675 -12830992
42641a2830992L565351M122924m810473n07901J6171406K1390908P337618p269087
$$ -12830992 -9265641 -5142717 -9953190 -10461091 5710315 27101223 34438841 27169754
42633B7169754q707990n703424q225886j0264443m675071J815725J240420j130073
$$ 27169754 18461764 12758340 4532454 -5731989 -10407060 -8591335 -7350915 -8480988
42625h480988J606078K754150o070092j5385975q242695J1730275K0813382P690546
$$ -8480988 -6874910 -4120760 -10190852 -25576827 -33819522 -22089247 -1275865 6414681
42617F414681j0511412j3065024l255676J352324l150659m931166J083461N339613
$$ 6414681 -4096731 -17161755 -20417431 -19065107 -22215766 -27146932 -26063471 -20723858
42609b0723858J075652m383966j868877O555591J3125368J4201108Q801339l191248
$$ -20723858 -19648206 -24032172 -25901049 -19345458 -6220090 7981018 16782357 13591109
42601A3591109j4559704j2770655K365647J2855987N501377q537043j0461665
$$ 13591109 -968595 -13739250 -11373603 1482384 6983761 -1553282 -12014947
42594a2014947j494790K619994j640437l444425M52054J500975k096250j987758
$$ -12014947 -13509737 -10889743 -12530180 -15974605 -15522551 -14021576 -16117826 -18105584
42586a8105584K144064J05650q058663q176925L344226R806036K81873j1637510
$$ -18105584 -15961520 -15855870 -23914533 -32091458 -28747232 -18941196 -18659323 -30296833
42578c0296833q638482N149200J4059620J3441189P731905k084230j2967902j2466847
$$ -30296833 -38935315 -33786115 -19726495 -6285306 1446599 -637631 -13605533 -26072380
42570b6072380M892519K1732646J7288689k504323j3296511p230497K27232k126801
$$ -26072380 -21179861 552785 17841474 15337151 2040640 -5189857 -4962625 -7089426
42562g089426p005260n970982l009378l249749k170755M873690J1999872J0217917
$$ -7089426 -14094686 -20065668 -23075046 -26324795 -28495550 -23621860 -11621988 -1404071
42554a404071j29720j0146406j1679718l056179J0002819J7368133J2706932j31383
$$ -1404071 -1533791 -11680197 -23359915 -26416094 -16413275 954858 13661790 13530407
42546A3530407j1776956j6558148j3569539l544482Q492500J2731547N957883
$$ 13530407 1753451 -14804697 -28374236 -31918718 -23426218 -10694671 -4736788
42539d736788j304527P69078N581980J921497m807204j107019Q394175N240108
$$ -4736788 -6041315 -5272237 309743 2231240 -2575964 -3682983 4711192 9951300
42531I951300j0555089j5859364J43367J7655012J5820810J833186m847564j734948
$$ 9951300 -603789 -16463153 -16319786 1335226 17156036 18989222 14141658 12406710
42523A2406710P27962M43664K287901L446944k015094q933373p525013m50425
$$ 12406710 13134672 13578336 15866237 19313181 17298087 8364714 839701 389276
42515C89276J393041l009260m986384j649874K610521P176197J3488710J5078820
$$ 389276 1782317 -1226943 -6213327 -7863201 -5252680 1923517 15412227 30491047
42507C0491047M892513q943545j1219133l455387j960033j0018610j1278962K525419
$$ 30491047 35383560 26440015 15220882 11765495 9805462 -213148 -11492110 -8966691
42499h966691J5642382J1518425k373254o682070K217443J0136534N376825r577661
$$ -8966691 6675691 18194116 15820862 9138792 11356235 21492769 26869594 17291933
42491A7291933k3162473k3769699q043418J3026705K1435084J2144631k63604
$$ 17291933 -5870540 -29640239 -37683657 -24656952 -3221868 8922763 8659159
42484H659159j497064M062873M305239J27897J226534O148906K863430j0365125
$$ 8659159 7162095 11224968 15530207 15658104 16884638 23033544 25896974 15531849
42476A5531849j9520440j4255239r94666Q292690J0454912Q780744N074936P47153
$$ 15531849 -3988591 -18243830 -19238496 -10945806 -490894 8289850 13364786 14111939
42468A4111939q41972N47142J7033l965954m978511J064464O805574K862676p621734
$$ 14111939 13269967 13817109 13834142 9868188 4889677 5954141 12759715 15622391 8000657
42459H000657j2831258q647228k133805Q33262K031659L264341J300101n123845
$$ 8000657 -4830601 -13477829 -15611634 -14778372 -12746713 -9482372 -8182271 -13306116
42451a3306116j0102419p843767m78640O209871J0221172J1176150N965770n283275
$$ -13306116 -23408535 -31252302 -31730942 -25521071 -15299899 -4123749 1842021 -3441254
42443c441254j2403645n103003J0049429J3995237Q55437j1595237n632495J0962908
$$ -3441254 -15844899 -20947902 -10898473 3096764 3952201 -7643036 -13275531 -2312623
42435b312623J5748194L307696r211157r088760m290244n406813o030219M635402
$$ -2312623 13435571 16743267 7532110 -1556650 -5846894 -11253707 -17283926 -12648524
42427a2648524J8698287J7398595M23291j0897111m580197M252812k748527j8224121
$$ -12648524 6049763 23448358 23871649 12974538 8394341 12647153 9898626 -8325495
42419h325495j9659492k906407J1743294P930541o712080j3987978p616448M793438
$$ -8325495 -27984987 -30891394 -19148100 -11217559 -17929639 -31917617 -39534065 -34740627
42411c4740627J4023325J5262879P571218l863885q357741j312018O886725K614460
$$ -34740627 -20717302 -5454423 2116795 -1747090 -10104831 -11416849 -4530124 -1915664
42403a915664j1154353j7150641p832461M110271N186779N91363L584608J2444065
$$ -1915664 -13070017 -30220658 -38053119 -33942848 -28756069 -28164706 -24580098 -12136033
42395a2136033J2509622K47382r628292n882719L058493L481179k820211m101762
$$ -12136033 373589 620971 -9007321 -14890040 -11831547 -8350368 -11170579 -15272341
42387a5272341R85756K768690j053274r60323O924449J2026508N559585m506147
$$ -15272341 -14286585 -11517895 -12571169 -13531492 -6607043 5419465 10979050 6472903
42379F472903m845253L258886O476015o29338q709533p545565J103432P113214
$$ 6472903 1627650 4886536 11362551 10733213 2023680 -5521885 -4418453 2694761
42371B694761L988256m456399p673762R8486J0800112J0029752l402854j3382169
$$ 2694761 6683017 2226618 -5447144 -5348658 5451454 15481206 12078352 -1303817
42363a303817q760884n9569j666736o663864J442741J6726565J5129350o288391
$$ -1303817 -10064701 -10124270 -11791006 -18454870 -17012129 -285564 14843786 8555395
42355H555395k0115974r108288Q363879R963545L931035Q418282J4802014K410954
$$ 8555395 -11560579 -20668867 -12304988 -2341443 1589592 10007874 24809888 27220842
42347B7220842k0218415k2753634j045341J4874554O978599o749763o171528Q06387
$$ 27220842 7002427 -15751207 -16796548 -1921994 5056605 -1693158 -7864686 -7058299
42339g058299p35541m704495J217999R869145P018231k083649j597647O866479
$$ -7058299 -7793840 -12498335 -11280336 -1411191 5607040 3523391 1925744 8792223
42331H792223P243750m145368j5490920k0662479k2921224j8610838N18164K5228413
$$ 8792223 16035973 11890605 -3600315 -24262794 -47184018 -65794856 -65276692 -40048279
42323d0048279L0843577J0239988j2725153j3467450L701336J7222614J7053611
$$ -40048279 -9204702 1035286 -11689867 -25157317 -21455981 -4233367 12820244
42316A2820244Q854153r57570r694297j2693415o486727L145522O050962L98236
$$ 12820244 21674397 20716827 11022530 -1670885 -8157612 -5012090 1038872 1437108
42308A437108o818868j0530129j1096065q018892J035169J2799341J7195788Q293626
$$ 1437108 -5381760 -15911889 -27007954 -35026846 -33991677 -21192336 -3996548 4297078
42300D297078o780108j4230293q566582J660466M475068q78328l661709K829828
$$ 4297078 -2483030 -16713323 -25279905 -23619439 -19144371 -20022699 -23684408 -20854580
42292b0854580J0587006P467427m681652j1290440n038404M790372O838708L009881
$$ -20854580 -10267574 -2800147 -7481799 -18772239 -23810643 -19020271 -12181563 -9171682
42284i171682K363275N944039O553185J063945n280994p103177n311377l924909
$$ -9171682 -6808407 -864368 5688817 6752762 1471768 -5631409 -10942786 -14867695
42276a4867695m375186m503334j541466M494301J0213743J2410870J1284334P824283
$$ -14867695 -19242881 -23746215 -25287681 -20793380 -10579637 1831233 13115567 20939850
42268B0939850L76428j0576081j6326500q280462O625252J0458127j150487j1172798
$$ 20939850 21316278 10740197 -5586303 -13866765 -7241513 3216614 2066127 -9106671
42260i106671n931555M682417M074011m816316o880205j449695j902198j0182618
$$ -9106671 -15038226 -10355809 -6281798 -11098114 -17978319 -19428014 -21330212 -31512830
42252c1512830j1458214J890502J7643292K1461952J3880190L429967m943361
$$ -31512830 -42971044 -41080542 -23437250 -1975298 11904892 15334859 10391498
42245A0391498q173455l451269M530436N157379k631687p094209k370643J846070
$$ 10391498 2218043 -1233226 3297210 8454589 5822902 -1271307 -3641950 -1795880
42237a795880k253325o487553j562000N779527M521443j381460q26160N184516
$$ -1795880 -4049205 -10536758 -12098758 -6319231 -1797788 -3179248 -4005408 1179108
42229A179108Q092627Q763787J2353674J1712890l814285k4900614k8926217j2506895
$$ 1179108 9271735 18035522 30389196 42102086 38287801 13387187 -15539030 -28045925
42221b8045925L100799L985426M20102L414757N135151l041107j0008485j210279
$$ -28045925 -24945126 -20959700 -20539598 -17124841 -11989690 -15030797 -25039282 -26249561
42213b6249561J5368017J8963129O436750n270792n372838r44653o57950k086678
$$ -26249561 -10881544 8081585 14518335 9247543 3874705 2930052 2272102 185424
42205A85424o37789P48013j619067l630508K39339O212123M617297o465508j6837786
$$ 185424 -452365 295648 -1323419 -4953927 -4714588 1497535 6114832 -350676 -17188462
42196a7188462j5730860m648733N075962P126007P379286J2627145J7325478J0666820
$$ -17188462 -32919322 -37568055 -32492093 -25366086 -17986800 -5359655 11965823 22632643
42188B2632643m330200j0771997j428923Q957426L936658j0930908j6823125q708449
$$ 22632643 18302443 7530446 6101523 15058949 18995607 8064699 -8758426 -17466875
42180a7466875L28911M80914l031753k183894J958225M667005N535575N310382
$$ -17466875 -17137964 -16657050 -19688803 -21872697 -19914472 -15247467 -9711892 -4401510
42172d401510K058627l965223p671488o273780l273307q80162M481155J2988249
$$ -4401510 -2342883 -6308106 -13979594 -20253374 -23526681 -24406843 -19925688 -6937439
42164f937439J5346174N500428n879531k888815J1695127J6849113J501843j8852240
$$ -6937439 8408735 13909163 8029632 5140817 16835944 33685057 35186900 16334660
42156A6334660k1876905p189947N611249M871816Q9449L618414J0428813O301290
$$ 16334660 -5542245 -12732192 -7120943 -2249127 -2159678 1458736 11887549 18188839
42148A8188839q933013j8603794j1016334N821859J5599552J2317852K161531
$$ 18188839 9255826 -9347968 -20364302 -14542443 1057109 13374961 15536492
42141A5536492o892427j0685590q631534m462127l812657n804820k200966Q864981
$$ 15536492 8644065 -2041525 -10673059 -15135186 -18947843 -24752663 -26953629 -18088648
42133a8088648J5674668R293435j91923K131514J0971254Q104688o745636j3270863
$$ -18088648 -2413980 6879455 6687532 8819046 19790300 27894988 21149352 7878489
42125G878489k996273P065963K929411m309404K61975R374231P808922p07113
$$ 7878489 4882216 11948179 14877590 10568186 10830161 20204392 28013314 27306201
42117B7306201k348547M45609n307353j6509246j7569155r215830q333611j6038861
$$ 27306201 24957654 25403263 20095910 3586664 -13982491 -23198321 -31531932 -47570793
42109d7570793j2233303Q917578K3340893J2623999o057527o450932O419953P552678
$$ -47570793 -59804096 -50886518 -27545625 -14921626 -20979153 -27430085 -21010132 -13457454
42101a3457454n463293r023221O865212K1345206J4027177o314963j7678171j5336714
$$ -13457454 -18920747 -27943968 -21078756 266450 14293627 7978664 -9699507 -25036221
42093b5036221j0365879o273294M213355J9593362K4462634J1182842n616180
$$ -25036221 -35402100 -41675394 -37462039 -17868677 6593957 17776799 12160619
42086A2160619p110184M425341J0892069N344252r75898N960N72611o211836j1338807
$$ 12160619 5050435 9475776 20367845 25712097 24736199 24742159 25314770 19102934 7764127
42077G764127m931769L407601k988410j9463255k3453695p726318Q673780R082301
$$ 7764127 2832358 6239959 3251549 -16211706 -39665401 -47391719 -38717939 -29635638
42069b9635638J673340K463753R894780J0840112L185864k682112j099845L123607
$$ -29635638 -27962298 -25498545 -15603765 -4763653 -1577789 -4259901 -5359746 -2236139
42061b236139M988564N051609N106063N698627O894585N739674l318345j8414947
$$ -2236139 2752425 7804034 12910097 18608724 25503309 31242983 27924638 9509691
42053I509691k5728435j4969656L895508J0626402M63799j0814732q209779N795019
$$ 9509691 -16218744 -31188400 -27292892 -16666490 -16202691 -27017423 -35227202 -29432183
42045b9432183J7377049J6171244K859853j0949394j0772297N216011K0034860
$$ -29432183 -12055134 4116110 6975963 -3973431 -14745728 -9529717 10505143
42038A0505143J6339946n98548r519764k126372P917192O927069j942467q884459
$$ 10505143 26845089 26246541 16726777 14600405 22517597 29444666 27502199 18617740
42030A8617740j1301462j0026325l184023P223668J1995540P143519J633300L859533
$$ 18617740 7316278 -2710047 -5894070 1329598 13325138 20468657 22101957 25961490
42022B5961490Q144216M466501n061523r930465o592914l22607M315848O006027
$$ 25961490 34105706 38572207 33510684 23580219 16987305 16664698 20980546 26986573
42014B6986573L741409j59061J344011R503400J2922710J394549j7842062k8643862
$$ 26986573 30727982 30568921 31912932 41416332 54339042 55733591 37891529 9247667
42006I247667k6763844k0247187j2897593j717026J0256071J3632332P461855
$$ 9247667 -17516177 -37763364 -50660957 -52377983 -42121912 -28489580 -21027725
41999b1027725J362742K65690m86647k194152J281277R862402J3125706O727959
$$ -21027725 -19664983 -19399293 -19885940 -22080092 -20798815 -10936413 2189293 8917252
41991H917252L13114P88252K17457q756512j6592669r870311O623016J5069861
$$ 8917252 9230366 10018618 10236075 1479563 -15113106 -24983417 -18360401 -3290540
41983c290540Q150221n093357j4084981j5410191q793245L233715J1941344J0220814
$$ -3290540 4859681 -233676 -14318657 -29728848 -38522093 -35288378 -23347034 -13126220
41975a3126220M108150N202639J1304447P847788q461279k1435051j7642935m658724
$$ -13126220 -9018070 -3815431 7489016 15336804 6875525 -14559526 -32202461 -36861185
41967c6861185K204967J019778m89328j449417n993754r064126k90594J6471722
$$ -36861185 -34656218 -33636440 -34125768 -35575185 -41568939 -50633065 -50923659 -34451937
41959c4451937K2500608R335513p426925q738266K268312P041469p15054p715240
$$ -34451937 -11951329 -2615816 -10042741 -18781007 -16512695 -9471226 -10186280 -17901520
41951a7901520k450491Q493615J1486462M495246l767910q139481j0566657j0852465
$$ -17901520 -20352011 -11858396 -371934 4123312 355402 -7784079 -18350736 -29203201
41943b9203201m360867P763221J4596192Q358930l574022p286390q58919L878870
$$ -29203201 -33564068 -25800847 -11204655 -2845725 -6419747 -13706137 -14565056 -10686186
41935a0686186j089536q779171p851102J724458J0388232J3146887J4093104J6479804
$$ -10686186 -11775722 -20554893 -28405995 -26681537 -16293305 -3146418 10946686 27426490
41927B7426490J5681764N902820j0215232k2755691k3617706j2451463L647626
$$ 27426490 43108254 49011074 38795842 16040151 -7577555 -20029018 -16381392
41920a6381392J3793274J0089197m687785j7684648j8228138q424318J573609
$$ -16381392 -2588118 7501079 2813294 -14871354 -33099492 -41523810 -39950201
41913c9950201O130140O885870N642622K233051n43709K064574Q613470J1411811
$$ -39950201 -33820061 -26934191 -21291569 -19058518 -19602227 -17537653 -8924183 2487628
41905B487628P505929K925008K649964L665117K553078K246605M534002L017724
$$ 2487628 9993557 12918565 15568529 19233646 21786724 24033329 28567331 31585055
41897C1585055p466110j9428423k0496722r773009K653927J0251979J4635769
$$ 31585055 24118945 4690522 -15806200 -25579209 -22925282 -12673303 1962466
41890A962466J6798179J3594880M244996p021499j5654224j8721859j4161590
$$ 1962466 18760645 32355525 36600521 29579022 13924798 -4797061 -18958651
41883a8958651m763744M75950k510160m565730L060923J1711339O827024o748414
$$ -18958651 -23722395 -23246445 -25756605 -30322335 -27261412 -15550073 -8723049 -15471463
41875a5471463r543195K104106J0925915P908367M226428N816203p469j7837096
$$ -15471463 -25014658 -22910552 -11984637 -4076270 150158 5966361 5958892 -11878204
41867a1878204k6876413j1510519R623889J0505764j220888M11973J3371103J0999903
$$ -11878204 -38754617 -50265136 -40641247 -30135483 -31356371 -30944398 -17573295 -6573392
41859f573392r498705j7515880K600625K4507574J8277295p112806j9832160q648362
$$ -6573392 -16072097 -33587977 -30987352 -6479778 11797517 4684711 -15147449 -23795811
41851b3795811R261568J5195324O998442n033571q200131K536416J6099005J3395457
$$ -23795811 -14534243 661081 7659523 2625952 -5574179 -3037763 13061242 26456699
41843B6456699q124298k6677420k2902551n226562M428831K296388L460413J4168113
$$ 26456699 18332401 -8345019 -31247570 -36474132 -32045301 -29748913 -26288500 -12120387
41835a2120387K1354189J3426228k480709j1391844j0076171p623118r998690
$$ -12120387 9233802 22660030 20179321 8787477 -1288694 -8911812 -18910502
41828a8910502j1510072l877948R444845J3783897J548533j4674755j5905217
$$ -18910502 -30420574 -34298522 -24853677 -11069780 -9521247 -24196002 -40101219
41821d0101219k009146Q665944O772186M174059J0828299J4934625J888958j7544462
$$ -40101219 -42110365 -33444421 -26672235 -22498176 -11669877 3264748 5153706 -12390756
41813a2390756j8451929J804507J8398360J3185025l283423j0480396m396793
$$ -12390756 -30842685 -29038178 -10639818 2545207 -738216 -11218612 -15615405
41806a5615405M091546P251974O310840M413582K641153J362079L04209j521243
$$ -15615405 -11523859 -4271885 2038955 6452537 9093690 10455769 10759978 9238735
41798I238735l631955m288523l826030l654979j558082N537522J2490523Q265425
$$ 9238735 5606780 1318257 -2507773 -6162752 -7720834 -2183312 10307211 18572636
41790A8572636p438644j7976632r316609Q880436J2927184l983841k1310172j6809284
$$ 18572636 11133992 -6842640 -16159249 -7278813 5648371 1664530 -19645642 -36454926
41782c6454926N045048J9362396J2935415q08223k762138N541409O803805n264138
$$ -36454926 -31409878 -12047482 887933 79710 -2682428 2858981 9662786 4398648
41774D398648j7341048j6387765n330820O794720J7900666K6159343K1679469
$$ 4398648 -12942400 -29330165 -34660985 -27866265 -9965599 16193744 37873213
41767C7873213J94867k1417388k0741073J68176J6394885J2855199k47462p350208
$$ 37873213 38068080 16650692 -4090381 -3922205 12472680 25327879 25080417 17730209
41759A7730209o414205j787102N927511J3183274J0118266m410100j5118573r896890
$$ 17730209 11316004 9528902 15456413 28639687 38757953 34347853 19229280 9332390
41751I332390J904989L646866m104911p781583l850824j736190n551562q040916
$$ 9332390 11237379 14884245 10779334 2997751 -853073 -2589263 -8140825 -16181741
41743a6181741m231499J389776M058257N043579O309960P335878Q800602J1456348
$$ -16181741 -20413240 -19023464 -14965207 -9921628 -3611668 3724210 12524812 23981160
41735B3981160J0917924K531890q179242j0181938l491890k5299m865152q193109
$$ 23981160 34899084 37430974 29251732 19069794 15577904 15552605 10687453 2494344
41727B494344j401939R202735J2032657N150961n283703j3326813j3142166k11495
$$ 2494344 1092405 10295140 22327797 27478758 22195055 8868242 -4273924 -4485419
41719d485419J7664259J9892129k788051k9760615l1753681q454849J1305891
$$ -4485419 13178840 33070969 30282918 522303 -31231378 -39686227 -28380336
41712b8380336Q356268m812434p419237Q6617K958997j649921k043681O880428
$$ -28380336 -20024068 -24836502 -32255739 -32169122 -29210125 -30860046 -32903727 -26023299
41704b6023299J5024644J2896369M502325j432006m366173q027811r608528l348793
$$ -26023299 -10998655 1897714 6400039 4968033 601860 -7425951 -17034479 -20383272
41696b0383272O476191O951916n576735j7526376j4563615m04563Q990562O687927
$$ -20383272 -13907081 -6955165 -12531900 -30058276 -44621891 -45026454 -36035892 -29347965
41688b9347965O57032j037257j23663O1875K310963Q102186J0688446N025702
$$ -29347965 -28690933 -29728190 -29851853 -29789978 -27479015 -19376829 -8688383 -3662681
41680c662681j228585K466652J2178672J3754993L322844q476465j3232578j3028171
$$ -3662681 -4891266 -2424614 9754058 23509051 26831895 18355430 5122852 -7905319
41672g905319r769414m28946J1396294J3197686J892396p949466m952561J926495
$$ -7905319 -17674733 -18103679 -6707385 6490301 8382697 433231 -4519330 -2592835
41664b592835j17961o407971o562148o046926j4188765j9370578l509174K1531576
$$ -2592835 -2710796 -9118767 -15680915 -21727841 -35916606 -55287184 -58796358 -37264782
41656c7264782K3172530j126354j4677042L145162K3638836J3953544j1023131
$$ -37264782 -14092252 -15218606 -29895648 -26750486 -3111650 10841894 -181237
41649a81237j3930260N367114J2415371n325785k1171899j3091326O415968J5392563
$$ -181237 -14111497 -8744383 3670988 -1654797 -22826696 -35918022 -29502054 -14109491
41641a4109491J2423914P537168K474226m544999q183491m529264n16923l011855
$$ -14109491 -1685577 5851591 8325817 3780818 -4402673 -8931937 -9448860 -12460715
41633a2460715o938515m469070K132911O421032Q479671J0185433P633928j317872
$$ -12460715 -19399230 -23868300 -21735389 -15314357 -6834686 3350747 10984675 9666803
41625I666803q517304n183917M527219R056522M706379k587144o626119m997648
$$ 9666803 1149499 -4034418 492801 9549323 14255702 11668558 5042439 44791
41617D4791J416003O332421J633800r752984j2206502J857524J7277469J4492395
$$ 44791 1460794 7793215 9427015 -325969 -12532471 -10674947 6602522 21094917
41609B1094917l110997j4299222r590736r35725r70984o288177o038594K276738
$$ 21094917 17983920 3684698 -5906038 -6841763 -7812747 -14100924 -20139518 -17862780
41601a7862780J0860741J0417300j165412j4745957j5493909J241566K0684421
$$ -17862780 -7002039 3415261 2249849 -12496108 -27990017 -26748451 -6064030
41594f064030K2996644P086076q049181p353031L139205P398165J315935l529893
$$ -6064030 16932614 24018690 15969509 8616478 11755683 19153848 20469783 16939890
41586A6939890K658458J2462963Q639036j2317200l0620035k5139137j622635
$$ 16939890 19598348 32061311 40700347 28383147 -2236888 -27376025 -28998660
41579b8998660J3061049N828351p853615r567159k718064o73509m085521n321094
$$ -28998660 -15937611 -10109260 -17962875 -27530034 -30248098 -30921607 -35007128 -40328222
41571d0328222m859870o415402m273530O547969J5050527R051548j115728L650586
$$ -40328222 -45188092 -51603494 -55877024 -49329055 -34278528 -25226980 -26342708 -22692122
41563b2692122J7796424J7085116j935188j5793186j2159936n998035p876111
$$ -22692122 -4895698 12189418 10254230 -5538956 -17698892 -23696927 -31573038
41556c1573038m423998J2735887K3615362Q728791j6544150k1768736m585924
$$ -31573038 -35997036 -23261149 354213 9083004 -7461146 -29229882 -33815806
41549c3815806J0213622Q299849n25067m134513k898063j058215M90712M61601
$$ -33815806 -23602184 -15302335 -15827402 -19961915 -22859978 -23918193 -23427481 -22965880
41541b2965880j582659l06991P390861J1613181J010177j5719395j6360366L515007
$$ -22965880 -24548539 -24855530 -17464669 -5851488 -4841311 -20560706 -36921072 -33406065
41533c3406065K1479629J7535942n13505j0418761m468011O007567R587207O889382
$$ -33406065 -11926436 5609506 5096001 -5322760 -9790771 -3783204 5804003 12693385
41525A2693385M440984N128253O933483O366462J444825n641917q432408k893322
$$ 12693385 17134369 22262622 29196105 35562567 37007392 31365475 22933067 20039745
41517B0039745M651526K056446j1793448k0445561r234384J1724005J6726783
$$ 20039745 24691271 26747717 14954269 -5491292 -14725676 -3001671 13725112
41510A3725112j175765j9477562j7437924l334843L110279K362734Q540767J8888363
$$ 13725112 12549347 -6928215 -24366139 -27700982 -24590703 -22227969 -13687202 5201161
41502E201161J4816280n776389k1023190j6350708k862155L789753M116733M360719
$$ 5201161 20017441 14241052 -6782138 -23132846 -25995001 -22205248 -18088515 -13727796
41494a3727796K826971j423032j342606M709767O320775j049455o266166k361020
$$ -13727796 -10900825 -12323857 -13666463 -8956696 -2635921 -3685376 -9951542 -12312562
41486a2312562K255p197572j2309457m130188O769929O140811R45996M755180
$$ -12312562 -12310307 -19507879 -31817336 -35947524 -29177595 -23036784 -22090788 -17335608
41478a7335608J1306558O342807m777781o318168p94074k741202j0118461q230390
$$ -17335608 -6029050 313757 -4464024 -10782192 -11576266 -14317468 -24435929 -32666319
41470c2666319J981967O099594L930130P856038J4769378Q469633q016807j1776780
$$ -32666319 -30684352 -24584758 -20654628 -12798590 1970788 10440421 2423614 -9353166
41462i353166K712911J3442274N996882p250109j2263463j2411991j1845634m485563
$$ -9353166 -6640255 6802019 12798901 5548792 -6714671 -19126662 -30972296 -35457859
41454c5457859P913621J0132810k86345l587028J0389967K2714686J4841392k581822
$$ -35457859 -27544238 -17411428 -17697773 -21284801 -10894834 11819852 26661244 24079422
41446B4079422r294651n801250m087756l951070l5192N73174j0106361k1225647
$$ 24079422 14784771 8983521 4895765 944695 909503 1482677 -8623684 -29849331
41438b9849331j5955729K254814J4644258J3097636M930260k869611q506680q700574
$$ -29849331 -45805060 -43550246 -28905988 -15808352 -10878092 -13747703 -22254383 -30954957
41430c0954957j310319Q098708J2567647J2060515P980657j804661j3963780j7004976
$$ -30954957 -32265276 -24166568 -11598921 461594 8442251 6637590 -7326190 -24331166
41422b4331166p923271M77402k96151j168721N095367P838995j552950j0359501
$$ -24331166 -32254437 -31777035 -32073186 -33241907 -28146540 -20307545 -21860495 -32219996
41414c2219996n412704K440123j892420q239189J261712J7098929J5698167J90547
$$ -32219996 -37632700 -35192577 -37084997 -45324186 -44062474 -26963545 -11265378 -11074831
41406a1074831m557011N531011R236037p24929o775937n58316L194106l675960
$$ -11074831 -15631842 -10100831 -864794 -1589723 -8365660 -8923976 -5729870 -9405830
41398i405830p915194j750731J908088m437266n986344P889485K1202321J4687712
$$ -9405830 -17321024 -19071755 -17163667 -21600933 -27587277 -19697792 1504529 16192241
41390A6192241m505274j5281377j2267607n599190j272113J765540K387546n11418
$$ 16192241 11686967 -3594410 -15862017 -21461207 -22733320 -20967780 -18580234 -19091652
41382a9091652k336581k67722M07267l201447l660555L823920R967009M902058
$$ -19091652 -21428233 -21695955 -21288688 -24490135 -28150690 -24326770 -14359761 -9457703
41374i457703n346484q587275n123963l222275k428414L580213J1238503R639029
$$ -9457703 -14804187 -23391462 -28515425 -31737700 -34166114 -30585901 -19347398 -9708369
41366i708369j195252q295699m623455J436105R0000n163095l634763O350240
$$ -9708369 -10903621 -19199320 -23822775 -22386670 -22296670 -27459765 -31094528 -24744288
41358b4744288J4677240J3016959N269390L22407j820119q289651j7354835j5863839
$$ -24744288 -10067048 2949911 8219301 8541708 6721589 -1568062 -18922897 -34786736
41350c4786736J39964J3414944P417826p625709p655595R776210K1874012J3322882
$$ -34786736 -34646772 -21231828 -13814002 -21439711 -29095306 -19319096 2554916 15877798
41342A5877798n593643j7209519j5729007l691860J3559090K3701642J4697396
$$ 15877798 10284155 -6925364 -22654371 -26346231 -12787141 10914501 25611897
41335B5611897o261814j7130030j1106644m420463o620882n006433Q509916J7469517
$$ 25611897 19350083 2220053 -8886591 -13307054 -19927936 -24934369 -16424453 1045064
41327A045064P026150q665791p839434M459023P230751j912249p638193n369250
$$ 1045064 8071214 -594577 -8434011 -3974988 3255763 1343514 -6294679 -11663929
41319a1663929m623121p304861n203074J777628M978140M289392P630156J3348338
$$ -11663929 -16287050 -23591911 -28794985 -27017357 -22039217 -17749825 -10119669 3228669
41311C228669J0963167J5070q299694q846370o850312n252487k735751k433299
$$ 3228669 14191836 14206906 5907212 -2939158 -9789470 -15041957 -17777708 -20211007
41303b0211007o959900p825718K892489J4112082R104019n792587q960076J102755
$$ -20211007 -27170907 -34996625 -32104136 -17992054 -8888035 -14680622 -23640698 -22537943
41295b2537943M388920m121465n431079P461837J3368907j727236j8181551j2242511
$$ -22537943 -18149023 -22270488 -27701567 -20239730 -6870823 -8598059 -26779610 -39022121
41287c9022121O915554J2595177L64070j0226417o980731K391883P512098Q713134
$$ -39022121 -32106567 -19511390 -19147320 -29373737 -36354468 -33962585 -26450487 -17737353
41279a7737353J0814884J3486504J1132147J21944j3189481j4560406L19482J3697101
$$ -17737353 -6922469 6564035 17696182 17818126 4628645 -9931761 -9612279 4084822
41271D084822N760364j4636101j9074235k170727R259084q69704j2111968k667174
$$ 4084822 9845186 -4790915 -23865150 -26035877 -16776793 -17646497 -29758465 -32425639
41263c2425639J3571361J0774971n700936r553957L500680J2825623Q348153P52422
$$ -32425639 -18854278 -8079307 -13780243 -23334200 -19833520 -7007897 1340256 2092678
41255B092678l071376q278842j3619960r512746J009309K464089o106795o582924
$$ 2092678 -978698 -9257540 -22877500 -32390246 -31380937 -28916848 -35023643 -41606567
41247d1606567P923218J9695196J4252002K188458l16047L538203J261135o092215
$$ -41606567 -33683349 -13988153 263849 2452307 2136260 5674463 6935598 843383
41239H43383p438306q69888M694068L377987k264170o666323n208689L002876
$$ 843383 -6594923 -7464811 -2770743 607244 -1656926 -8323249 -13531938 -10529062
41231a0529062J1419777J1265004M482937K567684P428624N268371j1259216k6513403
$$ -10529062 890715 12155719 16638656 19206340 26634964 31903335 20644119 -5869284
41223e869284k1361397j283597J0726559N661798k803878j384482N653901P114878
$$ -5869284 -27230681 -28514278 -17787719 -12125921 -14929799 -16314281 -10660380 -3545502
41215c545502J986845j253850K474930Q431194P808678j883874j2387607j2318208
$$ -3545502 -1558657 -2812507 -337577 8093617 15902295 14018421 1630814 -10687394
41207a0687394n74840J0832850J0238653l59114r170879r170429m219010j870382
$$ -10687394 -11262234 -429384 9809269 9450155 279276 -8891153 -13110163 -14980545
41199a4980545m164835o223038k840823L766115N228372p94836l922307N133790
$$ -14980545 -19145380 -25368418 -28209241 -24443126 -19214754 -20009590 -23931897 -18798107
41191a8798107J7110834J3796115m013489j4215228m910920Q576300Q662479Q85066
$$ -18798107 -1687273 12108842 8095353 -6119875 -11030795 -2454495 6207984 7093050
41183G093050r71393M3416n876174j1905675n280117O027447L459724q625048
$$ 7093050 6121657 6165073 288899 -11616776 -16896893 -10869446 -7409722 -16034770
41175a6034770p715984P312817J1413582m151465j4365373o31441J7921046J4300083
$$ -16034770 -23750754 -16437937 -5024355 -9175820 -23541193 -24172634 -6251588 8048495
41167H048495n739616j6834781j2699605o491374k648186N533414J4517120J1694746
$$ 8048495 2308879 -14525902 -27225507 -33716881 -36365067 -30831653 -16314533 -4619787
41159d619787r78037n943696L275148J2113953P117380o541609j5542306j4499224
$$ -4619787 -5597824 -11541520 -8266372 3847581 10964961 4423352 -11118954 -25618178
41151b5618178o046739N023267J2170848R568565r36683j0531050j3087514r254082
$$ -25618178 -31664917 -26641650 -14470802 -4902237 -5838920 -16369970 -29457484 -38711566
41143c8711566j863422N782507Q472052M286076L1439K637865P108828L750452
$$ -38711566 -40574988 -34792481 -26320429 -22034353 -22002914 -19365049 -12256221 -8505769
41135h505769m358277m333967N618863J2510128Q815685K419227J074341L67808
$$ -8505769 -12864046 -17198013 -11579150 930978 9746663 12165890 13240231 13608039
41127A3608039n034587r633922o201784J579723M816132K064517j443675k865438
$$ 13608039 8573452 -1060470 -7262254 -5682531 -866399 1198118 -245557 -3110995
41119c110995l504203m373409m407912j514124M948911R834995M185500j0938410
$$ -3110995 -6615198 -10988607 -15396519 -16910643 -11961732 -2126737 2058763 -8879647
41111h879647j7944824l445449J7948552J8733970k067588j5781209n884335R590372
$$ -8879647 -26824471 -30269920 -12321368 6412602 4345014 -11436195 -17320530 -7730158
41103g730158Q852327j854063m198148K009089M522531J777120K22414j594693
$$ -7730158 1122169 -731894 -4930042 -2920953 1601578 3378698 3601112 2006419
41095B006419o937948p598588L646127J4901061R869501n385641j1209387m965807
$$ 2006419 -4931529 -12530117 -8883990 6017071 15886572 10500931 -708456 -5674263
41087e674263j111701l917214l081395L683234O346297L005071L046940O400374
$$ -5674263 -6785964 -10703178 -13784573 -10101339 -3755042 -749971 2296969 8697343
41079H697343J129271j2538119j6607747k327175J5214078J8821415R986811o94322
$$ 8697343 9826614 -2711505 -19319252 -21646427 -6432349 12389066 22375877 21681555
41071B1681555r075105j4413327j4104812j0075804q787234q794151j529687J0285840
$$ 21681555 12606450 -1806877 -15911689 -25987493 -34774727 -43568878 -45098565 -34812725
41063c4812725J1371386j201252r057250N12238J4650731J5156660M379700l591900
$$ -34812725 -23441339 -24642591 -33699841 -33187603 -18536872 -3380212 999488 -2592412
41055b592412n269470n683515l913370L201418R521396O254192m144209j1759819
$$ -2592412 -7861882 -13545397 -17458767 -14257349 -4735953 1518239 -2625970 -14385789
41047a4385789j2019952o067619M293306J3174235J1036753j459566r223752k703001
$$ -14385789 -26405741 -32473360 -28180054 -15005819 -3969066 -5428632 -14652384 -17355385
41039a7355385P876631R219758M463611K730821J102616o484805j2599167p310594
$$ -17355385 -9478754 -258996 4204615 6935436 8038052 1553247 -11045920 -18356514
41031a8356514J751146k23437j0004215j0937463L07018J0437908J1529867Q437461
$$ -18356514 -16605368 -16828805 -26833020 -37770483 -37463465 -27025557 -15495690 -7058229
41023g058229M633639k342933j0458431j3206307j0575489p146063j685246P480073
$$ -7058229 -2424590 -4767523 -15225954 -28432261 -39007750 -46153813 -47839059 -40358986
41015d0358986J1536383K963116o322414Q38028J7228081J8969368L019555p864738
$$ -40358986 -28822603 -25859487 -32181901 -31343873 -14115792 4853576 7873131 8393
41007H393j549837P255292M867960j559565l047231n063346j1420604j2390333
$$ 8393 -1541444 5713848 10581808 9022243 5975012 911666 -10508938 -22899271
40999b2899271l696605J739395k990920k948948J2037081K2935655Q078678j8748059
$$ -22899271 -26595876 -24856481 -27847401 -30796349 -18759268 4176387 12255065 -6492994
40991f492994k4009230k123254J9126902K0092553J0723384N880252K548783o839317
$$ -6492994 -30502224 -32625478 -13498576 6593977 17317361 23197613 25746396 18907079
40983A8907079j5356912j1278221J456813O770982j154004j0032089o797975M744113
$$ 18907079 3550167 -7728054 -6271241 499741 -654263 -10686352 -17484327 -12740214
40975a2740214R989803M235748j570629J456429N752111n79285j3536282j7937475
$$ -12740214 -2750411 1485337 -85292 1371137 7123248 6543963 -6992319 -24929794
40967b4929794j0037095q10483M228842J2037161K3528971K4795891P786400j3143712
$$ -24929794 -34966889 -35777372 -31548530 -19511369 4017602 28813493 36599893 23456181
40959B3456181j8393858p939703L061875N803857K842690k049678o771728p783795
$$ 23456181 5062323 -2877380 184495 5988352 8831042 6781364 9636 -7774159
40951g774159m378614k027537l244995j500325O826412J2580128P255015j787190
$$ -7774159 -12152773 -14180310 -17425305 -18925630 -12099218 480910 7735925 5948735
40943E948735k954475M6708m003058j2003771j0142885K566745J1626248Q987233
$$ 5948735 2994260 3040968 -962090 -12965861 -23108746 -20542001 -8915753 71480
40935G1480K240541m95369r91398k835232m858389o113810p574937o750801J93931
$$ 71480 2312021 1816652 825254 -2009978 -6868367 -12982177 -20557114 -27307915 -27113984
40926b7113984J0019536J5058698J3743506R307756Q92694j2074973j9866728
$$ -27113984 -17094448 -2035750 11707756 21015512 21908206 9833233 -10033495
40919a0033495j2001636M455955J2383537R852682R666513J3142450O479780j1134497
$$ -10033495 -22035131 -17579176 -5195639 4657043 14323556 27466006 33945786 22811289
40911B2811289j8911887n614334J0820465R672005l592494j1141939j0288257
$$ 22811289 3899402 -1714932 9105533 18777538 15185044 4043105 -6245152
40904f245152q333079k822006J1005784K1052141R994859j5664557k9080819j7782321
$$ -6245152 -14578231 -17400237 -6394453 14657688 24652547 8987990 -20092829 -37875150
40896c7875150K454602J1931051R609212N742626M995812M769197K219611l426568
$$ -37875150 -35420548 -23489497 -13880285 -8137659 -3141847 1627350 3846961 420393
40888D20393j0454848j3294052o977778M840322J2134994J0659277N778875K464987
$$ 420393 -10034455 -23328507 -30306285 -25465963 -13330969 -2671692 3107183 5572170
40880E572170j323170p775379j2624451j1223658p014240p584637j3457066j5896390
$$ 5572170 4249000 -3526379 -16150830 -27374488 -34388728 -41973365 -55430431 -71326821
40872g1326821p015381J0354758K4142090K4007428J0931545l581663p884659
$$ -71326821 -78342202 -67987444 -43845354 -19837926 -8906381 -12488044 -20372703
40865b0372703n17580Q930397R262319j008940j1797193j2642471n232699l02262
$$ -20372703 -20890283 -11959886 -2697567 -3706507 -15503700 -28146171 -33378870 -33681132
40857c3681132j368699L39614R486220J4912284O248609n258346l47379J6109528
$$ -33681132 -35049831 -34710217 -25223997 -10311713 -4063104 -9321450 -9668829 6440699
40849F440699J7918025l045457k2260728j8313801k668933K845592K62648M930480
$$ 6440699 24358724 21313267 -947461 -19261262 -21930195 -19084603 -18821955 -13891475
40841a3891475J3784039J0446515l806052j0468055m899704k310963r215554j2230116
$$ -13891475 -107436 10339079 6533027 -3935028 -8834732 -11145695 -20361249 -32591365
40833c2591365k527639R384646J2746738J1803365J1240125M031926j2396118
$$ -32591365 -35119004 -25734358 -12987620 -1184255 10055870 14087796 1691678
40826A691678k2823445j3457740N594136J2995570M760389m217792k906020M499790
$$ 1691678 -21131767 -34589507 -28995371 -15999801 -11239412 -15457204 -18363224 -13863434
40818a3863434P906191K147081r683591j6853608r178453Q780793J7967812P549381
$$ -13863434 -5957243 -3810162 -13493753 -30347361 -39525814 -30745021 -12777209 -5227828
40810e227828r137270j1228233K744826J5450656J4043471J875735j0228910j4136914
$$ -5227828 -14365098 -25593331 -22848505 -7397849 6645622 8521357 -1707553 -15844467
40802a5844467p757906K881447O949076J386418l873880l55677O110424O454024
$$ -15844467 -23602373 -20720926 -13771850 -12385432 -16259312 -16614989 -10504565 -4050541
40794d050541M205395P366327J1606659P069905l262681q515551q892629j1876157
$$ -4050541 154854 7521181 19127840 26197745 22935064 14419513 5526884 -6349273
40786f349273j3475105m172440Q230975N535915r014335j0975810O902944K1795612
$$ -6349273 -19824378 -23996818 -15765843 -10229928 -19244263 -30220073 -23317129 -1521517
40778a521517J6492803L195384k054121m227940j0664504j0918340K075951J1247071
$$ -1521517 14971286 18166670 16112549 11884609 1220105 -9698235 -7622284 3624787
40770C624787J958170q827185j09872J2182778j513769k9373441k8689745O657390
$$ 3624787 5582957 -3244228 -3354100 8828678 7314909 -22058532 -50748277 -44090887
40762d4090887L1669074J6412241j1208516j1282525J0150519J8338150M615977
$$ -44090887 -12421813 3990428 -7218088 -18500613 -8350094 9988056 14604033
40755A4604033q166100o107612p43651m666215j3145675j5179313q434023J555809
$$ 14604033 6437933 330321 -413330 -5079545 -18225220 -33404533 -41838556 -40282747
40747d0282747Q199501P612044J593473l410121m499772n805937r253707q587234
$$ -40282747 -32083246 -24471202 -22877729 -26287850 -30787622 -36593559 -45847266 -54434500
40739e4434500Q3380Q895934Q937877M070678L454277O088571M848763J116746
$$ -54434500 -54351120 -45455186 -36517309 -32446631 -28992354 -22903783 -18055020 -16938274
40731a6938274K084034O679627P819072O324891Q199631R664767J266118j2358446
$$ -16938274 -14854240 -8174613 -355541 5969350 14168981 23833748 25099866 12741420
40723A2741420j4521896k622053N292135k033063j1542050p466224L708295N192695
$$ 12741420 -1780476 -4402529 889606 -1143457 -12685507 -20151731 -16443436 -11250741
$$ [...]
##END NTUPLES=NMR SPECTRUM
##END=
