##TITLE=31Pdec_LR-678-C1
 CDcl3, 24 sc
 28.6.2019
##JCAMPDX= 6.0         $$ Bruker NMR JCAMP-DX V2.0
##DATA TYPE= NMR SPECTRUM
##DATA CLASS= NTUPLES
##ORIGIN= UXNMR, Bruker Analytische Messtechnik GmbH
##OWNER= root
$$ XWIN-NMR		Version 3.5
$$ Fri Jun 28 15:40:16 2019 Russian Standard Time (UT+4h)  she@DPX200
##.OBSERVE FREQUENCY= 81.013821
##.OBSERVE NUCLEUS= ^31P
##.ACQUISITION MODE= SIMULTANEOUS
##.ACQUISITION SCHEME= undefined
##.AVERAGES= 24
##.DIGITISER RES= 17
##SPECTROMETER/DATA SYSTEM= spect
##.PULSE SEQUENCE= zgpg30
##.SOLVENT NAME= CDCl3
##.SHIFT REFERENCE= (INTERNAL, CDCl3, 0, 182.463)
##AUDIT TRAIL= $$ (NUMBER, WHEN, WHO, WHERE, WHAT)
$$ ##TITLE= Audit trail, XWIN-NMR		Version 3.5
$$ ##JCAMPDX= 5.01
$$ ##ORIGIN= Bruker BioSpin GmbH
$$ ##OWNER= she
$$ F:/spectra/data/she/nmr/P31/1/pdata/1/auditp.txt
$$ ##AUDIT TRAIL=  $$ (NUMBER, WHEN, WHO, WHERE, WHAT)
(   1,<2019-06-28 15:39:26.65 +0400>,<she>,<DPX200>,
      <created by zg, POWCHK disabled, PULCHK disabled
       configuration hash MD5:
       00 E9 B6 7A A2 85 ED C7 34 08 36 98 17 FE 4E 26
       data hash MD5: 32K
       5B 36 74 31 03 AB 1E E5 B8 32 B0 40 4F C1 5C 45>)
(   2,<2019-06-28 15:39:28.93 +0400>,<she>,<DPX200>,
      <Start of raw data processing
       efp BC_mod = 2 LB = 1 FT_mod = 6 PKNL = 1 PHC0 = -2588.513 PHC1 = 159.1996 SI = 64K 
       data hash MD5: 64K
       62 96 92 0B 02 9B B8 FD A5 B6 0F 21 17 AA 31 57>)
(   3,<2019-06-28 15:39:44.87 +0400>,<she>,<DPX200>,
      <pk PHC0 = 18.24245 PHC1 = 0 
       data hash MD5: 64K
       8C E7 B7 A4 6A 8D 05 61 FF EE 49 E2 83 4E 9B 64>)
(   4,<2019-06-28 15:39:47.76 +0400>,<she>,<DPX200>,
      <abs ABSG = 5 
       data hash MD5: 64K
       72 50 F1 FD 1E 2C 35 9D 16 F4 E8 41 F8 68 8C 0E>)
$$ ##END=
$$ 
$$ hash MD5
$$ 73 B9 23 7A DB 18 F0 90 85 52 96 E9 36 29 FD 72
##$RELAX= 
##$RELAX= 
##$RELAX= 
##$RELAX= 
##$RELAX= 
##$RELAX= 
##$RELAX= 
##$RELAX= 
$$ Bruker specific parameters
$$ --------------------------
##$DU= <F:/spectra>
##$EXPNO= 1
##$NAME= <P31>
##$PROCNO= 1
##$TYPE= <nmr>
##$USER= <she>
##$AMP= (0..31)
100 100 100 100 100 100 100 100 100 100 100 100 100 100 100 100 100 100 
100 100 100 100 100 100 100 100 100 100 100 100 100 100 
##$AQSEQ= 0
##$AQ_mod= 1
##$AUNM= <au_zg>
##$AUTOPOS= <>
##$BF1= 81.014009
##$BF2= 200.13
##$BF3= 200.13
##$BF4= 200.13
##$BF5= 200.13
##$BF6= 200.13
##$BF7= 200.13
##$BF8= 200.13
##$BYTORDA= 1
##$CFDGTYP= 0
##$CFRGTYP= 5
##$CHEMSTR= <none>
##$CNST= (0..31)
1 1 145 1 1 1 1 1 1 1 1 1 1 1 1 1 1 1 1 1 1 1 1 1 1 1 1 1 1 1 1 1 
##$CPDPRG= <waltz16>
##$CPDPRG1= <>
##$CPDPRG2= <waltz16>
##$CPDPRG3= <>
##$CPDPRG4= <mlev>
##$CPDPRG5= <mlev>
##$CPDPRG6= <mlev>
##$CPDPRG7= <mlev>
##$CPDPRG8= <mlev>
##$CPDPRGB= <>
##$CPDPRGT= <>
##$D= (0..31)
0 1 0 0 0 0 0 0 0 0 0 0.03 2e-05 3e-06 0 0 0 0 0 0 0 0 0 0 0 0 0 0 0 0 
0 0 
##$DATE= 1561721966
##$DBL= (0..7)
120 120 120 11 120 120 24 19 
##$DBP= (0..7)
150 150 150 150 150 150 150 150 
##$DBP07= 0
##$DBPNAM0= <>
##$DBPNAM1= <>
##$DBPNAM2= <>
$$ [...]
##$SUBNAM3= <"">
##$SUBNAM4= <"">
##$SUBNAM5= <"">
##$SUBNAM6= <"">
##$SUBNAM7= <"">
##$SUBNAM8= <"">
##$SUBNAM9= <"">
##$SW= 369.568048894756
##$SWIBOX= (0..15)
0 1 3 0 0 0 0 0 0 0 0 0 0 0 0 0 
##$SW_h= 29940.119760479
##$TD= 32768
##$TD0= 1
##$TE= 0
##$TE2= 300
##$TE3= 300
##$TEG= 300
##$TL= (0..7)
0 120 53 12 22 120 120 120 
##$TP= (0..7)
150 150 150 150 150 150 150 150 
##$TP07= 0
##$TPNAME0= <>
##$TPNAME1= <>
##$TPNAME2= <>
##$TPNAME3= <>
##$TPNAME4= <>
##$TPNAME5= <>
##$TPNAME6= <>
##$TPNAME7= <>
##$TPOAL= (0..7)
0.5 0.5 0.5 0.5 0.5 0.5 0.5 0.5 
##$TPOFFS= (0..7)
0 0 0 0 0 0 0 0 
##$TUNHIN= 0
##$TUNHOUT= 0
##$TUNXOUT= 0
##$USERA1= <user>
##$USERA2= <user>
##$USERA3= <user>
##$USERA4= <user>
##$USERA5= <user>
##$V9= 5
##$VALIST= <valist>
##$VCLIST= <CCCCCCCCCCCCCCC>
##$VD= 0
##$VDLIST= <DDDDDDDDDDDDDDD>
##$VPLIST= <PPPPPPPPPPPPPPP>
##$VTLIST= <TTTTTTTTTTTTTTT>
##$WBST= 1024
##$WBSW= 4
##$XGAIN= (0..3)
0 0 0 0 
##$XL= 0
##$YL= 0
##$YMAX_a= 34218
##$YMIN_a= -34519
##$ZGOPTNS= <>
##$ZL1= 120
##$ZL2= 120
##$ZL3= 120
##$ZL4= 120
##$ABSF1= 182.463
##$ABSF2= -187.1042
##$ABSG= 5
##$ABSL= 3
##$ALPHA= 0
##$AQORDER= 0
##$ASSFAC= 0
##$ASSFACI= 0
##$ASSFACX= 0
##$ASSWID= 0
##$AUNMP= <proc_1d>
##$AZFE= 0.1
##$AZFW= 0.5
##$BCFW= 0
##$BC_mod= 2
##$BYTORDP= 0
##$COROFFS= 0
##$CY= -3
##$DATMOD= 1
##$DC= 0
##$DFILT= <>
##$DTYPP= 0
##$F1P= 0
##$F2P= 0
##$FCOR= 1
##$FTSIZE= 65536
##$FT_mod= 6
##$GAMMA= 0
##$GB= 0
##$INTBC= 1
##$INTSCL= 5.30512e-09
##$ISEN= 30
##$LB= 1
##$LEV0= 0
##$LPBIN= 0
##$MAXI= 10000
##$MC2= 0
##$MEAN= 0
##$ME_mod= 0
##$MI= 50
##$NCOEF= 0
##$NC_proc= -5
##$NLEV= 6
##$NOISF1= 182.463
##$NOISF2= 159.3651
##$NSP= 0
##$NTH_PI= 0
##$NZP= 0
##$OFFSET= 182.463
##$PC= 4
##$PHC0= -2570.271
##$PHC1= 159.1996
##$PH_mod= 1
##$PKNL= yes
##$PPARMOD= 0
##$PSCAL= 0
##$PSIGN= 0
##$REVERSE= no
##$SF= 81.0140089999434
##$SI= 65536
##$SIGF1= 159.3651
##$SIGF2= -187.1042
##$SINO= 113.3802
##$SIOLD= 16384
##$SREGLST= <1H.CDCl3>
##$SSB= 0
##$STSI= 65536
##$STSR= 0
##$SW_p= 29940.119760479
##$SYMM= 0
##$S_DEV= 0
##$TDeff= 32768
##$TDoff= 0
##$TI= <>
##$TILT= no
##$TM1= 0
##$TM2= 0
##$TOPLEV= 0
##$USERP1= <user>
##$USERP2= <user>
##$USERP3= <user>
##$USERP4= <user>
##$USERP5= <user>
##$WDW= 1
##$XDIM= 65536
##$YMAX_p= 367426583
##$YMIN_p= -29172931
$$ End of Bruker specific parameters
$$ ---------------------------------
##NTUPLES= NMR SPECTRUM
##VAR_NAME=  FREQUENCY,     SPECTRUM/REAL,   SPECTRUM/IMAG
##SYMBOL=    X,             R,               I
##VAR_TYPE=  INDEPENDENT,   DEPENDENT,       DEPENDENT
##VAR_FORM=  AFFN,          ASDF,            ASDF
##VAR_DIM=   65536,         65536,           65536
##UNITS=     HZ,            ARBITRARY UNITS, ARBITRARY UNITS
##FACTOR=    0.456856943014862, 1,           1
##FIRST=     14782.0589164792, 0,            0
##LAST=      -15158.0608439998, 0,           0
##MIN=       -15158.0608439998, -29172931,   0
##MAX=       14782.0589164792, 367426583,    0
$$ Real data points
##PAGE= N=1
##DATA TABLE= (X++(R..R)), XYDATA
$$ [...]
48188 171978 -735960 -1100500 -619536 63680 310879 274744 451834 873701 1115151 897508
48178 897508 399586 52249 132902 455151 477340 -68723 -724902 -825285 -425638 -246087
48168 -246087 -628074 -1091229 -1118404 -820814 -506390 -135479 349383 644241 567824 481296
48158 481296 619842 466946 -388337 -1128608 -525268 1128473 2026585 1153198 -394174
48149 -394174 -979939 -532077 -254577 -752398 -1377588 -1331808 -642189 82186 341645 47630
48139 47630 -510337 -892882 -947272 -1019915 -1494866 -2183148 -2473123 -2054840 -1198096 -363581
48129 -363581 125135 87731 -375866 -682822 -162518 1130126 2337118 2740496 2456839
48120 2456839 1964659 1328259 328475 -855021 -1628714 -1710535 -1480230 -1443895 -1610162 -1613716
48110 -1613716 -1322749 -1076290 -1269683 -1841369 -2301215 -2267162 -1858538 -1476909 -1295345 -1143967
48100 -1143967 -886738 -670659 -665143 -732769 -589996 -237417 7979 -47610 -211660 -214356
48090 -214356 -131884 -272259 -640766 -757408 -189197 818957 1462565 1205231 383449 -110050
48080 -110050 269374 1154187 1587333 946597 -389087 -1374976 -1436988 -1148567 -1469057 -2369724
48070 -2369724 -2729865 -1815306 -355018 328967 -75534 -730355 -924282 -802538 -770832
48061 -770832 -820491 -708284 -353348 211495 939739 1619650 1958688 1979814 1952642 1789830
48051 1789830 1037001 -238217 -1100274 -794123 264589 1098210 1434766 1745354 2247732
48042 2247732 2581439 2462529 2056370 1627954 1312160 1261197 1502931 1582328 892001 -445709
48032 -445709 -1485465 -1490475 -722761 -35864 -15615 -657848 -1500806 -1877053 -1418526 -560677
48022 -560677 -203027 -624334 -1098150 -877212 -172003 259884 164715 -99852 -309571 -602229
48012 -602229 -920921 -810550 -74996 701229 682662 -222403 -1186532 -1357988 -729232 45299
48002 45299 509756 707581 632054 -33738 -1200516 -1870527 -1142260 396741 1148808 539451
47992 539451 -310570 -353359 -130878 -698792 -1736098 -1920144 -988299 -206379 -522299 -1277407
47982 -1277407 -1321056 -648366 -155646 -191160 -217296 107800 285620 -241001 -1132094 -1499830
47972 -1499830 -1101064 -675871 -926283 -1558656 -1736428 -1259622 -754246 -699562 -870313 -962838
47962 -962838 -1188328 -1796116 -2454953 -2669075 -2502218 -2304120 -1981444 -1228122 -322903 88058
47952 88058 30639 240413 970479 1492494 1122395 130368 -757341 -1226812 -1329828 -1071772
47942 -1071772 -557010 -179896 -170520 -216276 36983 383732 392416 74756 -231682 -412685
47932 -412685 -548092 -560973 -395022 -350218 -702100 -1115424 -999256 -398116 19572 -117733
47922 -117733 -488385 -664917 -615035 -504321 -428453 -482139 -735031 -1011546 -991332 -596338
47912 -596338 -13310 603750 1066916 897270 -263273 -1892556 -2851830 -2657836 -1981054
47903 -1981054 -1620413 -1530108 -1248693 -785409 -531585 -595055 -743979 -832034 -842651 -678330
47893 -678330 -329746 -109495 -288981 -611089 -601046 -301736 -246208 -663818 -1126208 -1107877
47883 -1107877 -594190 6875 350851 448021 596665 1045787 1615343 1744636 1131806 241501
47873 241501 -119201 268629 815864 887317 519882 280228 609633 1410580 2133836 2215803
47863 2215803 1576629 727046 249094 188100 146122 -73227 -238184 -172239 -92124 -216251
47853 -216251 -311341 9577 643783 1013183 754740 102553 -514500 -971237 -1326509 -1443233
47843 -1443233 -1129267 -635784 -552962 -970057 -1131226 -402513 629491 676185 -538050
47834 -538050 -1723172 -1584687 -476716 74037 -710017 -1990969 -2388997 -1460134 34754
47825 34754 1023450 1106924 778189 736017 990077 842714 -102763 -1233924 -1611635 -1141126
47815 -1141126 -565339 -407224 -508016 -655882 -1042498 -1815917 -2629062 -2961116 -2628039
47806 -2628039 -1799902 -828268 -207485 -296109 -802756 -907689 -228713 611495 712015 -31287
47796 -31287 -877225 -1077530 -505395 354033 796250 488374 -112106 -184777 389340 753352
47786 753352 213552 -718427 -937558 -158093 852000 1320721 1165192 646523 -54559
47777 -54559 -717314 -998053 -774700 -349658 -97654 -46334 65063 411182 849868 1028412
47767 1028412 730406 137754 -355632 -614438 -831323 -1054672 -988997 -497693 41953 249179
47757 249179 323143 697804 1344900 1855785 1993661 1710388 901815 -252934 -960415 -584064
47747 -584064 342733 666234 182489 -186442 92273 404585 119625 -393371 -495424 -373150
47737 -373150 -670273 -1390355 -1838555 -1523234 -659082 134225 359303 19081 -377125 -421439
47727 -421439 -437376 -1029104 -1963593 -2241709 -1545535 -758094 -522702 -192218 915373 1988649
47717 1988649 1678568 229977 -626134 28076 1199908 1468840 689466 -192936 -390901
47708 -390901 111306 843763 1412370 1843539 2343061 2654021 2095561 644004 -584835
47699 -584835 -707139 -450226 -1093129 -2331791 -2552571 -1282733 87480 442586 371161
47690 371161 709142 1000281 563170 57546 563700 1680020 1957886 1014301 -70670
47681 -70670 -452228 -450705 -625759 -951496 -1210580 -1358167 -1174736 -325488 870561 1441798
47671 1441798 984161 273779 156265 356466 23963 -890637 -1521290 -1284450 -571783
47662 -571783 -87012 59093 260471 616115 627964 -128862 -1246173 -1760625 -1279623 -508911
47652 -508911 -393318 -953247 -1331520 -883100 163929 1091125 1330501 707839 -491482
47643 -491482 -1515695 -1597707 -741745 122959 49672 -935241 -1924031 -2139284 -1679503 -1245686
47633 -1245686 -1252871 -1350314 -907333 114268 1029455 1244289 904955 535114 345907 259323
47623 259323 342755 721706 1183461 1357112 1227654 1023313 718631 204686 -167763 70789
47613 70789 621371 663061 117632 -182796 144688 430599 178303 -42675 352370 857640
47603 857640 757313 441604 748991 1452724 1588213 1050176 648531 622835 348897 -299562
47593 -299562 -536211 -46242 337112 -2238 -361302 199367 1372443 2078146 1936641
47584 1936641 1411316 835999 202351 -220934 59307 947155 1641864 1555537 931363 421813
47574 421813 424530 936842 1684863 2208586 2100933 1390797 576979 166836 249433 534658
47564 534658 685633 574660 310656 73044 -75215 -182460 -285488 -468990 -1003304 -2068643
47554 -2068643 -3207996 -3457737 -2379441 -700437 463420 807968 821524 782235 438434
47545 438434 -241945 -658948 -288797 586667 1267346 1527524 1696155 1905085 1696937 618540
47535 618540 -968903 -1971671 -1567880 -23424 1596530 2418179 2299842 1561534 616406
47526 616406 -49418 -19144 570729 981025 690424 58372 -211585 -58598 -44384 -480780
47516 -480780 -1095707 -1528588 -1634411 -1280061 -415250 499489 677100 -93560 -1108489
47507 -1108489 -1551501 -1291049 -688593 -50006 416799 489923 209795 39862 366133 977369
47497 977369 1339339 1224267 786930 210614 -364068 -664705 -405998 382780 1345677 2099035
47487 2099035 2429115 2319905 1960728 1626748 1401330 1110040 609288 -24535 -639951
47478 -639951 -1078590 -1062074 -449989 228181 71071 -957311 -1635482 -961980 391828
47469 391828 892913 159373 -742162 -975145 -921476 -1198252 -1566330 -1414876 -778063 -232240
47459 -232240 -75366 -150884 -310046 -562170 -827987 -936983 -875348 -760620 -585818 -226495
47449 -226495 311153 856828 1283386 1567747 1650651 1415318 858271 179124 -350103 -582827
47439 -582827 -585892 -557687 -616838 -650038 -434581 54974 531424 632640 245098 -393297
47429 -393297 -843775 -768716 -242993 203674 -2982 -940486 -2096193 -2812320 -2780149 -2187747
47419 -2187747 -1536804 -1259803 -1335112 -1323131 -970173 -657279 -900101 -1450748 -1409224 -431451
47409 -431451 645930 800403 138949 -286955 151903 1035357 1694845 2074673 2451073
47400 2451073 2698382 2411270 1687955 1207819 1311598 1475137 1096570 430912 145288
47391 145288 175979 -151687 -810420 -826476 206144 1235000 1136595 306613 -111028 -50040
47381 -50040 -344728 -987697 -1006481 -247292 160465 -320094 -604890 282868 1545095 1788965
47371 1788965 1076499 569606 670723 800546 728326 805238 893312 315897 -889376 -1741593
47361 -1741593 -1689414 -1301063 -1213659 -1258722 -1095664 -921623 -971073 -953968 -606115 -279761
47351 -279761 -376841 -633891 -594181 -428953 -632615 -1139179 -1373518 -1055177 -407818 314366
47341 314366 977471 1334567 1189120 795836 623816 707980 676524 402745 127547 -87607
47331 -87607 -454506 -863918 -796030 -142641 388998 127200 -687901 -1339716 -1618295 -1813114
47321 -1813114 -1959736 -1786459 -1414206 -1419947 -1965298 -2416147 -2172419 -1427812 -703987 -48957
47311 -48957 738804 1371411 1270542 511031 -85080 284 352552 332392 -17566 -167593
47301 -167593 65962 314201 229776 -44627 -64928 338609 719542 387906 -696796 -1585528
47291 -1585528 -1301349 -53926 1052190 1497014 1763663 2095311 1814819 534618 -791893
47282 -791893 -996378 -323971 113710 112013 396335 1044245 1206834 582647 -52897 -169828
47272 -169828 -218086 -535264 -598837 -75684 329732 -56406 -713696 -752104 -294279 -80752
47262 -80752 -179333 -85276 230567 369059 378785 617983 885984 662082 144632 69955 483125
47251 483125 701445 602702 860283 1611925 2011543 1637223 1305265 1719322 2203193 1759342
47241 1759342 730718 274161 535537 540992 -123530 -672234 -453434 50042 92161 -203620
47231 -203620 -269522 -140405 -258434 -451790 7992 1166670 1949989 1424439 37166
47222 37166 -941398 -947194 -505673 -200982 46253 498445 1012034 1318878 1472981 1593759
47212 1593759 1512924 1144707 883529 1050684 1193014 641777 -339109 -773525 -425566 -174005
47202 -174005 -619767 -1162882 -1061333 -705923 -992394 -1832524 -2226962 -1727891 -972785 -655591
47192 -655591 -721394 -826669 -927823 -1019674 -817973 -190846 444219 633444 547459 662533
47182 662533 991373 1171009 1212780 1544110 2202915 2578740 2242646 1560350 1094441 801701
47172 801701 353848 -20842 289312 1245788 1945439 1692761 822283 157432 41208 246453
47162 246453 488949 572097 265708 -436760 -1032765 -977330 -433323 -96538 -230258 -351838
47152 -351838 -23587 495970 640441 224013 -517756 -1256578 -1638379 -1307111 -260390
47143 -260390 942825 1669651 1857438 1924453 2136128 2346180 2308291 1939216 1258247 341258
47133 341258 -587007 -1213121 -1372656 -1116642 -550444 215272 930851 1239318 981712 386314
47123 386314 -145845 -409271 -493667 -543509 -484690 -63675 786558 1682484 2056626 1728236
47113 1728236 1058811 502849 225160 250076 651561 1285272 1580423 1051744 -27100
47104 -27100 -843670 -923997 -430690 335990 1191253 1745511 1489947 583855 30513 504715
47094 504715 1334904 1273491 95549 -1235756 -1936685 -2166896 -2232831 -1808260 -533101
47085 -533101 1065806 1948662 1743500 1004442 334493 -188524 -612343 -708508 -337797 113116
47075 113116 90689 -415689 -833429 -668792 -4789 639577 773550 297087 -415004 -806216
47065 -806216 -676998 -398827 -435843 -753778 -965911 -971329 -1021392 -1088591 -685351 353525
47055 353525 1304486 1284914 381199 -457680 -605911 -339614 -192614 -273166 -422838 -563172
47045 -563172 -552455 -111028 675975 1100402 602408 -371026 -810230 -372035 351947 748801
47035 748801 766295 522466 19994 -474453 -410660 231279 652864 329412 -101467 202912
47025 202912 801977 427987 -1068122 -2230444 -1836601 -433457 534180 553779 303990
47016 303990 406853 682668 662837 242088 -389001 -1075281 -1676671 -1888030 -1371003 -161778
47006 -161778 1147621 1830022 1759680 1606758 2064143 2954359 3424120 3000057 2029636 1016362
46996 1016362 66736 -736640 -978259 -457867 256308 396253 -73405 -587198 -834578
46987 -834578 -922325 -845768 -463607 -7791 14214 -446500 -883161 -1011942 -1126721 -1488233
46977 -1488233 -1863255 -1939526 -1773349 -1533603 -1165778 -621568 -140518 -15393 -272040 -750787
46967 -750787 -1261223 -1534531 -1359920 -949758 -818606 -1074273 -1174784 -654908 224341 825715
46957 825715 836988 375073 -257164 -616078 -302505 487098 917939 495491 -164148 -49867
46947 -49867 922249 1815233 1824679 1040659 68024 -637658 -936986 -870901 -564336 -149046
46937 -149046 278333 600687 712422 678199 629621 393868 -398219 -1562220 -2158454 -1557809
46927 -1557809 -404615 118906 -165135 -324729 219616 850174 671477 -245732 -966991
46918 -966991 -798669 56182 853710 1056239 680303 48165 -602826 -1131553 -1299089 -971333
46908 -971333 -523767 -515188 -781805 -495967 478868 1018592 259755 -925599 -1008823 4176
46898 4176 660504 269547 -251147 -11145 578289 757347 672432 906455 1424533 1749409
46888 1749409 1751068 1625549 1433941 1187736 1062868 1083179 947734 570604 371024 618600
46878 618600 966056 1074245 1158674 1393867 1383728 902230 554744 836271 1050480 218901
46868 218901 -1256954 -1989199 -1560227 -935496 -824191 -767347 -201197 581158 1049899 1220390
46858 1220390 1262426 988032 303112 -358701 -606799 -662553 -855186 -978881 -701801 -255389
46848 -255389 -130398 -335119 -509117 -578133 -733489 -872957 -636512 -51709 306173 -52018
46838 -52018 -964427 -1742133 -1739525 -900878 112205 503109 209008 -62363 154280 454810
46828 454810 343337 162046 540475 1207412 1253108 580750 166418 588836 1146924 946367
46818 946367 160985 -452566 -753936 -1125735 -1489150 -1278358 -386237 590124 1158879 1379631
46808 1379631 1361813 929843 83496 -689896 -923166 -665184 -191494 425120 1102561 1419104
46798 1419104 963061 -82983 -1058337 -1485589 -1391784 -1093976 -913442 -960992 -926563 -239639
46788 -239639 1199557 2547737 2702719 1508421 -59896 -970909 -1070958 -857350 -686675
46779 -686675 -491842 -139421 212801 222084 -194271 -621481 -551138 -66349 163735 -225635
46769 -225635 -727073 -660085 -166977 39937 -199059 -270472 239832 989465 1518368 1858582
46759 1858582 2148091 2137906 1577634 780710 317392 312489 453759 553863 683095 794105
46749 794105 617892 30226 -721429 -1267395 -1482425 -1539511 -1628545 -1660134 -1346089 -659208
46739 -659208 -58116 -9662 -394431 -714650 -809807 -933438 -1140359 -1136868 -858810 -650292
46729 -650292 -637357 -430175 266261 1196894 1965734 2413031 2352760 1569856 466224 45707
46719 45707 699065 1571497 1708675 1229968 720974 165897 -602985 -1001592 -391222 656769
46709 656769 951919 359578 -253856 -612305 -1293278 -2335942 -2907477 -2682744 -2340595
46700 -2340595 -2232807 -1725546 -469749 769548 1314125 1624427 2267524 2695982 2102566
46691 2102566 859880 7211 -286661 -660255 -1190542 -1176815 -340195 664384 1131465
46682 1131465 1045612 791446 690666 972109 1694934 2509959 2871635 2637704 2179374 1845514
46672 1845514 1623930 1391683 1198605 1175023 1320903 1447729 1273258 686608 32141 -78261
46662 -78261 534092 1278038 1417979 887288 232975 -61452 101292 604657 1248542 1786957
46652 1786957 2126432 2406118 2667436 2641269 2149018 1492435 1086259 902584 667327 394942
46642 394942 259636 120612 -254040 -563574 -187945 885962 1873123 2068495 1485071
46633 1485071 527072 -458139 -1098151 -992220 -203576 560643 690291 431023 501490 1008682
46623 1008682 1179982 376165 -897690 -1371652 -440511 1113031 2045153 2008920 1562923
46614 1562923 1056844 264655 -731808 -1131871 -467982 518021 786983 407664 246957
46605 246957 509183 528801 49275 -224419 314430 1261540 1777748 1601361 1101969 685759
46595 685759 483592 369172 66662 -492892 -814917 -267218 933412 1645071 1089671
46586 1089671 -154472 -880964 -690375 -209432 -41651 -45270 251909 908860 1483903 1567233
46576 1567233 1214291 797594 505416 155464 -418795 -1008468 -1302248 -1364965 -1488430 -1638902
46566 -1638902 -1485533 -1012975 -645187 -611203 -614869 -348217 66486 407591 732021 1078182
46556 1078182 1148436 742100 260060 250077 529287 305638 -683205 -1590262 -1368124 -87036
46546 -87036 1050817 1120282 566724 512998 1120105 1282437 231590 -1192621 -1559416 -762534
46536 -762534 -42532 -200090 -754909 -1044992 -1161330 -1330412 -1281687 -941134 -1010140 -1951113
46526 -1951113 -2895496 -2547762 -952789 541497 987483 656038 190497 -151368 -241345
46517 -241345 93257 610727 638042 -85870 -985674 -1369298 -1150884 -588021 219132 1165354
46507 1165354 1864177 2014905 1850070 1841399 2121867 2511543 2907638 3257556 3281091 2665604
46497 2665604 1571796 600241 146876 15142 -237341 -736950 -1187790 -1242365 -898119
46488 -898119 -528494 -513772 -850280 -1206026 -1369048 -1475781 -1703715 -1923213 -1848667 -1414378
46478 -1414378 -788458 -123204 438923 587388 46346 -942393 -1643748 -1535141 -820506
46469 -820506 -113954 183837 34123 -470344 -1173031 -1768100 -1916001 -1479117 -563927 537604
46459 537604 1329840 1315872 562801 -117131 17192 722866 1129733 946356 745971 1001469
46449 1001469 1483840 1848828 2177035 2533015 2568475 2102099 1629040 1643815 1811099 1446787
46439 1446787 553801 -261207 -679815 -829828 -759970 -467101 -301117 -592508 -957485 -745640
46429 -745640 -137099 32544 -435748 -861834 -832490 -668208 -563629 -250100 168810 74187
46419 74187 -498696 -584581 151036 576856 -281120 -1633858 -2020337 -1372110 -826233 -875739
46409 -875739 -908901 -496384 -65727 -145417 -693260 -1299028 -1531605 -1146618 -426385 -87305
46399 -87305 -330881 -375179 388536 1247506 1117883 259186 -115640 245911 396357 -79222
46389 -79222 -417897 -110464 255533 147279 -6 269889 495647 134699 -390026 -375079
46379 -375079 -49708 -183591 -752665 -853339 51569 1403223 2145225 1723814 523453
46370 523453 -462131 -497584 185144 700583 598279 306547 371149 714768 953742 1042321
46360 1042321 1193621 1420269 1525053 1393089 1045208 555070 51149 -400627 -940196
46351 -940196 -1610788 -1972668 -1593778 -961640 -1128508 -2184756 -2929250 -2550770 -1790641
46342 -1790641 -1686157 -1922890 -1474240 -383989 286611 160569 44046 551598 1222252
46333 1222252 1401167 1241112 1299285 1617254 1730351 1381228 826653 475191 429715 409372
46323 409372 97047 -423146 -670316 -295797 537368 1425707 2148552 2601147 2570760 1962761
46313 1962761 1131097 629331 673277 1077332 1565691 1880042 1806460 1469066 1399788 1892882
46303 1892882 2461123 2395947 1713457 1026192 609004 213400 -219695 -364318 -199429 -258940
46293 -258940 -846459 -1446547 -1298379 -303543 900097 1559178 1321906 385185 -647908
46284 -647908 -1193292 -1106318 -622640 6859 539261 525171 -384222 -1767510 -2566317 -2202352
46274 -2202352 -1228238 -580849 -510932 -588406 -465395 -178710 155476 481818 636739 428463
46264 428463 -19115 -299082 -230843 -109876 -290427 -694932 -938648 -838376 -576596 -401542
46254 -401542 -410964 -655362 -1146954 -1595714 -1434280 -451256 755823 1339400 1140175 689014
46244 689014 366574 82821 -187699 -176265 160495 477076 701837 1270259 2265073 2909201
46234 2909201 2521643 1517352 790464 494462 162938 -304361 -625553 -889008 -1416355
46225 -1416355 -1947675 -1869729 -1286565 -950092 -1007241 -776908 -46039 389233 -20908 -624011
46215 -624011 -513439 209299 790030 932481 871351 711514 367690 -56448 -386046 -689141
46205 -689141 -1011721 -1036789 -506850 217252 541701 452155 449346 772352 1177720 1451291
46195 1451291 1649639 1770485 1607372 1090307 496261 162894 119140 63238 -347111 -1121695
46185 -1121695 -1777522 -1694208 -786911 289280 756300 419252 -348023 -1091005 -1510567
46176 -1510567 -1404516 -727510 281258 1249609 1974219 2442644 2595443 2250928 1351175
46167 1351175 233959 -453057 -270741 524499 1210140 1454636 1665960 2202435 2604337
46158 2604337 2186992 1159519 395646 159577 -67912 -396242 -168095 800607 1588399
46149 1588399 1438409 850891 619426 507623 -120361 -886323 -774988 262615 1154436
46140 1154436 1191033 760675 504099 561757 847537 1339589 1827796 1934908 1626858 1266498
46130 1266498 1049792 847279 663570 727255 1008191 1142286 966278 683817 435702 188125
46120 188125 85426 342000 679984 483636 -284944 -895906 -829049 -414812 -222881 -311857
46110 -311857 -406888 -378382 -205251 161761 586974 735091 536985 341372 374736 406066
46100 406066 166410 -280526 -796101 -1357470 -1745983 -1534595 -735831 -17400 129420 57813
46090 57813 416627 1292810 2257219 2858466 2690283 1465511 -411691 -1746382 -1680970
46081 -1680970 -695932 69367 224510 256890 535746 923733 1246644 1411869 1111395 164527
46071 164527 -806778 -838289 48953 723281 446002 -196345 -284895 150147 440411 396273
46061 396273 390086 548214 589206 491971 685836 1332419 1863457 1589671 560472 -498599
46051 -498599 -1009545 -995174 -709138 -175740 646668 1451170 1735779 1416810 936493 594506
46041 594506 115381 -788710 -1686423 -1770712 -932555 -16707 180138 -177852 -312241 148300
46031 148300 815235 1131306 1004820 747801 552870 254008 -313504 -866733 -871967 -265844
46021 -265844 318645 312204 -39920 -88578 214970 286688 -92117 -396677 -260404 -130285
46011 -130285 -475359 -811326 -287865 912563 1575333 1002134 -113129 -675012 -526347
46002 -526347 -354137 -594676 -939773 -864285 -289230 327642 429156 -65647 -581426 -470413
45992 -470413 165577 542178 209042 -414474 -783180 -1003358 -1358072 -1518252 -1019814 -302397
45982 -302397 -338072 -1151597 -1626255 -1091261 -262321 -104852 -499488 -711755 -603782 -560386
45972 -560386 -576807 -305326 102319 35743 -580173 -1009900 -658916 176696 733835 609931
45962 609931 3566 -582487 -730346 -393081 121201 515147 704540 533494 -318430 -1709979
45952 -1709979 -2681693 -2415488 -1388588 -821086 -1028044 -1166693 -716640 -249143 -324468
45943 -324468 -507847 -157869 440633 510330 -21621 -492969 -486045 -202539 57016 231585
45933 231585 292090 109851 -385301 -1103033 -1783256 -1990783 -1410677 -386689 176321 -179527
45923 -179527 -838407 -908180 -387178 -56007 -392088 -1101566 -1647878 -1790493 -1636838 -1528086
45913 -1528086 -1789882 -2265498 -2280625 -1476181 -450915 -61853 -282897 -365975 3221 406933
45903 406933 513871 459289 340089 75197 -92943 247877 780775 577806 -443739 -1051913
45893 -1051913 -382067 662459 609045 -533580 -1498367 -1712750 -1796029 -2074398 -1879687
45884 -1879687 -823483 277857 535158 307430 492704 999836 965415 321018 73909
45875 73909 817046 1838029 2119916 1556953 709192 -66923 -662714 -853951 -572861 -268088
45865 -268088 -343293 -461935 -117107 287976 -186246 -1500911 -2422673 -2163914 -1419340 -1220963
45855 -1220963 -1442913 -1194976 -285446 526163 624866 207326 -183926 -257094 -6326 407431
45845 407431 644065 364541 -369842 -1002689 -911987 45931 1347469 2130303 1884852 948741
45835 948741 198481 176966 667822 1113193 1147605 701213 29015 -215664 530835 1867568
45825 1867568 2554163 1944597 833296 368232 587676 690148 368965 60409 24193
45816 24193 -11225 -234306 -437728 -433586 -276291 4825 469613 1024690 1448450 1591917
45806 1591917 1295452 405892 -728413 -1222108 -734460 -146892 -364617 -887791 -627583
45797 -627583 198013 327878 -415718 -734188 64611 994481 1068204 811024 1166022 1825444
45787 1825444 1707091 534255 -952430 -1954968 -2080781 -1283765 -42153 770751 799064
45778 799064 621771 779750 945181 672319 360349 647260 1314827 1670255 1660186 1718440
45768 1718440 1790314 1451325 861597 680712 1022184 1310307 1238835 1110958 1106197 927526
45758 927526 411366 -84921 -180798 27102 165329 35371 -204470 -120770 644502 1877749
45748 1877749 2815424 2911827 2346480 1535606 583493 -368904 -790369 -438955 17010 -159848
45738 -159848 -640014 -586930 -73620 59380 -355330 -580889 -263711 91746 174762 411148
45728 411148 1065841 1656046 1716972 1430803 1050675 391777 -589888 -1304531 -1176927 -389430
45718 -389430 438378 931585 1016411 761229 492477 606764 956869 922942 397789 111927
45708 111927 575832 1301117 1577992 1455968 1362340 1275265 966321 630268 513633 232039
45698 232039 -737679 -2035461 -2652233 -2185314 -1243681 -609990 -571558 -1059699 -1814445 -2284088
45688 -2284088 -1914616 -778405 426591 1130658 1337556 1279432 1034396 649350 319601
45679 319601 218940 291123 318996 123376 -274018 -576897 -448763 -21968 46179 -612283
45669 -612283 -1389433 -1333070 -395453 534079 899888 1103487 1560615 1804576 1164211 -41900
45659 -41900 -751847 -570865 -254136 -565247 -1195738 -1252017 -536296 150867 -13291 -957912
45649 -957912 -1891739 -2135088 -1606217 -661918 272817 895118 1036192 646008 -174417 -1124550
45639 -1124550 -1774089 -1840676 -1456418 -1037080 -802758 -550976 -23897 630870 970131 790717
45629 790717 373802 167546 333025 620568 645679 320016 19848 196651 782516 1212205
45619 1212205 1173893 1059419 1388402 2032177 2428221 2438755 2505818 2901198 3257308 3033142
45609 3033142 2177843 1161167 502896 357304 435136 318349 -38948 -207975 149088
45600 149088 754937 1019863 742396 215315 -225144 -410975 -251897 160696 481708 555444
45590 555444 752683 1371405 1929542 1725672 942724 387432 202056 -213479 -913899 -1130649
45580 -1130649 -627879 -244337 -470619 -497744 443528 1609617 1668071 590240 -412470
45571 -412470 -535433 6057 788833 1579644 1911119 1232482 -222145 -1391315 -1538686
45562 -1538686 -1012359 -625730 -649199 -676596 -298994 325600 648799 483862 365057 787656
45552 787656 1236102 683026 -800866 -1801351 -1402218 -436064 -156260 -410257 -129389
45543 -129389 904584 1918890 2483019 2844866 3031915 2696763 1909635 1160734 538390
45534 538390 -180568 -653805 -256278 663167 944328 312144 -196800 92408 504069 298765
45524 298765 -87140 70602 454372 229443 -562709 -1021447 -613758 243847 720463 324605
45514 324605 -652587 -1218239 -596145 721083 1390008 949804 403990 619576 1002691
45505 1002691 582164 -301995 -495729 149563 597928 215356 -511196 -991295 -1308655
45496 -1308655 -1596545 -1402841 -276882 1384544 2586672 2721539 2038024 1242460 822654
45487 822654 681773 306609 -648596 -1886728 -2650688 -2429009 -1419554 -280480 481093
45478 481093 813194 903804 855579 722638 776646 1398948 2518930 3423595 3462338 2800457
45468 2800457 2127671 1763097 1493434 1197371 1051189 1045610 878343 532546 452256 869026
45458 869026 1378402 1461116 1065922 465449 -68603 -244813 138516 809142 1183906 1143010
45448 1143010 1134946 1273904 1001746 98761 -629262 -348049 594011 1176269 1099030 926753
45438 926753 1019872 1042443 558116 -388609 -1324432 -1687052 -1244700 -446926 -110414 -462620
45428 -462620 -834811 -638123 -195821 -135983 -420965 -582362 -517775 -389800 -91915 463287
45418 463287 828360 556823 21427 -58908 291459 432814 117423 -389395 -950128 -1491179
45408 -1491179 -1568966 -947773 -368176 -660086 -1284305 -1022977 -59303 129096 -780539 -1201328
45398 -1201328 -50049 1488846 1674733 622820 -208083 -215026 -75658 -333983 -727865
45389 -727865 -907012 -944610 -1021454 -1171509 -1399701 -1673713 -1852016 -1896413 -1972219 -2080203
45379 -2080203 -1889784 -1261198 -607516 -362242 -382348 -241784 176738 711037 1196476 1391450
45369 1391450 1042444 395597 172833 580825 837769 253410 -695644 -1051980 -733754
45360 -733754 -426709 -413402 -365839 -192579 -247620 -608960 -838408 -620176 -136199 272973
45350 272973 381682 28998 -720576 -1368996 -1414054 -991678 -652362 -562429 -438489 -228819
45340 -228819 -268502 -668877 -1062502 -1085311 -728776 -183009 294899 422100 234956 256132
45330 256132 762951 1048939 167038 -1601698 -2853047 -2788474 -2016981 -1369169 -791953
45321 -791953 56326 861386 1031678 594724 89415 -146520 -92311 232398 665876 819268
45311 819268 588790 487261 956818 1589350 1593940 920688 392551 729455 1830886 2987865
45301 2987865 3484764 3091781 2280291 1822091 1887716 1782941 948520 -112699 -486878
45292 -486878 -172855 -7081 -340820 -632512 -526268 -505810 -1031074 -1670361 -1680683 -1033495
45282 -1033495 -273850 342492 930749 1331956 1073202 139061 -701412 -643938 270909 1207705
45272 1207705 1342590 534931 -636131 -1364334 -1246792 -567358 46807 263594 264902 330121
45262 330121 395621 198960 -244318 -566181 -506256 -235324 -65939 325 188313 487243
45252 487243 617343 541495 629988 1026394 1177358 514069 -523179 -799929 -1567 796136
45242 796136 514221 -463780 -872367 -339156 222319 30506 -552473 -772291 -609148 -600624
45232 -600624 -920059 -1229083 -1294809 -1234797 -1182283 -1116411 -996196 -714829 -26515 1043648
45222 1043648 1809567 1513601 363300 -602383 -839372 -869192 -1221102 -1473914 -975124
45213 -975124 -74591 151342 -666924 -1694701 -1937973 -1314960 -543922 -309548 -688312
45204 -688312 -1194048 -1325013 -1152860 -1203272 -1575343 -1560335 -640861 457428 518418 -420976
45194 -420976 -1003931 -464162 315971 178724 -680511 -1220065 -1098355 -806569 -587884 -175469
45184 -175469 440000 810137 704449 359455 8923 -245773 -148728 402619 778144 223781
45174 223781 -822563 -1030523 -144198 439572 -268050 -1268210 -1110964 -172073 -13226
45165 -13226 -918490 -1606815 -1397446 -1143235 -1585343 -2113414 -1908992 -1283024 -977040 -907007
45155 -907007 -573266 -187869 -400826 -1187239 -1895053 -2232157 -2402765 -2407244 -2036935 -1509864
45145 -1509864 -1266126 -1083436 -261052 1122452 1980844 1624230 683665 190585 350846
45136 350846 735912 1122812 1496083 1606754 1233382 711532 590108 825566 847804 407878
45126 407878 -140412 -456640 -647679 -930594 -1218942 -1260879 -981237 -507619 22523 544232
45116 544232 1003127 1281720 1193119 596941 -406490 -1418851 -1943491 -1677134 -710038
45107 -710038 415519 938527 489511 -458259 -1026707 -887365 -432090 55302 787120
45098 787120 1679443 1838488 634806 -1034327 -1490463 -328234 1096033 1448789 929042
45089 929042 573301 709448 790058 461866 98800 218576 826202 1496559 1872792 1947714
45079 1947714 1949247 2028696 2074494 1871357 1421706 980127 740195 642912 564474 527416 602618
45068 602618 730477 782878 729314 619869 438215 62271 -598829 -1386639 -1799206 -1303429
45058 -1303429 30421 1334445 1742275 1374255 1128188 1436867 1749672 1497736 1027644
45049 1027644 1036622 1433086 1457917 861976 267976 208522 422649 451476 432885 773788
45039 773788 1304021 1371871 793502 171740 68078 273656 234338 -94295 -270187 -131008
45029 -131008 -29759 -202260 -368012 -250103 -122386 -396238 -871893 -932942 -475659 -111102
45019 -111102 -261508 -520421 -267704 381684 690859 276185 -427104 -735633 -467682 -3950
45009 -3950 198189 -7454 -435433 -746664 -648290 -81647 671412 1132128 1031710 611105
44999 611105 371966 448579 404177 -158366 -941698 -1236468 -827018 -234735 49629 184177
44989 184177 549254 1019013 1102144 706622 316494 334494 616017 814677 869717 889255
44979 889255 803344 519055 304706 530860 919075 551950 -966829 -2688819 -3231664
44970 -3231664 -2429909 -1459795 -1221363 -1294391 -903109 -268843 -232381 -842688 -1212879 -828475
44960 -828475 -190412 130890 390179 1102376 2016542 2251221 1359699 -115067 -1110494
44951 -1110494 -879686 455987 1913085 2343123 1418321 -102865 -1208476 -1537505 -1293847
44942 -1293847 -626683 405236 1386135 1666911 1145721 530313 512887 901042 904843 211445
44932 211445 -594548 -811821 -523489 -396303 -714585 -1058219 -1018746 -744092 -467435 26312
44922 26312 893269 1521459 1111360 -83225 -884739 -695146 -108036 199097 322774 429265
44912 429265 72453 -972828 -1823796 -1430711 -123826 703166 356190 -536367 -1115466
44903 -1115466 -1162176 -789663 -96796 576250 694966 188461 -382224 -543865 -366782 -45698
44893 -45698 430771 916818 952375 410556 -53391 333249 1492633 2514123 2568748 1656792
44883 1656792 575104 211378 674508 1109680 669941 -332365 -689683 163704 1369793
44874 1369793 1684029 890650 -159438 -607807 -325203 190698 330485 -94565 -668556
44865 -668556 -883084 -841412 -1050022 -1440988 -1226495 -74419 1158212 1406179 676458
44856 676458 -202470 -696440 -805499 -583466 -182362 -106881 -607710 -1008235 -524374 361502
44846 361502 390204 -532573 -1053504 -436591 244716 -231111 -1314407 -1495346 -456330
44837 -456330 732414 1287721 1420634 1375660 922427 152828 -180917 289811 843967 634986
44827 634986 -121333 -546128 -317638 163141 579289 963697 1224320 1091433 663822 451540
44817 451540 676901 977194 999657 882368 921627 1138654 1410571 1655079 1630690 984958
44807 984958 -118221 -824682 -557174 138556 283016 -229223 -667649 -681598 -691553 -959103
44797 -959103 -1059293 -662339 -214848 -306353 -768799 -971621 -769032 -597676 -727234 -925930
44787 -925930 -913588 -733444 -539394 -295405 148220 809776 1499615 1928703 1893324 1424524
44777 1424524 743355 52021 -529536 -811922 -573275 78232 598719 531953 783 -575367
44767 -575367 -1083147 -1689442 -2336133 -2703356 -2699967 -2575974 -2444958 -2081179 -1360701 -566055
44757 -566055 -50984 104082 -73378 -594990 -1227626 -1449499 -1104374 -784701 -1041745 -1447286
44747 -1447286 -1090160 62392 1015976 1098423 770581 774540 1082714 1162039 818995 277616
44737 277616 -197949 -250155 578686 2130824 3243890 2878586 1467481 322571 -173070
44728 -173070 -802178 -1894899 -2605440 -2236404 -1315129 -741503 -659144 -796018 -1118337 -1375720
44718 -1375720 -782124 842938 2210163 1963018 565440 -338516 -169026 198481 145770
44709 145770 67800 237986 204772 -205566 -334044 281329 1127959 1493696 1332649 939401
44699 939401 470060 192036 457140 967704 823136 -194807 -1121153 -1116960 -521370 -43339
44689 -43339 253766 472659 272066 -363091 -532663 345006 1369664 1373655 742788 756628
44679 756628 1518439 1941214 1637424 1386107 1598936 1682957 1289982 994475 1195875 1349645
44669 1349645 917971 311090 263645 847523 1606371 2163831 2277847 1798828 1001229 516802
44659 516802 561195 634540 294396 -236553 -551965 -650005 -647366 -375382 262748 888214
44649 888214 1080578 977732 1034431 1366385 1674235 1661412 1252949 562851 -108976 -386248
44639 -386248 -125536 467175 1081703 1502486 1599002 1428766 1359554 1721979 2290631 2492431
44629 2492431 2179823 1770703 1549514 1299433 765171 51349 -568736 -863025 -654681
44620 -654681 -91076 184441 -231203 -679689 -209391 825998 1014492 -10523 -894018
44611 -894018 -542527 367996 684208 511660 578881 725200 299234 -465697 -721138 -336877
44601 -336877 136827 530190 969641 1052763 362500 -368282 34774 1253908 1612499 449121
44591 449121 -898744 -988617 -49153 779048 1045734 1057787 1005292 815159 553942 418069
44581 418069 495966 770406 1069786 982043 335808 -221567 129671 1044946 1244872 393922
44571 393922 -262116 277907 1266395 1361947 512940 -264537 -395384 -42898 622089 1393487
44561 1393487 1602722 817727 -181657 -188732 700294 1169554 554549 -396586 -795772 -611698
44551 -611698 -97191 719165 1439242 1162383 -283593 -1687879 -1847888 -1092175 -619548
44542 -619548 -781119 -938337 -764618 -697651 -1050413 -1501997 -1666516 -1527041 -1122086 -398420
44532 -398420 395948 724475 457507 89752 -8842 -74533 -349853 -517041 -236686 156875
44522 156875 134185 -95544 160142 906499 1247021 578911 -519545 -972554 -488553 208461
44512 208461 318726 -162959 -555482 -307589 415913 995920 1113166 1009664 920477 582924
44502 582924 -315718 -1383198 -1725068 -973777 270945 1125790 1201838 633110 -224985
44493 -224985 -897561 -960598 -429740 213383 577388 733131 906098 1115589 1321567 1612519
44483 1612519 1996176 2279294 2376125 2432138 2442148 2144892 1559083 1157733 1157527 1152982 909502
44472 909502 909620 1434935 1722937 1022082 48969 179841 1345961 2067508 1728497 1412570
44462 1412570 1947226 2468634 1901829 814055 527800 1013176 1009906 40096 -953016 -1079846
44452 -1079846 -547833 60916 648671 1281523 1700657 1695137 1516156 1449978 1335604 951217
44442 951217 559083 566887 870583 1054352 1087179 1216087 1193401 348681 -1245766 -2306407
44432 -2306407 -1679582 114469 1347824 1081448 87153 -344909 111714 875111 1423741
44423 1423741 1597107 1239183 261745 -922557 -1606990 -1567696 -1211064 -856247 -340106
44414 -340106 474593 1247714 1544628 1383699 1109936 948586 945091 1128955 1436575 1603315
44404 1603315 1391694 856949 244164 -224122 -321738 166486 1134555 2034497 2363416 2191969
44394 2191969 1992383 2057031 2306764 2532699 2552012 2223518 1604647 1059207 945762 1188659
44384 1188659 1349405 1112526 558345 27260 -136768 167485 616931 675364 215538 -244603
44374 -244603 -222491 16752 -127983 -592038 -639217 40429 789700 851014 364732 102087
44364 102087 449616 1075416 1495373 1560431 1331619 801649 -53198 -1045830 -1766105 -1870103
44354 -1870103 -1423299 -942911 -971113 -1492900 -1850752 -1397753 -238917 825913 1142556
44345 1142556 831894 470241 307069 77883 -411364 -861322 -876186 -563977 -387007 -471944
44335 -471944 -444251 -19680 603455 1119928 1541283 1937040 2023591 1467858 551877 97064
44325 97064 562469 1454018 1797280 1106360 -174917 -1094156 -1014416 -118937 857603 1419652
44315 1419652 1747780 2245091 2796235 2776299 1838296 429047 -636083 -964632 -791800
44306 -791800 -488604 -95329 541382 1268508 1527369 973546 94754 -164670 456386 1114613
44296 1114613 899313 25632 -472314 -112000 541452 819350 795593 868497 970168 726581
44286 726581 227769 117621 832468 2056556 3042358 3294683 2871402 2155115 1440785
44277 1440785 753475 67813 -383962 -253465 394331 964555 982093 638170 368182 100767
44267 100767 -551765 -1385212 -1517344 -502381 923825 1613307 1219555 256365 -734867
44258 -734867 -1511488 -1794624 -1323750 -420243 57112 -358879 -1200004 -1692267 -1581426 -1064799
44248 -1064799 -309677 503063 940527 701320 179605 126999 677558 1133554 854564 22165
44238 22165 -625010 -547634 214964 1149817 1624399 1378351 795721 501645 650698 878981
44228 878981 956969 1040973 1126907 789419 -120923 -928128 -855460 -110587 346014 93729
44218 93729 -268475 -83253 445068 631038 278028 -142816 -161552 201330 614024 803406
44208 803406 669209 285162 -52650 25661 535326 981652 920965 618646 780715 1564890
44198 1564890 2259487 2144504 1285257 187102 -891358 -1786414 -2003378 -1217993 -68278
44189 -68278 386658 87424 44412 755060 1400226 1116635 328863 80864 535940 962055
44179 962055 970169 969082 1390490 2111066 2760295 3121345 3100545 2678459 2030286 1430700
44169 1430700 939248 369481 -366736 -1007151 -1075503 -304616 939583 1733649 1466039
44160 1466039 679761 562355 1425143 2275105 2238805 1762266 1802860 2380902 2706467 2385590
44150 2385590 1711603 1011232 480088 449262 994384 1445615 1145068 557756 683432 1429391
44140 1429391 1650123 939173 265045 461182 1117513 1493308 1583169 1590928 1153091 -54684
44130 -54684 -1435604 -1996898 -1503580 -549605 223829 469524 25095 -942721 -1827662 -2057413
44120 -2057413 -1585108 -696006 373864 1356979 1865806 1761955 1350310 938900 535760
44111 535760 199267 205041 527234 655898 355002 123180 438286 1039881 1499683 1997048
44101 1997048 2844000 3633564 3617655 2724938 1561970 599308 -64095 -384415 -452204 -647968
44091 -647968 -1079394 -1126057 -248293 1010031 1621308 1458362 1193521 991656 389324 -449655
44081 -449655 -517196 561908 1771141 2000234 1378124 708507 202846 -499595 -1444480
44072 -1444480 -2224930 -2592001 -2647222 -2483242 -2059470 -1409512 -652100 160331 942335 1417342
44062 1417342 1367757 1025825 932034 1334197 1902884 2106228 1747414 1077686 470727 66858
44052 66858 -282988 -787446 -1459368 -2060543 -2271305 -1956392 -1312700 -695798 -237183 244992
44042 244992 833921 1235362 1215749 1099630 1316589 1579877 1235490 489933 401565 1282211
44032 1282211 2027663 1727421 1098216 1313937 2065423 2081529 1274162 910085 1502235 1919510
44022 1919510 1158223 -117826 -606024 -145705 402216 560101 635790 900177 1115798
44013 1115798 978105 572430 243315 190470 246910 38494 -549737 -1120032 -1200259 -867235
44003 -867235 -570956 -369983 155619 1121371 1999343 2294998 2081696 1594322 813520 -135394
43993 -135394 -640794 -238946 650865 1142559 897439 280360 -357851 -1034608 -1734968 -2114996
43983 -2114996 -1837126 -1002258 -62908 627897 1059900 1362959 1499932 1341881 1042904
43974 1042904 1041450 1469479 1798281 1406357 352309 -745735 -1415749 -1522299 -1001278
43965 -1001278 -1639 837483 929295 541048 378905 415474 -27753 -959016 -1471245 -1123023
43955 -1123023 -569149 -342776 -37018 597055 746418 -243262 -1501173 -1660699 -781505
43946 -781505 -86950 -102677 -238622 -80553 91686 148904 402667 858244 1107705 1157078
43936 1157078 1459374 1926304 1860597 1175567 708895 876609 982318 504275 169936 870861
43926 870861 2181423 2956534 2975491 2945392 3065391 2687439 1577619 584441 590117 1373293
43916 1373293 1988624 1931499 1501491 1215370 1270356 1567376 1956270 2328602 2573405 2574267
43906 2574267 2323987 2025300 1945853 2079898 2076493 1671467 1097130 843081 1073906 1553035
43896 1553035 2099178 2740916 3345043 3519333 3118067 2468921 1801984 869365 -406670
43887 -406670 -1319350 -1141412 -312774 -22782 -571466 -1010366 -611951 220063 891681 1482902
43877 1482902 1993516 1691652 279378 -998184 -699815 733791 1568622 1240730 801470
43868 801470 888625 848542 313874 107760 735451 1284349 909556 349801 703275 1504259
43858 1504259 1435034 486857 -24877 526477 1362833 1687418 1600127 1358899 795856 -39975
43848 -39975 -479723 -72039 704393 1104158 1132944 1394393 2097642 2680598 2494679 1615371
43838 1615371 773802 484847 471235 196353 -234451 -248013 122017 83352 -659985 -1245058
43828 -1245058 -849791 65880 485600 300599 153776 189205 -28367 -494376 -666721 -410780
43818 -410780 -142340 36852 469393 1101784 1399545 1290634 1328455 1657693 1674237 1060807
43808 1060807 330949 -100035 -584862 -1392435 -1869043 -1212050 283353 1431376 1487245
43799 1487245 821928 335016 478765 853929 738564 96057 -193579 499125 1464315
43790 1464315 1467805 500440 -241231 -179676 -45641 -373810 -457748 433398 1708243 2279732
43780 2279732 2114787 1985442 2105406 2005625 1552063 1158206 1018174 924764 896376 1258048
43770 1258048 1926649 2222214 1706818 862967 630816 1367204 2425765 2817429 2284104
43761 2284104 1560505 1367858 1374351 691334 -648625 -1464369 -958507 212377 868769
43752 868769 732801 366792 185863 183465 291334 367223 70581 -656064 -1200023 -955469
43742 -955469 -207936 227268 103517 -91468 17178 233429 204327 -120830 -466033 -400768
43732 -400768 343678 1466954 2203930 2115817 1547614 1061834 791317 670620 832380 1291172
43722 1291172 1669354 1779596 2045420 2736359 3246067 2878768 1969788 1401045 1311991 1169717
43712 1169717 872681 823226 1011512 981198 706438 620559 775272 862498 1058595 1853162
43702 1853162 2948163 3370993 2915978 2464335 2562484 2698442 2398140 2001743 1775776
43693 1775776 1252676 220273 -502581 -206182 456306 349523 -467547 -973173 -854678
43684 -854678 -914956 -1728845 -2740457 -3009886 -2340172 -1340116 -627350 -225725 270788
43675 270788 1020737 1562711 1335841 507175 -113838 -65847 297966 488562 518413 581031
43665 581031 623237 661610 1037093 1799169 2233482 1662709 472974 -323608 -396567 -278977
43655 -278977 -306840 -146290 437851 1013825 1065853 713186 467322 564914 886391 1294090
43645 1294090 1663390 1722698 1282381 611433 190528 23917 -354338 -947485 -855684 640099
43635 640099 2785781 3925085 3477587 2582886 2415787 2631109 2178517 1056462 275016
43626 275016 339196 786204 1199760 1664864 2041098 1786702 910309 243889 289817 577720
43616 577720 683607 1037785 1956547 2622399 2061709 716787 -9911 375681 1007629
43607 1007629 1066457 726901 534762 632645 920303 1380890 1889245 2107171 1858813 1318560
43597 1318560 694759 101676 -142300 384358 1464721 2033974 1249155 -365229 -1320047
43588 -1320047 -782317 536742 1274249 968832 435456 612160 1375376 1794426 1405888
43579 1405888 759205 549142 659588 493911 -2803 -224624 163254 693919 757125 443798
43569 443798 373176 822301 1387657 1539750 1222919 764522 400551 124113 -96150 -218896
43559 -218896 -250586 -206151 60144 648772 1182482 1071050 472498 434063 1522431 2781499
43549 2781499 2861141 1914174 1386175 1919213 2526806 2160752 1100318 231150 -197972
43540 -197972 -388986 -286514 106882 247387 -228834 -681322 -261273 726039 1170787 751411
43530 751411 281240 455645 1104251 1802936 2420243 2814711 2686448 2046254 1302318 646527
43520 646527 -119236 -922930 -1162556 -469479 684347 1473645 1507242 944998 243628 5731
43510 5731 600033 1574802 1855709 946685 -372481 -944268 -534788 198211 744096 1136352
43500 1136352 1392230 1218171 528863 -158032 -217260 327464 817326 722876 220487 -41047
43490 -41047 340453 1082371 1466763 1041804 154634 -238406 517172 1961756 2846070 2496072
43480 2496072 1635689 1456690 2027455 2238141 1414311 297293 22763 672621 1402734
43471 1402734 1624018 1416974 1015548 585198 474873 1036553 2073434 2966545 3464999
43462 3464999 3891958 4430527 4669486 4132191 2964213 1829016 1251324 1208441 1286466
43453 1286466 1176563 1038414 1284990 1964895 2606920 2852028 2922747 3141106 3294918 2955637
43443 2955637 2210912 1562486 1230337 1058909 973116 981715 860408 454197 219507 778699
43433 778699 1903894 2622712 2438142 1796399 1233660 772010 391675 389033 856499 1344229
43423 1344229 1469661 1490482 1924845 2890941 4064537 5029081 5523228 5593947 5528032 5363649
43413 5363649 4654917 3206142 1789801 1375526 1765670 1886004 1418070 1132067 1472836
43404 1472836 1920889 2066775 2199135 2375790 2055213 1266677 1016697 1752580 2499093
43395 2499093 2433166 2269344 2985611 4118428 4589710 4461205 4524747 4768542 4663096 4527640
43385 4527640 5187504 6537846 7768932 8783281 10148433 12041532 14677183 19242629
43377 19242629 26299217 33155851 35130089 30465919 22484804 15893798 12276528 10175534
43369 10175534 8163476 6217340 4761124 3918125 3698559 3971098 4232977 4012987 3412133
43360 3412133 2838755 2463282 2302339 2468205 2897003 3164899 2971979 2488257 1938182
43351 1938182 1305529 763694 819145 1572251 2369281 2661212 2655865 2629942 2271572 1417134
43341 1417134 830908 1338451 2548854 3328170 3318469 3154041 3323847 3628523 3706620 3387670
43331 3387670 2595704 1579730 1114619 1715745 2729222 3008315 2485456 2213936 2755701
43322 2755701 3448077 3564107 3329253 3285847 3344595 3082947 2529208 2073270 1888061 1910093
43312 1910093 2156986 2638268 3118517 3327126 3291907 3225684 3240210 3362828 3618029 3896605
43302 3896605 3989232 3928231 3971983 4041660 3628583 2663357 2022941 2529399 3711030 4314049
43292 4314049 3987701 3652973 4011173 4487299 4170017 3221868 2625410 2761756 2983013
43283 2983013 2668212 2068202 1788009 1878738 1931930 1895616 2242485 3167048 4014301 3899472
43273 3899472 2810613 1740276 1629021 2440490 3436485 4098060 4446062 4593955 4448505
43264 4448505 3984975 3471358 3175513 3044801 2872533 2606365 2328481 2165617 2412302
43255 2412302 3395167 4833756 5672462 5153845 3906434 3294348 3720307 4329424 4487556
43246 4487556 4638314 5279502 5978391 6154781 6173182 6715108 7476681 7522888 6807978 6351621
43236 6351621 6818494 7803253 8706604 9476638 10157886 10469723 10320764 10212319 10695380
43227 10695380 11832999 13500140 15722652 18360117 20942267 23257638 25717751 28754775
43219 28754775 32248764 35895603 39653552 43375106 46482821 48554995 49794390 50333939
43211 50333939 49550156 46831539 42709213 38414740 34511240 30757532 27147414 24141828
43203 24141828 21828161 19747486 17742688 16168217 15034477 13785634 12304104 11339014
43195 11339014 11390796 11828120 11746187 11168659 10691661 10352397 9681065 8708431 8094812 8154425
43185 8154425 8414426 8379797 8222095 8370679 8765854 8929312 8663320 8319475 8297342 8510968
43175 8510968 8544195 8251198 7955160 7970147 8166870 8255200 8324763 8711573 9338277 9642089
43165 9642089 9347049 8912676 8892197 9153556 9180837 8985332 9186295 10099858 11185783 11668580
43155 11668580 11472470 11233113 11441765 11866931 11951875 11617738 11407459 11775373 12488199
43146 12488199 13000527 13298905 13951613 15211121 16495987 17119358 17252817 17675553 18651433
43137 18651433 19593626 19965788 20012157 20276567 20789687 21211914 21585405 22399983 23884253
43128 23884253 25703566 27504763 29346694 31374573 33476732 35622360 38208265 41590431
43120 41590431 45474862 49328349 53344720 58445036 65254326 73639411 83452183 95209415
43112 95209415 109738392 127577234 149026240 174371792 203709180 236827810 273193851
43105 273193851 310864651 344539269 365789113 367426583 348693128 315797674 277282465
43098 277282465 239301108 204715453 174624415 149300340 128278094 110839408 96604844
43091 96604844 85266929 76070506 68184232 61419125 56013322 51811939 48177294 44657490
43083 44657490 41296218 38318388 35885958 34086090 32781952 31537651 30010870 28302897
43075 28302897 26644689 25027125 23575743 22934151 23564928 24830336 25555878 25518341 25576930
43066 25576930 26205216 26778160 26711145 26512207 27064057 28396719 29848961 31096039 32353278
43057 32353278 33780327 35344254 37215094 39726907 42920301 46590309 50800273 55866228
43049 55866228 61746889 67911551 73980352 80069665 86225365 91837495 95980247 98196787
43041 98196787 98667187 97730608 95627077 92797562 90111466 88445162 87972645 88025506 87759931
43032 87759931 86905373 85794115 84799703 84007295 83458982 83422294 84185412 85727292 87819530
43023 87819530 90360156 93334150 96465056 99247435 101524372 103840570 106896199 110522398
43015 110522398 113316407 113523448 110468606 105135704 99228821 93668526 88162126 82204427
43007 82204427 76086378 70611957 66104739 62191588 58518760 55167083 52223657 49427260
42999 49427260 46574529 43962005 42025663 40699011 39499906 38176294 36905472 35854873
42991 35854873 34889693 33808507 32610168 31424158 30377395 29590479 29066919 28494042 27416357
42982 27416357 25768869 24008362 22530506 21193778 19658364 17941781 16282427 14656429
42974 14656429 12914620 11328168 10428399 10170848 9798260 8843312 7826130 7528049 7892898
42965 7892898 8154475 7876713 7349196 7015893 7018872 7327976 7825550 8165063 8026602 7679202
42955 7679202 7828508 8681450 9606781 9983477 9891013 9585922 8850927 7519057 6262258
42946 6262258 6018942 6703518 7264315 7126269 6851197 7123657 7753264 8091507 7911365
42937 7911365 7390849 6629810 5737461 5165907 5405827 6384637 7527717 8339968 8621567
42928 8621567 8290245 7459352 6657175 6485572 6922397 7305853 7171656 6836719 6960883
42919 6960883 7713462 8600640 9091517 9250824 9618196 10423765 11097540 10867160 9848243
42910 9848243 9096538 9315648 9924005 9868831 9072562 8469398 8725201 9558999 10361256 10845844
42900 10845844 10923187 10528228 9874477 9402143 9171723 8745989 7967248 7357656 7335360 7502467
42890 7502467 7259225 6761703 6635108 6962933 7225766 7143945 6916683 6630131 6137487 5697573
42880 5697573 6026501 7266632 8376132 8112009 6472397 4749856 4214938 5050026 6472595
42871 6472595 7476936 7368385 6008365 3950779 2245434 1695144 2121018 2565530 2399822
42862 2399822 2031437 2259777 3140517 3943050 4182617 4131211 4134610 3986253 3383559 2595473
42852 2595473 2176152 2254361 2546969 2836696 2963463 2601242 1655515 738405 585305 1038518
42842 1038518 1296677 1192989 1414443 2208917 2706232 2097853 926688 518560 1379544
42833 1379544 2710445 3393299 3045457 2188505 1693213 1967208 2483405 2301511 1239139
42824 1239139 199666 56793 612457 1100976 1320671 1590564 1820402 1469115 534895
42815 534895 -157469 10964 664607 1044134 974872 787114 596143 223664 -241415 -350517
42805 -350517 57877 504064 493864 311010 740764 1909245 2808230 2359782 775378
42796 775378 -614728 -883785 -347833 255674 808678 1550666 2247337 2367387 1967415
42787 1967415 1675933 1696084 1481964 683915 -137706 -181505 550807 1322974 1600818 1546403
42777 1546403 1681728 2377600 3600686 4878165 5577559 5517374 5265053 5523755 6232467
42768 6232467 6630126 6290988 5700594 5557194 5835693 5953808 5682778 5371999 5234160
42759 5234160 4952323 4296487 3714973 3833856 4578145 5315693 5805352 6406418 7201872
42750 7201872 7499798 6625765 4877376 3259491 2446919 2359270 2577376 2763440 2745989
42741 2745989 2580385 2531451 2709094 2780177 2351373 1550219 857083 446818 156072 62539
42731 62539 510545 1423628 2175353 2434045 2607292 3044183 3292796 2748661 1721622 1144422
42721 1144422 1283608 1423060 975333 318473 202523 734241 1350941 1566765 1346961
42712 1346961 860611 280314 -126238 -68328 403245 805018 710605 238209 -128429 -126429
42702 -126429 84332 259327 339579 308309 23420 -610449 -1407364 -1993927 -2087931 -1608216
42692 -1608216 -627610 646637 1912315 2894637 3389336 3215091 2358690 1243105 544653
42683 544653 525651 791305 908337 925341 974591 791009 194402 -271600 58484 828253
42673 828253 923238 -6126 -1034666 -1223255 -711396 -221074 -91974 -218708 -414217 -412737
42663 -412737 16578 586845 650481 214550 142868 823496 1377460 981638 295371 504221
42653 504221 1407703 1697276 967718 181052 34041 89518 -147150 -408044 -396131 -339881
42643 -339881 -261429 345421 1407965 1762182 677239 -814502 -1158542 -357870 292723
42634 292723 245281 256431 872777 1518234 1498724 1060257 888022 1081925 1162685 817597
42624 817597 231674 -197337 -238055 -11447 107307 -106429 -425006 -455665 -158529 206678
42614 206678 569726 1079445 1640287 1876693 1684889 1428149 1452493 1782100 2381482 3233438
42604 3233438 3976392 4018042 3373793 2918791 3333864 4153986 4360412 3644141 2582646
42595 2582646 1813888 1600938 2023171 2913635 3586296 3268979 2011649 703959 11655
42586 11655 -268659 -585415 -824152 -535143 256867 888140 735772 -122831 -971500 -1136066
42576 -1136066 -624397 -77492 -57002 -492698 -921101 -1041308 -778244 -47150 1061855
42567 1061855 1954397 1954813 1162064 386983 96463 -50051 -382450 -526786 320 911949
42557 911949 1418480 1191983 617101 196124 76506 91770 -17843 -351324 -639510 -476367
42547 -476367 102659 607695 859689 1281428 2036974 2433743 1862681 945312 902691 1921143
42537 1921143 2956660 3162451 2746018 2330778 2213598 2430901 2878190 3143047 2838452
42528 2838452 2297534 2287126 2816414 2964793 2252204 1461542 1582201 2516353 3378015 3590924
42518 3590924 3168917 2382314 1711645 1710778 2329331 2727453 2305062 1519917 1116399 1019164
42508 1019164 739204 452960 715640 1277519 1196333 246876 -633052 -569713 211354 827685
42498 827685 705055 -97483 -1062029 -1519781 -1162504 -369185 285426 788883 1518053 2420527
42488 2420527 2994188 3087029 3026504 2843658 2112376 836703 -185595 -276170 386379 1260722
42478 1260722 2077068 2596034 2390979 1469013 625339 548371 935869 1100120 1073747 1368944
42468 1368944 1859311 1744263 718064 -492374 -982041 -605101 135623 744751 1030145
42459 1030145 1011724 825383 662153 644007 726818 740341 553123 270001 237074 675860
42449 675860 1284594 1437880 894939 95344 -369169 -344945 -55238 260940 454410 492942
42439 492942 612411 1159240 2023674 2524532 2176877 1320821 675635 538883 746102 1082583
42429 1082583 1303145 1066227 373386 -182897 -153096 60110 -140076 -453114 -73274 949414
42419 949414 1684300 1746353 1764159 2107318 2136504 1357192 505886 592042 1340354 1549077
42409 1549077 831241 78912 84075 508476 609174 403571 514188 1075023 1424638 1065994
42399 1065994 492184 607572 1448622 2011482 1547451 575105 174110 567071 968481
42390 968481 741499 107971 -359589 -410264 -132711 206503 179668 -436671 -1102787 -872707
42380 -872707 368731 1555874 1745364 1275339 1109739 1465186 1738478 1543483 1171988
42371 1171988 1100393 1521458 2264976 2788746 2468910 1363014 429666 449352 998887 1137670
42361 1137670 819340 772830 1139980 1250394 863125 617093 900165 1186300 996885 717813
42351 717813 851087 1137867 1108022 931160 994355 1117004 974750 926178 1558699 2620245
42341 2620245 3244587 3165963 2923548 2864476 2740627 2429533 2300263 2545746 2705797 2200312
42331 2200312 989546 -495061 -1739484 -2336927 -2165494 -1537860 -887346 -271504 467803
42322 467803 1123856 1258139 957588 838157 1132000 1395199 1348132 1328051 1542092 1535311
42312 1535311 918136 70944 -437787 -658679 -917060 -1129369 -1099749 -1073675 -1299901 -1424473
42302 -1424473 -1083113 -744598 -1079373 -1731697 -1707277 -918614 -343972 -553082 -1045091 -1275218
42292 -1275218 -1395477 -1594661 -1544303 -997454 -274354 304179 876901 1551913 2082328 2407786
42282 2407786 2823036 3181881 2745695 1444599 468953 736657 1435138 1098363 -342397
42273 -342397 -1649472 -2089588 -2025881 -1835997 -1382324 -672085 -47905 489984 1290917 2189351
42263 2189351 2482058 2011605 1450637 1233806 1046954 709331 654049 1018216 1135379 649099
42253 649099 376092 1165618 2435247 2835334 2115843 1374374 1455540 1938564 1909900 1131908
42243 1131908 179655 -208108 282610 1353938 2368576 2933010 3200328 3517642 3958270
42234 3958270 4365374 4592190 4440406 3668809 2434811 1429289 1102745 1016716 511057
42225 511057 -220571 -404270 84579 548047 599083 682681 1182259 1696915 1660288 1183699
42215 1183699 807871 758871 876909 1001305 1006203 670622 -58617 -767185 -880272 -266242
42205 -266242 629219 1172539 1003247 335255 -110854 204004 893848 1029872 473588 221561
42195 221561 934419 1747432 1408820 232359 -182038 792819 1931085 1935481 1162084 879332
42185 879332 1475774 2245661 2587182 2547790 2284790 1797949 1321708 1300328 1698447 1858490
42175 1858490 1383065 758764 706487 1181026 1448943 1054521 312851 -192191 -301645 -341867
42165 -341867 -631424 -1055580 -1164533 -728405 -144670 -90266 -682333 -1227450 -1028917 -235458
42155 -235458 443059 707035 886404 1192112 1291422 873552 207179 -235543 -412436 -562394
42145 -562394 -650605 -447926 -76078 25566 -260822 -542375 -479617 -186581 51459 128211
42135 128211 76021 31529 336751 1198050 2044839 1829370 440993 -712884 -263131 1310642
42125 1310642 2273764 1907646 1208745 1158147 1337896 889072 56481 -145437 531866 1260704
42115 1260704 1345938 1027535 938515 1313763 1942077 2491246 2659133 2299889 1610626 1022938
42105 1022938 811865 946536 1264207 1519620 1353877 661674 20942 234346 1249117
42096 1249117 2030462 1816083 1035623 583072 633788 776774 983358 1634781 2577511 2931709
42086 2931709 2197038 1062010 669935 1297461 2127181 2252099 1615161 924503 827557
42077 827557 1279443 1695166 1623982 1156069 673505 424091 499464 999616 1853570 2550450
42067 2550450 2487309 1712920 980282 876302 1209908 1492302 1675395 1986790 2248710 1956020
42057 1956020 1121388 507954 689723 1242958 1332395 906056 727499 1172124 1614055 1372797
42047 1372797 775571 658679 1045175 1051255 175566 -988662 -1576755 -1405172 -762781 162033
42037 162033 1094589 1370044 542038 -868058 -1840759 -1969724 -1562716 -845991 167159
42028 167159 1054692 1126573 471822 119349 723327 1683798 2058215 1816151 1574233 1468458
42018 1468458 1043332 205012 -381532 -92063 793690 1301863 799214 -299515 -936845
42009 -936845 -523710 525267 1472180 2138791 2706532 2952465 2447693 1514431 1139250
42000 1139250 1651834 2250616 2235497 1946690 1923142 1878734 1308723 547232 316819 572755
41990 572755 655962 347174 -49102 -441646 -932058 -1256864 -1132189 -985748 -1382748 -1839762
41980 -1839762 -1310878 96964 1067400 980177 691765 961118 1270365 954853 495767
41971 495767 706520 1338768 1536433 1245596 1170787 1520138 1684600 1181006 259099 -478477
41961 -478477 -605140 -63795 770142 1291460 1245175 967416 828795 767488 677094 799007
41951 799007 1237544 1511106 1193898 647350 458844 505187 341225 205869 690495 1518143
41941 1518143 1671597 875298 18112 -186402 -126625 -485406 -1223586 -1837697 -2057384 -1836158
41931 -1836158 -1170229 -403123 -245959 -966644 -1893100 -2186300 -1797029 -1228557 -723367
41922 -723367 -246461 5692 -248558 -769388 -906143 -388108 411673 1037934 1362312 1360191
41912 1360191 933184 217606 -223746 117119 1043976 1737627 1602299 921248 489952
41903 489952 603571 696196 200164 -533114 -674781 -179885 78802 -346127 -683760 -34242
41893 -34242 1216449 1755797 922113 -680097 -2014313 -2473389 -2007382 -1058983 -424211
41884 -424211 -563410 -945181 -655427 270038 833557 574775 235278 484789 835516 582096
41874 582096 131487 380375 1162396 1431233 887774 319525 208149 120564 -135235 162379
41864 162379 1434487 2745140 2887209 2031474 1389757 1549879 2042610 2371116 2499828
41855 2499828 2283346 1369782 -13566 -945763 -910973 -442110 -274908 -411680 -508182 -676939
41845 -676939 -1211943 -1756509 -1480570 -197525 1186024 1579835 870156 3632 -47201
41836 -47201 671161 1166425 688043 -324279 -766638 -225877 672518 1287476 1692770 2108942
41826 2108942 2249642 1786389 1025088 518101 324302 244201 452262 1166160 1919754 1999238
41816 1999238 1543154 1362947 1597020 1417268 355206 -849545 -1139227 -293954 1150412
41807 1150412 2548370 3316995 3069770 2123292 1431219 1507066 1804470 1628937 1183996
41798 1183996 1091776 1286294 1154306 579232 96130 52549 274507 575880 979713 1366790
41788 1366790 1486527 1441297 1634138 2092963 2359326 2236687 2141859 2422823 2752297 2561480
41778 2561480 1788109 853763 113412 -332529 -413387 -44709 620484 1108188 979643 336541
41768 336541 -118249 234489 1094094 1397186 588347 -576007 -969515 -613242 -586624 -1445905
41758 -1445905 -2463178 -2644854 -1846475 -564516 739787 1661343 1781987 1192985 701501
41749 701501 927402 1494313 1664953 1440983 1371816 1540196 1509563 1183097 950261 935069
41739 935069 792151 362012 -90262 -392221 -606057 -571608 -5109 779476 977389 371840
41729 371840 -426368 -1074895 -1925722 -2877384 -2825859 -1181421 829236 1490912 755707
41720 755707 -34124 -165426 12071 463278 1698045 3281957 3595146 1928209 -214096
41711 -214096 -866908 37748 993001 1034898 515257 60541 -189529 -245231 4945 482056
41701 482056 827263 788174 379657 -309599 -1094565 -1557426 -1401654 -941697 -787614 -1008805
41691 -1008805 -1058388 -606308 -9631 202347 -39832 -397688 -551855 -453091 -329318 -455912
41681 -455912 -730324 -598169 249072 1200470 1223811 86087 -1342370 -2059948 -1798728
41672 -1798728 -904042 104745 684533 501174 -182449 -692967 -718773 -545838 -417944
41663 -417944 -183008 187931 297147 -54234 -404332 -268275 136657 290191 164852 87901
41653 87901 45973 -304487 -994330 -1538109 -1375002 -320109 1217600 2270213 1961368
41644 1961368 520103 -699207 -655585 244226 878608 818313 389675 -185035 -829438
41635 -829438 -1085265 -545307 237923 246151 -523438 -1010311 -678993 -181573 -143183 -282483
41625 -282483 -238681 -356486 -964587 -1612505 -1768922 -1675387 -1752322 -1718702 -1174405 -633516
41615 -633516 -999064 -2166390 -3032453 -2884413 -2034221 -1084197 -317869 89763 -19610
41606 -19610 -436289 -686114 -676932 -761038 -1027406 -1077687 -707507 -273328 -97959 4320
41596 4320 268543 472608 298034 -109889 -333500 -207730 177864 761543 1430441 1861125
41586 1861125 1825319 1520875 1254226 957351 423801 -125565 -234702 38215 106212 -275844
41576 -275844 -638025 -553620 -300935 -351568 -547768 -334244 334506 870419 864938 540164
41566 540164 260801 38222 -254914 -556924 -804020 -1137348 -1590529 -1856338 -1774943 -1788878
41556 -1788878 -2335070 -2893746 -2343876 -456457 1558016 2360154 1925594 1286487 1184971
41547 1184971 1497408 1812793 1999101 2091660 2023272 1692155 1153851 632213 381944 494253
41537 494253 745911 761747 507414 482404 1127813 2107903 2552318 2088856 1294608 948504
41527 948504 1129294 1321411 1199075 929656 733569 524348 157590 -213236 -307250 -149487
41517 -149487 -40647 -78951 -32133 174046 188601 -203952 -534413 -209201 458858 452340
41507 452340 -512512 -1390924 -1114223 8194 820312 922576 963656 1392757 1745802 1459190
41497 1459190 754285 223717 -84364 -614008 -1440173 -1966133 -1656695 -806264 -292376
41488 -292376 -563969 -1119506 -1199349 -837865 -788610 -1319141 -1644092 -1018198 31141 290954
41478 290954 -460975 -1179374 -1083377 -673617 -821384 -1493246 -1975886 -1954185 -1718751 -1503094
41468 -1503094 -1233232 -925279 -823698 -1015776 -1209254 -997843 -212005 939182 1922985
41459 1922985 2227975 1889773 1534832 1652763 2003447 2056353 1804683 1692572 1865692 2032402
41449 2032402 2060958 2150793 2307531 2221489 1887507 1771491 1996323 1910334 1033688 33620
41439 33620 30330 1078727 2075890 2227271 1884197 1686141 1572679 1161145 596620 341083
41429 341083 362644 239302 4433 154284 672439 773622 6533 -986634 -1354995 -1210561
41419 -1210561 -1228376 -1398264 -1038625 -44984 732890 650047 126536 -64872 154140 317050
41409 317050 220067 51407 -58624 -141534 -190113 -248396 -527120 -1012596 -1152573 -465686
41399 -465686 605476 1015612 377744 -579740 -966566 -713315 -385723 -368612 -519743 -459838
41389 -459838 -15724 533445 639283 109687 -503120 -495384 12605 192104 -273810 -707520
41379 -707520 -574812 -495900 -1357660 -2733228 -3149256 -2065971 -739381 -646434 -1659044
41370 -1659044 -2416034 -2138914 -1331605 -767892 -562052 -486410 -584348 -988763 -1484232 -1754303
41360 -1754303 -1899910 -2259976 -2801158 -3118534 -3013692 -2644405 -2098852 -1297566 -403339
41351 -403339 178776 413383 766100 1431134 1879118 1575562 786568 215822 108858 166248
41341 166248 119684 -64486 -370754 -670094 -631441 -136172 386451 469608 235999 41205
41331 41205 -208336 -739615 -1181073 -952960 -268925 100434 11883 -27671 -15687 -506990
41321 -506990 -1293086 -1276675 -232773 492198 -95285 -1059671 -1010522 -310015 -407731 -1425851
41311 -1425851 -1916463 -1057731 231132 710138 320335 -201028 -427833 -438958 -391220 -334667
41301 -334667 -211436 115458 568634 654455 24504 -819307 -1007110 -535294 -316570 -826874
41291 -826874 -1455873 -1562378 -1451300 -1714952 -2135031 -1950326 -974236 177328 896929
41282 896929 1130727 1116147 985083 743223 437864 254246 451879 1086411 1746332 1790778
41272 1790778 1028686 14609 -501229 -314362 152559 372379 191049 -112900 -149171
41263 -149171 145911 412806 331435 74097 42434 255044 372420 289778 249359 333357
41253 333357 360781 386934 708822 1153485 1021326 156926 -540555 -270740 508285 788213
41243 788213 486978 353050 577121 473543 -284645 -969977 -783857 42100 639504 643494
41233 643494 438114 451716 693137 976285 1195294 1247709 979362 421614 -93404 -312897
41223 -312897 -457887 -893745 -1394190 -1208980 -155903 798791 631030 -309783 -703497
41214 -703497 -95715 507558 198107 -477569 -374916 552266 1200547 774635 -383465
41205 -383465 -1383704 -1631731 -1051018 21191 995273 1393838 1173642 570455 -210193
41196 -210193 -874215 -863935 153224 1621742 2426191 2041933 1030949 281916 73114
41187 73114 43371 -170905 -514130 -676958 -544358 -369128 -406906 -495315 -316847 -71470
41177 -71470 -379451 -1301263 -2014620 -1899031 -1421662 -1345896 -1530527 -1316161 -785787 -680671
41167 -680671 -1111139 -1294008 -751282 30903 405732 353699 178680 -20538 -314484 -838451
41157 -838451 -1827397 -3209116 -4139204 -3700514 -2235572 -1159201 -1136240 -1288712 -656161
41148 -656161 423668 1041681 1053217 874458 554261 -23525 -405725 3784 923103 1411490
41138 1411490 1071309 367386 -169800 -374569 -122985 671803 1584569 1831113 1189072
41129 1189072 353606 116061 471584 746894 403655 -467452 -1338256 -1784414 -1818346 -1703584
41119 -1703584 -1560417 -1363250 -1259553 -1501473 -1964208 -2149097 -1855614 -1426075 -1101116
41110 -1101116 -658847 -64798 92101 -575295 -1406439 -1387932 -487035 355305 429672 -130649
41100 -130649 -810911 -1183761 -990731 -337985 192809 100365 -432016 -898565 -1208739 -1512213
41090 -1512213 -1562130 -1026349 -328664 -345906 -1188558 -2036362 -2313686 -2297479 -2385726 -2502093
41080 -2502093 -2498217 -2464875 -2319430 -1717920 -751062 -147230 -348189 -854795 -919240 -503601
41070 -503601 -165584 -320938 -945889 -1706635 -2123582 -1926256 -1445593 -1281677 -1432650 -1264182
41060 -1264182 -566196 -18116 -188797 -652969 -675031 -325035 -255329 -633860 -955580 -842312
41050 -842312 -506896 -394589 -697541 -1218109 -1517846 -1321380 -913824 -881657 -1284352 -1454651
41040 -1454651 -914923 -97051 262014 97171 -85493 15140 350830 903037 1587294
41031 1587294 1900838 1316040 95991 -802669 -772145 -111509 525135 820676 791184 471992
41021 471992 -113813 -829178 -1455852 -1818058 -1847164 -1615893 -1323679 -1161294 -1170039 -1256855
41011 -1256855 -1304263 -1259721 -1203549 -1299069 -1517337 -1470782 -802119 261341 1077261 1341473
41001 1341473 1273924 1015335 399113 -466701 -998307 -923261 -746789 -942696 -1157827 -814907
40991 -814907 -109231 266385 107887 -252949 -630389 -983626 -930513 -109564 963144 1217509
40981 1217509 402299 -536603 -678833 -130756 455080 775136 884099 745480 293055
40972 293055 -181323 -98721 813290 2058479 2625562 1924160 529461 -320440 -150271
40963 -150271 240575 8053 -543424 -624456 -320803 -356879 -762972 -886513 -762693 -1292810
40953 -1292810 -2664330 -3651595 -3179748 -1823062 -986716 -1125291 -1520332 -1469305 -965468
40944 -965468 -354936 75227 189670 81303 5534 -134 -242887 -886191 -1609228 -2038452
40934 -2038452 -2208495 -2250654 -1958881 -1133201 -122113 475332 536026 420443 363779 282706
40924 282706 124949 -3793 -70188 -128378 -93667 184050 579017 694684 305969 -349653
40914 -349653 -774049 -656954 -188021 57127 -273536 -755195 -538015 574481 1723015
40905 1723015 1957631 1313758 563686 177331 31853 -8361 171509 545504 804504 820875
40895 820875 895932 1291187 1753361 1772060 1197213 383396 -236594 -540839 -675862 -813355
40885 -813355 -1074350 -1556291 -2162167 -2402097 -1759081 -499666 265916 -166186 -1039753
40876 -1039753 -1022348 -61214 498382 -157472 -1188470 -1441749 -1081379 -1025282 -1356923 -1382060
40866 -1382060 -1022373 -1004632 -1514979 -1666394 -743947 724146 1632436 1551281 872151 110506
40856 110506 -439877 -613977 -441329 -246438 -322774 -519808 -432108 4490 373334 312109
40846 312109 -13610 -126384 161976 548248 662298 504140 300524 87017 -251437 -565610
40836 -565610 -500108 -123313 -66098 -684141 -1417045 -1447346 -792878 -228249 -201883 -367503
40826 -367503 -260498 31485 55122 -463165 -1387778 -2236286 -2422071 -1748055 -749619 -252837
40816 -252837 -494176 -946419 -1066646 -875289 -693034 -676267 -805256 -1018110 -1153525 -1049984
40806 -1049984 -888230 -1092090 -1631460 -1802846 -1125354 -172585 40366 -582123 -1025662
40797 -1025662 -446562 828342 1816854 2012779 1651000 1116873 591853 262150 367473
40788 367473 794731 970628 526710 -113557 -211157 312120 824183 930770 952029 1239881
40778 1239881 1528757 1403931 1067041 1082000 1508027 1835397 1778052 1603262 1539078 1326390
40768 1326390 663492 -186932 -584251 -240504 470242 959280 1039811 1016170 1220438 1615533
40758 1615533 1929717 1995237 1719494 907801 -423302 -1603177 -1811368 -1214338 -913659
40749 -913659 -1357281 -1540527 -518719 922269 1187707 178118 -550905 -59180 704651
40740 704651 403685 -807513 -1637853 -1390488 -621897 -239739 -474833 -812181 -725690 -368425
40730 -368425 -375109 -876321 -1100766 -439394 457695 453934 -367497 -765920 -199427 464598
40720 464598 455167 234390 479632 861464 686725 61255 -470434 -885990 -1390934 -1634647
40710 -1634647 -1170309 -377647 -7867 -45982 81445 383737 356185 36981 -7732 187798
40700 187798 -113519 -1071758 -1788503 -1512887 -623270 21690 135450 -17370 -208215 -351800
40690 -351800 -347742 -210993 -167910 -357244 -595584 -609834 -364040 -94162 -165352 -814210
40680 -814210 -1770357 -2272639 -1857161 -1012098 -585919 -698817 -856091 -988384 -1482963 -2079704
40670 -2079704 -1771030 -297672 1129470 1305598 548905 -47239 -279311 -736650 -1372398
40661 -1372398 -1338730 -376641 607941 747477 291041 39593 257929 660918 1070008 1480611
40651 1480611 1681929 1429170 1005897 1063279 1713325 2213504 1848681 829045 -17928
40642 -17928 -226464 5852 320843 544629 584975 472182 543626 1083067 1673830 1491490
40632 1491490 471969 -438685 -576100 -419524 -577595 -634347 27506 766928 339031
40623 339031 -1063173 -1754067 -868728 483855 986568 933922 1361093 2197509 2482547
40614 2482547 2016589 1587596 1580477 1455616 879805 451181 752588 1294014 1068741 -84995
40604 -84995 -1277138 -1720003 -1603088 -1614888 -1937153 -2124216 -1913232 -1663004 -1710660 -1657602
40594 -1657602 -838300 573189 1503378 1194868 22461 -1115953 -1735288 -1746761 -1019068
40585 -1019068 395469 1801244 2291402 1717545 792361 195543 16340 124486 532642
40576 532642 1091165 1264889 708649 -105284 -322975 200239 681186 470171 -59312 -95614
40566 -95614 354683 400199 -440772 -1484734 -1829642 -1587072 -1542413 -1863010 -1941284 -1532370
40556 -1532370 -1212938 -1392885 -1583783 -1186765 -510568 -373054 -940136 -1529991 -1474738 -743464
40546 -743464 200836 785054 660795 13469 -535473 -613298 -517747 -655758 -853232 -732491
40536 -732491 -552282 -966198 -1917177 -2483000 -2084328 -1248363 -748403 -450648 376131 1787628
40526 1787628 2862643 2862001 2227101 2005240 2449181 2684732 1907509 471901 -603683
40517 -603683 -928914 -966583 -1059069 -939162 -421374 78225 154698 57879 225502 573510
40507 573510 785297 935023 1191042 1199485 504481 -558915 -1133823 -978239 -641431 -517265
40497 -517265 -473637 -498666 -886206 -1502376 -1636564 -1017724 -347949 -336471 -744336 -925898
40487 -925898 -842069 -897247 -1098418 -1065180 -747320 -508088 -486928 -417685 -186770 -117718 -474326
40476 -474326 -964109 -997004 -352120 577384 1193906 1248801 948250 594515 302763 133088
40466 133088 256162 704680 1089229 940119 345731 -114843 -154093 -112659 -341310 -607914
40456 -607914 -437440 161460 666409 750775 786278 1447751 2791118 3983098 4404777 5019010
40446 5019010 7795482 13064002 18028722 19083947 15602605 10413164 6468280 4252967
40438 4252967 2803683 1792700 1476840 1544241 1386328 1138329 1310363 1624117 1293441
40429 1293441 346848 -373177 -542485 -685647 -1044702 -1094543 -510567 204851 492243 503416
40419 503416 686778 1099739 1502003 1736508 1730508 1474029 1188079 1119884 1042798 474082
40409 474082 -417355 -721657 20367 1049492 1285903 624527 -136182 -374465 -176500
40400 -176500 38128 -26332 -420946 -975048 -1429589 -1686021 -1840702 -1912645 -1761068 -1399156
40390 -1399156 -1128765 -1154008 -1251290 -1022522 -359963 436050 872230 617061 -111090 -557586
40380 -557586 -192433 565827 814170 316029 -357653 -798384 -1106503 -1162764 -517972 566057
40370 566057 931977 101252 -800926 -590152 234110 374437 -217299 -484517 -163050 -112891
40360 -112891 -679263 -1067024 -719403 -160567 54937 213885 623801 809961 319201 -358169
40350 -358169 -527621 -472332 -996598 -2018739 -2486316 -1757780 -421373 469308 574724
40341 574724 439387 645098 1026249 887511 18705 -830085 -850141 -286485 -19943 -163765
40331 -163765 51913 849020 1346390 924449 221796 19915 -63257 -781043 -1762341 -1970449
40321 -1970449 -1355264 -879153 -969093 -1069333 -828247 -630131 -659318 -447559 191479 642498
40311 642498 453239 100918 195673 504857 403642 -147321 -693020 -1021818 -1225959 -1249534
40301 -1249534 -913739 -298387 280120 592244 596249 427211 421782 779272 1035845 437566
40291 437566 -834482 -1480441 -717921 495475 676281 -201467 -881566 -710855 -298193
40282 -298193 -315400 -677710 -1103009 -1522814 -1610948 -823061 588313 1399162 891684 -141529
40272 -141529 -556092 -418459 -544783 -916624 -654118 429063 1264566 910104 -201783
40263 -201783 -888809 -656460 -13191 383444 368078 102084 -266471 -612106 -772979 -708242
40253 -708242 -625929 -789740 -1205926 -1586506 -1607359 -1158856 -427006 163826 195427 -325374
40243 -325374 -804305 -589948 242158 885643 715965 -48629 -767230 -1146674 -1298157 -1315244
40233 -1315244 -1230010 -1228303 -1454614 -1682804 -1613788 -1414439 -1463213 -1612679 -1304370 -494520
40223 -494520 158551 239847 119820 247820 461701 419289 247102 258649 358343 220331
40213 220331 -149909 -438554 -434488 -125491 371477 731927 639357 350420 540449 1190856
40203 1190856 1265697 159805 -1146356 -1333372 -703258 -701984 -1624939 -2133390 -1352453 -219327
40193 -219327 -66630 -776480 -1176401 -684365 266330 1089423 1545966 1511738 930923 110708
40183 110708 -347530 -68941 745817 1450739 1414414 583664 -323308 -481137 56111 370238
40173 370238 -155709 -1081125 -1560300 -1348690 -834582 -435476 -337795 -524882 -694160 -443681
40163 -443681 114015 288691 -229549 -766548 -575598 14103 56942 -624496 -1262706 -1282987
40153 -1282987 -896488 -532657 -383687 -622115 -1357553 -2118056 -2023122 -890385 287803
40144 287803 403927 -528988 -1554592 -1905391 -1561311 -866781 -68150 666228 1056723
40135 1056723 828771 95907 -523271 -444630 168641 533032 240123 -242438 -343876 -205946
40125 -205946 -218171 -192522 209522 525816 -13667 -1059474 -1304903 -356925 596849 486709
40115 486709 -249670 -675409 -863803 -1442735 -2263224 -2603879 -2386540 -2183381 -2164362 -1972676
40105 -1972676 -1608570 -1546442 -1877619 -2104646 -1914572 -1476945 -890913 -61829 730034 887866
40095 887866 382572 -101191 -190275 -320702 -856957 -1394511 -1440078 -1200501 -1092210 -930286
40085 -930286 -300035 531004 768543 129253 -790305 -1226058 -990920 -499032 -281314 -455808
40075 -455808 -590027 -268390 174343 -70755 -1077894 -1842266 -1614862 -999433 -968999 -1251982
40065 -1251982 -749298 558583 1292488 594942 -618759 -942385 -284563 352830 409853
40056 409853 229721 166090 56343 -275055 -607042 -715160 -788079 -1118347 -1586696 -1791186
40046 -1791186 -1644065 -1527346 -1725551 -1931124 -1611406 -820366 -264460 -394048 -804367
40037 -804367 -906441 -863400 -1248293 -1913538 -1992073 -1197436 -353007 -211340 -431952 -333072
40027 -333072 -57709 -171676 -509191 -384514 199161 537661 465218 625390 1285964 1855997
40017 1855997 1981978 2165476 2684637 2831098 2106021 1394448 1789077 2732501 2639908 1219451
40007 1219451 -161456 -561017 -583918 -965427 -1289140 -936735 -340524 -271470 -541118 -455792
39997 -455792 -87128 2065 -18208 511505 1335527 1339872 252879 -801975 -868851 -294681
39987 -294681 229842 798264 1665465 2301154 2095440 1518085 1494287 1879052 1671403 746007
39977 746007 241761 891398 1913428 2119131 1423532 642606 315395 386768 691450 1064187
39967 1064187 1166226 853624 622673 1049234 1797394 1875569 1035475 216844 213921 530675
39957 530675 231163 -472103 -383875 888573 2190946 2295191 1467723 882389 847641 497600
39947 497600 -721983 -2106042 -2621988 -2192926 -1539791 -1185271 -1224253 -1773895 -2889407
39938 -2889407 -4045587 -4393182 -3719942 -2669075 -1875210 -1387995 -1082208 -1016712 -1065224
39929 -1065224 -771169 -38827 508600 398192 108458 348951 870241 787146 -34439 -748624
39919 -748624 -782703 -532729 -524870 -584102 -317899 81474 108550 -228822 -390952 -60904
39909 -60904 472047 699407 412027 -152046 -462179 -7400 1345545 3228016 5022313
39900 5022313 6198911 6450701 5744368 4400298 2970475 1865201 1170687 867901 980292
39891 980292 1341793 1497148 1153929 583569 255996 196330 68143 -175470 -176262 198988
39881 198988 531473 398534 -50226 -371559 -482091 -665075 -992239 -1141470 -916193 -632308
39871 -632308 -740928 -1256938 -1850909 -2373699 -2885038 -3152242 -2634480 -1277052 62749
39862 62749 471709 76068 -241342 -128373 -127068 -621805 -1101279 -919406 -331792 -182618
39852 -182618 -743262 -1390908 -1406780 -668497 445167 1426437 1852342 1622142 1162984 1116407
39842 1116407 1592680 1908639 1315277 -52520 -1169775 -1163251 -246745 558622 607314 235607
39832 235607 42519 -20884 -333301 -649482 -295382 591291 922599 207645 -588819 -445054
39822 -445054 173000 135548 -488260 -582423 162350 774652 552704 -7564 -190193 -1471
39812 -1471 330639 929053 1736755 2101693 1533539 406062 -556877 -995913 -772468 168946
39802 168946 1273815 1471031 511433 -441848 -336785 307095 365067 -122135 -310044 -209271
39792 -209271 -599526 -1408618 -1574676 -745418 114860 214607 -27093 83525 479712 812700
39782 812700 1170393 1674088 1967442 1726828 1229865 917469 808403 753680 807035 946368
39772 946368 918304 755184 908707 1436807 1651715 1118809 426168 317763 599064 654907
39762 654907 601565 1062623 2069266 3024776 3636688 4151184 4774804 5555661 6717968
39753 6717968 8420839 10309738 12013292 13894203 16410706 18790376 19381768 17602563
39745 17602563 14693377 12201938 10468076 8961747 7355145 5719298 4208368 3066067
39737 3066067 2551633 2492794 2335220 1914937 1616396 1430099 602072 -1126995 -2586767
39728 -2586767 -2417602 -932269 205567 94746 -510563 -573387 -210858 -295678 -1109496
39719 -1109496 -1932062 -1885721 -911185 100819 93758 -1137899 -2663292 -3247712 -2515023
39710 -2515023 -1218699 -387411 -326912 -481535 -166244 663904 1422038 1650935 1590690 1763969
39700 1763969 2134487 2122515 1534678 973757 1009503 1354697 1322453 821969 370917 259838
39690 259838 256521 145508 45239 56628 22344 -153287 -261269 -112941 86034 -72444
39680 -72444 -695054 -1428782 -1806906 -1689577 -1334188 -1015237 -635127 130979 1281816 2304579
39670 2304579 2673346 2349688 1667606 974830 584640 778232 1479221 2080401 1966300
39661 1966300 1166085 241722 -356723 -576517 -571490 -526592 -542842 -459934 -8029 639549
39651 639549 851302 447729 152029 547404 1055227 767903 -72428 -452163 -254191 -368826
39641 -368826 -1062334 -1455234 -978973 -224165 162364 353725 507363 154947 -716546 -981305
39631 -981305 119115 1554506 1804488 1010284 541576 806396 910568 427931 94201
39622 94201 436561 893915 804843 388701 225725 411650 648959 637889 87109 -1076015
39612 -1076015 -2212133 -2309851 -1214135 -1037 254117 -362854 -985241 -1018894 -479700
39603 -479700 236955 560469 178336 -401679 -259253 580609 855827 -230532 -1619988
39594 -1619988 -1633434 -277767 726874 273407 -760401 -866618 100091 926386 697693
39585 697693 -201860 -781661 -660917 -295879 -162277 -101183 318353 994826 1250210 678604
39575 678604 -278798 -834614 -740449 -426428 -376403 -632545 -914318 -1005484 -914890 -722298
39565 -722298 -381978 201920 875926 1195879 876398 151834 -543749 -1076315 -1432739 -1278229
39555 -1278229 -359694 658457 586886 -729435 -1976655 -2008430 -1267821 -921111 -1181250
39546 -1181250 -1398263 -1403658 -1641757 -2006923 -1676160 -425578 798928 1125717 865244
39537 865244 795878 909965 590158 -261128 -988604 -1067491 -689892 -384841 -427826 -724390
39527 -724390 -991496 -943977 -518849 -27308 84149 -253859 -580467 -401371 220258 706716
39517 706716 601013 41505 -438415 -468618 -104145 363111 671185 696410 506667 359581
39507 359581 481580 805500 1096798 1331435 1652915 1893137 1550488 517561 -508940
39498 -508940 -733046 -171310 492659 762562 649199 332518 -18547 -178652 -68502 36163
39488 36163 -94724 -185314 84858 325673 -133183 -1060544 -1400972 -752584 42981 177964
39478 177964 -40356 18766 128233 -357960 -1300485 -1880566 -1745076 -1275643 -798903 -307029
39468 -307029 -14256 -387042 -1298794 -1769000 -1027795 461910 1446725 1226020 304489
39459 304489 -213354 294350 1445045 2295603 2266146 1563625 701228 -130269 -980948 -1695496
39449 -1695496 -1992115 -1900350 -1663745 -1233103 -379144 621916 1020931 593018 75093
39440 75093 200319 717835 852612 407802 -133088 -371249 -278064 158150 970900 1898970
39430 1898970 2555590 2916834 3132241 2958037 2160663 1535302 2459694 4879716 6687156
39421 6687156 6052475 3743483 2014944 1623079 1314267 244119 -638069 -219116 1008083
39412 1008083 1759933 1718468 1448681 1124349 418591 -593154 -1392544 -1785510 -1923412
39403 -1923412 -1749288 -1282750 -1237263 -2262626 -3575284 -3527168 -1805412 60139 795832
39394 795832 848704 1128190 1428128 1098212 427098 193136 366062 357185 165884 185906
39384 185906 199126 -255038 -701576 -217482 862502 1074049 4445 -924003 -490310
39375 -490310 587356 808437 -41622 -969451 -1383002 -1588615 -1893547 -2138543 -2163933 -2046526
39365 -2046526 -1780704 -1273571 -747824 -655582 -1047843 -1431225 -1409903 -1136197 -955232 -900031
39355 -900031 -775953 -558048 -437651 -506341 -591244 -471336 -158950 134777 276838 304028
39345 304028 198189 -217706 -958061 -1608541 -1699797 -1314808 -1010482 -1114050 -1402069 -1506641
39335 -1506641 -1301027 -825254 -208732 224153 168481 -186364 -289820 13626 322580 442949
39325 442949 703624 1162928 1190016 483539 -46564 722439 2521265 3936430 4154735
39316 4154735 3644674 3113516 2643409 2069878 1487358 1034969 673856 427924 436212 635115
39306 635115 821040 1059984 1488482 1720339 1208870 310021 68523 608472 722263 -312434
39296 -312434 -1447033 -1330079 -332553 52659 -585102 -1218154 -1135263 -836275 -944183 -1252439
39286 -1252439 -1278752 -985448 -512767 146063 752330 692915 -226753 -1283155 -1619116 -1205727
39276 -1205727 -616017 -202095 29180 40485 -169688 -288534 -10530 419512 456654 51072
39266 51072 -231415 55188 734982 1320048 1509161 1278391 753121 138814 -392301 -837508
39256 -837508 -1246517 -1457325 -1185234 -468869 199484 367067 112112 -125801 -118271 -71683
39246 -71683 -292826 -778337 -1187486 -1161264 -639735 100369 702388 1034531 1228393 1402876
39236 1402876 1424279 1068393 414891 -122817 -296797 -364041 -654833 -941330 -690968 1401
39226 1401 290223 -284701 -1021604 -948594 -142211 513611 663801 757775 998913 927331
39216 927331 340575 -179671 -128112 214022 453798 811079 1487436 1884647 1314763 151372
39206 151372 -583127 -576097 -349584 -202048 45267 242695 -174261 -1177650 -1825762 -1353202
39196 -1353202 -83520 1012657 1241904 546690 -549838 -1228531 -1110167 -779244 -1028733
39187 -1028733 -1627935 -1619311 -871224 -340950 -533321 -779320 -564063 -481750 -1049711 -1521679
39177 -1521679 -954457 203329 715047 330540 -118068 -121744 42077 125787 253139 474524
39167 474524 741611 1200073 1780350 1760803 623794 -878491 -1497324 -1163604 -834942
39158 -834942 -800309 -387167 540130 1097866 792641 270643 159296 171825 -102768 -450364
39148 -450364 -610813 -719825 -672686 -14824 952120 1002583 -290267 -1632084 -1703621 -881239
39138 -881239 -293763 -74650 264851 523197 256188 -27254 447077 1225461 1283753 893037
39128 893037 1237178 2240568 2476790 1485528 491025 267705 -60890 -1172121 -1958129
39119 -1958129 -1108502 722223 1762460 1570644 1256083 1499318 1675338 1107753 154705
39110 154705 -356996 -147049 418706 854656 945949 862510 982420 1400863 1661591 1277730
39100 1277730 480438 64834 394878 882352 659448 -372577 -1340701 -1276560 -187825
39091 -187825 823022 683434 -417610 -1223671 -935637 -129541 166607 -98712 -101649 494060
39081 494060 1005224 745234 -13991 -481165 -376800 -77335 93773 263619 665050 1228790
39071 1228790 1664811 1778971 1583108 1188561 704038 209510 -230789 -525154 -544143 -248389
39061 -248389 152364 311551 134029 -51827 127352 601618 932663 837098 413665 -133281
39051 -133281 -696039 -1107637 -1112212 -713991 -318575 -271085 -429318 -439877 -255467 -87612
39041 -87612 -527 114203 253315 323055 388542 588773 835577 878107 627858 186446
39031 186446 -322482 -682430 -569386 -1367 434228 310746 74910 360470 797146 405604
39021 405604 -813568 -1691458 -1527476 -897439 -421678 175624 1062970 1417395 631853
39012 631853 -376692 -347513 334429 215891 -895440 -1680947 -1514710 -1403238 -2162771
39003 -2162771 -2982555 -2732090 -1715045 -982123 -518135 593430 2320845 3224955 2260982
38994 2260982 250381 -1038615 -896422 -189854 1493 -315452 -368507 116982 509818
38985 509818 212373 -439546 -593768 960 725937 924794 618805 301712 326219 619406
38975 619406 794901 491748 -170633 -473715 228392 1635986 2661640 2629526 1990579
38966 1990579 1631732 1795900 1992192 1739468 1046884 263933 -256256 -393957 -373200 -572128
38956 -572128 -1057261 -1420175 -1279477 -831229 -634180 -876446 -1128265 -918957 -378492 -124220
38946 -124220 -523002 -1235998 -1656124 -1715286 -1918767 -2438275 -2590786 -1689773 -158435 858060
38936 858060 938551 707848 596873 155277 -920476 -1853395 -1681602 -627289 261377
38927 261377 543686 587374 495235 -169689 -1412015 -2429294 -2591695 -2150328 -1596180 -921935
38917 -921935 10065 892516 1343131 1486869 1595918 1432785 574204 -772995 -1919356
38908 -1919356 -2604046 -3095846 -3319400 -2647287 -974821 601360 868962 41959 -453483
38899 -453483 227572 1351581 1624140 728867 -528112 -1275790 -1276115 -714725 110359 747889
38889 747889 722466 43510 -645753 -704227 -129449 620252 1188116 1416110 1136959 345040
38879 345040 -474644 -663941 -172767 316393 209416 -323446 -680067 -617862 -470295 -654697
38869 -654697 -1165901 -1607302 -1674213 -1538829 -1632015 -2000309 -2099883 -1450928 -317174 590638
38859 590638 952973 967032 729368 74976 -845720 -1413165 -1287713 -874381 -689832 -665908
38849 -665908 -491336 -275621 -357475 -696050 -964527 -1068550 -1073523 -813436 -176609 332626
38839 332626 24576 -903654 -1402031 -907272 -67326 185141 -227803 -704379 -850938 -738290
38829 -738290 -570920 -555847 -895096 -1480132 -1752359 -1297976 -483696 -80204 -298205 -611072
38819 -611072 -543872 -226358 -65609 -226250 -582747 -896953 -896496 -468485 15772 -164277
38809 -164277 -1292235 -2670226 -3182147 -2442622 -1170606 -363095 -305537 -537542 -607444
38800 -607444 -546457 -571307 -648409 -609183 -512403 -543668 -617032 -489304 -339222 -762678 -1917981
38789 -1917981 -3074588 -3415910 -2984094 -2356748 -1682847 -716641 307465 655967 161828
38780 161828 -394746 -337106 70983 283892 392014 739679 1057244 783652 98962 -170909
38770 -170909 237634 602607 214705 -758255 -1658699 -2103082 -2061762 -1626362 -1098812 -986256
38760 -986256 -1459421 -1987116 -1909347 -1288518 -833112 -984521 -1386641 -1340966 -592704 449315
38750 449315 1212214 1576501 1886023 2313460 2465214 1937754 1106902 825507 1277160 1731270
38740 1731270 1680049 1574715 1944586 2356539 1970554 784719 -424324 -1173666 -1509939
38731 -1509939 -1359597 -576616 336166 527559 67095 -156 746174 1343964 875961 -146631
38721 -146631 -597759 -310939 25940 97006 139427 142220 -200682 -773415 -1092751 -1118642
38711 -1118642 -1259725 -1490993 -1230527 -327856 476905 404602 -503460 -1587718 -2205586
38702 -2205586 -2036369 -1254548 -574630 -629434 -1128542 -1150738 -429799 287412 424698 381322
38692 381322 659995 873315 359928 -645928 -1252906 -1100822 -588131 -46340 571980
38683 571980 1155228 1285944 857137 330998 123560 91708 -118874 -480316 -600529 -227616
38673 -227616 432099 878813 755243 144032 -562423 -1049623 -1234008 -1100693 -679429 -231934
38663 -231934 -99044 -191004 -1541 636314 1223174 1345051 1283703 1391080 1316335 556318
38653 556318 -533793 -1100262 -1046074 -1090269 -1530220 -1782184 -1389028 -739764 -409824 -373908
38643 -373908 -294090 -132903 -45365 27567 270851 664016 959006 864406 239313 -646870
38633 -646870 -1148204 -973565 -768768 -1319598 -2215452 -2199435 -1065609 -194211 -615316 -1461803
38623 -1461803 -1256859 -78591 660784 285499 -408806 -518828 -154357 101428 131487
38614 131487 245164 579325 906259 925467 614007 329525 469667 907634 999267 413472
38604 413472 -322174 -521986 -350956 -566864 -1342187 -1977609 -1920694 -1517757 -1456199 -1835661
38594 -1835661 -2156180 -2054207 -1706441 -1471793 -1363913 -1087485 -582737 -245535 -351586
38585 -351586 -492095 -73866 686371 915591 388796 -14253 463472 1401487 1883421 1667756
38575 1667756 1093710 375559 -295376 -443223 68234 500846 199512 -291442 -44169
38566 -44169 659382 715308 22580 -357312 42566 445192 244121 -118498 -152571 -125844
38556 -125844 -310180 -384649 -187453 -160996 -416368 -250986 662106 1443304 1214678 411179
38546 411179 -25197 -109750 -443937 -861309 -563214 562040 1704387 2175506 1943507
38537 1943507 1230646 320870 -268719 -112631 559391 1097772 1183024 937416 483283 -119887
38527 -119887 -667596 -996431 -1183037 -1191763 -727200 72754 341053 -373316 -1162887 -923422
38517 -923422 -77082 21131 -763943 -1087985 -207516 924068 1149968 673214 423094 607090
38507 607090 673410 275013 -422213 -1153116 -1717644 -1865917 -1477968 -854125 -544632 -842411
38497 -842411 -1511415 -1970773 -1777164 -1070711 -505970 -578189 -1093893 -1465387 -1347932 -765601
38487 -765601 112801 959608 1319870 1091729 726045 534676 203191 -442555 -716847 -20048
38477 -20048 914736 869796 34662 -239157 410568 852293 399548 -170354 -123928 43771
38467 43771 -231435 -437172 -39681 313048 -183683 -1029274 -1174617 -638108 -179522 117995
38457 117995 676222 1220681 1103578 661225 897424 1760672 2024572 1116286 -133148
38448 -133148 -920984 -1484270 -2084587 -2022565 -589667 1560760 2864299 2495518 1039121
38439 1039121 -303995 -747531 -314908 378652 711360 571249 252205 -105431 -662041
38430 -662041 -1413381 -1967096 -2002998 -1686404 -1410352 -1325483 -1286278 -1086143 -633871 -62799
38420 -62799 302855 301940 218052 382686 547628 143661 -766489 -1387307 -1304138 -1106134 -1433169
38409 -1433169 -1903573 -1648505 -620623 359135 770461 868405 896823 599644 -76843 -414945
38399 -414945 251028 1404065 1766782 906366 -218059 -560533 -272188 -198087 -509330
38390 -509330 -566827 -70167 433996 452416 304296 486823 755557 515620 -80968 -180698
38380 -180698 528202 1264273 1167461 415670 -82518 171675 883244 1581017 2118773 2468211
38370 2468211 2436378 1892076 1081497 420011 46954 -134734 -31586 631837 1737885
38361 1737885 2576928 2543958 1829931 1108788 723655 558677 561329 882782 1455349 1862243
38351 1862243 1764001 1192664 432150 -98576 13731 672264 1041234 482510 -331007 -84548
38341 -84548 1258388 2165153 1560825 201848 -586126 -646290 -636920 -713439 -590067 -390244
38331 -390244 -398118 -332444 146395 552000 215915 -502101 -743432 -612454 -887488 -1449384
38321 -1449384 -1378246 -669477 -424010 -1026004 -1504842 -1204358 -785050 -885392 -962999 -313595
38311 -313595 706942 1321861 1396729 1114312 403618 -524082 -877685 -365633 198175 214947
38301 214947 367387 1333230 2281237 1960824 677369 -235146 -493864 -905968 -1518613
38292 -1518613 -1353961 -216512 706415 584645 105211 232519 728569 643113 -327061
38283 -327061 -1602713 -2456975 -2553411 -2091301 -1710734 -1921884 -2461170 -2599782 -2148561 -1609010
38273 -1609010 -1244269 -713171 102499 629012 423954 -103851 -309931 -195953 -179021 -388358
38263 -388358 -718385 -1232005 -1929065 -2347611 -1995355 -1103546 -437652 -342906 -392832 -42594
38253 -42594 702479 1358041 1460370 920248 64899 -582547 -673016 -277324 212317 402046
38243 402046 150855 -381923 -900006 -1230849 -1404401 -1425550 -1109408 -343694 584257 1204776
38233 1204776 1393571 1409810 1412453 1249999 796722 219350 -188516 -237176 109402 680374
38223 680374 1108233 1156536 996050 865384 590932 -98769 -874282 -1032037 -480604 126795
38213 126795 376742 518419 662419 349159 -578072 -1359479 -1260682 -625099 -279541 -317174
38203 -317174 -262885 -127505 -380665 -945818 -1101485 -537170 190165 456061 244795 -171049
38193 -171049 -676299 -1167156 -1407314 -1323288 -1120522 -903024 -523319 -15612 204516 -113454
38183 -113454 -597024 -692313 -396445 -222013 -505794 -1036436 -1378496 -1343338 -1041978 -592079
38173 -592079 39371 803430 1309033 1100859 296224 -364921 -352415 49209 303164 475056
38163 475056 967072 1581988 1594508 859668 147601 81069 344376 337913 65876 -136653
38153 -136653 -288029 -540824 -616622 -168069 472337 632786 340890 265186 528319 401211
38143 401211 -442156 -1087428 -461832 1138568 2295005 2114436 1061960 186812 55556
38134 55556 519404 1041067 1054827 362525 -623895 -1282384 -1504080 -1685000 -1951273 -1935030
38124 -1935030 -1570622 -1489883 -2070868 -2592989 -2110639 -878210 -29430 59348 121443 612230
38114 612230 1013148 936003 940662 1545921 2209794 2157267 1629635 1372605 1354713 1046943
38104 1046943 643250 794618 1209445 806281 -495574 -1351950 -874150 103704 315048
38095 315048 -238211 -654506 -526865 -144690 192459 261359 -276820 -1363895 -2169342 -2000547
38085 -2000547 -1295674 -933550 -877723 -439156 332131 622111 274122 138287 684864 1244962
38075 1244962 1123392 618864 293807 -69299 -972349 -2103970 -2607424 -2317633 -1968510
38066 -1968510 -2086205 -2307273 -2052958 -1418438 -981861 -932899 -847502 -400530 108299 280875
38056 280875 393762 1026464 1898415 1854853 450021 -1145910 -1568841 -1072238 -944151
38047 -944151 -1437955 -1504774 -641063 265761 376165 86069 134535 447905 626120 783756
38037 783756 1039223 806532 -453986 -2191134 -3318098 -3476965 -3027429 -2240399 -1352560
38028 -1352560 -964603 -1364961 -1746737 -1118295 221129 1133135 1341001 1533310 1901070
38019 1901070 1858956 1313957 915916 775087 195621 -902167 -1542946 -1255647 -878873
$$ [...]
##END NTUPLES=NMR SPECTRUM
##END=
