##TITLE=31Pdec_LR-677-RM4
 , 24 sc
 26.6.2019
##JCAMPDX= 6.0         $$ Bruker NMR JCAMP-DX V2.0
##DATA TYPE= NMR SPECTRUM
##DATA CLASS= NTUPLES
##ORIGIN= UXNMR, Bruker Analytische Messtechnik GmbH
##OWNER= root
$$ XWIN-NMR		Version 3.5
$$ Wed Jun 26 16:25:30 2019 Russian Standard Time (UT+4h)  she@DPX200
##.OBSERVE FREQUENCY= 81.013821
##.OBSERVE NUCLEUS= ^31P
##.ACQUISITION MODE= SIMULTANEOUS
##.ACQUISITION SCHEME= undefined
##.AVERAGES= 24
##.DIGITISER RES= 17
##SPECTROMETER/DATA SYSTEM= spect
##.PULSE SEQUENCE= zgpg30
##.SOLVENT NAME= CDCl3
##.SHIFT REFERENCE= (INTERNAL, CDCl3, 0, 182.463)
##AUDIT TRAIL= $$ (NUMBER, WHEN, WHO, WHERE, WHAT)
$$ ##TITLE= Audit trail, XWIN-NMR		Version 3.5
$$ ##JCAMPDX= 5.01
$$ ##ORIGIN= Bruker BioSpin GmbH
$$ ##OWNER= she
$$ F:/spectra/data/she/nmr/P31/1/pdata/1/auditp.txt
$$ ##AUDIT TRAIL=  $$ (NUMBER, WHEN, WHO, WHERE, WHAT)
(   1,<2019-06-26 16:24:14.00 +0400>,<she>,<DPX200>,
      <created by zg, POWCHK disabled, PULCHK disabled
       configuration hash MD5:
       00 E9 B6 7A A2 85 ED C7 34 08 36 98 17 FE 4E 26
       data hash MD5: 32K
       A5 5C B0 42 ED 5F E8 96 6F 33 E6 14 A7 87 A8 52>)
(   2,<2019-06-26 16:24:18.54 +0400>,<she>,<DPX200>,
      <Start of raw data processing
       efp BC_mod = 2 LB = 1 FT_mod = 6 PKNL = 1 PHC0 = -2475.354 PHC1 = -84.6004 SI = 64K 
       data hash MD5: 64K
       02 8C 81 FA FA 8E 19 63 4D C3 C0 1E B4 8D 4F 78>)
(   3,<2019-06-26 16:24:45.26 +0400>,<she>,<DPX200>,
      <pk PHC0 = -124.6883 PHC1 = 293.8 
       data hash MD5: 64K
       79 B6 18 34 49 6F 2A A9 D8 37 7F A2 8B 20 C5 6A>)
(   4,<2019-06-26 16:24:50.17 +0400>,<she>,<DPX200>,
      <abs ABSG = 5 
       data hash MD5: 64K
       9A 02 84 FC BC 78 7D C5 7D F9 75 18 79 1D 5A 42>)
$$ ##END=
$$ 
$$ hash MD5
$$ A4 0B 73 34 25 76 E4 92 74 5E 05 AD 64 2F F7 83
##$RELAX= 
##$RELAX= 
##$RELAX= 
##$RELAX= 
##$RELAX= 
##$RELAX= 
##$RELAX= 
##$RELAX= 
$$ Bruker specific parameters
$$ --------------------------
##$DU= <F:/spectra>
##$EXPNO= 1
##$NAME= <P31>
##$PROCNO= 1
##$TYPE= <nmr>
##$USER= <she>
##$AMP= (0..31)
100 100 100 100 100 100 100 100 100 100 100 100 100 100 100 100 100 100 
100 100 100 100 100 100 100 100 100 100 100 100 100 100 
##$AQSEQ= 0
##$AQ_mod= 1
##$AUNM= <au_zg>
##$AUTOPOS= <>
##$BF1= 81.014009
##$BF2= 200.13
##$BF3= 200.13
##$BF4= 200.13
##$BF5= 200.13
##$BF6= 200.13
##$BF7= 200.13
##$BF8= 200.13
##$BYTORDA= 1
##$CFDGTYP= 0
##$CFRGTYP= 5
##$CHEMSTR= <none>
##$CNST= (0..31)
1 1 145 1 1 1 1 1 1 1 1 1 1 1 1 1 1 1 1 1 1 1 1 1 1 1 1 1 1 1 1 1 
##$CPDPRG= <waltz16>
##$CPDPRG1= <>
##$CPDPRG2= <waltz16>
##$CPDPRG3= <>
##$CPDPRG4= <mlev>
##$CPDPRG5= <mlev>
##$CPDPRG6= <mlev>
##$CPDPRG7= <mlev>
##$CPDPRG8= <mlev>
##$CPDPRGB= <>
##$CPDPRGT= <>
##$D= (0..31)
0 1 0 0 0 0 0 0 0 0 0 0.03 2e-05 3e-06 0 0 0 0 0 0 0 0 0 0 0 0 0 0 0 0 
0 0 
##$DATE= 1561551853
##$DBL= (0..7)
120 120 120 11 120 120 24 19 
##$DBP= (0..7)
150 150 150 150 150 150 150 150 
##$DBP07= 0
##$DBPNAM0= <>
##$DBPNAM1= <>
##$DBPNAM2= <>
$$ [...]
##$SUBNAM3= <"">
##$SUBNAM4= <"">
##$SUBNAM5= <"">
##$SUBNAM6= <"">
##$SUBNAM7= <"">
##$SUBNAM8= <"">
##$SUBNAM9= <"">
##$SW= 369.568048894756
##$SWIBOX= (0..15)
0 1 3 0 0 0 0 0 0 0 0 0 0 0 0 0 
##$SW_h= 29940.119760479
##$TD= 32768
##$TD0= 1
##$TE= 0
##$TE2= 300
##$TE3= 300
##$TEG= 300
##$TL= (0..7)
0 120 53 12 22 120 120 120 
##$TP= (0..7)
150 150 150 150 150 150 150 150 
##$TP07= 0
##$TPNAME0= <>
##$TPNAME1= <>
##$TPNAME2= <>
##$TPNAME3= <>
##$TPNAME4= <>
##$TPNAME5= <>
##$TPNAME6= <>
##$TPNAME7= <>
##$TPOAL= (0..7)
0.5 0.5 0.5 0.5 0.5 0.5 0.5 0.5 
##$TPOFFS= (0..7)
0 0 0 0 0 0 0 0 
##$TUNHIN= 0
##$TUNHOUT= 0
##$TUNXOUT= 0
##$USERA1= <user>
##$USERA2= <user>
##$USERA3= <user>
##$USERA4= <user>
##$USERA5= <user>
##$V9= 5
##$VALIST= <valist>
##$VCLIST= <CCCCCCCCCCCCCCC>
##$VD= 0
##$VDLIST= <DDDDDDDDDDDDDDD>
##$VPLIST= <PPPPPPPPPPPPPPP>
##$VTLIST= <TTTTTTTTTTTTTTT>
##$WBST= 1024
##$WBSW= 4
##$XGAIN= (0..3)
0 0 0 0 
##$XL= 0
##$YL= 0
##$YMAX_a= 51131
##$YMIN_a= -77415
##$ZGOPTNS= <>
##$ZL1= 120
##$ZL2= 120
##$ZL3= 120
##$ZL4= 120
##$ABSF1= 182.463
##$ABSF2= -187.1042
##$ABSG= 5
##$ABSL= 3
##$ALPHA= 0
##$AQORDER= 0
##$ASSFAC= 0
##$ASSFACI= 0
##$ASSFACX= 0
##$ASSWID= 0
##$AUNMP= <proc_1d>
##$AZFE= 0.1
##$AZFW= 0.5
##$BCFW= 0
##$BC_mod= 2
##$BYTORDP= 0
##$COROFFS= 0
##$CY= -3
##$DATMOD= 1
##$DC= 0
##$DFILT= <>
##$DTYPP= 0
##$F1P= 0
##$F2P= 0
##$FCOR= 1
##$FTSIZE= 65536
##$FT_mod= 6
##$GAMMA= 0
##$GB= 0
##$INTBC= 1
##$INTSCL= 5.30512e-09
##$ISEN= 30
##$LB= 1
##$LEV0= 0
##$LPBIN= 0
##$MAXI= 10000
##$MC2= 0
##$MEAN= 0
##$ME_mod= 0
##$MI= 50
##$NCOEF= 0
##$NC_proc= -6
##$NLEV= 6
##$NOISF1= 182.463
##$NOISF2= 159.3651
##$NSP= 0
##$NTH_PI= 0
##$NZP= 0
##$OFFSET= 182.463
##$PC= 4
##$PHC0= -2600.042
##$PHC1= 209.1996
##$PH_mod= 1
##$PKNL= yes
##$PPARMOD= 0
##$PSCAL= 0
##$PSIGN= 0
##$REVERSE= no
##$SF= 81.0140089999434
##$SI= 65536
##$SIGF1= 159.3651
##$SIGF2= -187.1042
##$SINO= 113.3802
##$SIOLD= 16384
##$SREGLST= <1H.CDCl3>
##$SSB= 0
##$STSI= 65536
##$STSR= 0
##$SW_p= 29940.119760479
##$SYMM= 0
##$S_DEV= 0
##$TDeff= 32768
##$TDoff= 0
##$TI= <>
##$TILT= no
##$TM1= 0
##$TM2= 0
##$TOPLEV= 0
##$USERP1= <user>
##$USERP2= <user>
##$USERP3= <user>
##$USERP4= <user>
##$USERP5= <user>
##$WDW= 1
##$XDIM= 65536
##$YMAX_p= 289635588
##$YMIN_p= -29886394
$$ End of Bruker specific parameters
$$ ---------------------------------
##NTUPLES= NMR SPECTRUM
##VAR_NAME=  FREQUENCY,     SPECTRUM/REAL,   SPECTRUM/IMAG
##SYMBOL=    X,             R,               I
##VAR_TYPE=  INDEPENDENT,   DEPENDENT,       DEPENDENT
##VAR_FORM=  AFFN,          ASDF,            ASDF
##VAR_DIM=   65536,         65536,           65536
##UNITS=     HZ,            ARBITRARY UNITS, ARBITRARY UNITS
##FACTOR=    0.456856943014862, 1,           1
##FIRST=     14782.0589164792, 0,            0
##LAST=      -15158.0608439998, 0,           0
##MIN=       -15158.0608439998, -29886394,   0
##MAX=       14782.0589164792, 289635588,    0
$$ Real data points
##PAGE= N=1
##DATA TABLE= (X++(R..R)), XYDATA
$$ [...]
42255D726660N56352j35332J03845J259110J555836K01584j273325j210759k78751
42246E505220l94727j669517k085936n75239J152043R66846n79768j129191k4011
42237A165720Q92809K14307j060864j309934n65709J44458N53589Q78550P56061
42228A668987J764l65838M16848J095696J57988j199357m54942J914270K501099
42219E736515J62573j899427r23952J290738J477457q8495o60361L13924Q26020
42210F234992L9305o70812m72691k18908m67152o30404n14370o61769q19623q0846
42200A737722J124537J288459M47188K69428R94132Q11894p44126j435059R7065
42191D591240J802491J343926k73360n88989L49051N58440l05922o76862q4889
$$ plain form
42255 4726660 5283012 5147680 5251525 6510635 8066471 8268055 6994730 5783971 5505220
42246 5505220 5110493 3440976 1355040 779801 1931844 2898690 2318922 1189731 1165720
42237 1165720 2058529 2272836 1211972 -97962 -663671 -519213 34376 912926 1668987
42228 1668987 1670751 1304913 1721761 2817457 2975445 1776088 1321146 3235416 5736515
42219 5736515 5899088 3999661 3075709 4366447 5843904 5755409 5095048 5408972 6234992
42210 6234992 6274297 5603485 5130794 4911886 4444734 3814330 3299960 2638191 1818568 1737722
42200 1737722 2862259 4150718 4597906 4867334 5861466 6673360 5929234 4494175 4591240
42191 4591240 6393731 7737657 7464297 6875308 7224359 7782799 7476877 6800015 6715126
42182F715126M5677j082387k267187k045093n26157R47713J173660M8180j213268
42173A796264j118981K20669R60729R1028r19226l68742Q99416Q78803k52117
42164B187843m84665O16445J324125P65165J07283J09421j93586j312016j916605
42155A203410j064851m6709l22108j034113m79013R66358J460221P08110K35131
42146A626436O27252N55474p76184j910288j106642R88647K088598J319243J22091
42137C534627p4750K47304n9881o82108l54419Q21886J155695j50222j648310
42128B789822j565809o514J659764K573718K440513Q65160j773760l484463k530363
42119I68068R8237J781862J651719J033044O54471k54643j615151j717960l6627
$$ plain form
42182 6715126 6760803 5678416 3411229 1366136 839979 1787692 2961352 3009532 1796264
42173 1796264 677283 897952 1858681 1949709 1030483 661741 1561157 2439960 2187843
42164 2187843 1703178 2319623 3643748 4408913 4516196 4625617 4432031 3120015 1203410
42155 1203410 138559 91850 -230258 -1264371 -1743384 -777026 683195 1391305 1626436
42146 1626436 2253688 2809162 2032978 122690 -983952 4695 2093293 3412536 3534627
42137 3534627 3459877 3707181 3647300 2965192 2610773 3432659 4588354 4438132 2789822
42128 2789822 1224013 1217499 2877263 5450981 7891494 8756654 6982894 3498431 968068
42119 968068 1066305 2848167 4499886 5532930 6187401 5932758 4317607 2599647 2563020
42110B563020J285721M66329j073211q86729P15686J319798J95513q53536m44236
42101C288355N67536P18475p2484p95263p11957K6812N34253j00288j584012k139181
42091b67754n08142J894648K266040J58550j592694n74792J889659K571344O96960
42082F533819j289692j312691k47330j09902r94630j279867l77687L61307j71921
42073A111406j094101q54334M97067J427106R57822l70933j425258j499003m96322
42064a746550J029062J971893J618054N82395J12143N12180J061638J319197J411653
42055G871665J106027j0684j224157j109900K02000P36728n01464j925897j745066
42046C399252n54708r7197n90055r63494q83560p54749l31209Q13150J799665
$$ plain form
42110 2563020 3848741 4315070 3241859 2355130 3070816 4390614 4586127 3732591 3288355
42101 3288355 3855891 4574366 4501882 3706619 2994662 3021474 3555727 3455439 1871427 -267754
42091 -267754 -775896 1118752 3384792 3543342 1950648 1375856 3265515 5836859 6533819
42082 6533819 5244127 3931436 3684106 3574204 2579574 1299707 922020 1283327 1111406
42073 1111406 17305 -837029 -339962 1087144 2044966 1674033 248775 -1250228 -1746550
42064 -1746550 -717488 1254405 2872459 3454854 3566997 4079177 5140815 6460012 7871665
42055 7871665 8977692 8967008 7742851 6632951 6834951 7571679 7070215 5144318 3399252
42046 3399252 2844544 2747347 2157292 1193798 310238 -444511 -775720 37430 1837095
42037A837095J331466m5802m59985M02941Q61770J01951m89475K22905J051273
42028D814139L03992j436390k000678p25971O16275K69160j137205j404701L15975
42019c85404K253584K166388K75943j011494l96886O56583L55607o37654l65502
42010B911165J263230K295791J553153o8003j263882j777843j855271j569543
42002A488797j107720o85602r069J109580J707343P10212r86698j253430J81787
41993A155200J279623Q51602J19476K42664M21094j87753o37735p501O53623J38906
41983D029199o09459j23967Q92483P88729j06187k29053K77135q446q37200n56856
41973C516378O82844Q37330m75738j130906r0866Q45907K28891o11738j24085
$$ plain form
42037 1837095 3168561 3122759 2662774 3065715 3927485 4029436 3539961 3762866 4814139
42028 4814139 5118131 3681741 1681063 955092 1571367 1840527 703322 -701379 -385404
42019 -385404 1868180 4034568 4310511 3299017 2902131 3558714 3914321 3276667 2911165
42010 2911165 4174395 6470186 8023339 7955336 6691454 4913611 3058340 1488797
42002 1488797 381077 -304525 -313594 795986 2503329 3213541 2226843 973413 1155200
41993 1155200 2434823 3286425 3405901 3648565 4069659 3881906 3244171 3236670 3890293 4029199
41983 4029199 3419740 3295773 4188256 4976985 4870798 4641745 4918880 4910434 4073234 3516378
41973 3516378 4199222 5036552 4560814 3429908 3339042 4184949 4413840 3802102 3678017
41964C678017O25740q4712j426236j231301N20683J759872J378003J70776r07439
41955D483403j464437r42517P53380J975048Q63945j577653k182015m7020J939004
41946C801138J183729r94807j554619k3628J443118J430562N90118j38930p30282
41937E006399j264399j393718j013413m43245K48083J144887J682798J082547
41929E049939k42436q69195k69456N62847P25581M79905K17207m23774j605415
41920C625203k450532k075811p88748M62021J153118J128779L43302o50208q31161
41911h4037l7518P58857J094048J624100K291740J618671p09703k319773j345926
41902B890459L63268o4500j786585j519449R05404J996246J50493j899803j589564
$$ plain form
41964 3678017 4303757 4219045 2792809 1561508 2082191 3842063 5220066 5390842 4483403
41955 4483403 3018966 2076449 2829829 4804877 5668822 4091169 1909154 1862134 3801138
41946 3801138 4984867 3990060 2435441 2411813 3854931 5285493 5875611 5736681 5006399
41937 5006399 3742000 2348282 1334869 891624 1139707 2284594 3967392 5049939
41929 5049939 4807503 3938308 3668852 4231699 4957280 5437185 5654392 5230618 3625203
41920 3625203 1174671 -901140 -1689888 -1227867 -74749 1054030 1397332 747124 -84037
41911 -84037 -121555 637302 1731350 3355450 5647190 7265861 6556158 4236385 2890459
41902 2890459 3253727 3189227 1402642 -116807 788597 2784843 2935336 1035533 -554031
41893e54031j78950J42032l5282Q23207J806421J044032p21550j049539L07303
41884A583643J170640M83900l93289k55894K28478Q0841l48401k22407L17030
41875B644541L91134l37513j159008j065347L5705R93701P53382j25121k34007
41866A897467M05876L34559o84184r16051L66675J211594P0284j325719n94432
41857G66069J282243J496044K5931n22664N95577J268910L90890m71372j93705
41848D637923M6637o18146q80851K70584J373666P18914q86735j490574q67628
41839B303790k38265j13101r0070n4960j36040q0449J68184J2936o37316p01056
41829D33653M33820J618093J573483P71173K39363l90683j800659k827132j633648
$$ plain form
41893 -554031 -732981 -590949 -626231 196976 2003397 3047429 2325879 1276340 1583643
41884 1583643 2754283 3238183 2844894 2589000 2817478 2898319 2549918 2327511 2644541
41875 2644541 3035675 2698162 1539154 473807 509512 1503213 2256595 2131474 1897467
41866 1897467 2303343 2637902 1953718 1037667 1404342 2615936 2686220 1360501 766069
41857 766069 2048312 3544356 3570287 3047623 3643200 4912110 5303000 4831628 4637923
41848 4637923 4684560 4066414 3185563 3456147 4829813 5548727 4661992 3171418 2303790
41839 2303790 2065525 1952424 1862354 1807394 1671354 1590905 1759089 1772025 1134709 433653
41829 433653 867473 2485566 4059049 4830222 5069585 4678902 2878243 51111 -1582537
41820a582537J171101K707249J433119j070571k320407j570845J39973J366686
41812B73768J249733J22967n21933M77419K307741K884395J351084j004269k443233
41803D697672k422002j375148P1860J215875J441912Q18869N8807l23706l13405
41794C870734O2155O61219P23479m72208k210228k746782j587851k32128K6436
41785a905174j20949N59709J634768J697762P60829L26817R84143J411041L85101
41776E734047j320796j969585j154617o4836L26554L41230O26375R20127M67259
41767C905758o35508j268711o70484M93345Q54331m3342j277631j725559j304868
41758a672669p90340o59868n77281p6965O48993R80450P32194M29715O65442J384074
$$ plain form
41820 -1582537 -411436 2295813 3728932 2658361 337954 -1232891 -1092918 273768
41812 273768 1523501 1646468 1124535 1601954 3909695 6794090 8145174 7140905 4697672
41803 4697672 2275670 900522 972382 2188257 3630169 4449038 4507845 4184139 3870734
41794 3870734 3932889 4594108 5317587 4845379 2635151 -111631 -1699482 -1931610 -1905174
41785 -1905174 -2026123 -1466414 168354 1866116 2626945 2953762 3937905 5348946 5734047
41776 5734047 4413251 2443666 1289049 1224213 1550767 1891997 2518372 3438499 3905758
41767 3905758 3270250 2001539 1331055 1824400 2678731 2635389 1357758 -367801 -1672669
41758 -1672669 -2463009 -3122877 -3700158 -3777123 -3128130 -2147680 -1415486 -985771 -320329 1063745
41748A063745J873296J397496m0370j432012j546537l53115O56674K05795r68175
41739H56797r88222N46026K008835K063428J184925K97699o27115j587066j625462
41730B129845l97343N74887o087r55053n11031N29033J80380r58990m92033J299070
41720A392678J301952j297580l238952k125762O1392N42634o5366J74370P20535
41711b534099L3495r58378k84306J331179J502133K38391k88966L70243N58667
41702c1641n7962N8465J064463J076584m20330j358258m05051R67240R84150K6152
41692A903812o62988q91774r66699p98814n17643n13892k93269R64852K287961
41683E11546J612672p04804j695899k62528R25556k34050j797985j085162R02297
$$ plain form
41748 1063745 2937041 4334537 4294167 2862155 1315618 962503 1619177 1824972 856797
41739 856797 -131425 414601 2423436 4486864 5671789 5969488 5342373 3755307 2129845
41730 2129845 1732502 2307389 2301302 1346249 835218 1364251 1544631 585641 93608 1392678
41720 1392678 2694630 1397050 -1841902 -3967664 -3906272 -3363638 -3429004 -3254634 -2534099
41711 -2534099 -2500604 -3458982 -3743288 -2412109 -909976 -671585 -960551 -590308 -31641
41702 -31641 -89603 -31138 1033325 2109909 1689579 331321 -73730 893510 1877660 1903812
41692 1903812 1240824 349050 -617649 -1416463 -1934106 -2447998 -2741267 -1776415 511546
41683 511546 2124218 1419414 -276485 -539013 386543 152493 -1645492 -2730654 -1828357
41674a828357J352266J94066m25278n2253n5151m88100o3556Q88265N48456j005313
41664i34955j474640j02077R47034O9405j277295j024673M41937J318645J097982
41655i38637N53455n9243j063891j990022j682738k3282J472638J305874j47934
41646b573780r38658J81804K117563K610012J055729o93553p90686K74326P32099
41637A974856J51197l37634o3225L64635K58790l40507j108969j574990r23214
41628a599061J009836K599187J895232n34859j927063j015595L37728R0069j143204
41619b87730j556042r80785m73129p0176J025236K395401K474831Q68828r06430
41610B490004j392266p12270K44339J016278J344586P26182q93507k430301k495909
$$ plain form
41674 -1828357 -476091 -282025 -707303 -759556 -814707 -1302807 -1366363 -478098 70358 -934955
41664 -934955 -2409595 -2511672 -1564638 -1495233 -2772528 -3797201 -3355264 -2036619 -938637
41655 -938637 -385182 -444425 -1508316 -3498338 -5181076 -5204358 -3731720 -2425846 -2573780
41646 -2573780 -3512438 -3330634 -1213071 1396941 2452670 1759117 968431 1242757 1974856
41637 1974856 2126053 1788419 1725194 2089829 2348619 2008112 899143 -675847 -1599061
41628 -1599061 -589225 2009962 3905194 3370335 1443272 427677 765405 855474 -287730
41619 -287730 -1843772 -2824557 -3297686 -3367862 -2342626 52775 2527606 3396434 2490004
41610 2490004 1097738 385468 629807 1646085 2990671 3716853 2823346 393045 -2102864
41601b102864r21122R76776J670119Q02560n84437j069186k39248Q52411Q23354
41592B08363m10927j512476j372937l92560L09711M77565P23848J170993J138613
41583C40193M53479R556K96471K95712r68344k378347j815010P09096K644861
41574d12333K143598K18736j115644j401337j238433n94368O72788J525220R34754
41565G32981j44737j4351Q42942L51651j514596k213857n74073J203014R37955
41556c93071l00982l94905J70290n61826k256280k500499o28130J276572J596491
41547c992340J100330R25110P96954M17545P20725K123123K948528J515465j052350
41538E503090k067198r46482L11997L32557m663K39138J78094j140752k422327
$$ plain form
41601 -2102864 -3023986 -2047210 -377091 425469 -158968 -1228154 -1467402 -614991 208363
41592 208363 -202564 -1715040 -3087977 -3480537 -3170826 -2693261 -1969413 -798420 340193
41583 340193 793672 803228 1099699 1395411 427067 -1951280 -3766290 -3057194 -412333
41574 -412333 1731265 1950001 834357 -566980 -1805413 -2399781 -1726993 -201773 732981
41565 732981 588244 573893 1416835 1768486 253890 -1959967 -2534040 -1331026 -393071
41556 -393071 -694053 -1088958 -918668 -1480494 -3736774 -6237273 -6865403 -5588831 -3992340
41547 -3992340 -2892010 -1966900 -1169946 -752401 -31676 2091447 5039975 6555440 5503090
41538 5503090 3435892 2489410 2801407 3133964 3129301 3368439 3546533 2405781 -16546
41529a6546j541472J097485K564506J212941j080558j462714K05272J549921J061217
41520C590052k57850p83735m36518j89154l59464m85555m80524p47299j110211
41511a260258p30383M63448J158405K84935j262358j529639m7940J502966J472600
41502E1776K46521n44247k25855L90271M76765K18670J23480R4778k26332o33504
41492b7677n31588J52021P56801O73433R474o09722o66108j20688O16592J003480
41482A256018Q19072L83634K01127L26093K40248m92865j517618j855576r55322
41473a595189N04194J149212L88877q99684j418661r06855j12281M36637Q92859
41464a560891J300516J213635N13071j08710p8680J63049j45969q91952j245764
$$ plain form
41529 -16546 -1558018 -460533 2103973 3316914 2236356 773642 978914 2528835 3590052
41520 3590052 3332202 2548467 2111949 1922795 1563331 1077776 597252 -150047 -1260258
41511 -1260258 -1990641 -1527193 -368788 -83853 -1346211 -2875850 -2923790 -1420824 51776
41502 51776 298297 -245950 -471805 -81534 395231 613901 737381 832159 605827 -27677
41492 -27677 -559265 -407244 349557 1022990 1032464 422742 -243366 -364054 252538 1256018
41482 1256018 2075090 2458724 2659851 2985944 3226192 2733327 1215709 -639867 -1595189
41473 -1595189 -1090995 58217 447094 -452590 -1871251 -2778106 -2890387 -2453750 -1560891
41464 -1560891 -260375 953260 1466331 1357621 1278941 1441990 1296021 404069 -841695
41455h41695p69799K01509J005496R63732k85965k044615k596414r72618J559348
41446c781021K752495J990328O51743J8399J6902J20574K31896K99190J47468
41437B447974P0232N35080J000416L22873j167814j520525r479J370888O43139
41428C692784j188034j673781n26472L54512M8640l56076l9577L03284J19308
41419G34588J12014P42608J092378L89378n08473m54889R9407N690m94722k29510
41409A488469O72504P82930k21904q94771l94182Q1304o33748j508663q65268
41400a493329P43920J175645K7406p34224O3507R98381N32970m03182k8194J240614
41390B123514J415082J27212r19678p45100l10567m50591m86557J61444O26621
$$ plain form
41455 -841695 -1611494 -1409985 -404489 559243 273278 -1771337 -4367751 -5340369 -3781021
41446 -3781021 -1028526 961802 1613545 1631944 1648846 1769420 2001316 2300506 2447974
41437 2447974 2518206 3053286 4053702 4376575 3208761 1688236 1678757 3049645 3692784
41428 3692784 2504750 830969 304497 659009 707649 351573 311996 615280 734588
41419 734588 846602 1589210 2681588 3070966 2562493 2107604 2207011 2212701 1717979 1488469
41409 1488469 2160973 2943903 2721999 1827228 1433046 1514350 880602 -628061 -1493329
41400 -1493329 -749409 426236 453642 -280582 -217075 781306 1314276 911094 882900 2123514
41390 2123514 3538596 3665808 2746130 2001030 1690463 1239872 753315 914759 1541380
41381A541380J34336m14883J23417J091846J013168k5085o29629m19787l89063
41372B025700r15557j076384m06653J05831m14506j268710j267704n27189p9874
41363c825046p6327M34507J778700K750342K106331L91600o45855l51815J43517
41354B705954j23869m00484L94590J541320J318286k99689j457591j217290p97774
41345A663453j275045j734556r72202L52260P99262L27838j99465p27510j441870
41336c207835j352078M11318K358332K039963k94769j723437p10170J026556J375525
41327g6595N24436j73246k36260J62300R34562J480843P29116j127647k256260
41318c8751j642606n58968l84128m34461M98249J782569J967744J195468P01863
$$ plain form
41381 1541380 1675716 1260833 1384250 2476096 3489264 3464179 2834550 2414763 2025700
41372 2025700 1110143 33759 -372894 -267063 -681569 -1950279 -3217983 -3745172 -3825046
41363 -3825046 -3901373 -3466866 -1688166 1062176 3168507 3560107 2914252 2562437 2705954
41354 2705954 2582085 2181601 2576191 4117511 5435797 5136108 3678517 2461227 1663453
41345 1663453 388408 -1346148 -2318350 -1966090 -1166828 -838990 -1038455 -1765965 -3207835
41336 -3207835 -4559913 -4148595 -1790263 249700 -45069 -1768506 -2478676 -1452120 -76595
41327 -76595 447841 274595 38335 200635 1135197 2616040 3345156 2217509 -38751
41318 -38751 -1681357 -2240325 -2624453 -3058914 -2560665 -778096 1189648 2385116 3086979
41309C086979O23105J85341m33985l43607K43564K54298l15736m60910r7371j91519
41299B550159q89421j247116j025179j042403j420106j193083j75545M66541K20113
41290c756040K26514J350132K600079K536082J198851l22498j323929j612496
41282H96695j098158j52642L80301K68570K01742M59944L52361l22773n56803
41273D29237J33349N99669L226n01423K51375J007849r9487k105174k203194p3021
41263b557594J489754Q21040l13324J32414J295874J188252K3260m04817K24897
41254A899756N15418q7402n14733j51763M5162p34877j637766j402444l29343
41245b397992J85646k40600n12892J46135R90844R81309M59625N42181J100739
$$ plain form
41309 3086979 3710084 3895425 3461440 3117833 3361397 3615695 3299959 2839049 2741678 2550159
41299 2550159 1660738 413622 -611557 -1653960 -3074066 -4267149 -4442694 -3976153 -3756040
41290 -3756040 -3529526 -2179394 420685 2956767 4155618 3833120 2509191 896695
41282 896695 -201463 -354105 26196 294766 496508 956452 1308813 986040 429237
41273 429237 562586 1162255 1165481 664058 915433 1923282 1823795 -281379 -2484573 -2557594
41263 -2557594 -1067840 -246800 -560124 -427710 868164 2056416 2079676 1674859 1899756
41254 1899756 2415174 2327772 1813039 1661276 1706438 971561 -666205 -2068649 -2397992
41245 -2397992 -2212346 -2452946 -2965838 -2819703 -1828859 -847550 -387925 154256 1254995
41236A254995O66462j218470k751964k024468L22283J900542J693536Q96436O10240
41227A349592L43255n16536j163041n03311R99747J800965J169938k84229j545563
41218A650817j825371q20194O92168J053181l45719j802785j290265O64205J645730
41209c78233Q02159j54589K41362J161020J096079Q8117p32985p75982j59338
41200A187610P81363J223689J73277j833264k476812n82035J715909J593470l92239
41191A390968j115612M12862J681485O81145j078545j045550N89157J516712Q07633
41182C840255k19671m55457n06526j229084k048374j697465j21810J221623J065862
41173a50647j21587o48419L69707J851290J982816M37747j224208j495517o14775
$$ plain form
41236 1254995 1921457 702987 -2048977 -4073445 -3751162 -1850620 -157084 739352 1349592
41227 1349592 1692847 1176311 13270 -490041 509706 2310671 3480609 3196380 1650817
41218 1650817 -174554 -994748 -302580 750601 404882 -1397903 -2688168 -2023963 -378233
41209 -378233 423926 269337 510699 1671719 2767798 2855915 2122930 1346948 1187610
41200 1187610 1968973 3192662 3365939 1532675 -944137 -1526172 189737 1783207 1390968
41191 1390968 275356 688218 2369703 3050848 1972303 926753 1515910 3032622 3840255
41182 3840255 3620584 3165127 2658601 1429517 -618857 -2316322 -2438132 -1216509 -150647
41173 -150647 -272234 -920653 -550946 1300344 3283160 3720907 2496699 1001182 386407
41164C86407J13739J49467Q8015L55249M03167l79933j455236j508743j09386
41155a957254J525223J844379Q12402j56494j32819K28923o1560p60976r25263
41146D16561m77153j35929n5182K05015L96821k54983j317380j178706M18016
41137a982920J419039K79519j568406j692773j57071Q61595M40220j58364O8145
41128b491016N03295N23715O87476J389305J733103Q98750l26750n52821K54451
41119B619508Q45835M16915n64270j125969q24685p7920K85108j3917k42586L03770
41109A621789R59104M15244j110663j819541r72699o4819l49040p53456J15299
41100a958782J228761O46488r65489r37959J192696K634413J348461j026255j598274
$$ plain form
41164 386407 500146 649613 737628 1092877 1496044 1116111 -339125 -1847868 -1957254
41155 -1957254 -432031 1412348 2224750 2068256 1935437 2164360 2102800 1341824 416561
41146 416561 -60592 -196521 -251703 -46688 350133 95150 -1222230 -2400936 -1982920
41137 -1982920 -563881 -284362 -1852768 -3545541 -3702612 -2841017 -2400797 -2559161 -2491016
41128 -2491016 -1987721 -1464006 -776530 612775 2345878 3244628 2917878 2365057 2619508
41119 2619508 3465343 3882258 3317988 2192019 1367334 1289414 1574522 1560605 1318019 1621789
41109 1621789 2580893 2996137 1885474 65933 -906766 -971585 -1320625 -2074081 -1958782
41100 -1958782 -730021 -83533 -1049022 -1986981 -794285 1840128 3188589 2162334 564060
41091E64060l2788J543806J452864o3737j621805j857522l70099J606701K063167
41082C284647N07885j310241j689848j008182n33853l66346P1179M99323M15409
41073a30027M64816J338416J969598R51809p17397p97047L88073J66105j888098
41064A746248k658313l11829K383988J983746m91473j299437L35172J480924K73405
41055C442431j549786j643860l06433N24615J16881m87548j39279J041797J826902
41046B825720J215574k67206r86454l48738K03367o73865j895493j351439P97035
41037d81499K175064J605598M24404r3108n22111j462848j816070m85513J469562
41028H13479K068850J045629k13582p79480q50122p38655n19737m74327p64248
$$ plain form
41091 564060 531272 2075078 3527942 3464205 1842400 -15122 -385221 1221480 3284647
41082 3284647 3792532 2482291 792443 -215739 -749592 -1115938 -1044759 -545436 -130027
41073 -130027 334789 1673205 3642803 4594612 3877215 3080168 3468241 3634346 1746248
41064 1746248 -912065 -1223894 1160094 3143840 2652367 1352930 1688102 3169026 3442431
41055 3442431 1892645 248785 -57648 466967 583848 96300 -42979 998818 2825720
41046 2825720 4041294 3774088 2787634 2438896 2642263 1968398 72905 -1278534 -481499
41037 -481499 1693565 3299163 3723567 3630459 3108348 1645500 -170570 -656083 813479
41028 813479 2882329 3927958 3714376 2934896 2084774 1346119 826382 352055 -412193
41019d12193q50231k23913N44344N13921j20278l16938J73562N80884N13740M90055
41009H92953Q87877J289818J142138M10421n27423j078404o69001M86503J076468
41000C911350J12899j474202j798706n86373N19475M73694J90768O80125J212976
40991C242006O13732n64607p33453J95546N55005n36307j744501j409596P1395
40982c10780Q55369K62972m36101l9235Q86934J021145K16081o12355j078494
40973G65536j556329j879029j217410L12716J244668P72687L5883L38518J087954
40964i4806Q75348j01015k95461P62250J829671J781115P60573n71613j654381
40955C291681j737604l09190J820505L005753K678001J700540O58994p89548k463354
$$ plain form
41019 -412193 -1262424 -1486337 -941993 -428072 -548350 -865288 -691726 -110842 402898 892953
41009 892953 1780830 3070648 4212786 4623207 4095784 3017380 2348379 2834882 3911350
41000 3911350 4024249 2550047 751341 164968 684443 1158137 1348905 2029030 3242006
40991 3242006 3855738 3291131 2557678 2753224 3308229 2771922 1027421 -382175 -310780
40982 -310780 544589 807561 371460 332225 1219159 2240304 2456385 1844030 765536
40973 765536 -790793 -2669822 -3887232 -3574516 -2329848 -1557161 -1521278 -1182760 -94806
40964 -94806 780542 679527 384066 1146316 2975987 4757102 5517675 4946062 3291681
40955 3291681 1554077 1244887 3065392 6071145 8749146 10449686 11108680 10319132 7855778
40946G855778l162002k489851j735206j813723j652888o5871J835387J900353
40938F71977J26342j195089n67789R59530J491143N85790o75910j177928p78414
40929e60348j72410o2881l79150l88166K59308R17244P77990p20n50877m47940
40919f07950j2012L85116O67223P37848M26839j51225o38455q94207j026220r60007
40909b073050m17579N64290J431784J588348R28222j17628r28979j099591n94789
40900g18972M28341J739303K758873K568227R50011p10005o36425R10701J538890
40891H828944k34957k813362l403853j401096J206669K357203J747268M28692
40883F715508l72725j23620N27019L19741r08105j665208q82471K29625j45436
$$ plain form
40946 7855778 4693776 2203925 468719 -1345004 -2997892 -3063763 -1228376 671977
40938 671977 798319 -396770 -964559 -5029 1486114 2071904 1395994 218066 -560348
40929 -560348 -732758 -795639 -1174789 -1562955 -1303647 -386403 391587 390867 -160010 -607950
40919 -607950 -619962 -234846 432377 1170225 1597064 1445839 807384 -86823 -1113043 -2073050
40909 -2073050 -2490629 -1926339 -494555 1093793 2022015 1904387 975408 -124183 -718972
40900 -718972 -290631 1448672 4207545 6775772 7725783 7015778 6379353 7290054 8828944
40891 8828944 8593987 5780625 2376772 975676 2182345 4539548 6286816 6715508
40883 6715508 6342783 6219163 6746182 7065923 6157818 4492610 3610139 3839764 3694328
40874C694328j484226j552512J21707J465990R82821l05512q42073o61215l82033
40865A037275L15326J681210K547404J677880k14774j342729j277778j073668
40857C350146j274550j279527o97738k3721K88864M16476N39547M03488k10411
40848A512574j072060j651272j359718O0545J890109K673139J907073R85575J380119
40839F326084K327255J757874o07466k723513l057470k337141j818599j372545
40831a505521m13369M89012L63940m48466o81957L5976Q46892J021659P48044
40822D56210N73098P36141J041935R74948J51483j024091j622584j449030j275384
40813a437274j305635n22654J399843K691880J660827m99765j080491K85528J303367
$$ plain form
40874 3694328 2210102 657590 779297 2245287 3228108 2922596 2080523 1419308 1037275
40865 1037275 1352601 3033811 5581215 7259095 7044321 5701592 4423814 3350146
40857 3350146 2075596 796069 98331 74610 363474 779950 1319497 1722985 1512574
40848 1512574 440514 -1210758 -2570476 -2509931 -619822 2053317 3960390 4945965 6326084
40839 6326084 8653339 10411213 9803747 7080234 4022764 1685623 -132976 -1505521
40831 -1505521 -1918890 -1429878 -1065938 -1514404 -2196361 -2160385 -1313493 -291834 456210
40822 456210 1029308 1765449 2807384 3782332 3933815 2909724 1287140 -161890 -1437274
40813 -1437274 -2742909 -3265563 -1865720 826160 2486987 1987222 906731 1192259 2495626
40804B495626O71795k13866J04405R08739Q49550M5167o43145j070448j300971
40795A846852q84511J16259N46047j52949q36860m76915K36404M73834Q96358
40786A764519J905489J900436k62163k390768j537745J293210K280866M52446
40778E406290j202452p30011J49441l86271j247102q63045p373j0314k38713L71403
40768A241853R61213K61525q74304p88874J35934K56533m36647m61799N17499
40759H12933J278093J076089K89954p63923j922148k312237j202024L86296O90411
40750a666556j71494l97431N67339J204909M93349n02333m52495K51430L54680
40741c18602l68719j017973q13736J94781J306866J720710J236155M86408J12336
$$ plain form
40804 2495626 3167421 2953555 3057960 3966699 4816249 4861416 4218271 3147823 1846852
40795 1846852 962341 1078600 1624647 1471698 634838 157923 394327 868161 1764519
40786 1764519 3670008 5570444 5308281 2917513 1379768 2672978 4953844 5406290
40778 5406290 4203838 3473827 3623268 3236997 1989895 1126850 1119477 1109163 870450 1241853
40768 1241853 2203066 2464591 1590287 801413 937347 1193880 757233 295434 812933
40759 812933 2091026 3167115 3457069 2693146 770998 -1541239 -2743263 -2356967 -1666556
40750 -1666556 -1838050 -2235481 -1668142 -463233 30116 -472217 -924712 -673282 -318602
40741 -318602 -687321 -1705294 -2519030 -2324249 -1017383 703327 1939482 2425890 2538226
40732B538226r9011o89551j442448j607169j010444j46824O04660J024517O66419
40723a61625n17318j399312o80601J355073L071476L382481K546400J357356N66957
40714I520887P56725J627561J755571K52129j755174k565485k211855j801635
40706E578724j322879j37409R38358M95630p49449p19994M88975O46040p01904
40697D516092j388411n14829l7481j097768j814328o42711Q37805P80158K29676
40688H68203Q31482J555079O32734r64349j090323j76859k51611j111821p58696
40679d66161P46789J141272j26239q54331L19240J842093J799145N35854m04186
40670D533476m92507k96035l10600n44243p37001o35413l97750n67113j191873
$$ plain form
40732 2538226 2439215 1749664 307216 -1299953 -2310397 -2457221 -1852561 -828044 -161625
40723 -161625 -678943 -2078255 -2758856 -1403783 1667693 5050174 7596574 8953930 9520887
40714 9520887 10277612 11905173 13660744 13912873 12157699 9592214 7380359 5578724
40706 5578724 4255845 4118436 5056794 5552424 4802975 4082981 4571956 5217996 4516092
40697 4516092 3127681 2612852 2575371 1477603 -336725 -979436 -141631 638527 868203
40688 868203 1699685 3254764 3887498 2923149 1832826 1655967 1404356 292535 -466161
40679 -466161 280628 1421900 1295661 441330 760570 2602663 4401808 4937662 4533476
40670 4533476 4040969 3744934 3434334 2890091 2153090 1517677 1119927 552814 -639059
40661f39059j502356j089290n87647l62490L45841J759754K395178J277452Q546
40652A605929M26479J397272O43879j138680j218773M68878J070814l81752j453621
40643A420425o21348K45181o16761j817700j409345j73835K4005n66989l35072
40634c851439R53376K164322K608890K199615P75140j195970k222052j562648
40626a30766m15766j9685J89216J034815J639483R39016n4851K62677J225810
40617D669949Q98865n91604j203390l64227K18581m82234j214533n83604R11752
40608B259555J877554J820649J162789M08721o4756j17626j53113o74299j374496
40599E144978j404229o11643K91326P98772R49879O70554j32194q06048n08195
$$ plain form
40661 -639059 -2141415 -3230705 -3818352 -4180842 -3835001 -2075247 319931 1597383 1605929
40652 1605929 2032408 3429680 4073559 2934879 1716106 2184984 3255798 2874046 1420425
40643 1420425 799077 1044258 427497 -1390203 -2799548 -2973383 -2949378 -3516367 -3851439
40634 -3851439 -2898063 -733741 1875149 4074764 4849904 3653934 1431882 -130766
40626 -130766 -546532 -566217 -377001 657814 2297297 3236313 3181462 3444139 4669949
40617 4669949 5568814 4977210 3773820 3409593 3628174 3145940 1931407 1347803 2259555
40608 2259555 4137109 5957758 7120547 7529268 7464512 7346886 7193773 6519474 5144978
40599 5144978 3740749 3129106 3420432 4219204 5169083 5839637 5707443 4901395 4393200
40590D393200L40876M83093n2536K01577J573585K164756N32841j849952k415284
40581E372156j005348J32306l98169j519410j564986m27962P94488J368327J362183
40572D113585J021028M24058l46715j110415j607827j488502n96977N06950Q14474
40563A729659J77205j37059R12766K246215J739038n79474j974597o40271J547301
40554E020783J669649K10885M16785L203172N335983L804805j17828k897006l251542
40545A3395686k617304k142224j542911o91114k14186k47653k31966j98170p23730
40536D786428j386465r46537M61925J068614K16270l42855Q02362K136476J203622
40527G999840j613962l273161k015999N02177J523760M77063q08687o04463P88837
$$ plain form
40590 4393200 4734076 5217169 5164633 5366210 6939795 9104551 9637392 7787440 5372156
40581 5372156 4366808 4499114 4100945 2581535 1016549 588587 1383075 2751402 4113585
40572 4113585 5134613 5558671 5211956 4101541 2493714 1005212 408235 915185 1729659
40563 1729659 1906864 1769805 2682571 4928786 6667824 6088350 4113753 3473482 5020783
40554 5020783 6690432 6901317 7318102 10521274 15857257 19662062 19544234 16647228 13395686
40545 13395686 10778382 8636158 7093247 6402133 6187947 5940294 5708328 5510158 4786428
40536 4786428 3399963 2453426 2915351 3983965 4200235 3857380 4659742 6796218 7999840
40527 7999840 6385878 3112717 1096718 1598895 3122655 3599718 2791031 2186568 2975405
40518B975405J679868J140638N0424k06309L95062P18080L46413J13971M40179
40509G653731M15422n78825j450867r00942M30470Q30537P0140n56467n69396
40500E343803q65565j698999j920196r20630K81718Q01035J181687J803844J601552
40491E608249O4075q72488P30955L229134K965292m47213l119147k107859P63469
40482F814467J943066J023245K54664M31334R7643j229684j779677m17976J286924
40473H424006J413620O45724R94765K350227K434129K85677k163055k785822j989972
40464I609299j476689j389201m54539J378685K302385J138391r24488j896400
40456H287443j319324k00689N41073N74236k25495j475158j977225q96977Q76377
$$ plain form
40518 2975405 4655273 5795911 5846335 5640026 6035088 6753168 7099581 7213552 7653731
40509 7653731 8069153 7490328 6039461 5138519 5568989 6399526 6469666 5913199 5343803
40500 5343803 4478238 2779239 859043 -61587 220131 1021166 2202853 4006697 5608249
40491 5608249 5672324 4799836 5530791 8759925 11725217 11278004 8158857 6050998 6814467
40482 6814467 8757533 9780778 10035442 10466776 10564419 9334735 7555058 7137082 8424006
40473 8424006 9837626 10483350 11478115 13828342 16262471 16548148 14385093 11599271 9609299
40464 9609299 8132610 6743409 6288870 7667555 9969940 11108331 10183843 8287443
40456 8287443 6968119 6767430 7308503 7882739 7657244 6182086 4204861 3307884 4184261
40447D184261J617330R58206J52591J74029O72228R18538O39435k96195j827624
40438G192799l001189k541432o51084Q94719J040665O89552R57666J411881J051878
40429G045455N3803n90752m73321J39702R11533J285119N68057q97999j544903
40420F496694n98840O17893N46146m27928r84550j056303j348182j505914o80979
40411A058037N57985Q30856K75863M05380J607716K537606K210595J204018N40543
40402A1228599O21825J319145J974082J509479k42365j723954j512550l86785
40394A2787476N5033L5408Q09326J976943K030797J069835L40915l87616j910350
40385A6807767k518779K32768M406408M689254j03276m670543m468341j489442
$$ plain form
40447 4184261 5801591 6759797 6912388 7086417 7758645 8677183 9316618 9020423 7192799
40438 7192799 4191610 1650178 999094 1893813 2934478 3624030 4581696 5993577 7045455
40429 7045455 7099258 6508506 6035185 6174887 7086420 8371539 8939596 8041597 6496694
40420 6496694 5897854 6515747 7061893 6633965 5649415 4593112 3244930 1739016 1058037
40411 1058037 1616022 2446878 2722741 3128121 4735837 7273443 9484038 10688056 11228599
40402 11228599 11850424 13169569 15143651 16653130 16410765 14686811 13174261 12787476
40394 12787476 12842509 12877917 13687243 15664186 17694983 18764818 19105733 18718117 16807767
40385 16807767 14288988 14521756 18928164 23617418 23514142 18843599 14375258 12885816
40377A2885816j55058r50869j499634j171687r61977p15223J31885N62550k71692
40368G854111q98115j608P58488m29887j797625p70514J197138P95713j287494
40359E420207j334646R71372J885854r3210j824381p97235J159691J341835J10134
40350F839621p07816p98053p06883k30272O61825Q81098j49265j165640o96399
40341C928216R95295K527959K938648J984911P8579j545092j742786r12159m00093
40332G853478m72290l31033j5143l80177j102334p70180P23310J901901K107934
40323I515466K062106J774254L25408j774307k587721j855109j470640j962335
40315D027122j371144R96739K621019J544800m54016p63198J84053M55800K13613
$$ plain form
40377 12885816 12730758 11779889 10280255 9108568 8146591 7431368 7563253 8125803 7854111
40368 7854111 6955996 6954388 7712876 7282989 5485364 4714850 5911988 6707701 5420207
40359 5420207 4085561 5056933 6942787 6849577 5025196 4227961 5387652 6729487 6839621
40350 6839621 6131805 5333752 4626869 4396597 5058422 5939520 5790255 4624615 3928216
40341 3928216 4923511 7451470 10390118 12375029 12453608 10908516 9165730 8253571 7853478
40332 7853478 7381188 7050155 7035012 6654835 5552501 4782321 5505631 7407532 9515466
40323 9515466 11577572 13351826 13677234 11902927 9315206 7460097 5989457 4027122
40315 4027122 2655978 3652717 6273736 7818536 7364520 6601322 6785375 7241175 7454788
40306G454788R25069K132914J813480l88359k484650k684786j123228P78901J591486
40297H015615Q74970l13746m95850J97602J50893j129727k095941j593340m73976
40288C136500K05550P22938J234121Q06488n65205j017520K71762J232471R5459
40279F122564j524522j302786k11016p89674k610129k793804o50542J358215J502417
40270h99277Q73476R42042J283805P74077m08873j007433l33709Q21226R34635
40261B979969l34434j213688O5995K288062K332122k59588k234071j341125N44466
40252B827708Q79880L29834N81058Q17426k67019r73403R80624L850651L738146
40243A2764905M58050k347290k682851j968808j338557j07600J454096J492871
$$ plain form
40306 7454788 8379857 10512771 12326251 11937892 9453242 6768456 5645228 6424129 8015615
40297 8015615 8890585 8576839 8080989 8278591 8429484 7299757 5203816 3610476 3136500
40288 3136500 3342050 4064988 5299109 6105597 5540392 4522872 4794634 6027105 6122564
40279 6122564 4598042 3295256 3084240 2294566 -315563 -3109367 -3759909 -2401694 -899277
40270 -899277 -25801 916241 2200046 2974123 2565250 1557817 1224108 2045334 2979969
40261 2979969 2645535 1431847 1497842 3785904 6118026 5858438 3624367 2283242 2827708
40252 2827708 3707588 4037422 4618480 5435906 5168887 4195484 5176108 9026759 12764905
40243 12764905 13222955 10875665 8192814 6224006 4885449 4777849 6231945 7724816
40235G724816j90230j348399q01442K9613M8035K04520J195495J933557J472371
40226A0268336L47814q33888k058751k600522j381590P56893J520006M76214n09888
40217E984624n80011q38885j457911r53687O56381J156735n5664n80151Q92399
40208D223830K103633R04211j268272j849190q60102M150R4014k90714r41624
40199B119936j182552k32178P41572m71527k957261k790760Q05508L233980J306576
40190E73294j556400p90156K072615K466999M82658p0337J231394J110457r25017
40181D595507j501712M33676J600628J59502j162825K0055J693972J054995r55486
40172E938312j708213j143139r76182j281014p74008M04675P94304J32253l48264
$$ plain form
40235 7724816 7534586 6186187 5384745 5414358 5462393 5666913 6862408 8795965 10268336
40226 10268336 10616150 9782262 7723511 5122989 3741399 4498292 6018298 6494512 5984624
40217 5984624 5404613 4565728 3107817 2154130 2810511 3967246 3911582 3331431 4223830
40208 4223830 6327463 7231674 5963402 4114212 3254110 3258260 3352274 3061560 2119936
40199 2119936 937384 705206 1446778 975251 -1982010 -4772770 -3967262 -733282 573294
40190 573294 -983106 -1773262 299353 2766352 3249010 3178673 4410067 5520524 4595507
40181 4595507 3093795 3527471 5128099 5287601 4124776 4144831 5838803 6893798 5938312
40172 5938312 4230099 3086960 2110778 829764 55756 460431 1254735 1386988 1038724
40163A038724k1576M63005N94617N72363L94434k27378q03754k54142J263784
40154C020077J848909J88624k262254k695123m97078J863270J996797N04901k96363
40145C671760L26863J056503R57962N41233K02588n14091j429247j290929J13160
40136C635802J023978K30258r30053o60303M91224P45779l0982n98535p50767
40127C156401j291391j948802j475125R3837J180179R58936L27418L00254Q33493
40118B135200J454024J746455J115566n56613j933839j416768M59979J378640
40110D382644M16073o74514r2205J448381J829876L87528j362125j590337j73396
40101D571925J179398Q28685p17805j222553L10082J990635J492325o67328j933831
$$ plain form
40163 1038724 1017148 1480153 2074770 2647133 3041567 2814189 2010435 1756293 3020077
40154 3020077 4868986 5057610 2795356 100233 -396845 1466425 3463222 3968123 3671760
40145 3671760 3998623 5055126 6013088 6554321 6756909 6242818 4813571 3522642 3635802
40136 3635802 4659780 4890038 3959985 3299682 3790906 4536685 4505703 3907168 3156401
40127 3156401 1865010 -83792 -1558917 -1465080 -284901 674035 1001453 1301707 2135200
40118 2135200 3589224 5335679 6451245 5894632 3960793 2544025 3004004 4382644
40110 4382644 4798717 4124203 4031998 5480379 7310255 7697783 6335658 4745321 4571925
40101 4571925 5751323 6580008 5862203 4639650 4949732 6940367 8432692 7765364 5831533
40092E831533j344480l82875k02061j31176M18166N31386n17587j610543j273308
40083A319055M0174N50634l19691j207053o71221R62513J958795J171722n87100
40074C217828j468113q55207o8577l74766j079857n83770J165382K496902K188516
40065D638338P01225p96056j646608j830143j661104j437753r10388M75996K181414
40056b85079K349011K83571j752211j148006J153769J689002n31196k523337j594257
40047b358733J115154K633337J985103N08045m53275o30630k61152K85326N26815
40038C349990K49405l11953q81593j251249j027275j39637M63957j62426j224651
40029i35432r87609M60844J083209J73624k71525J220111K847956K007107o72834
$$ plain form
40092 5831533 4487053 4104178 3902117 3770941 4189107 4720493 4202906 2592363 1319055
40083 1319055 1359229 1909863 1590172 383119 -288102 674411 2633206 3804928 3217828
40074 3217828 1749715 894508 825931 451165 -628692 -1212462 -47080 2449822 4638338
40065 4638338 5339563 4543507 2896899 1066756 -594348 -2032101 -2942489 -2466493 -285079
40056 -285079 2063932 2347503 595292 -552714 601055 2290057 1758861 -764476 -2358733
40047 -2358733 -1243579 1389758 3374861 3882906 3429631 2799001 2537849 2823175 3349990
40038 3349990 3599395 3287442 2405849 1154600 127325 -12312 451645 289219 -935432
40029 -935432 -1923041 -1462197 -378988 -205364 -476889 743222 3591178 5598285 4925451
40020D925451k013185o29519J480629J908832O74282n95633j092644j350402j764080
40011A543731j658561l02107J590499K213387Q35582j066573j512916l59410R05130
40002B188762J257497R33338L85996k51790o19845k78556L91669N29161J70495
39993D706727J72878O48229P06061l0271q66127j217505j161115o86703K71071
39984B543245R48802M01077p81634r89108l8608O21619L95937K54471N48534K99152
39974D203487o15731q08213J11950O19705Q721k94211M47182N89580r08620k170916
39964A182934j336151K89389N59918R0629O57482J556213P85749j096351j576439
39955A113373k49919P76804M93027J07374L36523K94727l57560o01251j57656
$$ plain form
40020 4925451 2912266 2282747 3763376 5672208 6346490 5750857 4658213 3307811 1543731
40011 1543731 -114830 -416937 1173562 3386949 4222531 3155958 1643042 1283632 2188762
40002 2188762 3446259 4379597 4765593 4513803 3893958 3615402 4007071 4536232 4706727
39993 4706727 4879605 5527834 6233895 6203624 5337497 4119992 2958877 2272174 2543245
39984 2543245 3492047 3893124 3111490 2122382 2083774 2705393 3101330 3355801 3904335 4203487
39974 4203487 3587756 2779543 2891493 3511198 3519919 3225708 3672890 4262470 3353850 1182934
39964 1182934 -153217 136172 696090 786719 1444201 3000414 3786163 2689812 1113373
39955 1113373 863454 1640258 2133285 2240659 2577182 2871909 2514349 1913098 1755442
39946A755442k35513j243255j636938k21458J788324K218138O53849j210063j565168
39937C03358l26825R10440P46139k34359k17173J100055J812047O56647r21933
39928C828396r98113r4547J1081p06256r47650p48071j227906k013218j394321
39919d290605P97078K642515K747605J566202N7801j110321j079062M10070J682342
39910C423625P51206j559374k354091q09915Q00059P52949P4393J68397N94302
39901A841551N20032M21961Q57575J080811K98679q56265j272657q16172k5560
39892B049955O38179O64594k27365j217994j070795k9106M49882J01687J36509
39883A495546P15053L63068j234386k116279j018121N89485R34507N23385O13898
$$ plain form
39946 1755442 1519929 276674 -1360264 -1581722 206602 2424740 3078589 1868526 303358
39937 303358 -23467 886973 1633112 1398753 1181580 2281635 4093682 4750329 3828396
39928 3828396 2830283 2735736 2746817 2040561 1092911 344840 -883066 -2896284 -4290605
39919 -4290605 -3493527 -851012 1896593 3462795 3520596 2410275 1331213 1741283 3423625
39910 3423625 4174831 2615457 261366 -548549 251510 1004459 1078852 1247249 1841551
39901 1841551 2361583 2783544 3641119 4721930 5020609 4164344 2891687 2075515 2049955
39892 2049955 2688134 3352728 3125363 1907369 836574 807468 1257350 1359037 1495546
39883 1495546 2210599 2573667 1339281 -776998 -1795119 -1205634 -271127 252258 866156
39874H66156Q50286L15460m86140o15500m87062q33290r66715N5429J436857J648527
39864A784008P16790j53235n21658o77513m17286M53132J041536M73075m74561
39855B224288m57038K41709K37843o67622j348197j162709m17444N93157J528710
39846G72697J457221k644j381087r39699O73037J144254j46147j286928o26333
39837c35629J195660K466248K362727J232009p1218p31179n71691k14092r6506
39828E236329K32716J005627J161847k09680j933281k014352n72085M33322M00274
39819C740717Q34266K365128L181434J670882r82297k312490j668409m11746L09165
39810F726650O03870Q17634O05489n65428k358019l394247k496618k69135J115648
$$ plain form
39874 866156 1716442 2031902 1545762 930262 443200 -390090 -1356805 -1301376 135481 1784008
39864 1784008 2500798 2347563 1825905 1148392 731106 1184238 2225774 2698849 2224288
39855 2224288 1767250 2008959 2246802 1579180 230983 -931726 -1349170 -756013 772697
39846 772697 2229918 2227274 846187 -93512 579525 1723779 1577632 290704 -335629
39837 -335629 860031 3326279 5689006 6921015 6849797 6118618 5546927 5332835 5236329
39828 5236329 5469045 6474672 7636519 7426839 5493558 3479206 2907121 3340443 3740717
39819 3740717 4574983 6940111 10121545 11792427 10810130 8497640 6829231 6417485 6726650
39810 6726650 7330520 8148154 8753643 8188215 5830196 2435949 -60669 -329804 785844
39801G85844L78418j100110r90026Q50636K281630J876001N05666l72166m83859
39792C732034j47622O36016J501274J308457l67532k143209k369020j155929J71220
39783A165689R89033J528221J603943O32147j070136k201778j970517q47456L18134
39774A47280J138481J460727J110169K48895n58746r65414j103204j055194o21010
39765a98016J02306M69474Q2561n54472o47049p4913O94371J317575J629396J280352
39755D101585J21480j076326j153263r6445P09294K43688p80143r60575j15743
39746I93552O75163O62816J68685k32272m19843m64611l83854l67369n90759o45148
39736f03640O7815J118854J177412p7690j114523n56742P00804O69912p61087
$$ plain form
39801 785844 1164262 64152 -925874 -75238 2206392 4082393 4588059 4215893 3732034
39792 3732034 3584412 4220428 5721702 7030159 6662627 4519418 2150398 994469 1165689
39783 1165689 2154722 3682943 5286886 5919033 4848897 2647119 676602 -170854 147280
39774 147280 1285761 2746488 3856657 4105552 3546806 2581392 1478188 422994 -198016
39765 -198016 -95710 373764 456325 -98147 -745196 -820109 -125738 1191837 2821233 4101585
39755 4101585 4223065 3146739 1993476 1897031 2606325 2850013 2069870 1109295 993552
39746 993552 1668715 2331531 2500216 2267944 1848101 1383490 999636 632267 41508 -603640
39736 -603640 -535825 583029 1760441 1682751 568228 11486 712290 1382202 621115
39727F21115j516449k71501J633505K032810P76120l81737l26634J99390R0749
39718B857368m90390o48118k46633N1696Q831J00996M47797L87205l73836r52456
39708A142460m50376N33569N34691o91076j662042j085128M29717J177012N76673
39699E05500j25152L79528J519491J484975r7194j210204j20147J845426J876122
39690F058345k43038j786650j249147m19334j005528j604445l00279J627403J530127
39681B607454k68771j162704o60463o56436j355782o36136J693820K591292M44743
39672B597017j983208j503816R58845K189354J274064q0014o12629n70230l70852
39663A898531j29296j21364l49478j89416M60814N53449m60514j378945r40962
$$ plain form
39727 621115 -895334 -1166835 466670 2499480 3275600 2893863 2567229 2766619 2857368
39718 2857368 2366978 1718860 1472227 1523923 1532754 1633750 2081547 2468752 2094916 1142460
39708 1142460 692084 1225653 1760344 1069268 -592774 -1677902 -1248185 -71173 505500
39699 505500 380348 759876 2279367 3764342 3667148 2456944 2336797 4182223 6058345
39690 6058345 5815307 4028657 2779510 2360176 1354648 -249797 -550076 1077327 2607454
39681 2607454 2338683 1175979 515516 -140920 -1496702 -2132838 -439018 2152274 2597017
39672 2597017 613809 -890007 68838 2258192 3532256 3452242 2839613 2269383 1898531
39663 1898531 1769235 1647871 1298393 1108977 1569791 2123240 1662726 283781 -657181
39654f57181J86436M84044j69475o40967k75632O17054J369338J245647j1375
39645B147889j304695j053532M55303J137624K34903n57788o2855M92901m6175
39636A443575o99660n13193m63777j132875q63375J220712K637506J017094j781327
39627H64680k293883n77976P00037Q85795J352873J917290J082265o07611j081330
39618B242140l68703l00806q37210j95013J412030J717904L48861n69736j87966
39609C261501n3738q49798j109102m2486J043372R89378J99310o60996j285917
39600A491524r73031N75184J851554J204785m86602j120795o11083k45384J25366
39591A811518J228310J851529O06163r42996n67444N32362m0546j136598k52954
$$ plain form
39654 -657181 -470745 13299 -156176 -797143 -1072775 -455721 913617 2159264 2147889
39645 2147889 843194 -210338 244965 1382589 1617492 1059704 996849 1489750 1443575
39636 1443575 743915 230722 -233055 -1365930 -2229305 -1008593 1628913 2646007 864680
39627 864680 -1429203 -2007179 -1307142 -421347 931526 2848816 3931081 3323470 2242140
39618 2242140 1873437 1572631 735421 540408 1952438 3670342 4019203 3449467 3261501
39609 3261501 3207763 2357965 1248863 1206377 2249749 3239127 3438437 2777441 1491524
39600 1491524 518493 1093677 2945231 4150016 3663414 2542619 1931536 1686152 1811518
39591 1811518 3039828 4891357 5497520 4554524 3987080 4519442 4478896 3342298 3089344
39582C089344J152104P467k131969j370164J118319Q09800j736068j656422J180049
39573D62460J957601Q9558N6980K203536J832638j034623p47471L045460L946563
39564A1812702R34502O39649M251277M880594K243952N220317J3803132J6314108
39556F0100233J4378091K9161027O3924655Q0370797M1700785l0671652p5360043
39549A83603893o5035253l2047063j6007805j7040448j4673571o058028k858675
39542B9883050o056123o422047k767620j702607l410527k352270Q26061O70019
39534H667936k112154k119990K86046J30525k257979k005435Q53589J621217j73588
39525B890167m97966J078372R17889j218078j687528m6558L66156q63159o01333
$$ plain form
39582 3089344 4241448 4248915 2116946 746782 1865101 2674901 938833 -717589 462460
39573 462460 2420061 2509619 2566599 4770135 6602773 5568150 4820679 7866139 11812702
39564 11812702 12747204 13386853 17638130 22518724 24762676 29982993 43786125 60100233
39556 60100233 74478324 103639351 167564006 247934803 289635588 258963936 183603893
39549 183603893 118568640 86521577 70513772 53473324 38799753 32741725 29883050
39542 29883050 23826927 17404880 14637260 12934653 9524126 7171856 7997917 8667936
39534 8667936 6555782 4435792 4721838 4852363 2594384 588949 1442538 3063755 2890167
39525 2890167 2392201 3470573 4388462 3170384 1482856 1436298 1802454 939295 337962
39516C37962J366824J667483k56175j151664j09712J28092j122999j143102P36956
39507D53665J710336P44855J46328O42304k1123k109325k498017q7196J938472
39498I20299J247851l65754p36484m13511j80306O40590J561706M72836k233287
39489I13940k953144m80346J542548L37687j600736q94632J302498J855753R01034
39480I24602P07968J217195N61282j054103j529507m92365K88959L4947j10965
39471E48013M90448Q41292K10681m96249j54889P44751O18108j014540k541068
39462g53453k045891N5589J215842J19865j406643j073808N45050J252631P58318
39453a332500N15523O79528J02223p81437j68087J630669K059780M83348o63274
$$ plain form
39516 337962 1704786 3372269 3116094 1964430 1854718 1982810 859811 -283291 453665
39507 453665 2164001 2908856 3055184 3697488 3676365 1567040 -930977 -1018173 920299
39498 920299 2168150 1802396 1065912 652401 472095 1112685 2674391 3147227 913940
39489 913940 -2039204 -2519550 -977002 -639315 -2240051 -3134683 -1832185 23568 924602
39480 924602 1632570 2849765 3411047 2356944 827437 335072 624031 658978 548013
39471 548013 1038461 1879753 2090434 1594185 1439296 2184047 2802155 1787615 -753453
39462 -753453 -2799344 -2743755 -1527913 -1408048 -2814691 -3888499 -3343449 -2090818 -1332500
39453 -1332500 -816977 -137449 -35226 -816663 -984750 645919 2705699 3189047 2525773
39444B525773p2902K77775j073519k171226r36751J153743J440664K59254m5302
39435A357509J009437J756456J127923m71652k263082l233404k182572N00294
39427b399091K196115J191471o40348m80126J183706J517214j26201j448862r59297
39418C4581J41703L31927j37625l07272q6400m004l97566j205953j777099j049406
39408d457114J047270K749146K334372M63537q57467j199797j666766k173752
39400c760571j193799J289613K916589K150058M49762o0607N21464Q18902O06276
39391C737687N31836M06849l17838r29232k42081J127715J157421o23603k258873
39382B589881k083772q69765l31930o62438p29811R9R35982J371921J033363m4912
$$ plain form
39444 2525773 2452871 2730646 1657127 -514099 -1450850 -297107 1143557 1402811 1357509
39435 1357509 2366946 4123402 5251325 4779673 2516591 -716813 -2899385 -2399091
39427 -2399091 -202976 988495 348147 -131979 1051727 2568941 2442740 993878 34581
39418 34581 176284 508211 370586 63314 -23086 -27090 -424656 -1630609 -3407708 -4457114
39408 -4457114 -3409844 -660698 1673674 2137211 1279744 79947 -1586819 -3760571
39400 -3760571 -4954370 -3664757 -748168 1401890 1851652 1791045 2312509 3131411 3737687
39391 3737687 4269523 4676372 4358534 3429302 3187221 4314936 5472357 4848754 2589881
39382 2589881 506109 -363656 -695586 -1358024 -2087835 -2087736 -1151754 220167 1253530 1208618
39372A208618j236634j320686J21527J638173J533697L05336j38672L76826j8223
39363B469962j861473k877755j250330J442061K396584J359152K03623k56841
39355A624983p66695j423332j265203j56296P84493Q53715L80036k89059r23035
39346a180393p52681O20128J873352J389800j79025q34817m61586o37707j293896
39337a456825n97908J287988J619594m64535k032414q04637J337537J617814N85654
39328A092268L21717N87458q0240r96061l71663J180330J376498M8890p47514
39319B411683k25627L13181J66137Q5862K19814l08529j334802j470069n16315
39310f58665N6456l71087o02748J34887R04036Q20470M08103L62284M58492M15597
$$ plain form
39372 1208618 -28016 -1348702 -1227175 410998 1944695 2250031 2111359 2488185 2469962
39363 2469962 608489 -2269266 -3519596 -2077535 319049 1678201 1881824 1624983
39355 1624983 858288 -565044 -1830247 -1986543 -1202050 -348335 31701 -257358 -1180393
39346 -1180393 -1933074 -1312946 560406 1950206 1771181 936364 474778 -162929 -1456825
39337 -1456825 -2054733 -766745 852849 388314 -1644100 -2448737 -1111200 506614 1092268
39328 1092268 1413985 2001443 1921203 925142 553479 1733809 3110307 3159197 2411683
39319 2411683 2186056 2499237 2665374 2751236 2971050 2662521 1327719 -142350 -658665
39310 -658665 -602209 -973296 -1576044 -1441157 -537121 283349 691452 1053736 1512228 1927825
39300A927825M19663K02586q55980k102381j797159K24609J773418J270853p3505
39291I89929l24438L79856O40234K93883L53844J011386J279711N31717p30066
39282D426056j624791j664354r03544R8118O46455O39571O13102Q00743O96067
39273C727423r9620j178862j847610j779022r32038L92586J163416L30237j549407
39264a772897k438179j285154N95292J366908Q80440J30626m33270q27575o29621
39255d413430M11752J387812J238289M04324J69139O52942Q40307M25255J58251
39246A274641K97790J84225l36907m55880J01899L71119l11956j113450r45684
39237i34203r2809L83139K54109Q5394m3783o22351j500418j665209o04837Q48090
$$ plain form
39300 1927825 2347488 2550074 1694094 -408287 -2205446 -1980837 -207419 1063434 989929
39291 989929 665491 1045347 1685581 1979464 2333308 3344694 4624405 5156122 4426056
39282 4426056 2801265 1136911 233367 331485 977940 1617511 2230613 3031356 3727423
39273 3727423 3627803 2448941 601331 -1177691 -2109729 -1717143 -553727 -223490 -1772897
39264 -1772897 -4211076 -5496230 -4900938 -3534030 -2653590 -2522964 -2956234 -3783809 -4413430
39255 -4413430 -4001678 -2613866 -1375577 -971253 -802114 -149172 691135 1116390 1274641
39246 1274641 1572431 1756656 1419749 963869 1065768 1436887 1124931 11481 -934203
39237 -934203 -1027012 -643873 -389764 -304370 -348153 -970504 -2470922 -4136131 -4740968 -3892878
39227c892878J514418J184409M56892k32087p08683m99432Q51016K713979L532941
39218D920575K651500J360183J287030K092810J798138n15500l328112m478983
39210E787641l595029k035377r09851n6121J018812J960409J785845J00666k168899
39201A888096l348413k427999j5624K178052K873265K126163P29645p93796k138095
39192A071294k541351j185622J345508K855829J766194p18201j786342n12033
39184B95276J077637J064137L86145J000687K283666J662158j093520k838818
39176C837368j515349O36595L76687j700945k297245m98719J241565J250949Q36012
39167B166918J444446K163793J577157K25318n17134o65595j006379j301248q60931
$$ plain form
39227 -3892878 -2378460 -1194051 -737159 -969246 -1677929 -2177361 -1326345 1387634 4920575
39218 4920575 7572075 8932258 10219288 12312098 14110236 13594736 10266624 5787641
39210 5787641 2192612 157235 -752616 -808737 210075 2170484 3956329 4056995 1888096
39201 1888096 -1460317 -3888316 -3903940 -1725888 1147377 3273540 4003185 3209389 1071294
39192 1071294 -1470057 -2655679 -1310171 1545658 3311852 2593651 807309 295276
39184 295276 1372913 2437050 2823195 3823882 6107548 7769706 6676186 3837368
39176 3837368 2322019 2958614 3335301 1634356 -662889 -1161608 79957 1330906 2166918
39167 2166918 3611364 5775157 7352314 7577632 7060498 6394903 5388524 4087276 3226345
39158C226345j66600j72919m80765L7219J006818P57355j005424k350853j636340
39149g85164K53905J025759k32740k058017k273094l34473K029300K636339J293477
39140A555292p5991M7809R27332Q86812k87092j321460j362507p41986o2444L69443
39130f4792L14606j30288j60644P47383J655590J251641j0628m05148L39220N96621
39120D133561l60270j000227l5308J357711J295328n5343j089919j225767j050629
39111A969137o78138K02990R39560M57193p13411p38237P66310J908908J170549
39102E284861n23653j313512q41456j05184K38709K41697p0732o12466p48427
39093A549837L788R55087R46007k9690q92500j077811r34628m97037P23388K213279
$$ plain form
39158 3226345 3059745 2886826 2406061 2443280 3450098 4207453 3202029 851176 -785164
39149 -785164 -531259 494500 261760 -1796257 -4069351 -4403824 -2374524 261815 1555292
39140 1555292 1479301 1527110 2454442 3341254 3054162 1732702 370195 -371791 -434235 -64792
39130 -64792 249814 119526 -41118 706265 2361855 3613496 3602868 3197720 3536940 4133561
39120 4133561 3773291 2773064 2737756 4095467 5390795 5335452 4245533 3019766 1969137
39111 1969137 1290999 1493989 2433549 2890742 2177331 1439094 2205404 4114312 5284861
39102 5284861 4761208 3447696 2606240 2501056 2739765 2981462 2910730 2298264 1549837
39093 1549837 1553625 2508712 3454719 3425029 2532529 1454718 520090 23053 746441 2959720
39083B959720K186541q392k263271k044762J24476J196095l07614k360419k274230
39074b791856j65584J533858J250689k81226j435521j387260l29165J007268J700950
39065h97847J219496P6044n39888j19077N68982N34876j64253n94642r9728J076152
39055A060115K101397K189156J155691l17972j180798j051561n12940j30261L20245
39046C633072J117246J628825J007383l77959j236199j095717o92802m85484l8081
39037C460284O33846M75093q43870j739538p29310J145088J572510K68464p86586
39028C455981m53427Q4233m55938j387428j261068K797J293384J848409J643602
39019D770545Q70813q9216o82952q73195j213417j651438j188100M03008J549711
$$ plain form
39083 2959720 5146261 5137869 2874598 829836 954312 2150407 1842793 -517626 -2791856
39074 -2791856 -2957440 -1423582 -172893 -454119 -1889640 -3276900 -3606065 -2598797 -897847
39065 -897847 321649 397693 -142195 -261272 307710 842586 678333 83691 -16037 1060115
39055 1060115 3161512 5350668 6506359 6188387 5007589 3956028 3443088 3312827 3633072
39046 3633072 4750318 6379143 7386526 7008567 5772368 4676651 3983849 3498365 3460284
39037 3460284 4094130 4569223 3725353 1985815 1256505 2401593 3974103 4242567 3455981
39028 3455981 3002554 3086787 2630849 1243421 -17647 -14850 1278534 3126943 4770545
39019 4770545 5641358 5552142 4869190 3995995 2782578 1131140 -56960 346048 1895759
39010A895759Q43081q15046j489790r49750m66507m03445N4860Q95706J011528
39001E76396K08296l85786l50461n54434j104077o97553R30008J815063N57762
38992I95214j204325r30419J251772K966587K925073K024778J468723J529096
38984A1026499K117755K961215L019962J203128j884292m046851l862527k126295
38976H408594o02691j53708m83321r81016j257708j226693j039728q20871m93301
38967A349557j07951n2386m30784n94726m2623N59580K88347l34026Q7421J405023
38957B127432J659602n1324j876102j628065J48397J108212N06901j38683K34268
38948B090638P53735N15034K63770Q59567J321817K57274j381573j141086J152249
$$ plain form
39010 1895759 2738840 1923794 434004 -515746 -982253 -1385698 -1330838 -435132 576396
39001 576396 784692 398906 48445 -505989 -1610066 -2307619 -1377611 437452 995214
38992 995214 -209111 -1139530 112242 3078829 6003902 8028680 9497403 11026499
38984 11026499 13144254 16105469 19125431 20328559 18444267 14397416 10534889 8408594
38976 8408594 7805903 7652195 7168874 6187858 4930150 3703457 2663729 1842858 1349557
38967 1349557 1241606 1189220 758436 163710 121087 680667 969014 634988 722409 2127432
38957 2127432 3787034 3735710 1859608 231543 379940 1488152 1995053 1856370 2090638
38948 2090638 2844373 3359407 3623177 4482744 5804561 6061835 4680262 3539176 4691425
38939D691425K642870J423556o97003r96228J98860N40707m07545r26233n02368
38930E968041n91708j561312j626519J7789J449620R92532j84343l19686L941
38921D148355n53997j184650k91116J318969J442031J15707n67384o4173N1992
38912D415734o99915p83168M15892J318647P73020l29905r93527j445328j575487
38903A095963m54348J337738J420924o29888j749087J02180K202287Q97331k528739
38894A694361l436177o30947K084577J545851q48850k021151j413860n80507k87216
38885c893919P6834Q92495J580816J438176N06760l98181m15711L67924Q31201
38876I86395K49827m98963m6140J372775K059908J127944n01195j520234j519477
$$ plain form
38939 4691425 7334295 8757851 8060848 7064620 7263480 7804187 7396642 6470409 5968041
38930 5968041 5376333 3815021 2188502 2206291 3655911 4648443 4464100 4144414 4148355
38921 4148355 3594358 2409708 2118592 3437561 4879592 4995299 4427915 4363742 4415734
38912 4415734 3715819 2932651 3348543 4667190 5440210 5110305 4116778 2671450 1095963
38903 1095963 641615 1979353 3400277 2770389 1021302 1123482 3325769 4223100 1694361
38894 1694361 -1741816 -2372763 -288186 1257665 408815 -1612336 -3026196 -3606703 -3893919
38885 -3893919 -3817085 -2924590 -1343774 94402 601162 202981 -212730 155194 986395
38876 986395 1236222 737259 691119 2063894 4123802 5251746 4750551 3230317 1710840
38867A710840o46172P52136J727338J234681l41550j313276r98993o77889j358812
38858H8303j905823p79172J297308K090210R14190o09106q33536J85595J363300
38849A811269J788586J023058o98722k187097k154437p60349N25892Q97509J003253
38840A248962J300401R20606p11271k179756j654422K57172J033832j88282j314161
38831a286919l52252J695836K324444R50761o98398j195845q07576k42481M24507
38822H12077J042212R00706j38823r10076l22855J050454J669279R55483k81269
38813D777188j064976j100482o04960p9284j11318o71851q03144J44464J181026
38804A666663P09550j072606k093961j158255M66315R69816L85473p4730j80339
$$ plain form
38867 1710840 1064668 1816804 3544142 4778823 4437273 3123997 2125004 1447115 88303
38858 88303 -1817520 -2596692 -1299384 790826 1705016 1095910 262374 447969 1811269
38849 1811269 3599855 4622913 3924191 1737094 -417343 -1177692 -651800 245709 1248962
38840 1248962 2549363 3469969 2758698 578942 -1075480 -818308 215524 27242 -1286919
38831 -1286919 -1639171 56665 2381109 3331870 2633472 1437627 630051 387570 812077
38822 812077 1854289 2754995 2616172 1706096 1383241 2433695 4102974 5058457 4777188
38813 4777188 3712212 2611730 2006770 1927486 1816168 1144317 341173 485637 1666663
38804 1666663 2376213 1303607 -790354 -1948609 -1482294 -512478 -127005 -201735 -382074
38795c82074o48829j294212q81303Q09800K130829J580177j67423j107170l14586
38786b74791J261732K142706J728032M74458o49550q20662m6556O35422J15741
38777D566532j406445k415412j773825j05458R30057N60059l94029p47722l68042
38768a154285j7567j07600j96749J66375O42319O17343K48304L31195J074070
38759A603405J667406J380346M83491l66775j035345j522065j308133j55780Q39731
38750A586281L51804j057655j382676k2758J355238J418250R86849J158566J212456
38741E606355R7975j185143q32552P29003J256541O4379j104975q50366J94129
38732C975346R51894J366715J513402Q92064m21263j263654r59711k41812J44594
$$ plain form
38795 -382074 -1030903 -2325115 -3206418 -2396618 -265789 1314388 1146965 39795 -274791
38786 -274791 986941 3129647 4857679 5332137 4682587 3861925 3815369 4450791 4566532
38777 4566532 3160087 744675 -1029150 -1134608 -204551 355508 -38521 -786243 -1154285
38768 -1154285 -1171852 -1279452 -1476201 -1309826 -667507 -50164 198140 529335 1603405
38759 1603405 3270811 4651157 5134648 4767873 3732528 2210463 902330 746550 1586281
38750 1586281 1938085 880430 -502246 -525004 830234 2248484 3235333 4393899 5606355
38741 5606355 5704330 4519187 3686635 4415638 5672179 5736558 4631583 3781217 3975346
38732 3975346 4927240 6293955 7807357 8699421 8278158 7014504 6054793 5812981 5957575
38723E957575M31539O48522J1465j399013j895856n55518J039846J030720o660
38714E262620l55780J2624m107k03494M22835J277465P29209r82989j810539j076130
38704C271714l02106m36901n45226L183K72366k20066k71638Q04066J542447O07339
38694D725178p45319m64138R85184J205880n35483k208976j788604K76661J886681
38685C337064J749256M99963l02024J5718N56468J82229p54378q73925k0571K53553
38675D643353q62659j826031q90672J073310J610700J46158j321360j098783J97319
38666A671335R65414O16486m02065j464134j849211q94873R69772K002485J013479
38657B628688r23766j669605p28568L58957L86651j5229J93531O58826L53849
$$ plain form
38723 5957575 6389114 7037636 7049101 5650088 3754232 3198714 4238560 5269280 5262620
38714 5262620 4906840 4919464 4915357 4711863 5134698 6412163 7141372 6158383 4347844 3271714
38704 3271714 2969608 2532707 1987481 1990664 2263030 2042964 1771326 2575392 4117839 4725178
38694 4725178 3979859 3515721 4500905 5706785 5171302 2962326 1173722 1450383 3337064
38685 3337064 5086320 5586283 5284259 5299977 5856445 6038674 5284296 4410371 4389800 4643353
38675 4643353 3780694 1954663 1063991 2137301 3748001 3894159 2572799 1474016 1671335
38666 1671335 2636749 3253235 2851170 1387036 -462175 -1357048 -387276 1615209 2628688
38657 2628688 1704922 35317 -693251 -334294 52357 37128 230659 889485 1243334
38648A243334n33207p75083q0891M16048j3591n58126k38274N66174R12694Q62554
38638A801632J065511J236341M33658j122002j841178q50675P07197J115904J67901
38629B714289q67327r62903l56612P5545k5789k04458M1565M75145M71989Q9129
38619A450573R6594O54290P91513r3011j014520p60505J70105L50237k56800l60435
38609A028041L63625P76802L69642J45660P62233J297958P46320m85881j412843
38600C591557j703295j347984k91186P97269O54301o88501j400433l73869R70974
38591B08833P43316o68571j440457j004077k65323J92597M78457M32997j16875
38582a439103m56998J91814J197808J221854J40716r92033j519166j414206n01310
$$ plain form
38648 1243334 710127 -64956 -145847 270201 256610 -301516 -539790 26384 939078 1801632
38638 1801632 2867143 4103484 4537142 3415140 1573962 723287 1430484 2546388 2714289
38629 2714289 1846962 884059 527447 602992 577203 372745 414310 889455 1361444 1450573
38619 1450573 1547167 2201457 2992970 2899959 1885439 1124934 1295039 1645276 1388476 1028041
38609 1028041 1391666 2168468 2538110 2683770 3446003 4743961 5490281 5004400 3591557
38600 3591557 1888262 540278 249092 1046361 1700662 1012161 -388272 -762141 208833
38591 208833 952149 283578 -1156879 -2160956 -2426279 -2233682 -1755225 -1322228 -1439103
38582 -1439103 -1896101 -1704287 -506479 715375 856091 -135942 -1655108 -3069314 -3570624
38573c570624R96397J669196N46270q37142j05035K252275L097577J009328j756019
38564C302223k515659j431075l50969J5808L22808R72992J585605J608771P47321
38555D257825o95677j579920r16109N67567R61578k38134j317015q20089M02459
38546F22485O13180l73752j272333j128798r7454J001094J179876L9138j359951
38537g76515j282451L13172J308795L22534j114827p37199J030557J671120K53028
38528I88214j372678j330111j00721N85210J97542k18847K17670R31069O81811
38519E79159n60323j192347K287J866107K069832L32772j050195n31290M16530
38510A932532l14339k086786k463646r29929M49374K21144n22558r6839J343408
$$ plain form
38573 -3570624 -2574227 -905031 -358761 -1195903 -1300938 951337 4048914 5058242 3302223
38564 3302223 786564 -644511 -995480 -979672 -656864 316128 1901733 3510504 4257825
38555 4257825 3562148 1982228 1066119 1633686 2595264 2357130 1040115 220026 622485
38546 622485 1235665 861913 -410420 -1539218 -1636672 -635578 544298 583436 -776515
38537 -776515 -2058966 -1745794 -436999 -114465 -1229292 -1966491 -935934 735186 988214
38528 988214 -384464 -1714575 -1815296 -1230086 -1032544 -1251391 -1033721 -102652 579159
38519 579159 18836 -1173511 -1171224 694883 2764715 3097487 2047292 1516002 1932532
38510 1932532 1618193 -468593 -2932239 -3862168 -3412794 -3191650 -3714208 -3811047 -2467639
38501b467639K287605J869313M97278q86035j398017n66041J099473K133480J470891
38492D040308k58443j391563j214256o47369p39786j182200r93260k14750J64960
38483b436359q832L36034J500779J952564N38101j300254j358620j01996Q296
38474h70287j421640j898898m1015K103181K179226Q21904m5521l42994r68822
38465d84866j264790j8302J827229K141018R31439J77427M77554M32218m60350
38456C758577q72756j93057L85478J51949N8994O21615P23362k60505j067942
38447C305715o84084j37303n98345j240941p66686K12913K28716n21880n90356
38438g92251L63184J350581J782295J822841J361029J89908r69781j091578m17180
$$ plain form
38501 -2467639 -180034 1689279 2186557 1300522 -97495 -663536 435937 2569417 4040308
38492 4040308 3781865 2390302 1176046 528677 -211109 -1393309 -2386569 -2601319 -2436359
38483 -2436359 -2445191 -2109157 -608378 1344186 1882287 582033 -776587 -878583 -870287
38474 -870287 -2291927 -4190825 -4231840 -2128659 50567 872471 826950 483956 -484866
38465 -484866 -1749656 -1767958 59271 2200289 3131728 3309155 3786709 4218927 3758577
38456 3758577 2885821 2692764 3078242 3230191 3289185 3910800 4634162 4373657 3305715
38447 3305715 2621631 2484328 1885983 645042 -121644 91269 319985 -201895 -792251
38438 -792251 -429067 921514 2703809 4526650 5887679 6077587 5107806 4016228 3599048
38429C599048j07388m53652p52861q01566j025853j108138j04465J684070K459330
38420C388525J256166o51822j467363j035264m40194k26268o1392J89844Q7562
38411A039794n43947j043872n76431P82976J937865J919736R89260K27208P6384
38402D808973r6010p78154j421294j328005p49855l29771m6153L71182N38398
38393I69311O6673l43561J89047R97152N90342q99442j674499r73804p7672K5649
38383a130804J77055J097972J531758P3372k155880k607587p68240J202995J405566
38374a173793K98942n51216o27990n46074n86501j03932J356898K817434K534636
38365C418404L35584j466388p03776J410180J477207j241753l256060j492922
$$ plain form
38429 3599048 3491660 3038008 2285147 1483581 457728 -650410 -754875 929195 3388525
38420 3388525 4644691 3992869 2525506 1490242 1050048 823780 762388 952232 1039794
38411 1039794 495847 -548025 -1124456 -341480 1596385 3516121 4505381 4732589 4808973
38402 4808973 4712963 3934809 2513515 1185510 435655 105884 59731 430913 969311
38393 969311 1035984 692423 881470 1878622 2468964 1569522 -104977 -1078781 -1156453 -1130804
38383 -1130804 -953749 144223 1675981 1749353 -406527 -3014114 -3782354 -2579359 -1173793
38374 -1173793 -874851 -1426067 -2054057 -2600131 -3186632 -3290564 -1933666 883768 3418404
38365 3418404 3753988 2287600 1583824 2994004 4471211 3229458 -26602 -1519524
38357a519524K274076L756832J751900j026835k129283j767345r82912J934Q81860
38348A240703Q35041l8807m81758m1853L22132K17359N30029J342996J202343
38339E128185l21418j381895p23155J72063l23770j161368p00325J32624m07708
38330D13233j337750m15556J589483J602230q01312k554172j772151r2323N89803
38321b778515P09789J042745R04113K8672j67928R40850J599065M91364q31773
38312A938382m99608N13780J97230r77579r73116L13134J022711L32868p43542
38303A124260j235698j011968j38546Q29024N82460j111461k202271j025801Q38224
38294c351777Q55720l09974R117J771110K238375P28746l38795J88770M40488
$$ plain form
38357 -1519524 754552 4511384 6263284 5236449 3107166 1339821 356909 358843 1240703
38348 1240703 2075744 2036937 1555179 1513326 1835458 2052817 2582846 3925842 5128185
38339 5128185 4806767 3424872 2701717 2873780 2550010 1388642 688317 820941 413233
38330 413233 -924517 -1340073 249410 1851640 1050328 -1503844 -3275995 -3368318 -2778515
38321 -2778515 -2068726 -1025981 -121868 -93196 -261124 679726 2278791 2770155 1938382
38312 1938382 1438774 1952554 2149784 1172205 199089 512223 1534934 1867802 1124260
38303 1124260 -111438 -1123406 -1261952 -432928 149532 -961929 -3164200 -4190001 -3351777
38294 -3351777 -2496057 -2806031 -2796914 -1025804 1212571 1941317 1602522 1791292 2231780
38285B231780o40281j217421q4036R77463M87638q5578N82731Q47417o74570j699489
38275G25654K54726L007072K424898j139817l309716k220011n00502l78822p48304
38266a884822k57483J72615l02361l95532R04371J992305R71657j105330j540400
38257a444980J92568J837076J385787o43043k050303j331027Q14188K104906J119288
38248A984460r41516j666543n13361P51481Q26858M64122N97851N95812k93081
38239A806083j105522n33226O91914O65306p10657j430902l22479J268129J399639
38230A728285P9470r81713o04675O94597J649902J676547J104093L84471l60898
38221E370079r48754r13302j68221N48312N76722L67761P73676J546557J574965
$$ plain form
38285 2231780 1591499 374078 290042 1267505 1755143 1669565 2252296 3099713 2425143 725654
38275 725654 980380 3987452 6412350 5272533 1962817 -257194 -757696 -1136518 -1884822
38266 -1884822 -2142305 -1969690 -2272051 -2667583 -1763212 229093 1200750 95420 -1444980
38257 -1444980 -1252412 584664 1970451 1327408 -722895 -2053922 -1239734 865172 1984460
38248 1984460 1042944 -623599 -1136960 -385479 441379 905501 1503352 2099164 1806083
38239 1806083 700561 167335 859249 1524555 813898 -617004 -939483 328646 1728285
38230 1728285 1807755 826042 221367 915964 2565866 4242413 5346506 5730977 5370079
38221 5370079 4421325 3508023 3339802 3888114 4464836 4832597 5606273 7152830 8727795
38212H727795N32345q36421k013836k937646k934589j223517J116093J731331
38204B161555M31016j78666J105074J696389o02104l279590k442746R00847K051717
38195A843492q4732j358012Q51141L476583K846399M20039l1105J356767J161136
38186A0481708j462833l493272k842318j054563k51832j74052K91308Q17448O27822
38177B939416K26579L47581K93162q22239j921577j098806J237347K342864P81669
38168D325996j533842j908284l07459R95256N61046p63689j405634q32132N25277
38159c43465K075968L190538L251251K340822J440289J216879R95339k13528j942312
38150A2011781k619520j746318n73144k21089k58410J12220M70560m4668r95748
$$ plain form
38212 8727795 9260140 8423719 6409883 3472237 537648 -685869 430224 2161555
38204 2161555 2592571 2413905 3518979 5215368 4613264 1333674 -1109072 -208225 1843492
38195 1843492 1758760 400748 1251889 4728472 7574871 7994910 7963805 9320572 10481708
38186 10481708 9018875 5525603 2683285 1628722 1376890 1202838 1494146 2311594 2939416
38177 2939416 3165995 3513576 3806738 2984499 1062922 -35884 1201463 3544327 4325996
38168 4325996 2792154 883870 576411 1571667 2132713 1369024 -36610 -868742 -343465
38159 -343465 1732503 4923041 8174292 10515114 11955403 13172282 14167621 13954093 12011781
38150 12011781 9392261 7645943 7072799 6851710 6593300 6705520 7176080 7131412 6135664
38141F135664j070352j47228L71279l92833j490814j504800m80083K48247j40307
38132A528773r72589r91821O1549J047102P89953k69255m14411R97418K287985
38123D064704J516246p21100j931861j120082O2513M7761l93873K11496J403760
38114C139564J427227m5915j432872j447772m83384L74922O10501K65963m04176
38105B004058q96698p55532j96226J07808k5758j68812j48205k47254m04201q9426
38095h20246O81452J039069M44198n05083r23075o54830m189Q28299J465895J253857
38085B805347J88160o83064o12955l14828p92381j559504j291972Q485R33567
38076a319145Q57799P31657J176373J243234J34148r96252n14624R77657J184582
$$ plain form
38141 6135664 5065312 4918084 5289363 4896530 3405716 1900916 1420833 1669080 1528773
38132 1528773 556184 -435637 -374088 673014 1462967 1193712 779301 1776719 4064704
38123 4064704 5580950 4859850 2927989 1807907 1870420 1918181 1524308 1735804 3139564
38114 3139564 4566791 4520876 3088004 1640232 1156848 1531770 2142271 2408234 2004058
38105 2004058 1107360 351828 155602 263410 237652 68840 -79365 -326619 -730820 -820246
38095 -820246 -138794 900275 1344473 839390 -83685 -738515 -742704 85595 1551490 2805347
38085 2805347 2993507 2310443 1697488 1382660 590279 -969225 -2261197 -2252712 -1319145
38076 -1319145 -461346 270311 1446684 2689918 2824066 1827814 1313190 2290847 3475429
38067C475429n12252j969538j355036K06623M75103m75457o35737M49217Q42371
38058E00723m98917j723420q76042R16096J123904k71091r44537l4031P66716
38049a040599L51042m7929O24269J174647L36979p00800n3753J717857K480317
38040D842030J894809J595644K166275K254441J095977j65298m97575n93289j387368
38031A1205646k309392k230210j230826k90783J14432O9182n44917j738085k634782
38022D10265k113250l05106J340422J676084R76989K52620o7495l66480r64812
38013H39237j523009j566088j250951j014114n75014P37342K322521K215078k24502
38004c9500k528013j784877J337583L237943K116480p4741r83552q70692r61330
$$ plain form
38067 3475429 2963177 993639 -361397 -154774 320329 -155128 -790865 -341648 500723
38058 500723 1806 -1721614 -2597656 -1681560 -557656 -828747 -1773284 -1807315 -1040599
38049 -1040599 -689557 -737486 -113217 1061430 1398409 697609 643856 2361713 4842030
38040 4842030 6736839 8332483 10498758 12753199 13849176 13683878 13186303 12593014 11205646
38031 11205646 8896254 6666044 5435218 5144435 5258867 5328049 4783132 3045047 410265
38022 410265 -1702985 -2008091 -667669 1008415 1985404 2238024 2170529 1804049 839237
38013 839237 -683772 -2249860 -3500811 -4514925 -5089939 -4352597 -2030076 185002 -39500
38004 -39500 -2567513 -4352390 -3014807 223136 2339616 2264875 1281323 410631 -550699
37995e50699q73329K42961J428028J150905K1231j56473L47887n23800k824903
37986a738192l750032j642408J372325K379485J591818J243782J710888J201332
37978B368998q18277k270557j403180N99930J244598Q320j352213j323463j61458
37969c107302J044264J621702J356254L32272p33171q23680Q3339P35532K60736
37960G69946n78998n58727K56722Q87624R64372P49569J71157q16083j308529
37951E37053m82910O43884K87608j171261j312134P44767K850334K829118J191365
37942F117824k10103m94377M64531K685980M891078M456375O56825l430342m446685
37933A0691106k946357j781646j638130j100310k22496n38219j602706j070283
$$ plain form
37995 -550699 -1424028 -1181067 246961 1397866 1419097 1262624 1610511 1086711 -1738192
37986 -1738192 -5488224 -7130632 -5758307 -3378822 -1787004 -543222 1167666 2368998
37978 2368998 1550721 -719836 -2123016 -1523086 -278488 -270168 -1622381 -2945844 -3107302
37969 -3107302 -2063038 -441336 914918 1247190 514019 -309661 -226322 509210 769946
37960 769946 190948 -367779 -111057 776567 1740939 2490508 2661665 1845582 537053
37951 537053 54143 698027 985635 -185626 -1497760 -752993 2097341 4926459 6117824
37942 6117824 5907721 5413344 5877875 8563855 13454933 17911308 18568133 15137791 10691106
37933 10691106 7744749 5963103 4324973 3224663 3002167 2463948 861242 -209041
37925b09041J123041J990316J34564j882735j527735K3955L25517m22057l66216
37916h10391O23070J108721P40974N04325P82718J036953J043383Q85128J72108
37907F086989j211831k112026j478544k95050m05535j685176k186680j092303
37899d380156K90671P66255P66558J034016J270573R57802M05740P0336l38384
37890H43411j133661j641495r35619O08735J411674N62338r71721j415341k43338
37881b915017J273964J609569N92286p73926j561110j399043k26480J434212K227839
37872B62294J264616l21970n43566N16860O78063q63408k067904j329699j80959
37863b585673o70128j716837q36985J447416K059060J79591j451363p67749Q49665
$$ plain form
37925 -209041 914000 2904316 3038880 1156145 -371590 -347635 -22118 -444175 -810391
37916 -810391 -187321 921400 1662374 2166699 2949417 3986370 5029753 5914881 6086989
37907 6086989 4875158 2763132 1284588 989538 584003 -1101173 -3287853 -4380156
37899 -4380156 -4089485 -3323230 -2556672 -1522656 -252083 705719 1111459 1181795 843411
37890 843411 -290250 -1931745 -2867364 -2258629 -846955 -284617 -1256338 -2671679 -2915017
37881 -2915017 -1641053 -31484 560802 -213124 -1774234 -3173277 -3399757 -1965545 262294
37872 262294 1526910 1204940 661374 1178234 1856297 992889 -1075015 -2404714 -2585673
37863 -2585673 -3255801 -4972638 -5809623 -4362207 -2303147 -2123556 -3574919 -4342668 -3493003
37854c493003J322925J021237J323714J811114J080959n70364j366310o91696
37846D38576J82644J27023m21208m34096J90151N79301n055j297888k210213j893624
37836d744389o21712N90543J186493J460692J751700J876102J614367J166994
37828D280790P33345J13266q28261j656256j780294j190343m43308o64K26838
37819e44887O61789J333423J412490k5344k438525l705129k413587K02209J662267
37810c855294J221450K11683l19839p01188j220140j313988p51448j47859L48923
37801f527700J396416K713789K652658P04500j090794q04922N56383O87154n10084
37792b22600j074067j65348R47774J109082O80712L84218K04538l9767j36591
$$ plain form
37854 -3493003 -2170078 -1148841 174873 1985987 3066946 2496582 1130272 438576
37846 438576 621220 748243 327035 -107061 83090 662391 657336 -640552 -2850765 -4744389
37836 -4744389 -5366101 -4775558 -3589065 -2128373 -376673 1499429 3113796 4280790
37828 4280790 5014135 5127401 4299140 2642884 862590 -327753 -771061 -771725 -544887
37819 -544887 116902 1450325 2862815 2837471 398946 -3306183 -5719770 -5517561 -3855294
37810 -3855294 -2633844 -2422161 -2742000 -3443188 -4663328 -5977316 -6728764 -6876623 -6527700
37801 -6527700 -5131284 -2417495 235163 939663 -151131 -956053 -399670 287484 -222600
37792 -222600 -1296667 -1462015 -514241 594841 1275553 1659771 1864309 1824542 1687951
37783A687951J3524J18490L1738q9810k88339p73523j284032j142334j05927J250641
37773e81621J959692J240361q15051k680164k377837O1189J980698J212879r62088
37764i61942j580500j07757J216703R57736K02780L14502J000006J396838J383136
37755C821502R40120k83074j860749k418081j493140l46584j14171m49757p53034
37746b956968j193739j544045p01449J282031K361394J344175j4424K56942J054012
37737a12071J77187j562979j329082R99575K296011R24748r19641p88836N56623
37728B41535Q94716o9245q79428p50618j52994L64812O16565M58945l7595m95737
37718A90956q38269j285708j393441l21986J298413J386624m89703j716843k38132
$$ plain form
37783 1687951 1701475 1819965 1851703 1761893 1473554 700031 -584001 -1726335 -1832262 -581621
37773 -581621 1378071 2618432 1803381 -876783 -3254620 -3193431 -1212733 146 -961942
37764 -961942 -2542442 -2650199 -1433496 -475760 -272980 41522 1041528 2438366 3821502
37755 3821502 4761622 4478548 2617799 199718 -1293422 -1640006 -1754177 -2203934 -2956968
37746 -2956968 -4150707 -5694752 -6396201 -5114170 -2752776 -1408601 -1423025 -1166083 -112071
37737 -112071 65116 -1497863 -2826945 -1827370 468641 1393389 473748 -315088 241535
37728 241535 1136251 1067006 187578 -563040 -716034 -351222 265343 724288 686693 190956
37718 190956 -647313 -1933021 -3326462 -3648448 -2350035 -963411 -1453114 -3169957 -3408089
37709c408089J904184J258104j625853k616007j7497K965536K918685O39996r41740
37700A077319j069815j000714j000225j81478J193622J700540J069122M58230
37692B246601K58171l73193j405084j447240j94421N94322k01312j128921n58539
37683b209616N14941J97017q52977l19505J692448K280207J37740k161626j742613
37674b463984N87344J824525J009967j30182k37903Q2214j50252q43083j442516
37665a763870j687164j289415j8581J434476J799393R43547J15882m1988l45450
37656h53170j119198j040911N61884J729329L99171j973902j982222O99687K639188
37647i40144J599442n58395j219677p41746q12424j113722k51453J193667J298269
$$ plain form
37709 -3408089 -1503905 -245801 -1871654 -4487661 -4505158 -1539622 1379063 2019059 1077319
37700 1077319 7504 -993210 -1993435 -2174913 -981291 719249 1788371 2246601
37692 2246601 2504772 2131579 726495 -720745 -915166 -320844 -522156 -1651077 -2209616
37683 -2209616 -1694675 -1497658 -2350635 -2670140 -977692 1302515 1440255 -721371 -2463984
37674 -2463984 -1876640 -52115 957852 827670 589767 671981 521729 -321354 -1763870
37665 -1763870 -3451034 -4740449 -4759030 -3324554 -1525161 -581614 -465732 -507720 -853170
37656 -853170 -1972368 -3013279 -2451395 -722066 -322895 -2296797 -4279019 -3579332 -940144
37647 -940144 659298 100903 -1118774 -1860520 -2672944 -3786666 -4038119 -2844452 -1546183
37638a546183j1385r28992p64784n44919n66863J29921J388448J474949j16850
37629a486658j544196j317390j67469P77552J589837K110608J179252j018571
37621A22965j981087l68781J503669J079054m02065k36527R49013L98278j601151
37612e36632j790579O07346K410218J488462k37491m20281J43859l45198j427112
37603a07408j579800q95156l55220J49747J023018J419717N38650n84427n72533
37594i63412q3953o31382j738755j473704M20459J925476J439026m20779j836762
37585c363786j529551L89918K333684K373505M18912j344791j204339j69342j11049
37576b206839p32820l49321J046397J736355J056813Q7199m38112q78174j211659
$$ plain form
37638 -1546183 -1557568 -2486560 -3251344 -3796263 -4363126 -4233205 -2844757 -1369808 -1486658
37629 -1486658 -3030854 -4348244 -4515713 -3738161 -2148324 -37716 1141536 122965
37621 122965 -1858122 -2226903 -723234 355820 -46245 -282772 666241 1064519 -536632
37612 -536632 -2327211 -1719865 690353 2178815 1941324 1521043 1664902 1319704 -107408
37603 -107408 -1687208 -2582364 -2937584 -2787837 -1764819 -345102 193548 -390879 -963412
37594 -963412 -1047365 -1678747 -3417502 -4891206 -4470747 -2545271 -1106245 -1527024 -3363786
37585 -3363786 -4893337 -4503419 -2169735 203770 622682 -722109 -1926448 -2095790 -2206839
37576 -2206839 -2939659 -3288980 -2242583 -506228 550585 637784 199672 -678502 -1890161
37567a890161p79925J97057O14265K48617j09185l14827q30450j086987n6188
37558d007784J434156J348000k79316j256898q94703q71848j643692j218943R65546
37549f425482K225693R39856l63051Q63712K627732J544410j446505k504344q70145
37540c408124O46324O98742Q22274J521204R13344j513403l136036j933384N08917
37531d880142J468828O28858m33066o81744r8498R42933J535240P19662q51123
37522a649052j100920N47391J916883J058118r01802j457396j79163J175226J240621
37513F49906J91895j142860j931501j520804j66199Q21776O36004O5425O9707
37504b326651J84021l44683p94081r2345R91477Q27447k25033j64565J308546
$$ plain form
37567 -1890161 -2670086 -2473029 -1858764 -1610147 -1719332 -2034159 -2864609 -3951596 -4007784
37558 -4007784 -2573628 -1225628 -1504944 -2761842 -3656545 -4528393 -6172085 -7391028 -6425482
37549 -6425482 -4199789 -3259933 -3622984 -2759272 -131540 1412870 -33635 -2537979 -3408124
37540 -3408124 -2761800 -2063058 -1240784 280420 1193764 -319639 -3455675 -5389059 -4880142
37531 -4880142 -3411314 -2782456 -3215522 -3897266 -3995764 -3052831 -1517591 -797929 -1649052
37522 -1649052 -2749972 -2202581 -285698 772420 -129382 -1586778 -1765941 -590715 649906
37513 649906 841801 -301059 -2232560 -3753364 -3919563 -3097787 -2461783 -2396358 -2326651
37504 -2326651 -2142630 -2487313 -3281394 -3373739 -2382262 -1554815 -1779848 -1944413 -635867
37495f35867K048643P55524j028937j330527m45779J58228K72703O14871R82717
37486A391576N23706n32349j028026o86307k96032l1657Q45588K149820K190756
37477D527075J06227k333316k666341r29759N68052M96330q0063J01162M90207
37468B79574j1556r52098j001224j49068L42267M1663j50952K18871M43915K28461
37458g10147M46303J417086J793825M65363j437559j893286o96439O00730R63698
37449I49574O51471P8334n79220q01486k57558J55106o35004j789752j307147
37440c535682Q83128K444479J860037L10090n16228o53957p70967o49140k50668
37431h78908o29440j962600k215756n256K480737K094590n17965j736891l49324
$$ plain form
37495 -635867 1412776 2168300 1139363 -191164 -636943 -478715 -206012 408859 1391576
37486 1391576 1915282 1382933 354907 -331400 -627432 -659089 186499 2336319 4527075
37477 4527075 4633302 2299986 -366355 -1296114 -728062 -231732 -311795 -210633 279574
37468 279574 268018 -684080 -1685304 -1834372 -1492105 -1450442 -1601394 -1382523 -938608 -710147
37458 -710147 -263844 1153242 2947067 3412430 1974871 81585 -614854 -14124 949574
37449 949574 1601045 1679379 1100159 298673 41115 196221 -438783 -2228535 -3535682
37440 -3535682 -2652554 -208075 1651962 1962052 1445824 791867 20900 -628240 -878908
37431 -878908 -1508348 -3470948 -5686704 -5691960 -3211223 -1116633 -1634598 -3371489 -3720813
37422c720813J006699K97351j054128j024514o0021M52758O37385J052375R10520
37413a502388l97593j304217k88K388165K957715J110320p54361p80398J28373
37404A845328J86690p83797j540647j097366L83632J766814J835135N73351o03723
37395B565417n72737M0890Q6710j75453J32187M66199l18143j445301r84068P31311
37385E27012J173478k25659r37305L19024J128141n06511k370211j455370R42407
37376a404994J267610m38628q29458R35359J904864N76111n81629M88826J945486
37367C863547J297672n31657j110834n13011n47659j261961j104608M8481P27180
37358H67150N36047N27513Q23087K37710j253183j870217p15384P47264R52433
$$ plain form
37422 -3720813 -2714114 -2416763 -3470891 -4495405 -4555426 -4102668 -3465283 -2412908 -1502388
37413 -1502388 -1899981 -3204198 -3204486 -816321 2141394 3251714 2497353 1716955 1845328
37404 1845328 2032018 1248221 -292426 -1389792 -1006160 760654 2595789 3169140 2565417
37395 2565417 1992680 2033570 2120280 1944827 2077014 2543213 2225070 779769 -204299 527012
37385 527012 1700490 1474831 537526 856550 1984691 1478180 -892031 -2347401 -1404994
37376 -1404994 -137384 -576012 -1405470 -470111 1434753 2010864 1429235 1918061 3863547
37367 3863547 5161219 4629562 3518728 3005717 2458058 1196097 91489 139970 867150
37358 867150 1403197 1930710 2753797 2991507 1738324 -131893 -847277 -100013 852420
37349H52420L85438K18900J69003o69584j695134j297850O24425K138817J629346
37340B355781l12099j802357j805853q61768q8578j0635l13579l76189J14364
37331c100913R39639J568368J581113R99103K68309j53354k43166l42017o00675
37322I16407p29369m64370l2604J38877k3340l12326o50115r60798q14676J48969
37312b783345J405406J834436J088623Q8316k21763q1335l48602j118742j595173
37303a732179j236425l92889L05591O72033Q30055P68801M15556l9600k84026
37294f93083l14342l67611l65581J53338J269235K206922K145218J364039R68406
37285F366541J372643J682483R12246o92874j995186k249719j607935o80313p4127
$$ plain form
37349 852420 1237858 1456758 1625761 956177 -738957 -2036807 -1412382 726435 2355781
37340 2355781 2043682 241325 -1564528 -2426296 -2514874 -2525509 -2839088 -3215277 -3100913
37331 -3100913 -2161274 -592906 988207 1987310 2255619 2102265 1859099 1517082 916407
37322 916407 187038 -277332 -309936 -171059 -194399 -506725 -1156840 -2117638 -2932314 -2783345
37312 -2783345 -1377939 456497 1545120 1633436 1411673 1330338 981736 -137006 -1732179
37303 -1732179 -2968604 -3361493 -3055902 -2383869 -1553814 -785013 -369457 -409057 -693083
37294 -693083 -1007425 -1375036 -1740617 -1587279 -318044 1888878 4034096 5398135 6366541
37285 6366541 7739184 9421667 10333913 9641039 7645853 5396134 3788199 3107886 3033759
37276C033759p1409l15296j47042L48570K32374p09452j060874L63493K324407
37267C998530K438694N42658j013429p93948j55075p78973k005470k086905r37839
37258g91757L6956K10378K32567N63082R28385J145127J256210R14516k11217
37249D284247j452789j696998r40857k16495J3720K17837N19212L69339k38339
37240H58877m86028q6211K33323N8508n2148K07600J81461m91862r81646n00167
37230a058293M72945J065187J225658J155613M66547r27474j856740j203799K88006
37221c72350Q53926J37457m72986R5690J313525J911048J151904p51425k659946
37212A206843l033514j364373Q82353J611392M36483j060291j330841l05133J063584
$$ plain form
37276 3033759 2962350 2647054 2500012 2848582 3080956 2371504 1310630 1674123 3998530
37267 3998530 6437224 6979882 5966453 5172505 5017430 4238457 2232987 146082 -791757
37258 -791757 -754801 -544423 -311856 251226 1179611 2324738 3580948 4495464 4284247
37249 4284247 2831458 1134460 193603 -22892 -9172 208665 727877 1097216 858877
37240 858877 372849 286638 519961 578469 526321 733921 915382 423520 -558126 -1058293
37230 -1058293 -585348 479839 1705497 2861110 3327657 2400183 543443 -660356 -372350
37221 -372350 481576 619033 146047 241737 1555262 3466310 4618214 3866789 1206843
37212 1206843 -1826671 -3191044 -2308691 -697299 -260816 -1321107 -2651948 -2957081 -1893497
37203a893497J769551J282285J9789o94747l2750J065845J011213j90499j051037
37194A286153r19540o89113r13697q18314J19396J014764R53971M21480L79838
37185H34938Q02951J011400P27584R2797o04390p30756J19728R14399K4002j990886
37175A201767k293167J86623K552313J849888n13614r92937O22314J264147k04384
37166C672950j384349o44258K85563m08036j499500j037587K76131M85649k08072
37157d61509k9340J062583J234262j7875q78194j11375R59617N75844o55341o28516
37147A050156J086802K510480K020783O27907M62775J594672J810485j43332k500933
37138H519795k747255j013032L26468L4614p52219p99524m84178n20927n38237
$$ plain form
37203 -1893497 -123946 1158339 1178128 483381 450631 1516476 2527689 2337190 1286153
37194 1286153 366613 -322500 -1236197 -2054511 -1935115 -920351 33620 455100 834938
37185 834938 1637889 2649289 3376873 3469670 2865280 2134524 2254252 3168651 3192653 1201767
37175 1201767 -1091400 -904777 1647536 3497424 2983810 1990873 2613187 3877334 3672950
37166 3672950 2288601 1644343 1929906 1521870 22370 -1015217 -739086 -253437 -461509
37157 -461509 -490849 571734 1805996 1788121 909927 798552 1758169 2334013 1678672 1050156
37147 1050156 2136958 4647438 6668221 7296128 7758903 9353575 11164060 11020728 8519795
37138 8519795 5772540 4759508 5085976 5120590 4368371 3568847 3084669 2563742 2025505
37129B025505l1625M34527K03309k01322m9727Q6215p80596k100149k183713n23752
37119c121328J479236K224907J444700K0575q69789m48465R72775J974866J442826
37110E120303p3836j112531j129462o58103J2717R97676J713122J145224m04736
37101E610374j286160q50878m54926j185907j930495j117590N84862J077249n1580
37092C94949j020031o39572Q9187j30594p96237n69544N14811J151498P92405
37083b13128L19280N53950J142722J328408J007897M55717l62711j467210k218780
37074E46145j789871k70803J234198J680650R52340k36668r84902q99402m61737
37065b30050m93415j018461j123027l43347M85635M96766J81245M13681P20001
$$ plain form
37129 2025505 1993880 2428407 2631716 2430394 2380667 2466882 1686286 -413863 -2597576 -3121328
37119 -3121328 -1642092 582815 2027515 2048090 1178301 729836 1702611 3677477 5120303
37110 5120303 5046467 3933936 2804474 2146371 2159088 3156764 4869886 6015110 5610374
37101 5610374 4324214 3473336 3018410 1832503 -97992 -1215582 -630720 446529 394949
37092 394949 -625082 -1264654 -1175467 -1306061 -2102298 -2671842 -2157031 -1005533 -213128
37083 -213128 106152 660102 1802824 3131232 4139129 4594846 4232135 2764925 546145
37074 546145 -1243726 -1514529 -280331 1400319 2352659 2115991 1131089 231687 -230050
37065 -230050 -723465 -1741926 -2864953 -3208300 -2722665 -2225899 -2044654 -1630973 -910972
37056i10972J3715j269065j506707m10244N78422P12819R00817J614670J743427
37047A466882N80082p09559q36620j78769L65814Q38700J245857O96795q95709
37038B573473j739206n86988J112855J404220P96585Q97273J397534R36886j07160
37029F685472m06761l67295j138368j745703m73429J401835R05844j598311k494361
37020G68923n82498J196546P63686k19357o6611N8717q81475j373740l91976K72065
37010d55720n66276p77252J226463K820403J104853j907567k256675l74593J05021
37001a081343j228106j176839J130259K624356J485546j31902p598Q59411N70188
36992C043972o62350j420486j052658L61250K259536L301648K900854L182053
$$ plain form
37056 -910972 -897257 -2166322 -3673029 -4083273 -3504851 -2792032 -1891215 -276545 1466882
37047 1466882 2046964 1337405 500785 322016 687830 1526530 2772387 3469182 2573473
37038 2573473 834267 247279 1360134 2764354 3560939 4458212 5855746 6792632 6685472
37029 6685472 6278711 5911416 4773048 3027345 2553916 3955751 4861595 3263284 768923
37020 768923 186425 1382971 2146657 1927300 1860689 1919406 1037931 -335809 -727785 -455720
37010 -455720 -1021996 -1799248 -572785 2247618 3352471 1444904 -811771 -1186364 -1081343
37001 -1081343 -2309449 -3486288 -2356029 268327 1753873 1621971 1614373 2473784 3043972
36992 3043972 2381622 961136 -91522 269728 2529264 5830912 8731766 11913819
36984A1913819O461539J0250064Q530914j28276r168656j1488580p603247l306529
36976E461048j588691q07787M23244R51673R0345o26242L1614J043232R44231
36967E922667r6058j029866j415022j252541n07383L67579M45585l30338p48055
36958A356568r3962N89147L4371j183622j348694l1303J406351J719312J071890
36949C520058K23202m78060p87163k63489Q64579J270574N3159j717675k145532
36940E39653j034985j1144l0395j85408M84835J352457J345651P04558L96202
36931C561424M41713O3002q29554j402510j078742j81636M72748J34700j268857
36922h7712k538286j939624O55665L093598L308034J613914k64471j386247j602782
$$ plain form
36984 11913819 18375358 28625422 37156336 37028060 27859404 16370824 8767577 5461048
36976 5461048 3872357 3064570 3487814 4439487 4529832 3903590 3935204 4978436 5922667
36967 5922667 5826609 4796743 3381721 2129180 1621797 1989376 2434961 2104623 1356568
36958 1356568 1262606 1851753 1886124 702502 -646192 -677495 728856 2448168 3520058
36949 3520058 3743260 3265200 2478037 2214548 3079127 4349701 4402860 2685185 539653
36940 539653 -495332 -506476 -536871 -722279 -237444 1115013 2460664 3165222 3561424
36931 3561424 4003137 4066139 3236585 1834075 755333 573697 1046445 1181145 -87712
36922 -87712 -2625998 -4565622 -3909957 -816359 2491675 4105589 3841118 2454871 852089
36913H52089o79929P87016P69577j572870l581626k143741J493704L068271J395337
36904C87828l54448q0450K86282j091267k333835j045167J404187J893467K78993
36895f54410r05944n81650j26165n33128j010663o27206M20144J427169J863918
36886g27935J478399O63109L48502O75652N29879n67207j151311R6217J902972
36877C248277J932843J81669j132777q39567k1458J38582j01646r3180O4130R270
36867C386143k28930m65191n61137l12846K43135N64974K85619j64054k49905
36858B497808j23344l8108K27857N39207O6167j082354j181248N31744J918420
36849C356149P76010j472294j619427M33675J677768Q09499k15218n8770j65499
$$ plain form
36913 852089 172160 959176 1728753 155883 -3425743 -5569484 -4075780 -1007509 387828
36904 387828 33380 -47070 239212 -852055 -3185890 -4231057 -2826870 -933403 -654410
36895 -654410 -1560354 -2142004 -2268169 -2801297 -3811960 -4439166 -4019022 -2591853 -727935
36886 -727935 750464 1413573 1762075 2437727 2967606 2400399 1249088 1345305 3248277
36877 3248277 5181120 5362789 4230012 3390445 3368987 3507569 3405923 3312743 3376873 3386143
36867 3386143 3157213 2692022 2130885 1818039 2061174 2626148 2911767 2747713 2497808
36858 2497808 2374464 2336356 2564213 3103420 3169587 2087233 905985 1437729 3356149
36849 3356149 4132159 2659865 1040438 1474113 3151881 3961380 3746162 3687392 3521893
36840C521893j592404k509694j002991J597569K417896Q64596j132820j825789
36832C38256j008002N69350J717784J366738j85511j170869n19074O28632O31037
$$ plain form
36840 3521893 1929489 -580205 -1583196 14373 2432269 3296865 2164045 338256
36832 338256 -669746 -100396 1617388 2984126 2798615 1627746 1108672 1737304 2368341
$$ [...]
##END NTUPLES=NMR SPECTRUM
##END=
