##TITLE=31Pdec_LR-677-RM3
 , 24 sc
 24.6.2019
##JCAMPDX= 6.0         $$ Bruker NMR JCAMP-DX V2.0
##DATA TYPE= NMR SPECTRUM
##DATA CLASS= NTUPLES
##ORIGIN= UXNMR, Bruker Analytische Messtechnik GmbH
##OWNER= root
$$ XWIN-NMR		Version 3.5
$$ Mon Jun 24 14:03:44 2019 Russian Standard Time (UT+4h)  she@DPX200
##.OBSERVE FREQUENCY= 81.013821
##.OBSERVE NUCLEUS= ^31P
##.ACQUISITION MODE= SIMULTANEOUS
##.ACQUISITION SCHEME= undefined
##.AVERAGES= 24
##.DIGITISER RES= 17
##SPECTROMETER/DATA SYSTEM= spect
##.PULSE SEQUENCE= zgpg30
##.SOLVENT NAME= D2O
##.SHIFT REFERENCE= (INTERNAL, D2O, 0, 182.463)
##AUDIT TRAIL= $$ (NUMBER, WHEN, WHO, WHERE, WHAT)
$$ ##TITLE= Audit trail, XWIN-NMR		Version 3.5
$$ ##JCAMPDX= 5.01
$$ ##ORIGIN= Bruker BioSpin GmbH
$$ ##OWNER= she
$$ F:/spectra/data/she/nmr/P31/1/pdata/1/auditp.txt
$$ ##AUDIT TRAIL=  $$ (NUMBER, WHEN, WHO, WHERE, WHAT)
(   1,<2019-06-24 14:02:36.29 +0400>,<she>,<DPX200>,
      <created by zg, POWCHK disabled, PULCHK disabled
       configuration hash MD5:
       00 E9 B6 7A A2 85 ED C7 34 08 36 98 17 FE 4E 26
       data hash MD5: 32K
       CD 0A 5A 44 D3 E3 EB 84 7B D8 20 0F 88 5D F8 DF>)
(   2,<2019-06-24 14:02:43.01 +0400>,<she>,<DPX200>,
      <Start of raw data processing
       efp BC_mod = 2 LB = 1 FT_mod = 6 PKNL = 1 PHC0 = -2533.779 PHC1 = 63.19916 SI = 64K 
       data hash MD5: 64K
       ED D3 57 A7 A7 26 71 B3 53 E6 25 01 A8 CF 59 FB>)
(   3,<2019-06-24 14:03:14.21 +0400>,<she>,<DPX200>,
      <pk PHC0 = -68.02406 PHC1 = 157.1999 
       data hash MD5: 64K
       1A 6C 33 DB E8 B4 DC 6A DE 17 ED 5C 51 5A 6A 7F>)
(   4,<2019-06-24 14:03:17.65 +0400>,<she>,<DPX200>,
      <abs ABSG = 5 
       data hash MD5: 64K
       01 11 EE 8F F3 E3 09 7D 84 42 4D 35 22 D8 44 25>)
$$ ##END=
$$ 
$$ hash MD5
$$ 7E 88 E5 D4 94 3F DC FC 03 12 2F 1F 52 D1 1F FF
##$RELAX= 
##$RELAX= 
##$RELAX= 
##$RELAX= 
##$RELAX= 
##$RELAX= 
##$RELAX= 
##$RELAX= 
$$ Bruker specific parameters
$$ --------------------------
##$DU= <F:/spectra>
##$EXPNO= 1
##$NAME= <P31>
##$PROCNO= 1
##$TYPE= <nmr>
##$USER= <she>
##$AMP= (0..31)
100 100 100 100 100 100 100 100 100 100 100 100 100 100 100 100 100 100 
100 100 100 100 100 100 100 100 100 100 100 100 100 100 
##$AQSEQ= 0
##$AQ_mod= 1
##$AUNM= <au_zg>
##$AUTOPOS= <>
##$BF1= 81.014009
##$BF2= 200.13
##$BF3= 200.13
##$BF4= 200.13
##$BF5= 200.13
##$BF6= 200.13
##$BF7= 200.13
##$BF8= 200.13
##$BYTORDA= 1
##$CFDGTYP= 0
##$CFRGTYP= 5
##$CHEMSTR= <none>
##$CNST= (0..31)
1 1 145 1 1 1 1 1 1 1 1 1 1 1 1 1 1 1 1 1 1 1 1 1 1 1 1 1 1 1 1 1 
##$CPDPRG= <waltz16>
##$CPDPRG1= <>
##$CPDPRG2= <waltz16>
##$CPDPRG3= <>
##$CPDPRG4= <mlev>
##$CPDPRG5= <mlev>
##$CPDPRG6= <mlev>
##$CPDPRG7= <mlev>
##$CPDPRG8= <mlev>
##$CPDPRGB= <>
##$CPDPRGT= <>
##$D= (0..31)
0 1 0 0 0 0 0 0 0 0 0 0.03 2e-05 3e-06 0 0 0 0 0 0 0 0 0 0 0 0 0 0 0 0 
0 0 
##$DATE= 1561370555
##$DBL= (0..7)
120 120 120 11 120 120 24 19 
##$DBP= (0..7)
150 150 150 150 150 150 150 150 
##$DBP07= 0
##$DBPNAM0= <>
##$DBPNAM1= <>
##$DBPNAM2= <>
$$ [...]
##$SUBNAM3= <"">
##$SUBNAM4= <"">
##$SUBNAM5= <"">
##$SUBNAM6= <"">
##$SUBNAM7= <"">
##$SUBNAM8= <"">
##$SUBNAM9= <"">
##$SW= 369.568048894756
##$SWIBOX= (0..15)
0 1 3 0 0 0 0 0 0 0 0 0 0 0 0 0 
##$SW_h= 29940.119760479
##$TD= 32768
##$TD0= 1
##$TE= 0
##$TE2= 300
##$TE3= 300
##$TEG= 300
##$TL= (0..7)
0 120 53 12 22 120 120 120 
##$TP= (0..7)
150 150 150 150 150 150 150 150 
##$TP07= 0
##$TPNAME0= <>
##$TPNAME1= <>
##$TPNAME2= <>
##$TPNAME3= <>
##$TPNAME4= <>
##$TPNAME5= <>
##$TPNAME6= <>
##$TPNAME7= <>
##$TPOAL= (0..7)
0.5 0.5 0.5 0.5 0.5 0.5 0.5 0.5 
##$TPOFFS= (0..7)
0 0 0 0 0 0 0 0 
##$TUNHIN= 0
##$TUNHOUT= 0
##$TUNXOUT= 0
##$USERA1= <user>
##$USERA2= <user>
##$USERA3= <user>
##$USERA4= <user>
##$USERA5= <user>
##$V9= 5
##$VALIST= <valist>
##$VCLIST= <CCCCCCCCCCCCCCC>
##$VD= 0
##$VDLIST= <DDDDDDDDDDDDDDD>
##$VPLIST= <PPPPPPPPPPPPPPP>
##$VTLIST= <TTTTTTTTTTTTTTT>
##$WBST= 1024
##$WBSW= 4
##$XGAIN= (0..3)
0 0 0 0 
##$XL= 0
##$YL= 0
##$YMAX_a= 54270
##$YMIN_a= -83592
##$ZGOPTNS= <>
##$ZL1= 120
##$ZL2= 120
##$ZL3= 120
##$ZL4= 120
##$ABSF1= 182.463
##$ABSF2= -187.1042
##$ABSG= 5
##$ABSL= 3
##$ALPHA= 0
##$AQORDER= 0
##$ASSFAC= 0
##$ASSFACI= 0
##$ASSFACX= 0
##$ASSWID= 0
##$AUNMP= <proc_1d>
##$AZFE= 0.1
##$AZFW= 0.5
##$BCFW= 0
##$BC_mod= 2
##$BYTORDP= 0
##$COROFFS= 0
##$CY= -3
##$DATMOD= 1
##$DC= 0
##$DFILT= <>
##$DTYPP= 0
##$F1P= 0
##$F2P= 0
##$FCOR= 1
##$FTSIZE= 65536
##$FT_mod= 6
##$GAMMA= 0
##$GB= 0
##$INTBC= 1
##$INTSCL= 5.30512e-09
##$ISEN= 30
##$LB= 1
##$LEV0= 0
##$LPBIN= 0
##$MAXI= 10000
##$MC2= 0
##$MEAN= 0
##$ME_mod= 0
##$MI= 50
##$NCOEF= 0
##$NC_proc= -6
##$NLEV= 6
##$NOISF1= 182.463
##$NOISF2= 159.3651
##$NSP= 0
##$NTH_PI= 0
##$NZP= 0
##$OFFSET= 182.463
##$PC= 4
##$PHC0= -2601.803
##$PHC1= 220.3991
##$PH_mod= 1
##$PKNL= yes
##$PPARMOD= 0
##$PSCAL= 0
##$PSIGN= 0
##$REVERSE= no
##$SF= 81.0140089999434
##$SI= 65536
##$SIGF1= 159.3651
##$SIGF2= -187.1042
##$SINO= 113.3802
##$SIOLD= 16384
##$SREGLST= <1H.CDCl3>
##$SSB= 0
##$STSI= 65536
##$STSR= 0
##$SW_p= 29940.119760479
##$SYMM= 0
##$S_DEV= 0
##$TDeff= 32768
##$TDoff= 0
##$TI= <>
##$TILT= no
##$TM1= 0
##$TM2= 0
##$TOPLEV= 0
##$USERP1= <user>
##$USERP2= <user>
##$USERP3= <user>
##$USERP4= <user>
##$USERP5= <user>
##$WDW= 1
##$XDIM= 65536
##$YMAX_p= 299017065
##$YMIN_p= -22634170
$$ End of Bruker specific parameters
$$ ---------------------------------
##NTUPLES= NMR SPECTRUM
##VAR_NAME=  FREQUENCY,     SPECTRUM/REAL,   SPECTRUM/IMAG
##SYMBOL=    X,             R,               I
##VAR_TYPE=  INDEPENDENT,   DEPENDENT,       DEPENDENT
##VAR_FORM=  AFFN,          ASDF,            ASDF
##VAR_DIM=   65536,         65536,           65536
##UNITS=     HZ,            ARBITRARY UNITS, ARBITRARY UNITS
##FACTOR=    0.456856943014862, 1,           1
##FIRST=     14782.0589164792, 0,            0
##LAST=      -15158.0608439998, 0,           0
##MIN=       -15158.0608439998, -22634170,   0
##MAX=       14782.0589164792, 299017065,    0
$$ Real data points
##PAGE= N=1
##DATA TABLE= (X++(R..R)), XYDATA
$$ [...]
49645 -1545424 -2935021 -3159637 -2043942 -15309 2297955 4197211 5108646 4823988 3479052
49636 3479052 1478330 -394105 -1192158 -682899 127987 -81679 -1405715 -2490949 -1982914
49627 -1982914 105714 2523714 3949926 3954646 3156304 2637674 2995717 3775787 3941638
49618 3941638 2972926 1379567 140471 -158901 373865 1212030 1850466 2139773 2266569
49609 2266569 2329440 2078299 1336182 469594 -82802 -635628 -1851332 -3401839 -3992845
49600 -3992845 -3230112 -2493723 -2997260 -3758471 -2895610 -582043 977021 755258 380972
49591 380972 1523094 3259075 3494713 2082849 805590 616976 721869 580835 1000021
49582 1000021 2332200 3041954 1513376 -1405400 -3113481 -2394802 -682871 -85955 -1132754
49573 -1132754 -2750226 -3652709 -3349761 -2396372 -2021004 -2958468 -4326599 -4322835 -2517285
49564 -2517285 -721129 -766233 -2024489 -2303361 -987355 86496 -769326 -2847116 -4176568
49555 -4176568 -3976567 -2941176 -1714591 -395865 567124 341604 -1004996 -2198497 -2368802
49546 -2368802 -2200308 -2722674 -3563032 -3385962 -1847630 -144748 475569 -34735 -947171
49537 -947171 -1661744 -1810412 -1147547 -8797 472666 -644676 -2824518 -4208140 -3283872
49528 -3283872 -348724 2649271 3696366 2413157 429103 -116730 1287495 3052727
49520 3052727 3380463 2277092 1154365 696779 35141 -1700495 -3826110 -4825874 -4269917
49511 -4269917 -3216016 -2669100 -2369118 -1526062 -292294 230474 -458441 -1332265 -1004085
49502 -1004085 427953 1428428 1092075 440715 1009726 2566120 3205946 1859407 -170507
49493 -170507 -726192 666499 2454609 3018910 2249938 1085012 157390 -599184 -1282869
49484 -1282869 -1559207 -1057933 39655 1068344 1477598 1238914 797993 814694 1718589
49475 1718589 3087773 3651472 2661370 1334896 1906433 4657669 6915348 6107587 3025484
49466 3025484 543785 -363123 -1283786 -2936723 -3444489 -1264088 1960047 3225288 1784386
49457 1784386 -713991 -2790458 -3994597 -3836651 -2023957 177897 747116 -474428
49449 -474428 -1486881 -907958 372329 812174 117468 -1090981 -2193055 -2418710 -1030792
49440 -1030792 1435440 3138516 2997969 1875980 989751 299086 -605233 -1243761 -1161924
49431 -1161924 -1084132 -1718347 -2218319 -1358571 385289 1486600 1584553 1423054 1002409
49422 1002409 -339526 -2065857 -2557311 -1434208 -142016 182371 -122907 -655487 -1828960
49413 -1828960 -3505742 -4280727 -3303938 -1703181 -1038631 -1267841 -1397102 -1286208 -1437408
49404 -1437408 -1565541 -874711 351377 767343 -185389 -1448236 -1734933 -1040311 -371459
49395 -371459 -486003 -1321847 -2372363 -3157412 -3322655 -2644807 -1260407 137971 688088
49386 688088 184662 -673375 -1076783 -894111 -447730 21390 194670 -452274 -1811299
49377 -1811299 -2640025 -1940549 -494150 218613 345140 1298755 3062583 3820159 2906091
49368 2906091 2178257 3225768 4833014 4805507 3108601 1471221 721767 269766 -285999
49359 -285999 -697036 -943684 -1150178 -889987 123865 1055793 1050380 838832 1581399 2471962
49349 2471962 1489861 -1378579 -3668893 -3677985 -2400361 -1557075 -1336035 -1010577 -431909
49340 -431909 133279 632559 839548 310310 -489715 -62471 2159193 4596773 5274694
49331 5274694 4123231 2681451 2177073 2753693 3911856 4721728 4118023 2001497 -253217
49322 -253217 -1240313 -1189516 -1384959 -2178645 -2490202 -1378040 507756 1326920 -125007
49313 -125007 -2906967 -4448673 -3121242 -182045 1664379 1594927 1358433 2403242 3834388
49304 3834388 4069173 3124659 1992243 866978 -474868 -1370495 -1067213 -414302 -1091288
49295 -1091288 -3226043 -5223507 -5934755 -5603675 -4676249 -3254233 -2071351 -2451593 -4440221
49286 -4440221 -6015949 -5103807 -1872045 1568788 3340733 3249856 2470355 2216656 2608212
49277 2608212 2748624 2004787 876735 181571 -176793 -837711 -1700243 -2015104 -1676704
49268 -1676704 -1378263 -1399958 -1289486 -939216 -889314 -1174852 -921182 311584 1639206
49259 1639206 1998525 1558045 1352852 1967025 3051290 3719131 3102361 1083801 -1163994
49250 -1163994 -1997318 -1097432 131393 357367 -167606 -394524 -30510 442732 743144
49241 743144 943924 972714 684287 230118 -197373 -701472 -1250176 -1343092 -788075 -399064
49231 -399064 -1065653 -2380382 -3109021 -2904265 -2557071 -2493908 -2118358 -1022302 175304
49222 175304 879340 1535749 2620018 3246466 2119458 -272618 -1894313 -2000731 -2249217
49213 -2249217 -3917894 -5303588 -3738550 323444 3376158 3297602 1694621 1015751 1315764
49204 1315764 1350795 1153626 1407265 1406731 86379 -1458236 -1010268 1206637 2490647
49195 2490647 1601161 312857 263683 696071 635648 1003884 2628499 3969986 3152419
49186 3152419 1091425 232166 825809 777082 -979436 -3069136 -3818792 -3009339 -1196171
49177 -1196171 1063786 2808215 2933360 1552120 66128 -599891 -849434 -1115292 -889671
49168 -889671 207410 1349032 1445460 609250 -190033 -577678 -1030655 -1793563 -2344033
49159 -2344033 -2183940 -1628075 -1359754 -1434487 -1287629 -811344 -744133 -1421256 -1705642 -264015
49149 -264015 2184762 3221325 1786742 -320924 -819001 256388 1200667 1202576 887219
49140 887219 816489 848827 810896 606162 -182334 -1628822 -2594352 -1846779 -62617 647152
49130 647152 -529888 -2075674 -2224600 -970763 487779 1335939 1585461 1642516 1919195
49121 1919195 2355900 2123303 455654 -2059027 -3791499 -3903643 -3109517 -2402714 -1910787
49112 -1910787 -1406109 -1113560 -1382572 -2026680 -2455165 -2209296 -1266139 -187885 113624
49103 113624 -672209 -1670104 -1864919 -1483173 -1385781 -1331863 -188670 1993048 3498843
49094 3498843 3030808 1130309 -947453 -2638419 -3797933 -4199071 -4099966 -4378491 -5305776
49085 -5305776 -5962816 -5591027 -4774947 -4563268 -5069905 -5615576 -5687787 -5198452 -4302034 -3343627
49075 -3343627 -2475412 -1270848 432414 1405472 185406 -2362106 -3358092 -1608210 623377
49066 623377 686653 -1068212 -2415097 -2524812 -2373979 -2617976 -2768898 -2291920 -1287411
49057 -1287411 -211093 313767 -150155 -1020795 -945356 370451 1469672 1113654 -96356
49048 -96356 -1030541 -1745429 -2625834 -3029178 -2351376 -1428262 -1227724 -1065772 172473 1941422
49038 1941422 2977086 3412514 3947348 3815895 1954413 -435352 -1087582 -194170 -107569
49029 -107569 -1474495 -2321496 -1437951 -152886 32871 -619272 -1354838 -2107514 -2539847
49020 -2539847 -1793149 -116179 955774 833410 571035 678189 244965 -827604 -851977
49011 -851977 1014296 3003384 3155767 1950407 971059 404246 -412540 -1136035 -934626
49002 -934626 -126679 247860 -41037 -512173 -986161 -1452348 -1618100 -1520198 -1770861 -2359656
48992 -2359656 -2280172 -1299862 -834084 -1833386 -3087140 -3123722 -2587910 -2945884 -3809504 -3564231
48982 -3564231 -2100069 -962736 -1011482 -1630748 -2120389 -2301109 -1865956 -667474 368439
48973 368439 61715 -1200935 -1727899 -675202 1196546 2882259 4060211 4608013 4331709
48964 4331709 3397701 2238844 1026072 -95069 -552643 2974 918479 1288086 1099394
48955 1099394 772893 191146 -709296 -1094315 -405239 218174 -669796 -2394453 -2865444
48946 -2865444 -1507123 268105 1395993 2088123 2348558 1550171 -67178 -1248105 -1587520
48937 -1587520 -1909805 -2375315 -2073695 -1168928 -1477797 -3781691 -6251555 -6866280 -5960101
48928 -5960101 -4985249 -4110785 -2738298 -1373245 -1074748 -1493125 -1195324 99437 1050747
48919 1050747 644735 -523059 -1222400 -1024421 -423276 -56971 -121010 -353133 -509530
48910 -509530 -873218 -2014434 -3850998 -5300449 -5246130 -3675890 -1613881 -144049 286287
48901 286287 -89528 -625584 -676265 -33855 942889 1600258 1420463 474435 -371100 -81063
48891 -81063 1346851 2687585 2899142 2200638 1231480 -34961 -1552913 -2226621 -1226355
48882 -1226355 168801 -152400 -2043018 -3113259 -2098059 -376858 378982 213354 -272548
48873 -272548 -1244000 -2583500 -3092650 -2184680 -1127528 -1153134 -1461418 -694711 562145
48864 562145 557673 -896084 -2212604 -2352875 -1825798 -1395522 -1178066 -1192470 -1623370 -2178965
48854 -2178965 -2036352 -818661 837560 1906456 1951347 1491058 1430547 1885373 1758541
48845 1758541 203458 -1664093 -1789235 -128983 975338 33687 -1651974 -2355466 -2475839
48836 -2475839 -3043662 -3235286 -1666563 741899 1613850 511348 -713039 -833124 -370937
48827 -370937 259992 1485989 2903098 2888941 826721 -1760766 -3190029 -3550302 -3889167
48818 -3889167 -4531673 -5033123 -5040296 -4506200 -3545122 -2468653 -1575662 -854957 -311549 -246279
48808 -246279 -544663 -321324 651802 931175 -590587 -2334889 -1817915 535714 1856362
48799 1856362 1249123 953284 2269119 3178490 1667110 -1011840 -2551602 -3186382 -4622708
48790 -4622708 -6653756 -7396765 -6325505 -4791852 -3719107 -2732607 -1600439 -836587 -641180
48781 -641180 -518021 -107273 545842 1415575 2274447 2411844 1614734 982787 1582835 2742520
48771 2742520 2978615 2150314 1228710 426399 -648424 -1303459 -380921 1312001 1451598
48762 1451598 -331956 -1651171 -1019416 -97899 -720633 -1716356 -1021132 440398 -136128
48753 -136128 -2822463 -4377487 -2959744 -941734 -1522036 -4259232 -5948199 -5080511 -3334292
48744 -3334292 -2623318 -2593358 -1890203 -577697 43545 -475385 -1085137 -771878 160981
48735 160981 659611 195006 -829074 -1532477 -1205609 77522 1248261 1071553 -486922
48726 -486922 -2066374 -2395983 -1631064 -888708 -866639 -1398320 -2026682 -2390124 -2187403 -1383584
48716 -1383584 -480837 -76387 -63137 297758 1365902 2523070 2772795 1766171 143204
48707 143204 -1027798 -1158773 -633961 -378480 -854198 -1609114 -1919382 -1616537 -1031454
48698 -1031454 -393859 287911 873034 1069772 827339 454360 311744 567193 1130269
48689 1130269 1544611 1093561 -541612 -2693190 -4150312 -4300564 -3572811 -2703927 -1886741
48680 -1886741 -810168 658356 2034722 2480233 1531966 -381839 -2252003 -3373368
48672 -3373368 -3739092 -3508548 -2562423 -1048125 7927 -509574 -2239184 -3287881 -2251473
48663 -2251473 80607 1587551 1239005 91368 -229499 501571 1088356 598801 -514389
48654 -514389 -1074747 -482493 910963 2327515 3064082 2785418 1827961 1042440 862145
48645 862145 737257 38465 -789201 -826652 -281547 -401377 -1605023 -2773189 -2784434 -1722797
48635 -1722797 -102724 1886007 3564800 3472640 1205327 -1355274 -2141845 -1585411 -1579026
48626 -1579026 -2265584 -1905966 -68877 1196627 323997 -1272038 -1025036 1422368 4008979
48617 4008979 4832730 3706577 1478408 -897419 -2461546 -2501191 -1266505 66169 575059
48608 575059 443601 361936 481901 484811 462740 979603 2057031 2813615 2678549 2407405
48598 2407405 3005972 3932780 3508047 1245788 -1334438 -2629977 -2651572 -2268174 -1889125
48589 -1889125 -1742605 -2369596 -3640209 -4154610 -3033153 -1645239 -1978797 -3701716 -4558165
48580 -4558165 -3586501 -2193974 -1798224 -2053409 -1950035 -1286146 -437869 177570 -47192
48571 -47192 -1377702 -2626545 -1994701 285771 1596150 249755 -2070709 -2433722 -267590
48562 -267590 2441709 3827642 3653287 2575713 1270538 337924 131028 467933 905441
48553 905441 1174634 1117069 651490 118432 31331 99878 -678822 -2355577 -3349355 -2335874
48543 -2335874 -113798 1406576 1534170 1131925 1107646 1637894 2593904 3692316 4292239
48534 4292239 3853109 2574510 1096751 -135310 -786804 -548704 182189 218916 -960185
48525 -960185 -2297933 -2607730 -2243395 -2257297 -2607280 -2505222 -1966278 -1558129 -1041059 182698
48515 182698 1521069 1700011 750124 -39136 -85208 143503 638609 1818798 2824564
48506 2824564 1951133 -543528 -2042432 -1036930 698860 623927 -1350872 -3496763 -4784559
48497 -4784559 -5213517 -4696779 -3366284 -2361931 -2651090 -3372806 -2836953 -998035 437114
48488 437114 299061 -943320 -2369228 -3550842 -4077962 -3435633 -1949041 -928403 -1252378
48479 -1252378 -2444923 -3587717 -4390371 -4745187 -3979216 -1608369 1376548 3018161 2461332
48470 2461332 807303 -463456 -1241017 -2247611 -3213914 -2759077 -376092 2430580 3729312
48461 3729312 3324296 2556586 2397315 2727108 3270731 4009312 4441441 3631485 1633595
48452 1633595 -73044 -424859 -333921 -1346143 -3162065 -3787398 -2308448 -340116 -1303
48443 -1303 -1178869 -1804333 -666084 1113615 1776851 1190963 507756 95374 -843539
48434 -843539 -2432506 -3300466 -2483466 -1155797 -1199152 -2517014 -3109937 -1817941 186673
48425 186673 947016 -93228 -1802576 -2654067 -2010674 -516839 637624 1008563 1193689
48416 1193689 1621869 1798186 1452319 1523101 2723228 3858032 3248882 1363117 71080
48407 71080 -473151 -1845888 -4004221 -4573728 -2525343 -128923 359793 -122651 462179
48398 462179 1735549 1798672 456637 -856296 -1662556 -2628373 -3546498 -3428141 -2643545
48389 -2643545 -2844471 -4317838 -5181593 -3892221 -1268458 632089 770679 -185540 -791714
48380 -791714 -187765 1104324 1900548 2101266 2900258 4641781 5734336 5015568 3928963
48371 3928963 4347057 5193253 3824362 453714 -1664919 -900176 658448 789891 288537
48362 288537 854465 1867322 1453996 -332098 -1498199 -929075 392354 975350 497872
48353 497872 -247335 -408635 57917 377103 -75447 -906395 -1317702 -1397805 -1924032 -2976817
48343 -2976817 -3895467 -4625342 -5654502 -6327931 -4962293 -1499657 1529076 1959881 735913
48334 735913 358820 1531524 2739616 2555562 1067404 -600022 -1158605 30850 2115527
48325 2115527 3188465 2371877 862022 122900 -86446 -790682 -1769883 -1912460 -1126153
48316 -1126153 -472821 -601989 -1258938 -2114599 -2887200 -2876026 -1655589 -136964 312871
48307 312871 -199877 -273884 614480 1372720 1001532 -77054 -800155 -646086 357876
48298 357876 1962644 3536622 4198337 3580330 2110618 355466 -1473026 -3217557 -4506345
48289 -4506345 -5082461 -5112865 -4938773 -4617942 -3802973 -2166350 -127983 1068961 645240
48280 645240 -428163 -422068 683165 1008176 -350182 -1708870 -1205532 517736 1587038
48271 1587038 1700763 1716048 1286488 -730538 -3710810 -5413798 -4989746 -3850300 -3151584
48262 -3151584 -2359576 -947344 320009 707355 645834 710481 775225 899889 1688117 2994842
48252 2994842 3656281 3341376 3261715 4062146 4425848 3039430 782310 -391265 94844
48243 94844 1255373 2002606 1764025 532255 -683411 -432860 1082468 1620478 -116671
48234 -116671 -2307211 -2449082 -883509 107457 -116816 -253189 -23471 -854526 -3082861
48225 -3082861 -4719021 -4042584 -1790164 318615 1838855 3138588 3829135 3255601 2082934
48216 2082934 1859251 2834871 3354282 1934521 -739570 -2544407 -2342573 -996361 70138
48207 70138 578667 1148660 1858137 1962020 1065983 -204733 -950675 -844379 -121207 595836
48197 595836 356899 -1336159 -3482048 -4205850 -2914070 -1024873 -125164 -320355 -879561
48188 -879561 -1401179 -1659890 -1475058 -1547665 -3090538 -5547456 -6195198 -3625683 -264927
48179 -264927 598302 -821547 -1790224 -1562254 -2008907 -3821074 -5084943 -4457821 -3257445
48170 -3257445 -3141676 -3660274 -3482360 -2562892 -1755962 -1392293 -1388903 -1868000 -2718528 -3294266
48160 -3294266 -3184122 -2489776 -1072098 1221589 3229427 3031247 646171 -1400350 -1243322
48151 -1243322 45024 444786 -265083 -1092469 -1704734 -2108515 -1704501 -396010 391836
48142 391836 -461876 -1876422 -2248160 -2011448 -2499627 -3144192 -2164070 437296 2906457
48133 2906457 4450410 5481253 5375504 2853725 -974347 -2814785 -1527819 236782
48125 236782 94027 -778208 -246324 978580 652477 -1146948 -2121133 -1326864 -329730
48116 -329730 -578035 -1480939 -1679208 -951139 -207836 -335865 -1468211 -2933173 -3744597
48107 -3744597 -3477552 -2595586 -1649173 -608871 453981 673473 -533830 -2007617 -1766702
48098 -1766702 418353 2473953 2451844 668427 -991625 -1186855 -124789 906052 624249
48089 624249 -1044832 -2572573 -2320266 -694680 138046 -808810 -1871318 -1247415 105705
48080 105705 -222389 -2395663 -3927398 -3224198 -1681917 -1418493 -2444337 -3301450 -3370498
48071 -3370498 -3065340 -2429277 -1115970 430578 1156728 803876 18941 -884174 -2059139
48062 -2059139 -3031481 -2929369 -2162286 -2393336 -4100935 -5468762 -4703229 -2396206 -467338
48053 -467338 329893 585032 693892 642473 883928 1863271 2768411 2261874 601659 -416192
48043 -416192 -12606 455808 -403423 -2012418 -2867660 -2694408 -2421947 -2469667 -2186526 -1015512
48033 -1015512 604127 1771544 2171758 2354610 3034294 4152415 4740835 3934679 2052420
48024 2052420 314474 -472166 -464071 -27269 838146 2006899 2838786 2851552 2374169 2018836
48014 2018836 1881427 1809222 2067387 2983002 4070391 4270420 3158857 1344798 -399206
48005 -399206 -1766393 -2495489 -2088543 -584107 837820 897477 -103746 -430061 892309
47996 892309 2661841 2942068 1503131 -75043 -629167 -644549 -933206 -1225187 -961931
47987 -961931 -633049 -1064651 -1796160 -1532193 -166661 984168 1169794 1060706 1126163
47978 1126163 553385 -1237336 -3096808 -3456166 -2500966 -1767786 -1935156 -2269809 -2112441
47969 -2112441 -1621382 -916861 244173 1482471 1597500 126601 -1669782 -2262766 -1799834
47960 -1799834 -1653851 -2279186 -2580875 -1618144 -6154 966830 1032581 1019302 1521707 2279410
47950 2279410 2861847 3188849 3139214 2373839 1043294 134268 473980 1627831 2253720
47941 2253720 1351214 -1068229 -3968966 -5490819 -4003180 13097 3677838 4501154
47933 4501154 3123734 2032334 1981300 1494076 -45882 -970011 90966 1930519 2387617
47924 2387617 1053747 -868232 -2382963 -3145644 -2991138 -2259437 -1813089 -1657413 -566246
47915 -566246 1676977 2951500 1523350 -999356 -1696507 -591465 -290780 -1668592 -2831928
47906 -2831928 -2807078 -3253569 -5188189 -6585002 -5236451 -2196678 -225965 -25144 -162966
47897 -162966 44643 -175659 -1032709 -1420588 -604909 698265 1387597 1196753 564176
47888 564176 59329 133118 738748 1059002 285929 -1196704 -2087808 -1812217 -1235602 -1453156
47878 -1453156 -2444310 -3339015 -3603319 -3468052 -3328580 -3132729 -2468993 -1140602 414785
47869 414785 1315145 939169 -464855 -1848486 -2135758 -1164667 -1050 -68104 -1602585
47860 -1602585 -3116052 -2907515 -1158866 54302 -860863 -3071977 -4181240 -2784365
47852 -2784365 244564 2916701 4125357 4260490 4038925 3279801 1405298 -1011248 -2238862
47843 -2238862 -1524053 -315345 -255245 -661332 379837 2665769 3610958 1823101 -891227
47834 -891227 -2102357 -1793710 -1526463 -1861016 -2183213 -2203375 -2015783 -1269621 191680
47825 191680 1379937 1379423 999212 1517259 2249043 1436386 -558402 -1293318 51177 1356015
47815 1356015 1011159 501853 1829205 4021205 4432997 2650313 812946 207607 -308347
47806 -308347 -1926201 -3641636 -3531279 -1429170 745432 1106114 -455417 -2571855 -3866400
47797 -3866400 -3910162 -3044979 -1720852 -262981 889447 1252244 934897 921097 2196025
47788 2196025 4523312 6436747 6626331 5153121 3160761 1608326 608532 -48025 -242868
47779 -242868 171089 700658 554373 -196969 -487246 269919 1177544 1054575 208955 37570
47769 37570 971261 1884768 1783592 1090032 767038 1011922 1484124 2137233 3004122 3613777
47759 3613777 3465751 2817258 2235828 1641247 667276 -213142 -16696 1142194 1855847
47750 1855847 1316391 438821 331086 472784 -413979 -2073520 -2685393 -1353179 595334
47741 595334 1465800 1410744 1784609 2876784 3559472 3153308 2401610 2148763 2064525 1462944
47731 1462944 700487 753202 1636267 2222766 1815772 1162282 1447260 2621837 3235141
47722 3235141 2051907 -350609 -1925802 -1334661 459134 1324338 638159 -34871 700812
47713 700812 2018341 2123265 891026 -80858 82406 407452 -249419 -1559104 -2462381
47704 -2462381 -2745086 -2985248 -3315185 -3113802 -2013909 -658520 -115891 -624281 -1193632
47695 -1193632 -737298 484173 1131766 752091 689218 2237579 4518245 5435276 4496414
47686 4496414 3252271 2818441 2513234 1522477 428827 73413 89500 -195862 -329842
47677 -329842 405760 1385310 1438237 883528 1096975 2030746 1904833 -37326 -1964665
47668 -1964665 -1730527 278795 1851136 2009399 1978111 2991305 4398408 4685478 3635248
47659 3635248 2459566 1964994 1594266 573008 -828935 -1777400 -2024410 -1864166 -1411166
47650 -1411166 -811152 -831732 -2082477 -3609549 -3478909 -1220790 1277014 1955161 948386
47641 948386 107707 686996 2156229 3025823 2386181 792124 -245418 76776 863201
47632 863201 795142 42527 -275291 -342670 -1579305 -3886718 -4945083 -3431088 -1218872
47623 -1218872 -773954 -1776903 -2239790 -1844244 -1942204 -2862216 -3476414 -3283117 -2874882
47614 -2874882 -2333429 -1096005 476307 1304113 1580006 2656269 4590430 5692206 5031897
47605 5031897 3567205 2207109 727384 -560550 -152838 2240099 4335259 3972038
47597 3972038 1946617 629191 823166 1560990 2111605 2492313 2514757 1904559 1160468
47588 1160468 1037685 1344356 1275676 713090 288926 437559 1133642 2114225 2637593 1733940
47578 1733940 -368143 -1859905 -1581287 -877003 -1788192 -4004209 -5320074 -4852072 -4010065
47569 -4010065 -4192270 -5233831 -6500268 -7871539 -8933227 -8587583 -6460864 -3782882
47561 -3782882 -1985314 -1133453 -546489 -289176 -992719 -2418371 -3204282 -2383203 -678650
47552 -678650 183711 -523913 -1588100 -1286669 433767 1915661 2032397 1543208 1661671
47543 1661671 2204618 2152019 1357424 507333 -132114 -598623 -238330 1557079 3616204
47534 3616204 3726723 1607625 -411960 -511834 159053 -701021 -3197746 -5067727 -4577664
47525 -4577664 -2501030 -1019949 -1231670 -2081574 -1807514 -280670 718211 -2321 -1125508
47516 -1125508 -636404 1033181 1509748 118012 -1127929 -817136 -207949 -665989 -1108765
47507 -1108765 -65879 1329395 1056514 10360 1090402 4463590 6674144 5422576
47499 5422576 2778024 2069513 3399589 4184787 3067481 1258186 338802 532782 1330169
47490 1330169 2376238 3224674 3254722 2483027 1763388 1572905 1200387 -91218 -1523386
47481 -1523386 -1469665 274957 1932655 1987869 1150895 1160396 2198289 2824576 2456087 2384279
47471 2384279 3606913 4914521 4448949 2498193 1235586 1749078 2735168 2548642 1415012
47462 1415012 855485 1586516 2776739 3126301 2114916 295311 -1238576 -1679709 -1024243
47453 -1024243 186606 1524004 2817202 3752661 3842769 2978011 1653811 490062 -181238
47444 -181238 -251019 141318 421926 18688 -783261 -1012587 -325458 501473 775224 839085
47434 839085 1214962 1530814 1192715 585457 566542 1069796 1251136 846034 339332 -89875
47424 -89875 -655194 -1042122 -706849 -254182 -1070720 -3106202 -4478983 -4058710 -2987540
47415 -2987540 -2548466 -1998182 -152554 2044087 2613864 1592383 795468 747749 154788
47406 154788 -1294184 -1986271 -1131470 -269566 -666389 -1099178 -37935 1470568 1277541
47397 1277541 -423914 -1394482 -702182 406031 990571 1657691 2857647 3790638 3754460
47388 3754460 3118488 2255349 894854 -700815 -1337566 -667290 -83949 -661727 -1350083
47379 -1350083 -632865 956520 1617224 985822 332986 287430 104623 -608809 -1032706
47370 -1032706 -544420 264571 664596 890544 1410476 1818252 1247709 -469112 -2566972
47361 -2566972 -3967736 -3897725 -2428295 -721698 -119658 -557444 -534650 784810 2172021
47352 2172021 1926070 350842 -541178 239104 1372479 1092319 -540636 -1930939 -2056401
47343 -2056401 -1482175 -1257082 -1447259 -1209329 -146911 913938 813276 -481660 -1769841
47334 -1769841 -2047794 -1565946 -1157750 -995492 -620443 71438 697986 1271706 2302955
47325 2302955 3623402 3961897 2522035 447557 -353361 297632 678336 -277070 -1428615
47316 -1428615 -1169334 244184 1242360 1266534 1169078 1397495 1261891 449746 -72119 449719
47306 449719 1196717 1046929 451047 677577 1556913 1469406 -278469 -2331464 -2915904
47297 -2915904 -1632256 636321 2573882 2918249 1363258 -425384 27006 2908534
47289 2908534 5382713 5122666 3396944 2976059 3929829 3779307 1613005 -403758 -287361
47280 -287361 1088719 1762825 1507372 1382278 1564733 1244435 184107 -963936 -1680630
47271 -1680630 -1941668 -1861050 -1803965 -2360321 -3293502 -3166382 -1209191 1069162 1667383
47262 1667383 1067344 1588803 3806016 5619604 5381978 3997124 2986888 2269712 1219540
47253 1219540 419909 627695 1034228 440518 -442428 214041 2446470 4200704 4097696
47244 4097696 2839752 1496776 43106 -1602309 -2479206 -1758406 -244938 463705 17254
47235 17254 -420062 111985 1074067 1015871 -783481 -3279861 -4304594 -2611632 577578
47226 577578 2507408 1623120 -983645 -3021914 -3335199 -2443778 -1382871 -713024 -433331
47217 -433331 -213167 298441 1005746 1288718 729486 -228203 -721956 -467423 13895 7647
47207 7647 -883135 -2574394 -4321772 -4894626 -3656054 -1589534 -582842 -1319819 -2348989
47198 -2348989 -1744548 529590 2444706 2177102 186876 -1262872 -586662 1453259 2793958
47189 2793958 2579509 2039758 2605887 3747185 3542466 1358253 -1020556 -1474745 -73576
47180 -73576 1322554 1563229 1179031 832889 146007 -1171720 -2072465 -1356388 336835
47171 336835 1110129 368721 -562003 -636426 -456306 -754718 -926594 -265474 449407 140886
47161 140886 -522778 774 1559917 2428263 2009538 1574016 1912675 2111671 1490290
47152 1490290 1039547 1636883 2186580 1160153 -841108 -1737448 -857620 312176 280639
47143 280639 -749581 -1528435 -1218419 4320 1214965 1527095 998323 540250 553251
47134 553251 234983 -1003100 -2068346 -1350626 896828 2625499 2508854 1226927 82142
47125 82142 -427800 -229468 913995 2744299 4029750 3689501 2120230 788504 685428
47116 685428 1543494 2276681 1853330 107142 -1883348 -2526877 -1312437 488618 1104507
47107 1104507 108020 -1376508 -2139042 -2058361 -1779631 -1725063 -1758884 -1578898 -1000812 109482
47097 109482 1660021 2847832 2422410 126001 -2397788 -3024792 -1547261 206957 800257
47088 800257 667864 745559 873940 594695 527140 1518367 2965000 3473370 2969303 2673720
47078 2673720 2979616 2875287 1799110 627693 182337 -45166 -863527 -2009880 -2673943
47069 -2673943 -2720562 -2575151 -2401764 -2147739 -1981988 -1926578 -1348568 377359 2718505
47060 2718505 4145169 3640106 1715171 -221904 -1273797 -1607916 -1713098 -1511199 -557770
47051 -557770 1084684 2769687 4086407 5060068 5401335 4504789 2647866 1157123 641286
47042 641286 132720 -1041118 -1790671 -1154927 -437649 -1330500 -2719047 -1955440 864099
47033 864099 2662510 1919156 794837 1626312 3581190 4313978 3234257 1591352 562449
47024 562449 525025 1136148 1184806 -390212 -2533361 -2681478 -277121 2109048 2356722
47015 2356722 1536522 1479876 1633318 565113 -1006466 -1281084 -451905 -196787 -781106
47006 -781106 -1089138 -1061836 -1677177 -2692233 -2736383 -1750184 -1234105 -1828481 -2503348 -2431771
46996 -2431771 -1996464 -1651593 -1277553 -915431 -855041 -906759 -729242 -654266 -958304 -837124
46986 -837124 326161 1239458 188921 -2090488 -3120029 -2141836 -773811 -210224 -6623
46977 -6623 94972 -590631 -1993986 -2817146 -2494297 -1990202 -2087011 -2381676 -2321449 -1739243
46967 -1739243 -320979 1755257 2865456 1780070 221507 887819 2916990 2576309
46959 2576309 -903091 -3713958 -3104714 -1218068 -1215229 -2638884 -3314271 -3360100 -4224652
46950 -4224652 -5403477 -5082226 -3050878 -577696 1670054 3484633 4016595 2976333
46942 2976333 1917938 2226743 2831478 1994758 304993 -370183 30319 76197 -491346
46933 -491346 -750999 -704426 -1135867 -1780171 -1720761 -1213205 -1146163 -1191682 -476837 482271
46923 482271 591457 326658 907444 1917250 2019976 1457120 1397168 1381832 147075 -1409439
46913 -1409439 -1078427 877115 1858817 1154694 917564 2240344 3321396 2721613 1709789
46904 1709789 1869826 2631494 2677149 1911209 723147 -921244 -2458090 -2583210 -1346333
46895 -1346333 -692926 -1748725 -3227170 -3646335 -3367398 -3219436 -2889418 -2061359 -1480788
46886 -1480788 -1451991 -878182 750023 2026757 1853185 1392258 2066616 3084386 2868397
46877 2868397 1687926 889830 554741 -101977 -844149 -864094 -459990 -498372 -830591 -907450
46867 -907450 -1265128 -2643243 -4243838 -4628720 -3789736 -2612539 -966685 1688833 4328244
46858 4328244 5190831 4444901 3914261 4095480 3534059 1503714 -647441 -1443566 -984381
46849 -984381 -123854 636070 897843 372075 -280802 179168 1811257 3234126 3597005
46840 3597005 3600355 3970629 4162215 3439364 2259010 1607927 1630164 1780070 1854952 2087579
46830 2087579 2497481 2784589 2759675 2536133 2424289 2746581 3465966 3952183 3553485 2501556
46820 2501556 1771042 1870629 2219705 1957535 1048965 366920 794421 2242912 3516893
46811 3516893 3463436 2413131 1897897 2543474 3073499 2277920 1139191 1538727 3240410
46802 3240410 3927384 2474598 526129 118539 1111506 1960210 1971498 1591738 1102463
46793 1102463 304291 -621650 -942459 -260866 993071 2087089 2579002 2257281 908221
46784 908221 -1415022 -3860213 -4946189 -3826812 -1436253 210656 167831 -563743 -749150
46775 -749150 -753666 -1708048 -3341150 -3961700 -2680753 -518145 1036245 1650017 1947716
46766 1947716 2482013 3386495 4455146 5117108 4762750 3410149 1701188 154722 -1078747
46757 -1078747 -1740234 -1536195 -913725 -949894 -1995470 -3019939 -2781835 -1215848 712737
46748 712737 2105673 2726269 2879818 3063707 3517468 3947450 3901715 3375171 2704038 2026829
46738 2026829 1377525 1111075 1493472 1969437 1671072 623761 -433744 -1364105 -2671862
46729 -2671862 -4156806 -4782550 -4240921 -3459668 -3091045 -2667922 -1807431 -1031051 -670939
46720 -670939 -155284 746025 1100489 263701 -837075 -917412 77490 1576188 3448384
46711 3448384 5202960 5272495 2853782 -235212 -1346354 -296850 785779 591730 -205599
46702 -205599 -843161 -1630258 -2812127 -3808790 -4063751 -3416673 -1456591 1958871 5201855
46693 5201855 5703297 3213331 727910 983568 3234036 4775561 4576390 3798901 3424242
46684 3424242 3187530 2853409 2958908 3805850 4785360 5260755 5403591 5647002 5840521
46675 5840521 5468713 4424591 3166850 2257132 1967093 2151249 2303751 1947813 1183867
46666 1183867 627183 549521 376974 -500685 -1631740 -1920198 -1246670 -897386 -1883239
46657 -1883239 -3447232 -4010972 -3243661 -2287815 -2044383 -2207723 -2149980 -1814483 -1367808
46648 -1367808 -823359 -494348 -1003976 -2224127 -2958165 -2433728 -1468790 -1362092 -2253019
46639 -2253019 -3439372 -4584926 -5429035 -4939925 -2356566 1078880 3031790 2915459 2360828
46630 2360828 2558007 2732904 1946222 828280 360137 171853 -535248 -1304680 -1277370
46621 -1277370 -1129781 -2310442 -4371331 -4905747 -2747781 258974 1640193 1293589 889326
46612 889326 1050313 701687 -803771 -2350187 -2454082 -1113647 449107 1350849 1618379
46603 1618379 1504508 1005017 103522 -1002784 -2001667 -2518660 -2241012 -1411509 -989572
46594 -989572 -1694934 -2940351 -3369080 -2512120 -1296330 -851765 -1449672 -2605788 -3416815
46585 -3416815 -2778306 -363721 2324038 3051477 1538732 -109795 -288394 164899 -88324
46576 -88324 -480619 253506 1544775 1719466 776679 406638 1330033 2522364 3199373
46567 3199373 3689551 3962032 3122276 1101208 -641593 -868420 160275 1622909 2984589
46558 2984589 3453240 2243764 199399 -478017 786617 1737730 387612 -2060802 -2951875
46549 -2951875 -1705033 101574 1283378 1836181 1719823 736328 -493490 -1030537 -1097872
46540 -1097872 -1673428 -2660926 -2924191 -2248207 -1800308 -2258698 -2762658 -2293401 -1097300
46531 -1097300 -115222 274991 372665 497330 667439 687160 394293 22090 157220 939022
46521 939022 1553511 1122742 -75214 -905209 -754818 -10425 652095 791787 206549
46512 206549 -897044 -1864535 -2251185 -2192552 -1660288 -152569 1971069 2838127 1313411
46503 1313411 -778744 -634957 1598989 3049347 2384905 1465662 1965141 2706512 1867960
46494 1867960 -5607 -1079323 -1085012 -1171325 -1623563 -1563286 -639529 508826 1376925 1929432
46484 1929432 1940055 1191068 287953 136776 519422 209656 -1275952 -2873958 -3200014
46475 -3200014 -2020285 -342622 552094 183387 -653910 -648434 424420 1199728 327613
46466 327613 -1843191 -3851052 -4932149 -5338094 -5174505 -4072698 -2130615 -260830 655221
46457 655221 374978 -898610 -2554274 -3445987 -2687129 -842102 461356 422110 -131557
46448 -131557 -131404 291896 273436 -449324 -1275402 -1542240 -1112296 -282929 560822 1211333
46438 1211333 1655626 1831120 1566123 1012060 850527 1537962 2496173 2712031 2132913
46429 2132913 1749058 2146202 2702924 2559086 1780838 1123896 1028332 1218722 1063759 174334
46419 174334 -1060115 -1536376 -553999 1111067 1967612 1812340 2073081 3638297 5207059
46410 5207059 4730466 2051705 -857197 -2188060 -1990395 -1480420 -1388415 -1383036 -806958
46401 -806958 391678 1508455 1827697 1477263 1352044 2034050 2939903 2826885 1241762
46392 1241762 -665714 -1044900 673849 2813802 3035087 1081622 -792039 -719075 310600
46383 310600 59995 -1534781 -2370268 -1584529 -858678 -1531235 -2391733 -1826429 -573312
46374 -573312 -354842 -807170 -78974 1853155 2791907 1583969 -224004 -765424 -273218
46365 -273218 -80374 -415076 -432000 202097 878019 1033274 823947 738711 835182 455040
46355 455040 -1061287 -3106842 -3769581 -1883675 1247584 3286860 3736435 3908341 4143240
46346 4143240 3102619 452004 -1862319 -2345093 -2118706 -2585674 -2603699 -467056 2371497
46337 2371497 2562024 -231716 -2582735 -2140627 -567277 -311822 -796291 68519 2087137
46328 2087137 3008363 2070428 1013940 1255110 1914962 1506516 263957 -431555 -348919
46319 -348919 -823827 -2659769 -4539037 -4350042 -1911878 520379 905318 -120011 -291142
46310 -291142 1173390 2782773 3213635 3077224 3411668 3636693 2479334 385676 -599897
46301 -599897 495686 2276205 2731535 1359129 -831976 -2543280 -2902872 -1747437 100170
46292 100170 1297030 1343891 1179504 1947137 3523390 4780313 4974664 4269524 3056999
46283 3056999 1390603 -814413 -3330014 -5413587 -6069340 -4940872 -3157177 -2616132
46275 -2616132 -3764945 -4639461 -3083166 359094 2908681 2944625 1702229 1202138 1752303
46266 1752303 2438265 3103638 4372529 5928771 6235559 4513705 2125722 1223208 2308860
46257 2308860 3724531 3508356 1318469 -1563918 -3710477 -4607121 -4375761 -3096266 -939222
46248 -939222 1255729 2281611 1777846 752234 517779 1308346 2228620 2368657 1666447
46239 1666447 834110 705308 1462271 2216524 1615032 -679114 -3228884 -4019547 -2451041
46230 -2451041 163943 2000522 2247797 1366897 391814 96840 423439 545296 -214713
46221 -214713 -1463456 -2077422 -1550365 -601015 -226267 -477215 -474919 516266 2281332 3888752
46211 3888752 4599487 4492393 4158439 3882522 3438229 2723483 2051412 1469458 395758
46202 395758 -1395218 -2940859 -3195771 -2634105 -2566369 -2945965 -2273451 -71180 1919022
46193 1919022 1862155 165847 -1248085 -1268273 -250810 1047999 2184127 2976529 3533477
46184 3533477 4051546 4045468 2414392 -876328 -3806961 -4170157 -2149072 74191 1094136
46175 1094136 1470347 2117015 2780678 2673451 1838219 1231815 1634109 2710237 3195251
46166 3195251 2289133 932180 990140 2802992 4528955 4695688 4217005 4521537 4860284
46157 4860284 3595915 1499384 1151404 2947398 4321263 3665178 2508277 2536246 2770317
46148 2770317 1583861 -261027 -776517 178446 1058760 1115134 803566 298962 -475030
46139 -475030 -625739 1049931 4116261 6647928 7367832 6492748 4735884 2795076 1537147
46130 1537147 1221461 728332 -977623 -2864648 -2945537 -1157606 723054 1943329 3371669
46121 3371669 4997419 5274770 3842491 2624564 2910176 3351641 2422044 967822 401927
46112 401927 84294 -1082065 -1749364 277985 4038190 5950682 4636368 2526600 1908279
46103 1908279 1910705 861216 -517200 -395747 967027 1675300 1417100 1972622 4107753
46094 4107753 5838817 4902267 1875216 -422127 -230548 1526418 2875024 3034439 2626180
46085 2626180 2369593 2355933 2504836 3032768 4050014 4887531 4322721 1877814 -1107069
46076 -1107069 -2213015 -324430 2869151 4487276 3721327 2633506 3242372 4823661
46068 4823661 5188155 3867300 2400177 1667668 851149 -447718 -887761 603426 2841560
46059 2841560 3873530 3516961 2883707 2175008 840028 -461119 -221139 1314046 1977813
46050 1977813 908034 35620 1048973 2539823 2131310 421418 400006 2976116 5390402
46041 5390402 4940665 2504564 933990 1109340 1403051 698177 14797 528324 1410051
46032 1410051 889436 -1127246 -2749897 -2443789 -763692 471412 55261 -1770144 -3667883
46023 -3667883 -4073751 -2420894 -1734 1047066 234324 -533371 423300 1966486 1680135
46014 1680135 -370588 -1427771 -88693 1427344 460847 -2099439 -2993744 -1093939
46006 -1093939 1383460 2215128 1719485 1307992 1220704 939373 708932 1186123 2089687
45997 2089687 2502595 2344669 2433322 3068795 3532251 3168001 2202769 1306324 976880 1472929
45987 1472929 2664643 3768692 3908524 3197214 2639275 2698836 2650161 1736816 320766
45978 320766 -634665 -685244 7638 1167463 2347318 2825754 2264172 1220231 459600
45969 459600 86061 -114034 12311 492284 477420 -910219 -3040888 -4124391 -3265872
45960 -3265872 -1337990 331001 1262669 1592307 1422066 878877 240004 -284322 -369261
45951 -369261 782542 3606127 6736837 7648511 5513111 2468576 1115618 1596078 2274264
45942 2274264 2550454 3387612 5151238 6539965 6290057 4919385 3961295 3948976 3886364
45933 3886364 2648310 445659 -1270148 -1292097 42078 1155984 872249 -422645 -1300297
45924 -1300297 -728979 1070174 2814281 3035850 1271392 -1223985 -2335464 -1121156
45916 -1121156 1271832 3014614 3427438 2953718 1955006 442557 -1235021 -2321465 -2344375
45907 -2344375 -1412675 -41473 855756 353903 -1228622 -1955649 -378951 2197394 2940467
45898 2940467 1057470 -1276675 -1865780 -853934 502904 1845044 3230668 3844224
45890 3844224 2870239 1184122 597025 1413399 2049797 1333799 72339 -184852 829304
45881 829304 1961024 2183190 1749650 1807378 3088143 5089006 6607416 7023613 6763107
45872 6763107 6413248 5857617 4681029 3060990 1684265 938044 711066 877879 1404911
45863 1404911 1982261 2116283 1720191 1200343 883824 756529 788380 1036789 1338130 1393054
45853 1393054 1311241 1580265 2297246 2944710 3196662 3394771 3808981 3956845 3278584 2142906
45843 2142906 1497481 1697205 2338286 3110104 4006601 4624993 4138531 2420854 603139
45834 603139 -9423 781337 2223355 3572854 4409408 4479176 3937562 3481482 3526174 3447452
45824 3447452 2427626 924701 336722 1074573 1962283 1955893 1536946 1744368 2585972
45815 2585972 3294219 3697677 4380335 5567260 6614323 6714161 5681879 4074490 2869461
45806 2869461 2840940 3829324 4769602 4807059 4193967 3778042 3955339 4519701 5114780 5373181
45796 5373181 5149833 5164791 6640908 9417746 11282654 10526337 8443094 7491585 7434517
45787 7434517 5695762 1835711 -971775 -232399 2326748 3467778 3001645 3145356 4296064
45778 4296064 4371969 2580058 1203309 2403184 4993379 6008033 4614059 2874984
45770 2874984 2736418 3575359 3313716 1274824 -970267 -1721520 -1369279 -1696568 -3133731
45761 -3133731 -3795498 -1838143 1997607 5114802 5935577 5097005 3989567 3208650 2646323
45752 2646323 2143986 1557754 785319 120292 33340 268716 -158268 -1487299 -2359819
45743 -2359819 -1334219 1030738 2628772 2457779 1824179 2362747 3684380 4006291 2779473
45734 2779473 1457176 1391138 2107328 2433436 2430911 2992336 3979415 4248066 3665477 3650047
45724 3650047 4999358 6311198 5622095 2959940 200937 -1231804 -1456722 -1091381 -297752
45715 -297752 799601 1634070 1805170 1804254 2517667 3969808 4966252 4312152 2343787 877521
45705 877521 1359505 3309310 4987004 5340079 4664928 3555169 2204246 973814 637893
45696 637893 1452379 2682354 3600563 4264552 4772656 4619408 3621966 2718851 2810520 3374497
45686 3374497 3329721 2832857 3026452 4248376 5664117 6565899 6894249 6512980 5204568
45677 5204568 3615964 3077132 3994556 5221203 5459212 4685665 3856002 3711166 4157825
45668 4157825 4448675 3849427 2444544 1202288 867514 1053459 974960 733208 1088199
45659 1088199 2187327 3390450 4260432 4911802 5455360 5852188 6183626 6388788 6116183
45650 6116183 5644831 6282563 8558990 10611489 10083754 7375760 5138581 4593455 4493538
45641 4493538 4058074 4505485 6544543 8431676 8193072 6381999 5016409 4818112 5031329
45632 5031329 5170573 5450316 5938364 6466802 7018684 7383527 7048521 6218692 6122189 7365135
45622 7365135 8811214 9081110 8280374 7187692 5789351 4033795 3084213 4031062 5869410
45613 5869410 6526807 5674663 4841746 4838250 4834383 4248662 3865414 4379053 5095532 4978081
45603 4978081 4242817 4096347 5148853 6569904 6835140 5307802 3116569 2141313 2942298
45594 2942298 4235368 4765346 4908268 5669403 6839046 7265798 6583500 5558611 4872570
45585 4872570 4548090 4558307 5163217 6536993 8494688 10388523 11025063 9449800 6468071
45576 6468071 4544114 5254879 7593634 9712383 11304508 12971295 14392161 15055191
45568 15055191 16072227 19128264 23983035 29141416 34661589 41635904 48514860 50717076
45560 50717076 45350918 34656385 23610966 15543733 10995152 9101024 8449224 7593781
45552 7593781 6252428 5544723 6158083 7008195 6650025 5303741 4465940 5011473 6567816
45543 6567816 8330926 9618496 9848505 8750724 6723227 4744232 3875939 4551603 5914275
45534 5914275 6261257 4957559 3520751 3682551 4763252 4582084 2907226 2036295 3421931
45525 3421931 5610096 6496304 6014309 5430009 5359996 5767983 6761108 8062437 8617233
45516 8617233 7964217 7212066 7553150 8604713 9269934 9375455 9323563 8970674 8129814
45507 8129814 7569122 8310864 10330791 12757853 14731732 15404659 14152405 11758941 10287656
45498 10287656 10585045 10969153 9683297 7512090 6392621 6489386 6529870 6291167 6744560
45489 6744560 8082166 9411962 10205811 10482523 9928876 8497661 7465928 8051635 9255610
45480 9255610 9034784 7504462 6903430 8210755 9848500 10203030 9551766 8854551 8331062
45471 8331062 7987289 8080216 8318078 7923192 7174109 7583357 9776067 12359415 13698906
45462 13698906 13825398 13827678 14199614 14486517 13976938 12390562 10479469 9885442 11380503
45453 11380503 13337163 13366633 11637289 10936639 12936794 16058384 17888523 18171795 18215087
45444 18215087 18555067 18617727 18006727 16948758 15806082 14878874 14295696 13663940 12419570
45435 12419570 10839058 9920684 9972368 10245588 10200414 9948880 9182259 7256270 5027016
45426 5027016 4870793 7615596 10844658 11722653 10428776 9271567 9316039 9604032 9252364
45417 9252364 8693964 8791155 9758978 10983929 11371662 10288270 8622487 8149384 9274747
45408 9274747 10430530 10419715 10042531 10302914 10439442 9356634 7820095 7314544 7595990
45399 7595990 7388971 6832953 7082392 7912100 7979667 7333971 7413958 8459164 9156153 9131321
45389 9131321 9477403 10226301 9669196 7251675 5025077 4845239 5932597 6714642 7404627
45380 7404627 8890730 10387378 10351723 9042654 8114640 7960640 7404749 6089618 5300386
45371 5300386 5882906 6878098 7059895 6667898 6587037 6611470 5756178 4048436 2867176
45362 2867176 3273507 4829007 6448885 7715727 8743555 9337697 9239905 8966436 9314997
45353 9314997 9962730 9739546 8710460 8710400 10865848 13619056 14497103 13153721 11272845
45344 11272845 9992308 9072357 8416487 8548538 9189034 9020911 7633607 6382983 6472652
45335 6472652 7325874 7821042 8147329 9278064 11232773 12950511 13527887 12740274 10762302
45326 10762302 8279441 6563683 6474697 7392196 7812766 6989158 5499649 4369114 4150881
45317 4150881 4722398 5493852 5935971 6229927 7069603 8448796 9210091 8509616 7243309
45308 7243309 7031983 8025866 8834471 8685835 8461124 9121807 10166592 10517184 10255841
45299 10255841 10403668 11190468 11639930 11120014 10388208 10487111 11227483 11613186 11474303
45290 11474303 11682894 12664830 13703508 14140249 14301626 14480386 13885533 11827098 9450710
45281 9450710 8820107 10225500 11759994 11910124 11298404 11262546 11920394 12627514 13430811
45272 13430811 14763067 16061100 15993244 14322584 12705319 13092827 15536791 17922127
45264 17922127 18055622 16009619 14076787 14167061 15763052 17118783 17891670 19207359 21202008
45255 21202008 22286376 21611341 20735599 21554997 23607300 24856139 24513786 23704345 23702979
45246 23702979 24806994 26739833 28962354 30634390 31314892 31701437 32814245 34563910
45238 34563910 35963481 36536473 36610942 36499302 36412404 36912535 38274396 39558962 39574166
45229 39574166 38706079 38493087 39307749 39793119 38817604 36695260 34183354 31610420 29457722
45220 29457722 28515933 28799821 29300241 29299419 28944795 28222338 26651701 24474942 22747999
45211 22747999 21611345 19978092 17791937 16903022 18309151 20011585 19447688 17064558
45203 17064558 15559646 16183585 17686137 18591314 18629859 17933732 16598555 15346261 15124065
45194 15124065 15679277 15841086 15519713 16026573 17883352 19653504 19788251 18626044 17651338
45185 17651338 17486164 17513296 17054511 16128483 15208769 14754341 14887008 15263217 15406346
45176 15406346 15235194 14980215 14637282 14037756 13456393 13403380 13607771 13054224 11565281
45167 11565281 10635502 11868202 14901316 17681835 18770433 18686167 18743468 19107320 18629357
45158 18629357 16652659 14384914 13836172 15485501 17771377 19150490 19799092 20626332
45150 20626332 21491514 21638187 21433631 22158682 23969647 25478019 25808236 25881417 27031060
45141 27031060 29335366 32014339 34632119 37148192 39413287 41275621 42696941 43417372
45133 43417372 43264810 43105176 44351282 46899248 48811419 49024422 49088587 50816111 53326710
45124 53326710 54260364 53221335 52021395 51828697 52155432 52698937 53987910 55615433 55837303
45115 55837303 53977019 51679292 50656225 50519395 50038363 49301502 49160015 49486715 49656990
45106 49656990 50199169 52226060 55360638 57962177 59840505 63324883 70715835 81305087
45098 81305087 91547267 97767221 98307173 93632392 85308614 75188526 65176031 57061666
45090 57061666 51919366 49448545 48262760 47155848 45917171 44802483 43776970 42800835
45082 42800835 42342500 42731144 43213160 42656954 41317508 40929468 42612378 45445181 47689696
45073 47689696 48859358 49957593 52087207 55457594 59459388 63066183 65359269 66333132
45065 66333132 67149646 69016552 71806879 74296264 75709217 76413177 77062004 77758849 78254895
45056 78254895 78291243 77441909 75288619 72176061 69173149 66789242 64357369 61286427
45048 61286427 58211053 56000585 54224634 51771263 48638587 45787885 43315452 40241179
45040 40241179 36387192 33029851 31100097 30045793 29260314 29382382 31090155 33591708
45032 33591708 35470411 36218545 35841372 33925995 30587043 27544753 26476331 26678706
45024 26678706 26119889 24561992 23746835 24486671 25590547 26022223 26118791 26043940 25052835
45015 25052835 23296048 22459031 23260219 23957748 22888126 21030854 20297177 20540974 20280774
45006 20280774 19414636 18997846 18941179 18310137 17730994 19021657 22013699 24035884 23508899
44997 23508899 22197312 22685956 25085881 27609438 29314744 30760850 32540948 34644721
44989 34644721 37178036 40500426 44399884 47995722 50914666 54084623 58830924 65279478
44981 65279478 72156080 78463896 85064006 94073489 106823489 123087881 142107450 162811775
44973 162811775 182165491 194742071 195887072 185276522 166437599 143551066 120153918
44966 120153918 99792785 84892107 74359527 64733494 54825389 47289458 44424424
44959 44424424 44444354 43725151 41261731 38889911 38118359 38792700 40248132 41753332 42118337
44950 42118337 40774812 39168965 39306198 40889954 41662374 40687342 39345796 38597635 37305327
44941 37305327 34435126 31289042 29929205 30293268 30443736 29267649 27537146 26385592
44933 26385592 25979559 25937985 26061230 26135776 25677241 24512530 23330936 23015770 23376519
44924 23376519 23089260 21254089 18677132 17045326 16917360 17228560 16975827 16583693 16949270
44915 16949270 17750553 17743623 16639505 15685329 16067723 17417643 18307577 17838039 16433996
44906 16433996 15355826 15601579 17001189 18255771 18163626 16919357 15902056 16085454 16977824
44897 16977824 17245696 16088315 13908703 11941054 11310920 12149035 13499395 14289377 14322121
44888 14322121 14008303 13364411 12026501 10356913 9660879 10694809 12470913 13274668 12686896
44879 12686896 11897749 11941876 12300672 11778785 10500425 10261852 12424849 15819912 17558206
44870 17558206 16157201 13189034 11331655 11375769 11962749 11894281 11566336 11937834 13047588
44861 13047588 14121661 14657747 14921614 15578358 17023039 18844810 19984252 19875798 19394816
44852 19394816 19995597 21803463 23387320 23786993 23906246 25176133 27466291 29259853
44844 29259853 29659027 29352703 29605815 31056374 33665306 37115663 40772155 43717001
44836 43717001 45604634 47597818 51843317 59503135 69581096 80338423 91751046 105666435
44828 105666435 123363461 144130332 166819971 191087310 215046308 232572080 235962172
44821 235962172 222577154 197521446 169065070 142794912 120666615 103228686 90308860
44814 90308860 80405041 71712642 63920278 57780046 53266252 49531008 46334183 44002131
44806 44002131 42150357 39993058 37834540 36580030 35669932 33371700 29667876 27027567
44798 27027567 27252330 28975216 29525491 28210965 26482663 25653503 25756137 26154691 26113394
44789 26113394 25114716 23640930 23236426 24670697 26355922 25865383 22997354 20101233
44781 20101233 19179296 19849010 20579985 20775427 20780086 20618509 19832256 18414035 17061130
44772 17061130 16355563 16202237 16246092 16448648 16934186 17407192 17091872 15498124 13213119
44763 13213119 11664077 11862940 13423006 14967137 15457570 14973730 14300734 14089236 14499337
44754 14499337 15353238 16331160 17039879 17115113 16462215 15496911 15060189 15810696 17504510
44745 17504510 19023445 19370359 18616162 17714983 17502035 18095515 19119425 20090970 20550568
44736 20550568 20223651 19297432 18380036 18049114 18462580 19264466 19671409 18931899 17214602
44727 17214602 15883282 16194252 17718812 18858933 19024983 19256880 20291680 21250681 21153974
44718 21153974 20596488 20537623 20309363 18640428 16247105 15353702 16474059 17661137 17491742
44709 17491742 16830656 16733468 16602729 15903296 15933339 17846537 20137775 20380800 18787186
44700 18787186 17741289 18113411 18406985 17688597 16995595 17203191 17623145 17669325 18003430
44691 18003430 18793339 18517275 16081957 12937423 11460502 11997608 12944361 13115802 12604857
44682 12604857 11744869 10654828 9663059 9003316 8215008 6895816 5877208 6536822 8942251
44673 8942251 11643405 13297498 13580133 12561550 10338155 7631270 5850326 5951831
44665 5951831 7517247 9151317 9602726 8661671 7353818 7060345 8035463 9095336 9197675
44656 9197675 8757764 8689934 8864043 8739812 9042414 11114827 14432801 16420884 15541636
44647 15541636 13399344 12787529 14397605 16472623 17314567 17104877 17134052 17937041 18695353
44638 18695353 18446945 17503695 17199687 18196769 19632053 20275592 19893605 18917980 17530527
44629 17530527 16025898 15399743 16221721 17296086 16990407 15798152 15831802 17459869 18283063
44620 18283063 16318091 12637104 9674549 8203164 7412540 7024338 7647048 9349408
44612 9349408 11296733 12811380 13780756 14098304 13679636 13009741 12728762 12592273 11717813
44603 11717813 10028406 8608643 8305868 8711156 8988178 9106578 9609833 10521838 11275349
44594 11275349 11769405 12777505 14873699 17376150 18943808 19076310 18454421 17877547 17580211
44585 17580211 17670956 18361385 19391368 20101921 20620972 22037931 24602396 26701908 26766009
44576 26766009 25450546 24728680 25520361 27512867 30476423 34084968 37204438 39358587
44568 39358587 42279095 47847180 55406198 64070520 76631808 96193556 117957052 130020562
44560 130020562 126419428 115835896 112409393 119466465 126971252 124464761 111828843 96536326
44552 96536326 84605655 76689461 70523082 64344397 58248177 53559212 51000706 49475091
44544 49475091 47227427 43950608 40706978 38009525 35353320 32664749 30740392 29865530
44536 29865530 29194092 27942143 26272747 24700167 23434234 22481932 21661901 20542075
44528 20542075 19109483 18253018 18649176 19483985 19391531 18370862 17541183 17272115 16973987
44519 16973987 16621342 16941795 17883725 18243949 17208916 15336582 13837455 13586495 14643096
44510 14643096 16010560 16344909 15646161 15363659 15945326 15767349 13996133 12748348 14140098
44501 14140098 16862664 18530493 19848567 23010943 27401992 30955489 34526819 40284436
44493 40284436 47364596 55477014 71436383 102184512 138376497 155100933 136971865
44486 136971865 96757538 61278892 43271242 35470098 28327163 21862384 19075212
44479 19075212 18174077 16230980 14151923 13384353 12115851 8787607 5870856 6294858
44471 6294858 8724099 9814179 9068442 8310135 8046394 7382933 6397531 5993436 6226340
44462 6226340 6815911 8289101 10650009 12033880 10823425 8232824 6714175 6562853
44454 6562853 6225480 5334789 5058690 5526096 5204922 3396643 1613679 1655260 3392482
44445 3392482 5134593 5507924 4546812 3444578 3495699 4896684 6487770 6997351 6453793
44436 6453793 5953974 6162966 6591033 6418050 5568133 4724824 4478750 4706817 4854950
44427 4854950 4669122 4347666 4002881 3533994 3258020 3876563 5168045 5553806 4107676
44418 4107676 2355993 2543790 4392656 5353213 4248373 2853142 3220844 5056847 6695002
44409 6695002 7372112 7454862 7399635 7526635 8089183 8714774 8457207 7132328 5941168
44400 5941168 6146533 7770900 10018119 12165242 13676725 14412508 15097636 16638118 19044307
44391 19044307 22588373 29671593 42386648 56994685 64184235 57965014 42672468 28337880
44383 28337880 20483960 17388019 15788442 14822600 14090537 12163928 8981465 6892156
44375 6892156 7235481 7938849 6576941 4171054 3623692 5362834 6961479 6885957 6389635
44366 6389635 7137420 8746779 9856325 10475876 11630441 12955653 12490025 9671833 7080948
44357 7080948 7502043 9931539 10621787 8205269 5480255 5176954 6218740 6036437 4811159
44348 4811159 4854099 6654006 8216162 8226587 7492185 6958931 6436494 5833010 5767920 6244890
44338 6244890 6311728 5705193 5336367 5533685 5404640 4709382 4705421 6027529 7220510 6771810
44328 6771810 5463890 5217353 6375791 7590469 7931173 7756477 7627774 7458398 6866067
44319 6866067 5760908 4550140 3955932 4250851 4512450 3400142 1115368 -273143 783474
44310 783474 3298116 4994736 5032238 4518130 4633769 5277723 5637729 5329936 4652677
44301 4652677 4058936 3688974 3486695 3637268 4437763 5475296 5588043 4414683 3381712
44292 3381712 3936651 5225048 5141749 3571589 2615936 3239347 3843714 3118004 2221357
44283 2221357 2660794 3810524 4364675 4730318 5849377 6806176 5982804 3978483 3096905
44274 3096905 4153416 5778347 6677600 6634566 5492451 3296555 1517472 1981600 4214727
44265 4214727 5769641 5543177 4856653 4962060 5675031 6974921 9431052 11981796 11871330
44256 11871330 8543247 5365946 5323689 6903658 6825285 5253234 5099907 6937594 8131936
44247 8131936 7358960 6748040 8336153 11003442 12592307 13024242 13327048 13064759 11028881
44238 11028881 7780171 5331946 4420490 3931288 3134509 2714946 3163816 3832651 4372525
44229 4372525 5606065 7821211 9452054 8977378 7332674 6772542 7745800 8645967 8602500
44220 8602500 8641514 9618001 10786520 11343252 11804374 12580218 12583563 10984534 9330036
44211 9330036 9787721 11668868 11934337 9406820 6387161 5369027 6083438 6972338 7837014
44202 7837014 9244124 10505226 10392184 9394928 9174013 9754372 9337633 7408775 5999223
44193 5999223 6742263 8411013 9001417 8891112 9818701 11553788 12106818 11208188 10956937
44184 10956937 12282907 13303547 12691642 12382536 14601689 17850865 18736621 16929770
44176 16929770 15157208 14415709 12671163 9272934 7332570 9504194 13723684 15828175
44168 15828175 15082609 14421059 15768342 17678144 17851896 16033417 13749020 12373255
44160 12373255 12030645 11849892 11153291 10563351 11288816 12881301 12942489 10276054 7191434
44151 7191434 6893087 9279335 11245412 10742857 8608707 6679911 6175457 7765871 10868300
44142 10868300 12659332 10323402 5096044 1829270 3460489 7851702 11143803 12151529
44134 12151529 12024191 11601215 11148469 11361008 12546913 13529138 12969157 11161086 9290085
44125 9290085 7850953 7102626 7906378 10377266 12679424 13128566 12811217 14069727 16840124
44116 16840124 18682457 18370781 17255207 16716530 16351127 15497410 14840692 15320776 16536285
44107 16536285 17344865 17396293 17158537 16826207 16007273 14454565 12643600 11445653 11196411
44098 11196411 11144110 10158522 8140652 6252094 5440457 5334939 5069560 4490840 3863678
44089 3863678 3131700 2400685 2459970 3684215 4995855 5202887 4894561 5548187 7032900
44080 7032900 7608262 6469858 4802211 4031400 4319632 5050514 5564015 5144610 3555067
44071 3555067 1961190 2101830 4052914 5903749 6137117 5336952 5097398 6174165 8066822
44062 8066822 9506666 9177717 7082953 5370438 6438286 9886480 12826986 13633052
44054 13633052 13616265 14238341 14687878 13711573 12128988 11509978 11476854 10484901 8687072
44045 8687072 7859339 8560926 9348417 9131985 8595944 8623244 8669557 7639785 5608321
44036 5608321 3833528 3386999 4262655 5620247 6580610 6874885 6820089 6639374 6070132
44027 6070132 4973177 4042998 4258135 5555461 6620922 6320747 5064730 4420761 5421716
44018 5421716 7516514 9349370 10385726 11310289 12690059 13845997 13630981 11937183
44010 11937183 9719674 7861055 6885608 7403546 9464879 11449651 11183794 8728678
44002 8728678 6661992 6771493 7777681 7427731 5681698 4395360 4619609 5738926 6912286
43993 6912286 7912244 8506901 8141073 6498953 3870014 1082179 -590225 -104648 2037068
43984 2037068 3796341 3810538 3003227 3057312 4033288 4785595 5151938 6176716 8342964
43975 8342964 10982661 13351682 14976274 15096074 13290817 10746646 9385217 9451702 9369380
43966 9369380 8278210 7173451 6957305 6921334 6188925 5468980 6103978 8012629 9722585
43957 9722585 10234275 10024587 10164836 10876715 11135993 9874638 7697736 6800689 8394871
43948 8394871 10710321 10804818 8197770 5270689 3947262 3607952 2861582 1793001 1402464
43939 1402464 1978622 3127800 4531323 5687015 5769958 4798687 4142713 4765914 5712048
43930 5712048 5567210 4777395 5052944 6756432 8326832 8376009 7160844 5765627 4840290
43921 4840290 4468665 4481502 4522566 4326940 4152066 4502558 5354717 6117123 6401737 6365405
43911 6365405 6267338 6187600 6242159 6584336 7063293 7266860 7001217 6433497 5816764 5484785
43901 5484785 6034175 7892068 10529389 12645762 13465662 13471929 13526344 13662974 13323737
43892 13323737 12619534 12582405 13805449 15381674 15903138 15356176 15188165 16257938 17546977
43883 17546977 17541249 16276100 15130679 14958242 15432306 16133880 17203565 18706725 20265879
43874 20265879 21631138 22870123 23816176 24204696 24569108 25932982 28139979 29548704
43866 29548704 29092408 27725940 27052043 27391401 28112641 29021942 30283752 31565458 32440696
43857 32440696 33233162 34324564 34974389 34073109 31967443 30353096 30237128 30982063 31492823
43848 31492823 31435952 31093039 30831140 30977831 31569039 32046039 31823233 31312251 31792560
43839 31792560 34072237 37668912 41223569 43150780 42104275 37872291 32195818 27891726
43831 27891726 26486735 26968010 27201489 26282449 25123854 24931319 25599289 25900691 25143842
43822 25143842 24131676 24026456 24611491 24572481 23533025 22689776 22938471 23480831 23176900
43813 23176900 22346011 22093931 22563695 23076147 23419930 23687563 23340798 21933328 20461769
43804 20461769 20451964 21839462 23281835 24392033 25829701 27110061 26464275 23608761 20788986
43795 20788986 20000155 20644017 21007792 20705723 20497448 20944713 22517842 25829261 30203531
43786 30203531 32929759 31714357 27552974 23738192 22282529 22630393 23534769 24478411
43778 24478411 24966670 23987882 21144391 17617166 15170456 14340023 14034445 12927141 11021231
43769 11021231 9648593 9835981 10967834 11580383 11344555 11427679 12680491 14369894 15233522
43760 15233522 14999354 14194007 13180897 12241009 12035002 13004097 14568062 15708136 16169652
43751 16169652 16522542 17360306 18941891 21059129 22594852 21950089 18992383 16107369
43743 16107369 16082991 19043699 22458593 24024441 23523245 21977992 20200436 18477856
43735 18477856 16850442 15363569 14436906 14785313 16365560 17798224 17771583 16726051 16088814
43726 16088814 16120936 15825436 14890266 14226664 14315175 14432168 14031729 13675774 14002708 14835876
43716 14835876 15865703 17158842 18391096 18618428 17536005 16150013 15693755 16763755
43708 16763755 19767027 24725027 29893441 32193191 30361936 26552814 23619401 22119933
43700 22119933 21402199 21979474 24394599 26689894 25902627 22138609 18626729 17274103
43692 17274103 16525105 14438195 11637239 9858677 9340495 9246478 9410847 10034101 10464689
43683 10464689 9768088 8067641 6265062 4957145 4491246 5307414 7190065 8955476
43675 8955476 9961520 11048620 12729253 13455788 11437795 7534593 4489210 3690173
43667 3690173 4511233 6364040 9121295 11608287 12196335 11355875 11331081 12824650 14571660
43658 14571660 16831476 21990831 29855880 35476243 34648413 29431753 24979418 22617150
43650 22617150 19784869 15730460 12878812 12289338 11843662 10189208 9021918 9696484
43642 9696484 10533612 9705920 8412169 8660426 9678209 9267987 7661195 7267449 8876540
43633 8876540 10511047 10329377 8810755 7533016 7150176 7224778 7189991 6854130 6309022
43624 6309022 5706499 5166648 4989349 5760807 7655996 9669200 10425953 9950448 9662537
43615 9662537 10418450 11755748 13325536 15423183 17445848 17727723 16158545 15221056 16874116
43606 16874116 20007090 22609193 24609448 26534834 27517773 27596688 30047892 37651385
43598 37651385 48356362 59661033 76071582 104528303 139649845 160788591 151234050
43591 151234050 118504844 89221761 82896397 94589861 103924940 96890705 76445826
43584 76445826 54961135 40832224 33269004 27298705 20689583 15077019 12056285 10680214
43576 10680214 9261653 7708768 6751376 6096849 4938170 3596183 3105256 3511318 3965249
43567 3965249 4241613 4758034 5214501 4704235 3353014 2457799 2572012 2661991 1774276
43558 1774276 573768 509088 2087220 4550803 6743046 7836156 7748458 7322716 7593124
43549 7593124 8414442 8388472 6767477 4865979 4653548 6198191 7549922 7260198 5985398
43540 5985398 5162453 5085449 5166947 5375185 6150575 7141474 7421965 7202767 7944679 10067426
43530 10067426 11735997 10994445 8267197 5612515 4217660 3908155 4467736 5786227
43522 5786227 6934091 6807583 5862209 5692642 6636119 7264586 6579698 5193696 3906579
43513 3906579 2766197 2229120 3507531 6569969 9198406 9433806 8003259 7085945 7498229
43504 7498229 8241236 8082644 6538658 4019421 1928400 1794189 3430389 4906396 5127711
43495 5127711 5098471 5590016 5309167 3184687 963496 1175496 3431350 5144010 5355790
43486 5355790 5412275 6109784 6668780 6717184 7036518 7896994 8529450 8616766 8618953 8447504
43476 8447504 7572171 6525043 6407751 6854904 6576651 5986395 6854887 9035884 10241041
43467 10241041 9813068 9955509 12115430 14988834 17602674 21310814 26357102 29184471
43459 29184471 26418265 19898554 14609270 12676588 12374876 12130782 12149782 12230437 11205930
43450 11205930 9189392 7849605 7781609 7801645 7455115 7940541 9589567 10583943 9593676
43441 9593676 8005265 7902981 9027372 9435455 8498426 7586960 7878470 8826260 9179652
43432 9179652 8743546 8561667 9473112 10865542 11249475 10132870 8723141 8238578 8166186
43423 8166186 7268758 5934335 5976550 7869015 9788354 10228003 10127867 11047407 12310472
43414 12310472 11921568 10080531 9668675 12385453 15928482 16514365 13518861 9949168
43406 9949168 8278764 7547038 5519287 2349460 343129 553510 1577784 2086884 2674353
43397 2674353 4097430 5227374 4534896 2836804 2585356 4417086 6123033 5523185 3031732
43388 3031732 717454 -113782 398724 1593948 2912647 3856405 4057901 3530137 2734652
43379 2734652 2472231 3467047 5516259 7175989 7083935 5685599 4790651 5204481 5791602
43370 5791602 5340553 4285646 3726100 3617241 3100548 2156926 1736542 2342527 3462446
43361 3462446 4419767 4981674 5153344 5180582 5718095 7091061 8353263 8121346 6604721
43352 6604721 5718381 6634956 8236632 8791494 8267705 7915833 8249098 8780145 9414144
43343 9414144 10581084 11867463 12020953 10884022 10026738 10603764 11689911 11856932 11491827
43334 11491827 12128179 14025878 15998003 17441104 18807839 19825995 19092150 16393118
43326 16393118 13974803 14089344 16119528 17543757 17229445 16287807 15841223 15528542 14664562
43317 14664562 13654607 13472500 14415738 16031118 17739746 18867061 18504053 16268402
43309 16268402 13248436 11390566 11487385 12168290 11413831 8926067 6420311 5501000 5938268
43300 5938268 6493146 6800101 7503237 8770135 9798461 10050405 10004944 10198383 10333099
43291 10333099 9926640 9126767 8259246 7306978 6553148 6894979 8518480 10087957 10612652
43282 10612652 11452499 14657620 19463376 22431406 21584063 18623171 16161500 14417741
43274 14417741 12113555 9428248 8090499 8770463 10061977 10424358 10014404 10095670 11369695
43265 11369695 13390239 15170338 15931838 15514425 14402638 13279758 12412316 11583067 10689439
43256 10689439 10172687 10614536 11959638 13345382 13805016 13113769 11918819 11078568 10914071
43247 10914071 11059210 10950575 10449078 10007049 10147313 10723250 10936541 10394861 9925403
43238 9925403 10725762 12664740 14139086 13954340 12725856 11940041 12194877 12953809 13492014
43229 13492014 13344878 12301964 10861462 10340314 11503550 13251882 13742606 12799970 12115691
43220 12115691 12923877 14598297 15861072 16246759 15820234 14516380 12655663 11416858
43212 11416858 11794665 13271886 14184090 13373990 11215874 9210920 8735848 9843405 11099429
43203 11099429 10918801 9153859 7038157 5715741 5456981 6156735 7603100 9099172
43195 9099172 9849906 10080654 10813985 12159217 12884864 12240883 11133082 10741715 10945832
43186 10945832 10956528 10611911 10127967 9393600 8479296 8084638 8522001 9046918 9198154
43177 9198154 9887257 11893677 14135790 14987804 14709467 14878007 15728857 15812819 14348519
43168 14348519 12355698 11184866 11167308 11903979 12745387 12878057 12051724 11253787 11551662
43159 11551662 12409542 12496351 11997189 12418163 13974198 15064958 14891088 14761740 15910347
43150 15910347 17617789 18540860 18433528 17411950 15011180 11520895 9078607 9586157
43142 9586157 12089609 13836502 13617761 12621594 12202525 12311156 12321001 12204516 12452965
43133 12452965 13488353 15314235 17235248 18032431 17104447 15433550 14794139 15929756
43125 15929756 17933013 19333101 19346238 18184024 16632107 15379682 14610338 14384311 15201137
43116 15201137 17302193 19312697 19021766 16462104 14883817 17019838 21183357 23004461
43108 23004461 20769972 17065202 14992192 14815804 15060715 15056027 15080406 15201048 15339395
43099 15339395 15814113 16775296 17745076 18683110 20753655 24743917 29133723 31117838 29603710
43090 29603710 26125740 22684881 19747599 16746220 13617779 11092814 9814454 9753593
43082 9753593 10436897 11418854 12485962 13555513 14528201 15389597 16435598 18071666 20156149
43073 20156149 21789976 22080012 20977221 19133715 17190803 15530611 14398022 13719236
43065 13719236 12960392 11720307 10387274 9707498 9840438 10416482 11315489 12544600 13410371
43056 13410371 12903652 11250817 10100360 10611802 12201679 13784984 15306227 17079841
43048 17079841 18412916 18211523 16665028 15107429 14246652 13585178 12592407 11409336 10328592
43039 10328592 9620259 9957578 11827496 14234025 15216096 14172972 12534004 11528483
43031 11528483 10562777 8749070 6826481 6166627 6638046 6928561 6582582 6359359 6829263
43022 6829263 7930476 9722632 12154214 14071866 13972752 12120580 10586201 10624298 11173490
43013 11173490 10641643 9114413 7888348 7616599 7947524 8538344 9393298 10248019 10418444
43004 10418444 9556790 8304872 7981211 9420226 11933929 13681407 13506660 12148180
42996 12148180 11027576 10268286 9003804 7373462 6589863 6715018 6143032 4246756 2932925
42987 2932925 4063999 6517704 7604601 6669132 5353598 4653232 3858200 2714933 2573853
42978 2573853 4303609 6439966 6768999 5146343 3609680 3852816 5410500 6446524
42970 6446524 5865081 4423382 3851905 5038596 7303871 9443752 10912438 11585769 11078083
42961 11078083 9311924 7439705 6940409 7672809 8019150 7308604 6837635 7736609 8966852
42952 8966852 8648109 6708539 4891963 4381386 4702414 5062734 5524598 6338717 7084135
42943 7084135 7234639 6989065 6803034 6580299 6185084 6353806 7881823 9881581 10272655
42934 10272655 8656816 7379714 8477379 10580815 10646071 8265579 6094467 5858844
42926 5858844 6371391 6452915 7317844 10031769 12573916 12294729 10267310 10031747 12206190
42917 12206190 13656542 12704125 11829611 13382997 15371460 14278409 10413803 7418461
42909 7418461 7059484 7432226 6589122 5373012 5564175 7022432 8124017 8095919 7573662
42900 7573662 7187951 6737763 5961839 5405560 5926777 7378103 8309539 7484115 5503019
42891 5503019 4217211 4490758 5468490 6326748 7468343 9062366 9659732 7967701 5396707
42882 5396707 4889136 7127803 9655233 10169585 9080098 8111535 7898714 8039505 8354590
42873 8354590 8809927 8910841 8350770 7786989 7963361 8501680 8558358 8291840 8601996 9601641
42863 9601641 10371713 10222024 9341085 8206229 7141037 6455757 6277666 6245595 6078231
42854 6078231 6349336 7851924 10196168 11942157 12259638 11643773 10926551 10520006 10719809
42845 10719809 11563246 12011622 10545485 7316080 4590650 4120076 5062628 5620609 5717834
42836 5717834 6476864 7707923 7889308 6696364 5694656 5945915 6521293 6340684 6166115
42827 6166115 7398081 9649509 11008535 10553844 9299246 8413330 7650203 6252169 4703355
42818 4703355 4543534 6368690 8799962 9973655 9684617 9321297 9701463 9918965 8922423
42809 8922423 7470733 7396914 9096858 10868184 10980484 9492201 7670273 6479547 6184458
42800 6184458 6708724 7675613 8488891 8871602 8961840 8628121 7386262 5421947 3889181
42791 3889181 3560606 3959669 4501000 5481689 6902590 7379364 5853884 3737889 3475742
42782 3475742 5160784 6462070 6025430 5009928 4773378 4959940 4791033 4537037 4511336
42773 4511336 4100634 3228911 3490131 6059457 9324124 10470966 9080227 7429677 7349864
42764 7349864 8451451 9627121 10636535 11523926 11729480 10757741 9120046 7860152 7416174
42755 7416174 7382583 7180768 6689480 6332781 6596835 7354822 7887686 7820446 7612334 7607086
42745 7607086 7127945 5439721 3292177 2348067 3068097 4314759 5218399 6177262 7538796
42736 7538796 8537110 8393805 7523233 6690552 5766542 4417780 3410558 3881557 5470403
42727 5470403 6439632 5848629 4593928 3977048 4164492 4591118 5100692 5850597 6471145
42718 6471145 6270398 5406964 5099150 6140345 7597015 7721443 6225403 4907964 5488477
42709 5488477 7301731 8003241 6496374 4229154 3242640 3749840 4352747 4148521 3705132
42700 3705132 3964844 4913330 5639345 5410769 4489903 3947328 4613503 6118433 7156986
42691 7156986 6880195 5780992 4984868 5009378 5563655 6141366 6243470 5413838 3880737
42682 3880737 2954896 3803210 5775201 6971750 6728819 6429457 7279666 8388411 8086517
42673 8086517 6352151 4627369 3640262 2839284 1996283 1910483 2969748 4146355 4270853
42664 4270853 3609765 3334339 3836254 4364291 4168183 3377223 2783332 3148187 4597050
42655 4597050 6373335 7407785 7443676 7297735 7691076 8296466 8438089 8182050 7971455
42646 7971455 7648717 6810867 5817783 5331361 5020153 3989075 2515503 1911017 2335088
42637 2335088 2340205 1392870 1288322 3617321 6870393 7828476 5545966 2443112 1333469
42628 1333469 2533258 4201944 4683709 4064182 3722057 4542436 5736239 5935188 5348506
42619 5348506 5595504 6929974 7262019 5239847 2747896 2275333 2984213 2111507 -264423
42610 -264423 -1042409 948778 3007965 2791108 1581893 1462652 1758904 851499 -334897
42601 -334897 378817 2648883 4054363 4010558 4498901 6611901 8755678 9042597 7681917
42592 7681917 6213792 5786139 6860435 9270971 11707439 12174665 9934405 6507558
42584 6507558 4192051 3951558 4966451 5736214 5434724 4614147 4577818 5691496 6717060
42575 6717060 6492917 5679879 5727817 6615497 7056959 6652305 6195764 5953914 5449624 5072922
42565 5072922 5942911 7773375 8899741 9021543 9713940 11276862 11488509 9108214 6436373
42556 6436373 6261367 8022185 9351675 9866840 10635963 11025599 9349032 6376354 4983259
42547 4983259 5841980 6329969 4634805 2372864 1784833 2494839 2754324 2284839 2017747
42538 2017747 2029328 1558649 660065 351607 1159559 2530299 3718985 4574155 5371009
42529 5371009 6203236 6554646 5598491 3381955 1539936 1913529 4303878 6552435 7131712
42520 7131712 6650256 6427422 6727929 7028456 6937244 6075459 4065184 1495194 -69863
42511 -69863 43784 708006 893047 1346068 3093631 5339660 6503711 6595235 6750818
42502 6750818 6895172 5839584 3675786 2177920 2434382 3595052 4387591 4542856 4315338
42493 4315338 3866344 3595809 3964684 4586537 4551482 3892403 3522610 3529117 3036488 2164433
42483 2164433 2376586 4047908 5383832 4970921 3887169 3794698 4279392 3919800 3050943
42474 3050943 3424528 5479911 7743387 8821872 8470707 6874104 4484238 2546680
42466 2546680 2160860 2662055 2455585 1588959 1786653 3554287 5079381 4838288 3672130
42457 3672130 3195546 3561507 4052289 4614412 5320052 5336029 4112660 2889180 3259933
42448 3259933 4689396 5280194 4779047 4766742 5641630 5618288 3692728 1706912 1887931
42439 1887931 3602183 4359233 3352718 2148079 2010412 2353355 2246838 1949452 2112104
42430 2112104 2508633 2543165 2410060 2805393 3758598 4534823 4623047 4249141 3951986 4080204
42420 4080204 4626509 5215112 5421199 5412956 5937957 7226712 8346793 8320560 7460007 6676132
42410 6676132 5842856 4159359 2102439 1428989 2665052 4034593 3862685 2850764 2750606
42401 2750606 3794060 4932887 5864419 7025326 7901895 7274158 5346609 3891432 3790998
42392 3790998 4051088 3912741 4263950 5819939 7361234 7371423 6504383 6738648 8539261
42383 8539261 10438922 11228768 11017909 10100168 8385304 6431149 5624986 6460924 7593902
42374 7593902 7553810 6772040 6939026 8676264 10800756 11921443 11937979 11564460 10883091
42365 10883091 9113754 6020771 3006043 1996821 3093590 4129879 3252159 1371767
42357 1371767 1024414 3021098 5480122 6392667 5863325 5153379 4686974 4155317 3833364
42348 3833364 4398491 5669326 6799632 7761140 9397231 11664642 12971246 11998242 9427703
42339 9427703 7047557 5618554 4492688 3154478 2228885 2632502 4189559 5554474
42331 5554474 5591351 4721671 4658492 6488805 9064650 9826699 7542763 3829593 1493511
42322 1493511 1642178 2988012 3774267 3564330 2975442 2498388 2266016 2587893 3858004
42313 3858004 5763528 7163201 7175819 6141988 5069027 4249502 3078308 1492405 868777
42304 868777 2592009 5936779 8477620 8924146 8502072 8804089 9284522 8219721 5626293
42295 5626293 3541841 3219334 3602711 3265736 2528525 2562877 3358361 3911291 3937384 4051082
42285 4051082 4356532 4114522 3047907 1988653 1827172 2518722 3488272 4420740 5258117
42276 5258117 5880255 6190375 6225196 5919533 5079531 3868358 3039443 3333715 4698988
42267 4698988 6289386 7241606 7426896 7451413 7856331 8369211 8229099 7259939 6099117
42258 6099117 5183126 4257653 3379721 3471395 4837034 5892427 4893329 2637713 1762448
42249 1762448 3194763 4961983 5023445 3695905 2474041 1934783 1926962 2573421 3717486
42240 3717486 4283250 3573088 2555955 2577029 3364586 3633587 3162495 2838038 2946254
42231 2946254 2912623 2714323 3134727 4342046 5326009 5101374 3734606 2076949 1138503
42222 1138503 1583210 3060780 4239268 4307632 4081648 4664940 5573650 5568971 4904951 4974446
42212 4974446 5782172 5694568 4075723 2337257 1701544 1616553 1259956 1035901 1471951
42203 1471951 1960640 1794195 1377438 1307809 1276688 1001996 1240228 2604799 4163794
42194 4163794 4410449 2993381 554788 -2220372 -4292303 -4101190 -1285532 2128540
42186 2128540 3786864 3735756 3694955 4287722 4721627 4791985 5275272 6265705 6777990 6229791
42176 6229791 4970691 3305745 1434436 391755 1406743 3947726 5830692 5700746
42168 5700746 4193404 2477435 1163485 934159 2419282 4621303 5114698 2988559
42160 2988559 328957 -419207 524943 1156467 648921 -10909 171481 1126804 2287356
42151 2287356 3132921 3201359 2406741 1395987 1005452 1367655 1938841 2273127 2454341
42142 2454341 2928749 4048939 5467393 6015857 4854120 2809698 1676444 1934658 2228314
42133 2228314 1570508 858482 1339064 2655393 3568434 3798885 3896036 3861571 3208253 2096123
42123 2096123 1274160 1069145 1356297 2222737 3670867 4949128 5217771 4716336 4350412
42114 4350412 4352692 4292778 4133968 4223472 4399073 4127193 3411738 2643085 1777419 647237
42104 647237 -219424 -186200 415388 992095 2043281 4297856 6794581 7635418 6724481
42095 6724481 5921471 6155090 6256860 5272392 4106794 3937619 4547040 5220764 5882732
42086 5882732 6342010 5853107 4567599 4030551 4941326 5758055 5004107 3691220 3687690
42077 3687690 4719735 5013113 4263505 3831080 4130154 3839242 2052829 -317344 -1721578
42068 -1721578 -1443420 282147 2493519 3653957 2694247 288619 -1671242 -2060571 -1353779
42059 -1353779 -589331 -323901 -529366 -683655 -30173 1497890 2853406 3191799 3156421
42050 3156421 3742423 4369073 3595445 1574811 141034 275487 1031401 1312897 1262563
42041 1262563 1416032 1811636 2437857 3338680 3860227 3085567 1457790 627470 1211760
42032 1211760 2105291 2485669 2876341 3533979 3565435 2727647 2432578 3581846 4821855
42023 4821855 4457972 2944513 2022311 2428156 3791673 5629189 7010237 6535315 4340365
42014 4340365 2864837 3724866 5105398 4529828 2986969 3383527 5556542 6162056 3809007
42005 3809007 1172311 975845 2459773 3222057 2534606 1308309 271801 -324577 -174678
41996 -174678 729893 1840571 2757178 3444098 3532208 2588516 1336038 1153786 1946412
41987 1946412 2092434 1054964 300990 857140 1791646 2149930 2473559 3010618 2363417
41978 2363417 -128068 -2216522 -1253278 2108514 4902047 5800927 5866979 5858917 5217081
41969 5217081 3839539 2708484 2234199 1698021 922158 980844 2489133 4352486 5052231
41960 5052231 4415146 3398539 2612021 1705842 184022 -1475672 -1857360 -219455 2098807
41951 2098807 2918596 2130391 1975019 3614560 5006017 3753935 757645 -1094228 -1009062
41942 -1009062 -686952 -1055443 -1208121 -766568 -744084 -1359351 -1276353 -12765 941805 597380
41932 597380 178269 950266 1987499 1781329 784904 540625 1130706 1276175 533233
41923 533233 -163867 13476 956106 2097641 2763581 2335384 995764 -18656 202342
41914 202342 1021870 1345441 1398364 2195931 3592641 4290687 3841028 3285757 3449732 3758396
41904 3758396 3356105 2499939 2076466 2289486 2605486 2741123 2958412 3333429 3373412 2751464
41894 2751464 2094915 2490995 4168568 6140060 7330939 7582922 7251810 6465850 5462756
41885 5462756 5109772 6055515 7558919 8191483 7663285 6950540 6676383 6556595 6511017
41876 6511017 6942362 7588693 7517728 6780480 6614718 7302867 7391816 6092565 4910011
41867 4910011 5381782 6431888 5770087 3171961 612808 -431529 -187179 675613 1956417
41858 1956417 3490860 4910546 5883390 5955338 4679680 2681205 1660795 2140138 2251290
41849 2251290 433077 -1677674 -1279982 1267621 2748288 1716454 198584 235550 1271981
41840 1271981 2062315 2884100 4247411 5126815 4344410 2723885 2200654 3249504 4424508
41831 4424508 4206450 2522927 689351 247437 1456413 2834200 2852864 1904808 1442485
41822 1442485 1444140 596341 -861675 -830022 1243880 3020614 2791881 2081273 2730634
41813 2730634 3526810 2456280 707408 1118065 3386722 4306201 2886257 1890531 3329949
41804 3329949 5368519 5339959 3591341 2362674 2387687 2673397 2792076 3397140 4613139
41795 4613139 5473999 5256329 4440370 4045903 4511813 5373006 5756935 5190567 4090464
41786 4090464 3384451 3587744 4402941 5148859 5246200 4410722 2948302 1884894 2164924
41777 2164924 3553119 4858617 5294237 4975693 4124611 2779327 1538514 1445071 2467851
41768 2467851 3065918 2135555 620143 205297 1029937 1776507 1598748 811998 -70301
41759 -70301 -759938 -655952 911358 3569967 5923072 6970487 6798210 5802338 4259425
41750 4259425 2937104 2920263 4068592 4563916 2921625 -151577 -2713820 -3761250 -3551870
41741 -3551870 -2480733 -933222 132908 -58681 -743344 -395248 940957 1549764 746016
41732 746016 156087 1334233 3345863 3998106 2626281 391685 -1452179 -2181600 -1136851
41723 -1136851 1595823 4171565 4406763 2492076 796430 678780 1124652 1073949 1228213
41714 1228213 2324127 3215231 2479137 976948 849521 2346638 3572917 3453562 3077047
41705 3077047 3484288 3769703 2559301 344919 -1031917 -847499 -226973 -348603 -904186
41696 -904186 -757619 492870 2168560 3431356 3968374 3770528 2821750 1395745 358573
41687 358573 593077 1959431 3137128 2765340 740733 -1630352 -2723800 -1955127 -232735
41678 -232735 1002504 1299117 1500143 2283424 2885777 2046072 16141 -1399793 -1088667
41669 -1088667 -21202 119637 -987700 -2222812 -2506566 -1718816 -465337 505707 861468
41660 861468 1016305 1603420 2400938 2405116 1407075 761092 1806535 4048191 5759512
41651 5759512 6019915 5287791 4249193 3052003 1629005 -213 -1729730 -3062744
41643 -3062744 -3017481 -1081684 1867525 4280166 5390024 5339284 4332921 2698977 1461285
41634 1461285 1556440 2439869 2656737 1920679 1433369 1972635 3010793 4103928 5640461
41625 5640461 7376407 7661216 5514871 2566133 1333464 1941155 2114402 549974 -1229247
41616 -1229247 -1155298 331037 849554 -476273 -1535239 13210 3307275 4965236 3213360
41607 3213360 -36150 -1831847 -1618530 -866011 -338357 451605 1422256 1545243 688579
41598 688579 188549 818520 1482387 859913 -623249 -1452497 -997371 43058 726440
41589 726440 705024 306908 251634 940543 1776529 1705945 609460 -548671 -1102635 -1262380
41579 -1262380 -1057422 78888 2068787 3733101 4404110 4856023 5650984 5764565 4229315
41570 4229315 2165340 1513383 2316798 2928954 2611588 2228071 2359620 2412960 2006915
41561 2006915 1846327 2560978 3666896 4312980 4341070 4075931 3638386 2954892 2067704
41552 2067704 1097136 177848 -407593 -362287 211896 804160 995834 803326 560949 612385
41542 612385 983177 1268049 1138351 993657 1498457 2287240 2031864 369896 -1156795
41533 -1156795 -1011150 260762 994234 842035 906658 1745714 2622454 2767223 2226315
41524 2226315 1363593 509715 141505 473760 901773 769822 552241 1243154 2754061
41515 2754061 4086083 4910185 5600618 5790721 4562716 2393280 1281734 2247130 3987862
41506 3987862 4720704 4204032 3275381 2511168 2110823 2154285 2252313 1752578 819738 431795
41496 431795 892771 1387868 1403767 1329702 1144584 1006 -2032415 -3264886 -2528484
41487 -2528484 -773041 587497 1591205 2680667 3083409 1937259 76630 -976772
41479 -976772 -1034531 -721719 108447 1615228 2491893 1409955 -551024 -1134425 -322919
41470 -322919 -245163 -1674023 -3010621 -3133327 -2885591 -2985767 -2748465 -2019074 -2265478
41461 -2265478 -4181538 -5896827 -5339620 -3154781 -1563523 -1323807 -1542095 -1650598 -1679272
41452 -1679272 -1079435 761985 2942182 3817906 3527743 3969016 5776658 7029795 5929385
41443 5929385 3407688 1763652 1565257 1395246 384083 -487428 15744 1546336 2647273
41434 2647273 2503304 1481842 210534 -988309 -1568826 -589875 2048332 4537046 4482385
41425 4482385 1722852 -1009607 -1031532 1173147 2724961 2007306 335434 -325315 -55162
41416 -55162 -401941 -1868090 -3282979 -3545800 -2799357 -1667265 -411846 660039 897155
41407 897155 189254 -456042 -32571 1115883 1738419 1154026 -306452 -1908984 -2858887
41398 -2858887 -2506433 -1142276 -246914 -898635 -2151874 -2127814 -558019 1074469 1932513
41389 1932513 2823111 4401946 5880544 6278105 5724517 4700099 3103009 944424 -1051380
41380 -1051380 -2365960 -3162016 -3146637 -1417571 1504978 3199408 2589512 2108121 4329124
41371 4329124 7614569 7945392 4653664 1355878 840265 1803845 1650725 179536 -969195
41362 -969195 -904583 -95186 587908 457354 -501655 -1229681 -773858 -78035 -961065 -2964114
41352 -2964114 -3386217 -1381612 335977 -522096 -2362750 -2465135 -1297609 -1248163 -2262695
41343 -2262695 -1919660 470742 2805652 3477768 3130634 2643980 1816278 869271 1025469
41334 1025469 2451474 3512601 3288591 3085448 4041683 4872563 3828217 1722923 964408
41325 964408 2131343 3464383 3640065 3245786 3191863 3216102 2689586 1832705 1258074 908975
41315 908975 284599 -506191 -637499 346261 1760829 2438867 2082731 1611466 1944221
41306 1944221 2726309 2779184 1767757 737229 685818 1211998 1154713 178222 -976459
41297 -976459 -1635772 -1849653 -1853005 -1564060 -926180 -280476 -620 21811 217767 789941
41287 789941 1553937 2218839 2568024 2391468 1538875 228462 -838734 -984195 -308485
41278 -308485 253418 -107249 -1125163 -1751129 -1346761 -217260 1035078 2066749 2415181
41269 2415181 1318381 -1232534 -3644603 -4063936 -2711969 -1822362 -2746250 -4074668 -3524391
41260 -3524391 -1007355 1371542 2140519 1987003 2181814 2637737 2315563 889754 -886176
41251 -886176 -2247607 -3089108 -3527074 -3392377 -2476731 -1095042 -99639 -87765 -527047
41242 -527047 -74879 1696515 3200094 2470768 13502 -1276063 229158 2538125 2668322
41233 2668322 696537 -634144 15518 1018937 678964 -334270 -541248 -101938 -202012
41224 -202012 -923692 -1270193 -866224 -254076 308565 1063775 1730594 1443979 52442
41215 52442 -1373865 -1736277 -1059210 -163304 356321 540092 740234 1114126 1377759 1107095
41205 1107095 337890 -414307 -889613 -1380159 -1949247 -1936523 -907458 364484 744997
41196 744997 347058 365335 1304392 2263838 2227130 1372183 741842 982993 1649308 1628932
41186 1628932 338218 -1413503 -2145246 -1531654 -873535 -1272385 -2151537 -2369489 -1860767
41177 -1860767 -990613 739583 3595279 5916933 5716269 3775743 2835989 3536467 3692584
41168 3692584 2209604 953874 1395764 2022969 1112006 -166517 90929 1032067 574759
41159 574759 -814059 -923069 324225 956204 701594 1358898 3003914 3115252 677991
41150 677991 -1756858 -1871437 -1009835 -1639906 -3272147 -3434221 -1609221 302514 1025454
41141 1025454 1186386 1536161 1812739 1750325 1722562 1863914 1658662 876743 46306 -399321
41131 -399321 -686089 -1037159 -1110837 -507460 642795 1915085 3027428 3840322 4303032
41122 4303032 4551882 4685435 4380579 3249300 1738207 1088588 2000443 3703104 4737163
41113 4737163 4398140 3073024 1440709 -146980 -1522804 -2425577 -2638684 -2281013 -1744135
41104 -1744135 -1272455 -686872 354087 1821987 3207046 4008350 4156198 3828324 3104944
41095 3104944 2099574 1220605 830665 648460 -37274 -1384143 -2591037 -2725437 -1726974
41086 -1726974 -391242 429437 441918 22404 -15825 940063 2464461 3091916 1776978
41077 1776978 -537243 -1426624 464046 3682531 5352731 4291841 2219855 1630406
41069 1630406 2894931 3992782 2989177 189825 -2414045 -3430059 -3294428 -3275849 -3758851
41060 -3758851 -3890531 -2834243 -952892 592821 1309819 1889326 2912642 3541273 2416948
41051 2416948 -97788 -1711652 -978670 591960 423181 -1587134 -2951227 -2084297 -203221
41042 -203221 937681 1475334 2164542 2085447 -148519 -3382804 -4515456 -2492915 338370
41033 338370 1650845 1967687 2786631 3564549 2512764 -445610 -3343854 -4438932 -3384846
41024 -3384846 -693153 2312737 3460818 1691695 -898429 -1020831 1407928 2894889
41016 2894889 1177607 -1668405 -2293515 -499685 1220228 1375374 690277 184468 -71376
41007 -71376 -306747 -600911 -1176486 -2072231 -2558749 -1831278 -163587 1489066 2750383
40998 2750383 3773667 4364017 4267373 3960450 3956408 3717726 2590875 1369530 1265381
40989 1265381 1614435 587252 -1724874 -3020520 -2086431 -406117 281099 139092 5680
40980 5680 -136450 -233952 571582 2309006 3359997 2854141 2406159 3657453 5458083
40971 5458083 5652117 4591351 4401842 5311123 5255967 3202287 636836 -573252 35769
40962 35769 2112917 5043736 7608081 8841405 9546274 11175570 12996608 12547407 9522276
40953 9522276 6803233 6371414 6447182 4554376 1557875 249259 1055091 1719295 891528
40944 891528 -327165 -626469 -293528 -189511 -394545 -555333 -536652 -169194 791168 1985785
40934 1985785 2516852 2144886 1729631 2026510 2677358 2891746 2596973 2369464 2577672
40925 2577672 3052010 3353623 3050521 2040871 934710 769885 1896351 3336721 3679581
40916 3679581 2547305 923176 171732 964035 2888376 4718360 5297392 4699131 4410229
40907 4410229 5758827 8161999 9651146 9322631 8428098 8507925 9285121 9415168 8776239
40898 8776239 8611508 9354800 9748302 8713955 6909858 5519660 4478110 3119645 1918213
40889 1918213 2092618 3627600 5086793 5582679 5709003 6184441 6755592 7010992 7216143
40880 7216143 7550510 7363492 6094373 4317997 2986075 2152992 1409958 1113905 1955652
40871 1955652 3396019 3831619 2751809 1729330 2510976 4671249 5962669 4863588
40863 4863588 2166440 -4072 -260898 1099882 2728187 3342866 2472994 738871 -409401
40854 -409401 247418 2450153 4543106 5235001 5037868 5433580 6841106 8176714 8470538
40845 8470538 8086770 7944707 8147190 7954929 6838866 5086012 3447348 2461043 2093025
40836 2093025 1948992 1844733 1979859 2369540 2522152 2227150 2225434 3143466 4013589 3182945
40826 3182945 879091 -590094 127208 1544245 1581267 575292 546732 2060886 3444057
40817 3444057 3143202 1528514 -4372 -739677 -914998 -872857 -538898 256519 1154604
40808 1154604 1265431 182324 -1075243 -806366 1435087 4240140 5899457 5860949 4494134
40799 4494134 2520461 1195281 1801180 3964145 5458519 4753194 2869055 1689678
40791 1689678 1536716 1752389 2504327 4150896 5610359 5399520 3912738 2806277 2480042
40782 2480042 2056100 1459444 1415745 1646635 1316924 1105260 2352660 4165009 4146184
40773 4146184 2330618 1373034 2133123 2369404 1133813 996547 3643674 6340090 5750556
40764 5750556 2898569 1068957 668928 -225538 -1474833 -927854 1423454 2943054 2431771
40755 2431771 1709650 2451539 3994086 5040691 5327994 4899545 3788355 3044098 3951985
40746 3951985 5505923 4890267 1550763 -1320559 -760048 2313068 4914941 5778278 5516754
40737 5516754 4464659 2631622 1124116 1339977 2662731 2772562 734976 -1550169
40729 -1550169 -1656293 478736 2694156 3184750 2210012 1253772 1167494 1757790 3004419
40720 3004419 5611586 9591982 12998922 13370621 10505333 6783139 4544686 4060489
40712 4060489 4218430 4066651 3218213 1798205 665246 827839 1999320 2590163 1820857
40703 1820857 895009 1143814 1909034 1560076 70778 -851409 -130361 1452244 2601555
40694 2601555 3022639 3173585 3303544 3298325 3075131 2707991 2371191 2356944 2860970 3544670
40684 3544670 3665403 3050905 2728392 3963380 6517316 8503258 8575764 7804063 8313336
40675 8313336 10094662 10569756 8031605 4206297 2070754 2120188 2573580 2626103 3179664
40666 3179664 4250262 4147033 2245591 519745 844234 2365276 3179577 3285286 3972238
40657 3972238 5231773 5803009 5293997 4351900 3068852 1215376 -14286 1352802 5122122
40648 5122122 8385325 8700022 6477846 3605804 1193371 -371265 -531564 816518
40640 816518 2534695 3369984 3509561 3978834 4827133 5008527 4018829 2676345 2052539
40631 2052539 2297460 2796385 3045590 3104921 3404891 4244138 5341932 5877279 5167312
40622 5167312 3399421 1626373 968999 1709254 3002634 3524777 2674855 1232694 612478
40613 612478 1396616 2837202 3823629 3966318 3607159 3241270 3277840 3977379 5109149
40604 5109149 5861305 5607232 4725760 4242258 4681843 5674947 6619700 7172664 7030078
40595 7030078 5950740 4430886 3774167 4756954 6429293 6950801 5650062 3683432 2605523
40586 2605523 2894285 3996967 5100176 5516646 5034742 4433727 4996068 6789501 8034559
40577 8034559 7113129 4725249 2912543 2293129 1725920 716763 432673 1668694 3322765
40568 3322765 3986810 3905342 4094729 4444992 4181224 3602615 3730406 4468915 4823470 5126796
40558 5126796 7336416 12308631 17992709 21357117 21394702 19336160 16542908 13385406
40550 13385406 10109723 7643620 6876126 7482606 8028433 7389169 5885414 4800603 4782533
40541 4782533 5012910 4227349 2413337 1076950 1659582 3930367 6209318 7130268 6892175
40532 6892175 6591570 6598584 6194642 4961124 3773142 3703413 4448682 4875235 4883231 5434009
40522 5434009 6610270 7108645 6237738 5047233 4604574 4462312 3958876 3707793 4232339
40513 4232339 4290648 2611727 580119 845219 3380794 5281935 4858013 3649827 3498586
40504 3498586 3722535 2760129 1200167 1324733 4022060 7439714 8818909 7263033 4841890
40495 4841890 4869926 8430589 12770188 14199950 12449131 10627821 10815833 11724160 11425164
40486 11425164 10221028 9354031 8734020 7886025 7761634 9417681 11773277 12865496 12812896
40477 12812896 13389873 14908189 15677517 14695541 12889548 11290719 9762042 8145479
40469 8145479 7116335 7101251 7511609 7744559 7985218 8469376 8851912 8775694 8235258 7088999
40459 7088999 5203400 3373285 2907877 3779133 4364308 3739289 3085077 3863682 5574533
40450 5574533 6517549 6197828 5792121 6419603 7830411 8759707 8076193 5828004 3539289
40441 3539289 2963627 4015150 4552094 2967128 416979 -520823 941235 3048699 3918529
40432 3918529 3630322 3641985 4970454 7381871 9803572 11072189 10603155 8741666 6440824
40423 6440824 4549057 3493444 3410521 4094620 4848014 4960682 4539680 4428826 5133257
40414 5133257 6310180 7542341 8943032 10431769 11081015 10307423 9543624 11272238 15662275
40405 15662275 19242767 18267078 13091363 7897493 5949230 6425438 6484023 5137179 3819632
40396 3819632 3848020 4884777 5970253 6791633 7486242 8115227 8919639 10464789 12878752
40387 12878752 15242881 16250243 15408918 13414548 11536247 10784227 11418140 13008352
40379 13008352 14947754 16782903 17971565 17846170 16490102 15313874 15743725 17298300
40371 17298300 18015397 17023023 15538110 14822276 14430832 13489462 12585114 12866298 13844671
40362 13844671 13786971 12305736 10995997 11033554 11458620 10690006 8823147 7316667 6740486
40353 6740486 5944920 3820623 1285016 789672 3588892 7827536 9986119 8466340
40345 8466340 5239049 3507546 4252901 5833680 6600428 6718519 7191058 8173054 8997715
40336 8997715 9301775 9350362 9419359 9445656 9338462 9306927 9756310 10874294 12257145 13038142
40326 13038142 12662994 11533657 10580053 10212624 10080856 9846315 9661172 9741029 9970998
40317 9970998 10167193 10346078 10621308 11240561 12621810 14583064 15559091 13788342 9774797
40308 9774797 6371956 5527971 6009083 5519298 4069730 3572180 4653585 5829260 5923368
40299 5923368 5501159 5377362 5240180 4559448 3705925 3353889 3639073 4513988 6010170
40290 6010170 7539527 7926277 6857384 5382583 4304790 3159435 1619391 674214
40282 674214 1185567 2324584 2848869 3008102 3634453 4235576 3887383 3392485 4374954
40273 4374954 6420571 7362059 6634389 6167756 7371277 9265437 10423496 10821187 10676559
40264 10676559 9307538 6638680 4403733 4220986 5467157 6475394 6872249 7273495
40256 7273495 7594891 7335360 6929126 7191572 7794590 7758726 7136493 6797304 6829446 6553123
40246 6553123 5869193 5201797 4374723 3066380 2185371 3086500 5323766 6845781 6711522
40237 6711522 6051698 6019406 6456663 7103743 8333687 9732365 9591675 7190381 4368483
40228 4368483 3321647 3665304 3253020 1414511 -264598 -404300 429533 1009035 1411465
40219 1411465 2700823 4898792 6260851 5211476 2683937 1547996 3241314 5786964
40211 5786964 6109199 3750129 974400 -534424 -1353705 -2361330 -2892631 -1973905 -153937
40202 -153937 1236792 1902433 2399837 2696775 2236505 1227476 645347 859588 1207582
40193 1207582 1103008 793050 783511 1129264 1599436 2136004 2800565 3387782 3384484 2587614
40183 2587614 1837205 2635369 5346750 8037425 8218695 5986956 4259842 5245784 7767045
40174 7767045 9057201 8236063 6638310 5375884 4329271 3531089 3764247 5025672 5646154
40165 5646154 4094499 1139579 -834012 -603349 675590 1280421 1141573 1432194 2325993
40156 2325993 2481900 1276800 339711 1559037 4205253 5650360 4816850 3214468 2353942
40147 2353942 2016512 1780720 2324011 3878053 4995593 4524247 3568791 3703859 4315657
40138 4315657 3784913 2520404 2464937 3866835 4921373 4797003 4730506 5535060 6141018
40129 6141018 5584132 4637814 4244398 3788839 2348156 622222 162370 1232341 2654898
40120 2654898 3447329 3561580 3191401 2350695 1340297 1012492 2143963 4519397 6780733
40111 6780733 7555442 6969003 6554778 7139947 7456299 5869572 2989069 1090805 1049532
40102 1049532 1499146 1312694 1127527 1633179 2045703 1573003 1093130 1849515 3356251
40093 3356251 4153501 4074272 4191597 4758727 4727839 3471574 1764449 738497 777124
40084 777124 1710550 3243317 4752731 5321105 4569588 3246806 2569663 2932018 3429793
40075 3429793 2826807 1054045 -496114 -522824 536185 1031007 225147 -927643 -1292077
40066 -1292077 -847912 6404 1422251 3460742 5212692 5649305 5008168 4406161 4339845
$$ [...]
##END NTUPLES=NMR SPECTRUM
##END=
