##TITLE=31Pdec_LR-677-C1
 CDCl3, 24 sc
 1.7.2019
##JCAMPDX= 6.0         $$ Bruker NMR JCAMP-DX V2.0
##DATA TYPE= NMR SPECTRUM
##DATA CLASS= NTUPLES
##ORIGIN= UXNMR, Bruker Analytische Messtechnik GmbH
##OWNER= root
$$ XWIN-NMR		Version 3.5
$$ Mon Jul  1 14:53:51 2019 Russian Standard Time (UT+4h)  she@DPX200
##.OBSERVE FREQUENCY= 81.013821
##.OBSERVE NUCLEUS= ^31P
##.ACQUISITION MODE= SIMULTANEOUS
##.ACQUISITION SCHEME= undefined
##.AVERAGES= 24
##.DIGITISER RES= 17
##SPECTROMETER/DATA SYSTEM= spect
##.PULSE SEQUENCE= zgpg30
##.SOLVENT NAME= CDCl3
##.SHIFT REFERENCE= (INTERNAL, CDCl3, 0, 182.463)
##AUDIT TRAIL= $$ (NUMBER, WHEN, WHO, WHERE, WHAT)
$$ ##TITLE= Audit trail, XWIN-NMR		Version 3.5
$$ ##JCAMPDX= 5.01
$$ ##ORIGIN= Bruker BioSpin GmbH
$$ ##OWNER= she
$$ F:/spectra/data/she/nmr/P31/1/pdata/1/auditp.txt
$$ ##AUDIT TRAIL=  $$ (NUMBER, WHEN, WHO, WHERE, WHAT)
(   1,<2019-07-01 14:52:52.29 +0400>,<she>,<DPX200>,
      <created by zg, POWCHK disabled, PULCHK disabled
       configuration hash MD5:
       00 E9 B6 7A A2 85 ED C7 34 08 36 98 17 FE 4E 26
       data hash MD5: 32K
       AC DC 7C 54 97 1C 3B 1C 75 14 2E 24 67 31 49 45>)
(   2,<2019-07-01 14:52:54.37 +0400>,<she>,<DPX200>,
      <Start of raw data processing
       efp BC_mod = 2 LB = 1 FT_mod = 6 PKNL = 1 PHC0 = -2568.651 PHC1 = 143.3996 SI = 64K 
       data hash MD5: 64K
       52 AC 2B 56 5D DF EA D9 BD F3 29 85 E0 CF 32 97>)
(   3,<2019-07-01 14:53:24.89 +0400>,<she>,<DPX200>,
      <pk PHC0 = -11.85958 PHC1 = 46.60001 
       data hash MD5: 64K
       16 94 6E 24 42 9D 8E EF 3B 5D 35 F7 5C 2D 78 AA>)
(   4,<2019-07-01 14:53:28.46 +0400>,<she>,<DPX200>,
      <abs ABSG = 5 
       data hash MD5: 64K
       09 87 AC AD B2 CD 1E 90 CC 15 03 42 1E C5 74 61>)
$$ ##END=
$$ 
$$ hash MD5
$$ 54 6A CE D2 59 41 B7 79 0E C4 DA AC 43 8D BC C9
##$RELAX= 
##$RELAX= 
##$RELAX= 
##$RELAX= 
##$RELAX= 
##$RELAX= 
##$RELAX= 
##$RELAX= 
$$ Bruker specific parameters
$$ --------------------------
##$DU= <F:/spectra>
##$EXPNO= 1
##$NAME= <P31>
##$PROCNO= 1
##$TYPE= <nmr>
##$USER= <she>
##$AMP= (0..31)
100 100 100 100 100 100 100 100 100 100 100 100 100 100 100 100 100 100 
100 100 100 100 100 100 100 100 100 100 100 100 100 100 
##$AQSEQ= 0
##$AQ_mod= 1
##$AUNM= <au_zg>
##$AUTOPOS= <>
##$BF1= 81.014009
##$BF2= 200.13
##$BF3= 200.13
##$BF4= 200.13
##$BF5= 200.13
##$BF6= 200.13
##$BF7= 200.13
##$BF8= 200.13
##$BYTORDA= 1
##$CFDGTYP= 0
##$CFRGTYP= 5
##$CHEMSTR= <none>
##$CNST= (0..31)
1 1 145 1 1 1 1 1 1 1 1 1 1 1 1 1 1 1 1 1 1 1 1 1 1 1 1 1 1 1 1 1 
##$CPDPRG= <waltz16>
##$CPDPRG1= <>
##$CPDPRG2= <waltz16>
##$CPDPRG3= <>
##$CPDPRG4= <mlev>
##$CPDPRG5= <mlev>
##$CPDPRG6= <mlev>
##$CPDPRG7= <mlev>
##$CPDPRG8= <mlev>
##$CPDPRGB= <>
##$CPDPRGT= <>
##$D= (0..31)
0 1 0 0 0 0 0 0 0 0 0 0.03 2e-05 3e-06 0 0 0 0 0 0 0 0 0 0 0 0 0 0 0 0 
0 0 
##$DATE= 1561978371
##$DBL= (0..7)
120 120 120 11 120 120 24 19 
##$DBP= (0..7)
150 150 150 150 150 150 150 150 
##$DBP07= 0
##$DBPNAM0= <>
##$DBPNAM1= <>
##$DBPNAM2= <>
$$ [...]
##$SUBNAM3= <"">
##$SUBNAM4= <"">
##$SUBNAM5= <"">
##$SUBNAM6= <"">
##$SUBNAM7= <"">
##$SUBNAM8= <"">
##$SUBNAM9= <"">
##$SW= 369.568048894756
##$SWIBOX= (0..15)
0 1 3 0 0 0 0 0 0 0 0 0 0 0 0 0 
##$SW_h= 29940.119760479
##$TD= 32768
##$TD0= 1
##$TE= 0
##$TE2= 300
##$TE3= 300
##$TEG= 300
##$TL= (0..7)
0 120 53 12 22 120 120 120 
##$TP= (0..7)
150 150 150 150 150 150 150 150 
##$TP07= 0
##$TPNAME0= <>
##$TPNAME1= <>
##$TPNAME2= <>
##$TPNAME3= <>
##$TPNAME4= <>
##$TPNAME5= <>
##$TPNAME6= <>
##$TPNAME7= <>
##$TPOAL= (0..7)
0.5 0.5 0.5 0.5 0.5 0.5 0.5 0.5 
##$TPOFFS= (0..7)
0 0 0 0 0 0 0 0 
##$TUNHIN= 0
##$TUNHOUT= 0
##$TUNXOUT= 0
##$USERA1= <user>
##$USERA2= <user>
##$USERA3= <user>
##$USERA4= <user>
##$USERA5= <user>
##$V9= 5
##$VALIST= <valist>
##$VCLIST= <CCCCCCCCCCCCCCC>
##$VD= 0
##$VDLIST= <DDDDDDDDDDDDDDD>
##$VPLIST= <PPPPPPPPPPPPPPP>
##$VTLIST= <TTTTTTTTTTTTTTT>
##$WBST= 1024
##$WBSW= 4
##$XGAIN= (0..3)
0 0 0 0 
##$XL= 0
##$YL= 0
##$YMAX_a= 10644
##$YMIN_a= -8454
##$ZGOPTNS= <>
##$ZL1= 120
##$ZL2= 120
##$ZL3= 120
##$ZL4= 120
##$ABSF1= 182.463
##$ABSF2= -187.1042
##$ABSG= 5
##$ABSL= 3
##$ALPHA= 0
##$AQORDER= 0
##$ASSFAC= 0
##$ASSFACI= 0
##$ASSFACX= 0
##$ASSWID= 0
##$AUNMP= <proc_1d>
##$AZFE= 0.1
##$AZFW= 0.5
##$BCFW= 0
##$BC_mod= 2
##$BYTORDP= 0
##$COROFFS= 0
##$CY= -3
##$DATMOD= 1
##$DC= 0
##$DFILT= <>
##$DTYPP= 0
##$F1P= 0
##$F2P= 0
##$FCOR= 1
##$FTSIZE= 65536
##$FT_mod= 6
##$GAMMA= 0
##$GB= 0
##$INTBC= 1
##$INTSCL= 5.30512e-09
##$ISEN= 30
##$LB= 1
##$LEV0= 0
##$LPBIN= 0
##$MAXI= 10000
##$MC2= 0
##$MEAN= 0
##$ME_mod= 0
##$MI= 50
##$NCOEF= 0
##$NC_proc= -9
##$NLEV= 6
##$NOISF1= 182.463
##$NOISF2= 159.3651
##$NSP= 0
##$NTH_PI= 0
##$NZP= 0
##$OFFSET= 182.463
##$PC= 4
##$PHC0= -2580.51
##$PHC1= 189.9996
##$PH_mod= 1
##$PKNL= yes
##$PPARMOD= 0
##$PSCAL= 0
##$PSIGN= 0
##$REVERSE= no
##$SF= 81.0140089999434
##$SI= 65536
##$SIGF1= 159.3651
##$SIGF2= -187.1042
##$SINO= 113.3802
##$SIOLD= 16384
##$SREGLST= <1H.CDCl3>
##$SSB= 0
##$STSI= 65536
##$STSR= 0
##$SW_p= 29940.119760479
##$SYMM= 0
##$S_DEV= 0
##$TDeff= 32768
##$TDoff= 0
##$TI= <>
##$TILT= no
##$TM1= 0
##$TM2= 0
##$TOPLEV= 0
##$USERP1= <user>
##$USERP2= <user>
##$USERP3= <user>
##$USERP4= <user>
##$USERP5= <user>
##$WDW= 1
##$XDIM= 65536
##$YMAX_p= 446392258
##$YMIN_p= -216815953
$$ End of Bruker specific parameters
$$ ---------------------------------
##NTUPLES= NMR SPECTRUM
##VAR_NAME=  FREQUENCY,     SPECTRUM/REAL,   SPECTRUM/IMAG
##SYMBOL=    X,             R,               I
##VAR_TYPE=  INDEPENDENT,   DEPENDENT,       DEPENDENT
##VAR_FORM=  AFFN,          ASDF,            ASDF
##VAR_DIM=   65536,         65536,           65536
##UNITS=     HZ,            ARBITRARY UNITS, ARBITRARY UNITS
##FACTOR=    0.456856943014862, 1,           1
##FIRST=     14782.0589164792, 0,            0
##LAST=      -15158.0608439998, 0,           0
##MIN=       -15158.0608439998, -216815953,  0
##MAX=       14782.0589164792, 446392258,    0
$$ Real data points
##PAGE= N=1
##DATA TABLE= (X++(R..R)), XYDATA
$$ [...]
47236 -9080894 -7589579 -3515237 -3554157 -7154149 -10113691 -10571539 -5453283 10465925
47228 10465925 33269347 45117806 32462936 5329736 -13227797 -15053976 -12054843
47221 -12054843 -13695775 -14089950 -7177211 -1484932 -7991320 -20352216 -20696580 -4675305
47213 -4675305 10646986 7978585 -8758814 -20483438 -16698032 -6034634 -2810704 -9615372
47205 -9615372 -17598619 -20244547 -19923246 -20446639 -20063760 -15771458 -9612597 -5228072 -1434469
47196 -1434469 4656226 10440983 10745826 6695833 3809521 1464746 -6302366 -17509013
47188 -17509013 -20509019 -11406174 -3267494 -8615894 -20358873 -21952076 -11706680 -3326082
47180 -3326082 -3683115 -4889098 -1433767 -877425 -9848857 -20723506 -22552648 -17505536
47172 -17505536 -15262776 -16028894 -11019127 1753036 13261285 16156443 12902401 9718491
47164 9718491 10096405 15712694 25678672 32452701 26805852 11159407 587962 4683523
47156 4683523 14215993 12640768 -2973449 -19453081 -24017019 -16986835 -8347283 -6622284
47148 -6622284 -11958971 -17259791 -15370047 -5896369 5907640 16334676 25251526 30315720
47140 30315720 25538911 9806808 -8225119 -19050446 -22128420 -21605886 -17191759 -7039614
47132 -7039614 3505373 5143023 -3587813 -15022119 -22631092 -25539345 -23303124 -14662300
47124 -14662300 -3346531 2254530 -1610943 -9954288 -15640335 -15086186 -7367118 5234036
47116 5234036 14469782 11795234 76003 -7142887 -1853564 8861956 13106895 8106692
47108 8106692 -32739 -4788983 -3203653 3304081 8010868 4148303 -5007566 -7628612
47100 -7628612 230406 6735520 -179672 -15485686 -23873887 -19523381 -9803087 -1986070
47092 -1986070 3813584 8558620 10185347 7871438 4206712 1027875 -2333766 -5495416
47084 -5495416 -6157302 -4079022 -1990643 -1055526 1217354 6542936 11541946 10399508
47076 10399508 2171290 -5987248 -5630148 1609326 3427411 -7319834 -19695668 -16556616
47068 -16556616 1578385 16024482 15628899 9898351 10205439 11590678 4700401 -5496604
47060 -5496604 -7886785 -4533048 -5823500 -10984192 -9842879 -1887607 2720439 1055834
47052 1055834 611190 3518803 3420580 592707 4105851 14309663 18731418 11912386
47044 11912386 4891121 7350722 13933613 16724483 17907046 19876816 15315833 -774933
47036 -774933 -19178068 -28425673 -29816889 -29373226 -24572998 -12330785 -1655473 -3346463
47028 -3346463 -12689238 -16556873 -13123537 -10843797 -12109267 -11738187 -7895157 -916990
47020 -916990 13808965 36110555 49172603 36878400 11181276 665795 9833347
47013 9833347 12561583 -7184246 -31119222 -35759897 -25485678 -18716659 -16707701 -7792274
47005 -7792274 6236229 10760437 3607377 -468275 6364544 13417303 10092147 2895707
46997 2895707 4491442 13543385 15366710 780105 -22410647 -37724101 -36759330 -26162403
46989 -26162403 -18342534 -17200867 -16229294 -10738800 -6078912 -9211815 -16663422 -18131218
46981 -18131218 -10584343 -1476055 2336961 1678877 -715233 -5783637 -13486524 -18021277
46973 -18021277 -14126683 -6142067 -4796113 -14365739 -27290592 -33248373 -30626844 -26386203
46965 -26386203 -26023311 -27061955 -23344637 -13103977 -364105 10080114 15560704 13788267
46957 13788267 3003505 -13523804 -26521436 -28249683 -20010140 -9489784 -2103437
46950 -2103437 2028919 4233302 4859058 4611008 4359537 3205702 288567 -1370456 2583521
46941 2583521 10232705 13403507 8277168 1458700 959538 4736721 4390513 -1447954
46933 -1447954 -4888728 -1264410 3475444 2658233 866090 8253100 24079864 34326570
46925 34326570 29257669 17341792 15382377 27457425 40779284 42743200 34823128 26146187
46917 26146187 19835604 13018723 7263742 9440125 19760742 26750255 20557149 7605435
46909 7605435 4523445 17193936 32286801 32845777 18039548 2669075 -1000913 4745293
46901 4745293 10053590 10948625 11288832 13637886 13919595 7040906 -5125244 -13950572
46893 -13950572 -11753251 1490787 18276038 29920415 33704119 33798984 34305561 32855486
46885 32855486 24206259 9186403 -5065689 -14471410 -21224868 -24918105 -18308516 1082754
46877 1082754 21574478 29822172 29146606 33225818 42366465 40641309 21086777 -274107
46869 -274107 -5022288 3730714 9714246 7676194 5148521 4759890 695952 -6738500
46861 -6738500 -7948543 -162258 5218205 -1764647 -15449123 -23334209 -22456153 -19360976
46853 -19360976 -18114533 -16086829 -10529674 -3949707 -2335636 -9410889 -21418648 -28337382
46845 -28337382 -24537942 -17599537 -19735537 -30156846 -35422107 -30071410 -25358082 -30349594
46837 -30349594 -35539650 -26857499 -7897534 5530913 8160289 8252094 10422598 10761044
46829 10761044 9562906 13380485 20193103 16755090 -1826568 -21213590 -25457748 -17025487
46821 -17025487 -10043541 -10159217 -11281310 -9023226 -7669131 -13109061 -24699952 -35552699
46813 -35552699 -38901721 -34773477 -30658124 -32733493 -36632042 -32226856 -18226774 -4785909
46805 -4785909 792182 2639494 6139631 7980801 3880471 -1113173 430040 5972947
46797 5972947 7392486 4333993 3077877 3913069 231207 -9122191 -16252376 -15667348
46789 -15667348 -11586361 -10169759 -10432497 -7416746 -1056983 2343755 -2903033 -15239982
46781 -15239982 -26942230 -32252488 -33221877 -34654004 -34611850 -26237319 -10050347 3378278
46773 3378278 6474002 2362754 -4622661 -15646055 -27104523 -25780955 -7575585 8484388
46765 8484388 1930741 -19508992 -30661370 -25726233 -22944651 -31730136 -38388927 -31918690
46757 -31918690 -22732897 -23288474 -27350773 -23521967 -16081047 -16136510 -21446907 -21142085 -14496052
46748 -14496052 -10193872 -10796046 -11356551 -11141328 -14739442 -22561161 -29767299 -33029116
46740 -33029116 -30603595 -19736255 -3030329 7261746 2164114 -10123683 -14001565
46733 -14001565 -6922406 1198399 5648816 10698998 16961869 18718199 15161480 12269598
46725 12269598 11955054 10687835 9870544 15188295 23799880 25336743 18924982 15670567
46717 15670567 19310725 18463139 5881910 -7731613 -9721837 -4498677 -4239327 -8552224
46709 -8552224 -7033523 1974764 8376683 5947859 423758 -214919 3697688 5681362
46701 5681362 2069349 -3644746 -4946159 -449412 4046517 4675427 7560141 19970768
46693 19970768 34661556 34775982 18038889 4183956 10566050 29971676 41600843
46686 41600843 35682039 17643532 -3440179 -18438422 -17501733 -136531 18018787
46679 18018787 21866204 16861165 18842626 28074859 30490172 23355480 20008080 25407295
46671 25407295 26473819 15260566 4399238 7042398 15144766 12581997 563178 -5459632
46663 -5459632 877241 10680758 14552205 11251610 2694517 -8448814 -15487533 -11521848
46655 -11521848 1588182 14488638 20715313 19988571 12907456 309677 -12468410 -18827860
46647 -18827860 -19353168 -20132706 -22371704 -21245612 -15907872 -12624964 -16059589 -24848257
46639 -24848257 -37244938 -52192346 -62012941 -54668270 -30236729 -6728240 -610461
46632 -610461 -7301160 -10060878 -3459362 2870872 1773791 -2085546 -2652096 -1996596 -3825348
46623 -3825348 -4542347 1907733 13555451 21935589 23926696 25739303 32296964 37325770
46615 37325770 30107407 11557039 -3513821 -4433918 556980 -4193024 -17712829 -21209774
46607 -21209774 -4586053 16472700 19086959 2658806 -11066393 -5316694 14556397
46600 14556397 31726807 36331212 30435305 22014073 18225846 20363732 22544869 18124874
46592 18124874 7728473 -2766958 -10739031 -16953636 -18475782 -10732621 1925780 7745424
46584 7745424 3675095 664906 7443657 17840727 21040906 16211937 9089192 1953288
46576 1953288 -3706106 -1877289 9590732 20834851 21408905 15005023 11379879 9266098
46568 9266098 1392959 -8156923 -8818232 -4252958 -9492213 -25279642 -34157404 -27425600
46560 -27425600 -17272770 -13733656 -8352119 6478353 18843423 14985274 3024585
46553 3024585 474385 7088644 9468951 6669057 10590269 22290728 27515402 18599818
46545 18599818 4756146 -2968917 -2970487 3687140 16969568 30217189 32258365 22956155
46537 22956155 14623583 12603759 7552496 -5702803 -15238125 -9085642 5406647 11903006
46529 11903006 7282628 902505 -2856097 -8084640 -15533796 -19111098 -14674072 -4009826
46521 -4009826 9325360 20602410 22104544 9625291 -9228964 -21050838 -21099871 -14806990
46513 -14806990 -6092273 6445166 20695346 28147819 23872063 12379867 -110197
46506 -110197 -12662649 -24795498 -31177898 -27149651 -15545580 -2755255 8700090 18636038
46498 18636038 23823661 21035794 14326927 12354616 17189076 21345334 18091875 9571470
46490 9571470 1157630 -7295624 -18132909 -26521132 -23295272 -8969272 3718870 6805556
46482 6805556 9139948 21999456 37628390 35698794 12396097 -10502755 -12459661 291038
46474 291038 5692397 -4814860 -19356126 -24767916 -21364162 -18144457 -22335614 -35631693
46466 -35631693 -53686278 -66510082 -64285227 -45735786 -19106109 4686795 17946219
46459 17946219 18598945 11776863 6893551 8007632 9277330 4907199 -485631 1100630
46451 1100630 7426013 9057667 3898086 -1823205 -6087278 -13256991 -23146079 -29337106
46443 -29337106 -30034407 -29423793 -26682618 -16017186 -5011 10714570 14523077 20433386
46435 20433386 27648107 21381097 -1388847 -20165684 -19381489 -12378843 -18840945 -32255447
46427 -32255447 -32097750 -18617317 -10477916 -12309664 -10625949 -2884641 -4702459 -20857311
46419 -20857311 -31705419 -20748158 881463 10746329 4359646 -4042635 -1970089 10184670
46411 10184670 22656836 23636719 8758989 -11375619 -19653496 -12600828 -3965958 -3985513
46403 -3985513 -5604603 1442880 13100159 17992950 14959411 12564141 14742537 16512355
46395 16512355 12766599 4447398 -3786989 -8579084 -11871979 -20304156 -36073598 -48972338
46387 -48972338 -45852211 -28923866 -14201758 -9634441 -7651178 -3497591 -4848431 -13940312
46379 -13940312 -16461022 -3097294 10910895 5568044 -13866779 -25467174 -22622210
46372 -22622210 -17654895 -17112240 -13914310 -4660322 3867649 8285420 12503318 15235855
46364 15235855 9354457 -2650970 -7882520 -2307841 3910533 5438743 10620004 23520203
46356 23520203 31488824 21397753 -1919214 -23218174 -34554740 -37173143 -33905339
46349 -33905339 -28209456 -24110573 -20070153 -9850847 4481644 9267242 -2963718 -20476566
46341 -20476566 -26346265 -18969849 -9321766 -3388363 2607237 12436831 23762394 30598321
46333 30598321 27214118 12799705 -4369922 -12864782 -11671149 -10761499 -14723134 -16042448
46325 -16042448 -10669566 -8093737 -15470053 -22651476 -16671800 -2663622 5031661 6494160
46317 6494160 13990681 28653057 36317040 28101757 11106931 -3808478 -12712177 -14461192
46309 -14461192 -7304124 6275628 19526710 28596054 32910752 29312028 15467404 -778609
46301 -778609 -5949526 3368505 17949485 29046184 34639895 33780999 26807169 21423337
46293 21423337 25318210 31333714 24388567 5901890 -4832679 672059 6780332 -1521714
46285 -1521714 -16255385 -21717467 -18803515 -18182073 -18581647 -9412720 8950124 23143460
46277 23143460 24712886 18428403 13190619 14173069 22661274 34538286 40175840 34138819
46269 34138819 23283489 17687211 17047557 15034874 12901972 17017736 25024498 27039517
46261 27039517 20774363 13663906 9102811 2453581 -7336842 -14038571 -15127169 -15022358
46253 -15022358 -13961216 -6015289 6835628 12017779 5814280 2712959 14031647 28186784
46245 28186784 26391745 9728302 -5675094 -14916367 -26759070 -40599248 -41877024
46238 -41877024 -27238972 -15967575 -23635839 -37815637 -36103328 -19773606 -10804660
46231 -10804660 -18062945 -26279068 -22852550 -16911057 -20511219 -25733082 -17740070 -2606087
46223 -2606087 -1722125 -18205139 -28547968 -15484582 6665890 12248668 -982341 -13124970
46215 -13124970 -12737938 -8865678 -11415241 -15626092 -13202101 -7217356 -5812500 -7632004
46207 -7632004 -3680730 9014991 23947362 34013838 36684201 31536860 20750545 12462862
46199 12462862 14817568 23398134 22696606 6025212 -12697263 -15702994 -6063086 -4845969
46191 -4845969 -22955709 -46367306 -54496907 -45085842 -32814089 -28131343 -27202775 -22185110
46183 -22185110 -12417174 -2476584 4671436 8583515 8991512 5989898 793351 -5304434
46175 -5304434 -10796105 -12503306 -7729247 1276565 8839916 12757644 15142819 15648443
46167 15648443 10714745 2689087 1813056 12216134 22013922 16801130 127890 -9440891
46159 -9440891 -1895486 12414076 16575735 5413626 -12890955 -27280971 -32059522 -28881448
46151 -28881448 -24188337 -22552483 -21395252 -15246571 -5076703 1944429 3203088 4906562
46143 4906562 12251855 20756881 22095556 14742744 4167611 -4361334 -8182166 -4954658
46135 -4954658 6188737 21128679 32336023 34820222 29310244 20891863 15731527 16140883
46127 16140883 16401598 7121092 -12301416 -29216741 -31539088 -23506573 -20448210 -28429616
46119 -28429616 -36998397 -34169437 -21522333 -10340994 -8004790 -13003312 -19707687 -22902096
46111 -22902096 -19732759 -12054371 -6020386 -5640563 -7769824 -6869260 -2887760 264255
46103 264255 2491820 7168367 12525984 10886635 198967 -9797879 -8690965 1270710
46095 1270710 9004798 8760320 3642666 -2750244 -9433590 -12291391 -4691359 11763254
46087 11763254 24152684 21754686 8183832 -4849843 -11313663 -12904262 -12100095 -10638993
46079 -10638993 -11989543 -17263261 -19795208 -11510162 5416174 20356093 27442944 29234250
46071 29234250 27234828 18647910 5621483 -1716664 2723115 12736892 18983570 19948475
46063 19948475 18225819 13116191 4871217 379203 4966697 12148450 11325247 3411368
46055 3411368 -1389142 -266140 -839050 -5935509 -7056733 1419005 10760787 8467765
46047 8467765 -5259068 -19147326 -25384087 -25308617 -22664714 -18718660 -14973517 -14837945
46039 -14837945 -19334429 -23340925 -18889322 -3338734 15227605 22094054 9049240 -15227814
46031 -15227814 -31595645 -30097240 -19896240 -16016874 -20228521 -21769735 -14757339 -5347389
46023 -5347389 694208 8137382 22745871 37486996 38456345 24244660 10363947 11044503
46015 11044503 23124982 32894909 34175696 32864815 35080928 37799365 33630177 20924353
46007 20924353 5811774 -4807882 -10060360 -14133995 -19025811 -20309594 -13131187 -1809476
45999 -1809476 2368717 -3959182 -9785403 -5194463 1570585 -6634034 -30306533 -49032890
45991 -49032890 -46149826 -26901158 -6825557 6817859 13624914 10688611 -2243450
45984 -2243450 -14285755 -13859295 -5130651 -1653113 -5738529 -7605612 -4241403 -3797868
45976 -3797868 -8681240 -9659253 -2630238 2897176 73921 -3536209 -343840 3131186
45968 3131186 -1342645 -7542384 -5266234 1131139 380343 -5477119 -5794692 -2920754
45960 -2920754 -9927461 -25643385 -31250957 -18026076 -1762920 -53944 -8719654 -12305114
45952 -12305114 -7703119 -4480679 -7876210 -13531120 -16287444 -14710138 -8786682 -690386
45944 -690386 4324832 4178993 4013331 7744990 9944571 3989037 -5774335 -9463776 -6683241
45935 -6683241 -6223916 -12039369 -19371061 -24286168 -26827098 -24500425 -13946483 -1228537
45927 -1228537 963427 -9403670 -19624613 -20298261 -16642204 -15343189 -11906924 -1920179
45919 -1920179 4562587 -5738111 -27972175 -42847652 -40717961 -29877423 -20857206 -15090030
45911 -15090030 -11856512 -14247743 -21903697 -26876769 -24034158 -19154087 -19602752 -22226437
45903 -22226437 -18383391 -7876157 -40848 -1815208 -11079570 -21494655 -27831783 -26006995
45895 -26006995 -14308038 2296946 13516672 13630204 8092684 6593384 10457365 11172598
45887 11172598 2794068 -7973257 -8513691 3422838 15282986 14472935 3965269 -1881864
45879 -1881864 4359092 15298939 20482676 19872475 21104470 26976295 31431544 27564633
45871 27564633 15317221 540083 -10505956 -14606432 -11868470 -4650668 3507593 8438660
45863 8438660 6482768 -2297436 -11702465 -13566435 -6688961 844043 1048441 -4514070
45855 -4514070 -8148316 -6720738 -3990887 -2882523 -926256 5057057 13995415 22570013
45847 22570013 29163210 33723473 36144207 36557799 35034036 30003610 20612880 12608401
45839 12608401 16793182 35912940 55763728 57130584 38286060 19341511 19835229 35762528
45831 35762528 44510345 31459495 5641549 -12780289 -15232327 -10198146 -8932140 -12575371
45823 -12575371 -15123093 -13924143 -12647874 -15309582 -21013007 -24891781 -22524614 -13776060
45815 -13776060 -3662500 1432320 -66938 -3545798 -4379400 -3511392 -4357554 -6247748
45807 -6247748 -4981399 778739 7531527 11200120 10057867 4361201 -2600173 -4113443
45799 -4113443 3313909 12670251 12646513 2913264 -4061252 32854 7844831 7414463 -1483589
45790 -1483589 -9210344 -10098283 -6989634 -4953799 -7346561 -15274856 -24258012 -24981735
45782 -24981735 -15167194 -6625322 -10702717 -20792186 -22374181 -17913500 -24450003 -43657003
45774 -43657003 -53123727 -37121608 -10181772 3762374 3377252 4591548 12019418 14799088
45766 14799088 8120527 939080 837243 6057698 14554516 26677643 35828239 31071229
45758 31071229 14831307 4964932 11961864 25453469 30945735 28638860 26393447 24749883
45750 24749883 20619178 17433430 18940928 19188033 11550552 2670357 3661957 10952336
45742 10952336 10784360 1707430 -3147507 1541142 4085883 -4799619 -16320622 -16274967
45734 -16274967 -4319109 8618033 15681271 17622631 15096576 6688020 -5812930 -16658179
45726 -16658179 -21648681 -21187535 -18013389 -14163371 -9796096 -3878830 3370418 9393659
45718 9393659 12849028 16692687 23298027 27737589 22513669 9584174 464353 2053852
45710 2053852 9135448 13768407 14943727 14933895 13261627 9724476 7215230 5911879 828799
45701 828799 -8557040 -12670366 -4044832 9779687 14815592 9307270 5015794 11060336
45693 11060336 24240215 34942604 36064692 26721239 13227466 5763724 8596783 14698860
45685 14698860 14974216 10305386 8319243 10761804 11432380 5432238 -6190914 -19705994
45677 -19705994 -30394767 -33225096 -28717721 -25609722 -30177773 -35971753 -32914066 -23342193
45669 -23342193 -18405383 -20988602 -24266827 -25577540 -27594405 -25226401 -7376859 23252960
45661 23252960 46226462 46466283 30166502 11549681 -4476182 -19069547 -30531374
45654 -30531374 -38021853 -44801289 -49200655 -42229648 -23626869 -9938556 -14603142 -28501092
45646 -28501092 -33288901 -26861883 -21304969 -20975516 -18540617 -11279467 -6468976 -8886750
45638 -8886750 -14531259 -18412895 -18778899 -12968688 590050 14593042 16897298 5377490
45630 5377490 -8814201 -14765080 -11384830 -2527135 8739980 17904747 18678668 9750411
45622 9750411 -2163792 -9013401 -8737995 -5764707 -7373404 -18087345 -33127939 -39591731
45614 -39591731 -30224025 -14228244 -7522011 -13814126 -22846715 -25743161 -23041766 -17933895
45606 -17933895 -11463796 -6091909 -5054178 -5730796 -1409049 8393710 16875933 20446219
45598 20446219 21923585 21879434 16299507 5868689 -1455431 -1019321 3215751 6952342
45590 6952342 10748343 13855469 11960522 5054545 -1037523 -4395794 -8863751 -13199640
45582 -13199640 -10220441 -1627936 -306937 -10001266 -16184728 -7978545 3632237 3346610
45574 3346610 -3654637 -1211583 10830815 16735825 8364389 -7571583 -23290636 -35247634
45566 -35247634 -37496898 -26506137 -12989251 -12422579 -21889589 -23030500 -11273573 -3995652
45558 -3995652 -12462080 -23204476 -18800125 -2757521 9971316 15643954 19337559 18477361
45550 18477361 6424943 -10607108 -16732700 -7611606 4587059 9172896 7908466 5648921
45542 5648921 2586779 1133012 8861738 25824981 37649644 32069228 16984674 10418876
45534 10418876 15056498 15878260 4883026 -5409153 -1051063 11042638 12566461 1231566
45526 1231566 -5421281 4660413 21768972 30069326 29314951 30363163 34850674 32281123
45518 32281123 17528766 -189891 -9902957 -11793674 -11728665 -9683260 -1733567 9658573
45510 9658573 15881432 13140683 6724273 2796870 1456840 286473 -595457 -1158915
45502 -1158915 -4569230 -11499668 -14191988 -4558061 11082399 14239655 -3675425 -28022136
45494 -28022136 -37079947 -27581835 -15350830 -11984012 -11403221 -2876134 11557945 19917523
45486 19917523 16179189 6336960 -73844 989105 7357850 14277456 17155613 13153550
45478 13153550 2222302 -12580838 -25455828 -30190659 -25244551 -16492139 -11478612 -10540048
45470 -10540048 -7642133 -638587 4814953 3965946 -26951 -1839228 -2003113 -4290264
45462 -4290264 -8777333 -12607806 -14868590 -16116632 -15713013 -13721648 -12250374 -10882045
45454 -10882045 -5038753 6149078 15190428 15689843 11556483 9373683 6847362 -1351428
45446 -1351428 -10337588 -9477578 1292544 11156781 13922725 11982706 5218186 -9393135
45438 -9393135 -24228455 -22992760 -4129866 11320028 5994771 -10514323 -16816059 -9017542
45430 -9017542 -86471 4418455 12846187 28798381 40984207 37846754 22917329 9042093
45422 9042093 3171296 2863628 4096148 6271326 9908183 13757423 15783459 15396393
45414 15396393 13385873 10106529 5074908 -1304612 -7221421 -11779119 -15805712 -18390152
45406 -18390152 -15720712 -7624613 -2019485 -5383086 -10129304 -1493133 20747249 37931265
45398 37931265 35608867 21338785 11036908 6579175 -457313 -8662548 -6794542 5184502
45390 5184502 10554978 -1696920 -19737806 -23435866 -9413855 7918880 16557856 17969374
45382 17969374 18057687 16760120 11152281 3038484 -2526174 -4023661 -3723118 -2257291
45374 -2257291 1698442 6036292 5527523 318695 -1228965 6908496 18748605 22828927
45366 22828927 15663430 2642624 -11503290 -24711894 -31495668 -25650788 -11726613
45359 -11726613 -4005283 -8987911 -16950160 -16502854 -9541687 -4441382 -1940785 2198752
45351 2198752 5449051 860053 -10129759 -17631864 -17214463 -15122112 -17016389 -18914604
45343 -18914604 -13997374 -4256480 -273938 -9268521 -25431653 -34141061 -27481634 -14092226
45335 -14092226 -9115811 -14737064 -17981209 -10105330 994290 4090284 1855405 4998658
45327 4998658 15082525 24180433 27668256 25836134 15919023 -4034790 -23827028 -27739627
45319 -27739627 -15434709 -4011968 -5419551 -13479731 -17941610 -18903398 -19424227 -14748661
45311 -14748661 196831 19136375 30548717 31791166 29092279 27003890 25710806 26129413
45303 26129413 29842213 34787072 36961642 35707389 32859220 28438521 21846927 15542995
45295 15542995 12820541 13251832 14210569 14961589 15383405 13369068 8482809 5989017 11527225
45286 11527225 22648483 30783802 31273750 26963551 22434771 19498645 18432239 18824676
45278 18824676 18099307 13098720 4533407 -3066966 -6784170 -7909188 -8295941 -7322009
45270 -7322009 -4452516 -2391915 -4668807 -10617588 -15424503 -15967091 -14502962 -14648183
45262 -14648183 -15433514 -13119561 -8647452 -7898857 -12264858 -14971021 -12028808 -11005134
45254 -11005134 -19860060 -30575831 -26154325 -5276531 12160284 9725402 -5094656
45247 -5094656 -12897738 -7448002 603484 931559 -5154552 -10438924 -11800009 -12365086
45239 -12365086 -16187765 -21632091 -21101264 -10666340 1101070 932262 -11105010 -19839526
45231 -19839526 -14994127 -3805789 2464738 5101179 11247543 17991965 15261260 1493852
45223 1493852 -14098179 -23318840 -24631323 -19754966 -13258731 -12324979 -17518087 -17217378
45215 -17217378 -1940793 18921060 27122293 20517143 14138673 16105541 17670883 11333614
45207 11333614 4468284 6879429 15237615 18868754 14583627 8464691 7214665 12684653
45199 12684653 21202915 25236399 19519716 6895480 -5802473 -15903597 -22358736 -18889509
45191 -18889509 -1532630 18574171 24787869 18673731 17738053 25823460 24888532 5171334
45183 5171334 -15746843 -18607481 -10790623 -10657186 -16625078 -13389323 -869356 5749001
45175 5749001 1958460 -1384824 401871 -413815 -5690023 -5441851 3973235 11443758
45167 11443758 8019591 -582513 -4940124 -3732727 1478395 11446064 22110758 23586656
45159 23586656 14787026 9288074 17525775 31628267 37333042 33286356 28160757 24919181
45151 24919181 19524830 11985430 7832416 9232524 12702155 14901836 14060766 7512994
45143 7512994 -4717034 -14864206 -13371392 -251085 15208289 25443137 29116880
45136 29116880 25520304 12834151 -5339493 -18334278 -18220314 -8522429 181266 1773216
45128 1773216 -673739 -605619 3905138 8451776 8033245 3144380 -1192861 -1641945 832121
45119 832121 4467993 9071503 13480812 14398076 10207288 3111008 -4350965 -11326450
45111 -11326450 -15494715 -13247036 -6622011 -4428414 -10971754 -18668015 -18555827 -13458008
45103 -13458008 -12167868 -14024380 -9706875 3035678 14317875 14392991 3218517 -12871914
45095 -12871914 -25719045 -26338990 -12044114 4810820 6373116 -7370223 -15642851 -4421868
45087 -4421868 13656955 17120816 4451416 -8026405 -11158992 -10590574 -10659473 -6287803
45079 -6287803 4583185 12543558 8384459 -3457082 -9756951 -3406074 10387433 19592445
45071 19592445 14932543 -1595431 -15580023 -12850262 3715839 15684675 11329049
45064 11329049 94822 -1403611 8096438 15529264 14068015 11064062 13698152 17783215
45056 17783215 17125935 15524563 19679665 24533467 17274318 -3181934 -21259996 -23905119
45048 -23905119 -16076215 -9902717 -5791845 4303978 18049894 21088541 7448911 -10102449
45040 -10102449 -16605438 -12299514 -5217960 4601289 20790661 35349185 32980327 12889900
45032 12889900 -5962665 -6811296 5874139 14529415 9386011 -4014229 -13649463 -12614908
45024 -12614908 -4502391 328260 -3657220 -9638680 -7638582 33862 1673418 -4711262
45016 -4711262 -7367102 -773898 3554883 -3952657 -13278241 -10921146 -4916475 -14668752
45008 -14668752 -38144175 -49307813 -33178709 -6657663 4796044 -1306380 -7718789
45001 -7718789 -3761566 4761405 9316018 10711042 15066752 24559326 35448186 42110002
44993 42110002 40705498 30638549 15084457 860959 -4160928 2784020 14523546
44986 14523546 19043956 12677518 4830700 5100020 9417118 6113395 -6406824 -16885427
44978 -16885427 -16558459 -8726972 -952404 4099624 6532522 5429773 2073159 1279382
44970 1279382 4807410 7808323 5396137 -1734894 -10919685 -21049986 -29359671 -31165598
44962 -31165598 -27158727 -24842972 -28016838 -30889067 -27475566 -20110378 -12922577 -4236435
44954 -4236435 7056313 14600816 13316034 9305234 10956282 14983848 12654017 6427839
44946 6427839 7519806 17350282 24082784 20022153 11452800 6998996 5359750 385101
44938 385101 -7691006 -11756471 -5994637 8062095 21521572 23991513 13021316 -2114637
44930 -2114637 -9433118 -6415650 190014 4531548 6414952 7521738 8516154 8973959
44922 8973959 5619309 -6644097 -26222949 -40979613 -40353994 -28013704 -14335701 -918895
44914 -918895 16233561 31989307 35266406 27078136 21089793 23955140 28478779 28628540
44906 28628540 26629149 21312513 5766078 -15890805 -24953273 -12208254 7016845
44899 7016845 13277544 7357895 2234130 1169449 -2034271 -8179352 -12050935 -12449669
44891 -12449669 -11599578 -8834202 -4586735 -5034474 -12740425 -19010785 -16338408 -11588547
44883 -11588547 -14696811 -21154775 -19741493 -11971950 -8732824 -11884045 -14731077 -17099637
44875 -17099637 -23206385 -27049469 -18205540 -2179972 3554618 -3857993 -8129128 44449
44867 44449 10113667 11075387 6754055 3676169 -377107 -5646493 -2387515 14503992
44859 14503992 33591474 40684876 35666214 26244910 14538027 71766 -12577050
44852 -12577050 -19734129 -25069454 -31080055 -32199767 -25413063 -18276534 -15492447 -7274028
44844 -7274028 15038264 39498126 45449748 30793545 12762066 4197613 3033951 3447265
44836 3447265 3061027 -1189735 -11250655 -20677891 -20468112 -12843917 -8472065 -10353112
44828 -10353112 -12364390 -13139938 -17188604 -21252409 -15724119 -3800761 -2363201 -15627006
44820 -15627006 -24003424 -11841584 6849537 6711062 -12831450 -27019160 -18851106 2880882
44812 2880882 19636289 23529435 17901786 8784718 1907355 595033 716127 -6607903
44804 -6607903 -21651091 -30510885 -19979440 4416762 22141105 19322291 1308130
44797 1308130 -16450025 -23800623 -20172545 -10025454 125894 3290607 -2812594 -12019157
44789 -12019157 -15734976 -12745297 -8684016 -6224732 -2083659 4770724 8962608 7047858
44781 7047858 4328424 7567015 15043078 20261965 22305672 24815798 26118272 19098258
44773 19098258 2964841 -11938620 -15411345 -9532317 -5201934 -8112819 -11857580 -6023296
44765 -6023296 10253248 25194029 26797361 16852527 8208420 8077900 10605050 8672798
44757 8672798 5086769 5224764 5499394 -561867 -8735316 -8499383 -172013 4427831 280267
44748 280267 -3544838 741319 7463200 7322112 1394794 -2176658 -90012 4156317
44740 4156317 6317072 4251202 -1526046 -6061186 -3236719 5233041 9264328 3011718
44732 3011718 -7947060 -16693240 -24822347 -35131781 -41745986 -37710343 -27957525 -23916603
44724 -23916603 -27287061 -29292391 -25029168 -18618178 -14224298 -11940301 -13399790 -21061118
44716 -21061118 -29401190 -27204266 -13330137 -967768 62488 -2954823 2230521 13266688
44708 13266688 16165017 5737941 -6877641 -9030055 -1778845 3443492 -512166 -9223575
44700 -9223575 -13253222 -9311860 -3478920 -3241018 -8010592 -10529253 -7858082 -6210290
44692 -6210290 -11079869 -16404812 -10773214 5526781 17349398 12568848 -2637110 -12487190
44684 -12487190 -11573832 -7808713 -6726785 -3439688 5655976 12330043 6340094 -8883890
44676 -8883890 -19678510 -19739416 -15626526 -14768983 -16878353 -19299025 -22232039 -24217793
44668 -24217793 -19603778 -6701531 6106650 8600240 957710 -6453797 -3839773 9720560
44660 9720560 25606600 31360846 21600405 5860043 410816 9277208 19510162 18893546
44652 18893546 10452894 3587020 -353645 -4469646 -6218548 -2996007 -2180998 -11698039
44644 -11698039 -23437378 -20917457 -3594559 10937504 11209259 4164680 -979680 -6971856
44636 -6971856 -18846340 -31376111 -35651406 -30780193 -21485570 -10765049 -1421731 2290960
44628 2290960 1321303 3027839 9044209 9861298 -451634 -12240245 -13117546 -5966430
44620 -5966430 -2539254 -4345668 -2776560 4524529 10504643 11595086 11593252 11362698 6007028
44611 6007028 -4649071 -12471669 -11805362 -6179792 -1211164 1670811 1418917 -4789710
44603 -4789710 -15521392 -23477301 -24358879 -21692754 -19110646 -14322506 -5761387 884286
44595 884286 -671312 -8011412 -13064977 -11208389 -2788876 9612604 19246983 15709931
44587 15709931 -3152229 -22083703 -21719851 -2314497 15437554 16673426 10278602 14120650
44579 14120650 29751851 41428287 37359311 22283360 8490304 2828200 5096607
44572 5096607 11721267 16299843 12193844 356197 -9219772 -9401050 -5717045 -7807359
44564 -7807359 -14194428 -14142060 -4141734 6493114 8826483 5509155 5053621 10655142
44556 10655142 18499882 22797560 19620470 9851607 72644 -4104526 -5740436 -10485472
44548 -10485472 -13244889 -2947919 15864871 20811508 730366 -25647968 -33346179
44541 -33346179 -23037649 -13603288 -11914063 -10040653 -7839388 -15484126 -31460911 -38956331
44533 -38956331 -30164011 -16367802 -7378117 1103384 11105489 11858671 -1494720 -14392322
44525 -14392322 -13217171 -6283066 -8401186 -15994016 -15971974 -10568470 -12807161 -21781363
44517 -21781363 -23018068 -12779647 -2788772 1057999 6622193 18207461 28132023 31771460
44509 31771460 35961775 44413056 47725612 37593865 21347363 13153314 17650330 29130570
44501 29130570 39772732 42685989 34893851 23852732 22606095 31440995 33876397 20050204
44493 20050204 4170984 5595761 19898547 24918108 13021020 530624 2132634
44486 2132634 10627522 10001476 -859687 -7175300 2144324 20937930 32508011 27373241
44478 27373241 13270901 6359843 12198050 19464629 16121611 7059155 7957816 23467694
44470 23467694 40421453 43851112 31785559 12145528 -6707117 -18162376 -17734907
44463 -17734907 -7904498 1718411 4683632 4670029 7257723 9144553 2915928 -9435963
44455 -9435963 -15880810 -8914721 4806295 12126351 7478469 -3017794 -9464264 -7685174
44447 -7685174 -1007124 5765042 12096710 19775749 26429874 25335205 13922811 -811562
44439 -811562 -8983107 -8014313 -2747128 2536762 7320097 10813497 10637636 7734089 8174846
44430 8174846 16065886 26235669 27800602 16153250 -69644 -5786233 5688878 24933329
44422 24933329 35146127 29058182 15333880 7470886 9388585 14542207 16427282 15354278
44414 15354278 15376512 18617033 23483473 26342106 25210264 23240052 25991141 32132644
44406 32132644 30849442 15181748 -4611562 -10287054 1359291 14642482 17038299
44399 17038299 14399175 17647739 24311397 24306548 18019651 15639211 19724207 20590401 11629886
44390 11629886 -298662 -4147430 2229005 12394470 19648928 21003152 16825766 10768214
44382 10768214 8049864 10863365 16317699 19564952 17172908 8030127 -5390534 -16731468
44374 -16731468 -21272691 -22287145 -26740445 -33706430 -33581171 -21930009 -7897550 -3736793
44366 -3736793 -10388749 -18753252 -21713366 -19223429 -14054484 -8523823 -4607613 -2641033
44358 -2641033 -643150 1610342 143405 -7013175 -13800854 -12754992 -6511581 -5595219
44350 -5595219 -14105591 -24458670 -28264344 -25839266 -21628084 -16349251 -8966229 -2090223
44342 -2090223 965809 2470554 7251510 13479334 12589692 814565 -13553858 -18251472
44334 -18251472 -10482120 1177110 7291271 6100475 1316227 -3863307 -7331012 -5951724
44326 -5951724 1956245 12573441 19742840 22518083 24604513 25407042 18419050 2674900
44318 2674900 -10556448 -10216399 -1262119 982361 -8055391 -16141935 -12234040 -1828500
44310 -1828500 2075865 -2802334 -7597865 -7488632 -7453459 -10917117 -11464699 -2313645 10973851
44301 10973851 15759718 9706753 4549030 9462267 17908450 17499704 8215120 2008035
44293 2008035 5590047 12982176 16847418 17884980 18374252 15016123 5900554 -1780790
44285 -1780790 -573448 4335018 1297312 -9953671 -17197073 -13744309 -7227376 -6151795
44277 -6151795 -6673059 -186293 11146083 14865183 3883309 -13761820 -22552836 -15238683
44269 -15238683 -106396 7743890 2486843 -7017003 -9447491 -4974756 -2235774 -4723409
44261 -4723409 -8105455 -10120424 -13672451 -18196236 -17383469 -9614740 -1955808 1552783
44253 1552783 6824689 17633160 24984804 18908912 5041430 -2397780 -1346137 -3410844
44245 -3410844 -14469243 -25407115 -25719242 -17350533 -10070775 -9169753 -12416813 -15086969
44237 -15086969 -13795069 -7469245 2677391 14344194 24500037 27418294 16821096
44230 16821096 -4000014 -17762190 -8872856 15883305 32335009 27645086 14317623
44223 14317623 10468201 16200700 18765693 13662454 8306813 7410815 7077847 5085047
44215 5085047 6472657 13947847 20170734 16290298 4517430 -3986728 -2680014 3861982
44207 3861982 7335886 5460109 2391557 1968235 3495741 3902618 1668598 -2124838
44199 -2124838 -4817477 -3167241 4430976 14136835 16789456 6212790 -12057099 -24498321
44191 -24498321 -23954319 -16604381 -12048059 -10676736 -6086749 2558573 7774109 4300236
44183 4300236 -3839078 -9754546 -12058134 -12512496 -9679014 -1665809 6216423 4129653
44175 4129653 -9615069 -24104704 -27799155 -21102878 -12824530 -7438825 -1811083 6337179
44167 6337179 12982670 12893579 6373216 -1244499 -4652474 -2302107 2283996 2484078 -4574874
44158 -4574874 -12113865 -8869073 7414309 25221503 30949047 22533604 8844478 -1176085
44150 -1176085 -5142317 -5553192 -5506773 -5306193 -1734869 7123906 16014368 16850860 10918756
44141 10918756 9158053 15241431 16867304 3101755 -16625930 -23392330 -14674061 -5299336
44133 -5299336 -3838900 -3781173 -708969 -1722707 -10004806 -14221399 -4929728 8525618
44125 8525618 10367755 1242195 -4029017 1810033 10853910 13460739 9289337 4196862
44117 4196862 3684685 9827062 18528627 20527354 11458386 -177854 -2006580 6108218
44109 6108218 12421876 9687005 3245418 1424549 5377494 11170287 15566299 16191363
44101 16191363 10866298 658861 -9210031 -14008818 -13067168 -8042513 -668274 6805449
44093 6805449 11602624 11743646 6244841 -3985730 -12680040 -9390827 9403275 32031060
44085 32031060 41735016 35066594 23651636 18249968 19248619 23244240 28838512 32454005
44077 32454005 28185146 17879523 13385278 21438867 32457188 32133293 19552649 5940506
44069 5940506 -1020118 -3281694 -4776778 -6014140 -6834512 -8153594 -9623200 -9813454
44061 -9813454 -9124457 -8844498 -7751517 -3884782 391622 -239285 -6148064 -9713410 -2894300
44052 -2894300 12665832 24594708 20621502 2066970 -15096317 -16593034 -6484851
44045 -6484851 -1573235 -8766990 -16470447 -12252068 166440 9191035 12487087 14928573
44037 14928573 15253802 8336421 -1495372 -4108387 -1741755 -8237412 -24777358 -31543098
44029 -31543098 -14654711 10185761 16348559 2692530 -5972957 4339351 16584316
44022 16584316 8144066 -15333335 -25983217 -10522087 13232656 20685003 10101212
44015 10101212 -1157991 -3128931 -3114206 -9492920 -18605077 -23337451 -25000556 -28160244
44007 -28160244 -30221159 -25946591 -18548940 -16095384 -18256956 -16457734 -7641723 1156974
43999 1156974 3502201 598439 -4198029 -9808130 -13937174 -13315851 -10847434 -14711578
43991 -14711578 -26168526 -35684151 -35968183 -31610884 -30196129 -30983648 -29317754 -25958821
43983 -25958821 -23863806 -20302235 -10667805 2600961 12435312 16428780 17181001 15770018
43975 15770018 11764457 7927621 8067194 11082355 12791212 12218209 10719219 7269355
43967 7269355 1068239 -3057892 1198443 12634143 23002917 24949945 15129697 -5861998
43959 -5861998 -29104448 -37770759 -23161416 1122653 12031493 4119944 -6797186
43952 -6797186 -7096712 -245721 4191929 4170160 2588742 1240952 2867978 10378700 19063767
43943 19063767 18883669 9855850 4995673 10951961 16222139 8427808 -5597933 -8824684
43935 -8824684 2945624 19014507 30454949 36369826 35517190 24703616 7794773 -3706650
43927 -3706650 -3428037 2398067 3569635 -1688284 -5565399 -515249 10808225 16559548
43919 16559548 9229451 -3160516 -5610946 3947909 12277677 10662170 5686737 4710037
43911 4710037 3859481 592712 4681037 21164370 33525621 23650706 1289265 -8617655
43903 -8617655 -4227030 -7629979 -26583537 -42302557 -43013840 -43245649 -54864973 -61883559
43895 -61883559 -45363006 -17385221 -6394763 -17344016 -28976950 -26768488 -17261837
43888 -17261837 -9481169 -1688261 8616119 16691313 18970460 18745471 18197384 13845991
43880 13845991 5040208 -845001 2523284 11319504 16180014 12444265 2711540 -7592715
43872 -7592715 -14462543 -17207478 -17973730 -18857687 -20162925 -22204265 -25778713 -28634290
43864 -28634290 -25842913 -17636315 -11783515 -12397745 -12009116 -3104369 7703693 8407355
43856 8407355 1330822 472910 8933051 13530802 6146529 -3143291 -1944442 6420459
43848 6420459 10367679 7432596 3828365 2194333 478427 185058 5436219 13900649
43840 13900649 17397811 13458198 9755707 14086683 24210335 31075638 30432862 28199948
43832 28199948 33192901 45588261 55554224 55183562 48294314 43223187 38554637 24986639
43824 24986639 2607287 -13817816 -12653179 -636448 7400281 7953309 8715300 13171623
43816 13171623 16361610 15777450 16375321 21859939 28293944 29861671 25746282 18300213
43808 18300213 9022539 -209807 -5304595 -3017226 5274378 14402838 19036142 16969971
43800 16969971 11643877 10987155 19621267 31643523 35735425 28707549 18750254 12907922
43792 12907922 7772725 -1748430 -9837221 -5445244 9954964 19934004 12753232 -3036057
43784 -3036057 -8914779 1203207 15820332 21954519 18765279 12938882 7370845 252237
43776 252237 -7940906 -13106484 -13090531 -9714560 -4572846 2924455 11960084 18433327 18629204
43767 18629204 12308434 1230681 -12112836 -23154961 -27024832 -24556163 -22699832 -25081203
43759 -25081203 -25610904 -16931262 -3177709 2534708 -5492159 -17368258 -19141736 -9035587
43751 -9035587 1792120 3261391 -2939925 -7438493 -4687221 2364558 7669780 8192903
43743 8192903 3724278 -5052088 -14416093 -16567021 -7041513 6881174 11850216 5121409
43735 5121409 -137071 9362692 30004348 45152903 43372231 27509709 7632695 -8528027
43727 -8528027 -17417216 -18067057 -12823876 -7810673 -9086542 -16889284 -24290042 -23326911
43719 -23326911 -13636495 -3208286 1789060 5132238 12976188 20213396 14139572 -5496571
43711 -5496571 -20375778 -15177962 2144527 11131477 4814855 -5278316 -6845915 1324535
43703 1324535 13670086 22865626 20535665 4520740 -12697095 -14352233 -1839244 4621488
43695 4621488 -6486146 -20983580 -18505303 103231 16476911 20262211 18172220 18832930
43687 18832930 20994095 20355755 18972116 21334625 25386070 23985310 15291840 7290291
43679 7290291 9659218 22860405 37935376 46435844 46779238 40189014 26328560 7803915
43671 7803915 -5712798 -5701919 4218331 12644300 14860812 15674147 18972833 23626319
43663 23626319 29861955 39284171 46884872 44325289 34300793 29279194 30970673 24976156
43655 24976156 4487667 -14587462 -14870920 -2087598 6788654 9842305 16311934 23594065
43647 23594065 19868937 8302275 6874605 20040912 29891863 23074545 10171558 8565666
43639 8565666 19072381 30164060 35386258 36189034 34785984 33051805 32526148 29072807
43631 29072807 15124830 -6210385 -18448840 -11785606 2847737 9745064 9729444 12962806
43623 12962806 17943793 13690325 68824 -10120266 -10509433 -8360829 -9346953 -8584098
43615 -8584098 -2557473 1755435 -2059947 -8279192 -7509109 -684435 4512078 6846894
43607 6846894 11042984 15795689 13161436 2436470 -4713874 944940 12689534 17313128
43599 17313128 14787813 18217527 32797091 45148846 40353722 22408402 8052574
43592 8052574 3788003 160383 -10706837 -22833360 -25770075 -17848386 -4792048 8254429
43584 8254429 17734130 20217795 15774762 9149365 3948264 494223 1712487 12349654
43576 12349654 27000131 29202435 12194642 -7872313 -11172357 430355 10579050
43569 10579050 14439649 20526163 29601431 31044416 22684607 16544108 19308171 22676526
43561 22676526 19693940 15519091 13685300 6603847 -9100590 -20881231 -16981402 -4360270
43553 -4360270 3158041 4582022 5151204 110132 -16298549 -31802105 -26812237 -3416609
43545 -3416609 15620438 18619886 16616749 18502217 14487232 -4296764 -25487127 -30422212
43537 -30422212 -20359164 -12368144 -13466166 -13550486 -4203253 8153331 12171293 6422611
43529 6422611 -1196732 -4753279 -5895891 -9185014 -15438330 -20960887 -21963818 -17906968
43521 -17906968 -10548289 -2197787 3663256 3058153 -3552520 -9064799 -7230585 -1235697
43513 -1235697 739018 -2101211 -2431463 2192976 3890626 -3057148 -10913262 -7143452
43505 -7143452 8783060 24386433 29125970 24435699 18596232 16736914 17508744 16234155
43497 16234155 9466771 -1851236 -12719866 -18604335 -19783537 -20026779 -21274260 -21600147
43489 -21600147 -18927081 -14619893 -11320579 -8083072 -1003606 9485257 15042615 8109350
43481 8109350 -6431160 -14776888 -11627132 -7114229 -11342970 -19173460 -19205912 -12459829
43473 -12459829 -9826392 -12652943 -9778139 3168088 14311631 11641426 -1476544 -13828346
43465 -13828346 -20734624 -23604921 -23213194 -21746307 -24847515 -33468421 -40018300 -40307228
43457 -40307228 -41412280 -48032579 -49831755 -35995773 -15677932 -7301962 -10551445 -7192946
43449 -7192946 8789180 20026921 11295751 -8638564 -20105632 -16827544 -7533527 -1062815
43441 -1062815 697923 -82670 940409 8390389 21473600 32902564 37141330 35714790
43433 35714790 31406710 23317885 12397831 5563744 7538151 13141557 14683408 13298148
43425 13298148 15076958 17942120 11166524 -9941210 -34791595 -47076150 -42088429 -31582080
43417 -31582080 -30134165 -38045260 -41634872 -32048530 -18224019 -15187340 -23887505 -31930817
43409 -31930817 -32093122 -28589451 -24736957 -17849927 -10254442 -11537603 -22302200 -28362386
43401 -28362386 -21082089 -11638382 -12280954 -14099496 -211867 25549640 41805077 39867553
43393 39867553 32987766 33184760 35014896 27966939 12040112 -5839870 -20895250 -29392754
43385 -29392754 -26863432 -14342268 -694396 6417674 7375349 6213879 6063044 10904360
43377 10904360 22807418 33503972 28848599 8575030 -7696043 -3481320 13082892
43370 13082892 21610325 17102270 11649711 11329030 7327480 -6004944 -17877553 -14894238
43362 -14894238 38174 12716114 17160212 19671296 24570722 27118645 24172211 21883518
43354 21883518 24631921 23212804 6186260 -18405563 -26102643 -5887200 23704077
43347 23704077 36937191 31540667 25937043 30660424 36236207 30426821 15304808 2414708
43339 2414708 -248783 8590657 25510147 41447585 45395574 36501648 27847209 30592213
43331 30592213 38281532 36002820 22904463 14098621 17610969 20807804 8399170 -13099558
43323 -13099558 -21399047 -8731602 6225291 2849551 -14298542 -23476480 -16167057 -6270376
43315 -6270376 -7918003 -17105078 -21647962 -19235013 -16508832 -17110582 -20382209 -27157708
43307 -27157708 -36825239 -41917227 -35899962 -24487081 -19125814 -20436383 -18568962 -9480362
43299 -9480362 555962 7577069 14836654 21686585 19299613 3697596 -15802166 -27217913
43291 -27217913 -27866246 -21191683 -9848160 2382570 9346206 9520482 8152780 7608600
43283 7608600 3192802 -5675221 -8671260 2526042 20696651 31026692 28278784 18940378
43275 18940378 10838320 7542801 8631672 8923933 1991857 -9737809 -14363082 -6450555
43267 -6450555 3521709 3591028 -3577226 -8934046 -13445060 -23040734 -32813210 -31396830
43259 -31396830 -19233623 -8444262 -4876728 -3395510 -862505 98611 1526864 9781422
43251 9781422 21244981 22688005 12151361 6407631 18604092 38729992 46925757 39515249
43243 39515249 31072832 33606630 42985176 46402515 37319006 20906999 6369852 -4383906
43235 -4383906 -17175027 -32427418 -37415576 -20656630 8346346 25824285 22401059
43228 22401059 13423826 16091093 28141924 37326006 41091288 44486626 45363674 36168427
43220 36168427 19362631 8467789 11285801 21336392 28942326 32693833 35576189 36673862
43212 36673862 33454481 28806645 28787485 33422558 35172641 28327843 16305591 7461439
43204 7461439 6628001 13317734 24716214 35572125 37817675 27997357 15732958 16825502
43196 16825502 34456880 54001186 60844219 56524974 51549688 49619919 47710005 46037246
43188 46037246 47098400 47467957 40990852 29202223 19449753 13989243 10324082 10416440
43180 10416440 17962343 26673230 23893459 8481008 -6115844 -9687069 -5522399 -52429
43172 -52429 5896428 10951973 10218272 4921748 4287390 10599638 12681703 2538770 -11177128
43163 -11177128 -15953458 -13256070 -12797373 -15356924 -12650243 -964118 14506006 26672033
43155 26672033 30771344 24873876 13107015 5133173 6202437 11361308 14915935 20070161
43147 20070161 31901937 45794630 51336325 44905033 31724157 18748873 11468819
43140 11468819 13310797 21363640 26467849 23618386 18122783 16381389 16772560 15705707
43132 15705707 15180746 16550516 14457448 6063843 -1286543 -1557981 -994170 -6000983
43124 -6000983 -8634539 1238213 16295383 20928188 15370567 13155292 17397741 18429587
43116 18429587 14810115 17083639 27093924 31868936 24580461 16016219 17795447 27522964
43108 27522964 37683027 46451008 51984646 48406245 36925935 30681818 38491446 51625076
43100 51625076 55902641 50250971 44372225 43370271 43457356 39904027 32321898 23551350
43092 23551350 17390595 15900634 17674199 21616386 31135770 48259896 64772947 68477778
43084 68477778 59185031 48679529 43150209 36797812 26310648 19643771 23651238 32584798
43076 32584798 36165515 31728527 22747938 13095746 8207516 13876007 27880697 39619848
43068 39619848 42322714 38209808 29474355 15511554 2883947 4082239 18857296 30070946
43060 30070946 27290606 21268230 24123702 29099873 24691954 16861229 19471481 30831209
43052 30831209 37938497 38863457 43007095 51761726 56173864 53898524 53270833 58809167
43044 58809167 64838063 64746087 56950844 43199183 30848469 32761669 52033101 70552256
43036 70552256 68088309 50543619 42115573 49663735 54315090 42632238 26665965 23589914
43028 23589914 31342726 36757585 36239965 35319337 35281726 32832458 29430747 30971118 39602279
43019 39602279 52284712 65277788 75206104 79467624 81583567 92961778 122088245
43012 122088245 162111931 194876650 209345372 213599482 226829822 259771472 303959481
43005 303959481 340787858 359406272 362169597 353580622 332150781 298149579 262162126
42998 262162126 236547631 221036589 205242141 184080171 162868137 148255914 142078709
42991 142078709 143665875 150386946 155936087 155391657 151880383 151647274 154117729 154556986
42983 154556986 154280378 158397248 164519055 164375976 156834168 148661216 141721994 130744660
42975 130744660 115738601 105271528 103799937 105468844 103906702 99449844 94270865 89176771
42967 89176771 86872500 89389052 92077511 90431797 91243223 102899202 115694258 110410899
42959 110410899 89356906 78182971 89195087 103393575 100791275 89144014 86527114
42952 86527114 92032512 93192239 90421725 93835754 103473992 111423828 118205733 129947211
42944 129947211 143692162 151667796 156469571 166788427 181695337 194125379 206134813
42937 206134813 225039870 247641404 264591196 278156485 298890825 325994398 348565461
42930 348565461 366573489 391882397 424705079 446392258 442250856 417763590 386198274
42923 386198274 353113540 319783488 290052013 265670932 243333708 222618922 209352370
42916 209352370 205985981 205458237 198501441 181074039 153555935 121007076 95349106
42909 95349106 87328268 93714207 101194687 103603030 104698725 104340488 97087821 87737999
42901 87737999 91531575 111013044 127456584 125398256 112819407 105883101 105876000 104658327
42893 104658327 102559945 105124707 108734173 105233901 97374492 95142100 98563033 98096205
42885 98096205 92008692 89670023 94967683 98616544 92171219 80682444 75522186 80861079
42877 80861079 92786220 107127458 122049756 134940442 142453533 144616757 145419376 147223261
42869 147223261 146619890 139216739 128099886 122508334 125593127 128997561 125465752 122057397
42861 122057397 131246472 150646305 163275445 160483146 153583290 157176653 170277876
42854 170277876 181457755 185395782 185686143 185841505 185716913 184452400 180668240 171814484
42846 171814484 158179261 144848679 135254254 125820129 111248349 92023893 73117339
42839 73117339 59037159 53317767 57715372 67654252 73403543 69902432 60577837 49097365
42831 49097365 35579505 24735627 26299737 38978583 45236243 34594164 22849311
42824 22849311 31946506 56108949 66304667 48750336 22189001 12384367 23117876
42817 23117876 39397900 49172522 53097940 57507840 64562344 69178338 64508104 51309643
42809 51309643 39442269 36616643 39061672 38501141 34313810 31680252 31548624 31123989
42801 31123989 31139788 33035612 31821241 22802778 13349685 15436967 26891051 33434194
42793 33434194 30760840 30519607 40460744 52427147 56759471 56607395 59255564 62498719
42785 62498719 58954621 47953538 35543007 27116150 25406539 30937803 39737904 45143496
42777 45143496 45300026 44159656 43599071 41455669 38546486 38446920 38222695 30362729 17438472
42768 17438472 12193682 17262369 18765248 9385102 3771067 17078672 39324085 47845059
42760 47845059 38225038 25685226 20224235 18748791 21266509 35892108 62061164 83316602
42752 83316602 85286856 71889190 56625035 44709691 30996083 11775291 -7389869
42745 -7389869 -15118015 -4010721 20922144 43345336 48672213 37451339 23594297
42738 23594297 19444777 25301750 32804887 34355266 28271747 18006539 8458559 2718332
42730 2718332 1881599 6317892 14101380 19188318 16626925 10289847 8947353 13138614
42722 13138614 14281207 10109101 10781882 22955023 37877646 44773893 46556509 50373355
42714 50373355 51641271 43012032 32539032 34467130 44615666 44182388 28889408 15178549
42706 15178549 13638960 15234035 10689636 5047164 2823366 -4009934 -19599310 -30490943
42698 -30490943 -24603121 -12454481 -11718750 -19447784 -19380514 -11202679 -10112705 -17294129
42690 -17294129 -14230321 5972825 22035266 13319630 -9087723 -17360567 -5108343
42683 -5108343 7770770 6626578 153428 1822529 8538419 8842709 3007098 1636462
42675 1636462 7769375 12923353 11108013 5579216 -209004 -7143893 -12065342 -6801408
42667 -6801408 6784146 11955342 -889363 -15681455 -8996869 17214928 37195637
42660 37195637 35642851 24382783 20645291 23666820 21995923 13479703 6694507 7421154
42652 7421154 13093655 18793549 21830104 20838940 15215071 6560428 -415061 1058091
42644 1058091 14741786 33466654 39790018 22609259 -7639616 -28921987 -32651080
42637 -32651080 -29064983 -27394642 -23894734 -14252625 -4701195 -1807096 -1111540 4292140
42629 4292140 11612331 14222755 12716551 10716939 6532436 -603349 -2229619 9368844
42621 9368844 26757863 34728344 29999991 22833098 20656156 21011935 20629163 21073538
42613 21073538 23405972 24895728 22835276 16581374 6541973 -3783726 -7224332 -580014
42605 -580014 9904020 16930899 21865214 28531713 32616966 27826534 19031251 17658658
42597 17658658 25769975 35690771 43288608 49457529 50267113 39922057 24326505 17693059
42589 17693059 23113277 29242273 28329808 23725167 16816975 2443633 -16596123 -25649407
42581 -25649407 -17464525 -2451862 8626506 18717357 31357904 37846925 31573978
42574 31573978 23495371 27002627 35877976 34618393 24685480 21626611 28328841 30812088
42566 30812088 23595246 21047369 35021914 54321685 57294150 37954139 10780735
42559 10780735 -6180419 -5948667 6065916 17993000 19703071 10968876 2007858 1929965
42551 1929965 6633504 3109871 -12296895 -25187871 -18409828 6262424 29334198 37247302
42543 37247302 35954892 36444610 36761305 29307217 19226092 19852316 30363610 34128384
42535 34128384 23978367 14235791 18630499 28504153 25258325 6563069 -12701673 -21288000
42527 -21288000 -21185520 -17974519 -12579667 -4239063 5412803 12909869 14375967 8164801
42519 8164801 -659569 -2480890 5630848 15392265 19004725 19282138 21302225 21084756
42511 21084756 12916272 2692800 1547548 8304556 10402743 2281774 -8107677 -11840704
42503 -11840704 -7882988 1259791 12304677 18399164 14669209 9119004 16481072 36458578
42495 36458578 49183835 39801338 18502636 6705779 9733897 14460674 12123086 11913080
42487 11913080 27178721 54560371 74720244 74304936 60755578 50344978 46163657
42480 46163657 37800022 22624023 14324696 23555752 41379748 52686086 56877215 61692435
42472 61692435 64105131 54995159 39935050 36600382 49586355 64698820 71932340 77530121
42464 77530121 87459203 95476197 96778128 98997511 108177815 115540671 110592198 98256477
42456 98256477 90460622 87727905 81682429 71080925 63241794 61486140 60917736 56061403
42448 56061403 45990422 33339526 23273757 20966081 26256484 34245011 43003037 53795470
42440 53795470 61365602 54738443 33955532 15236914 10550850 11923062 6448136 -2911848
42432 -2911848 -4559400 1680483 6350849 6855959 7630937 7609370 2078827 -4972862 -4164931
42423 -4164931 4375669 11482438 12823968 10682655 4826474 -5076751 -10752977 -4035904
42415 -4035904 7572171 10165017 6787423 12785401 27164215 30385549 16761905 7339261
42407 7339261 18855250 38386237 43935917 35475196 28501705 27943533 27158846 26155531
42399 26155531 31535662 39589449 36816762 20757931 7082092 9989851 24069753 31704791
42391 31704791 23590353 6512683 -6881187 -10747510 -7331600 196710 10286887 17820136
42383 17820136 14267834 -329989 -11488855 -6676858 5806997 6987633 -4821167
42376 -4821167 -11499350 -3504083 5843430 2856262 -4460375 288965 16482063 27989642
42368 27989642 24535243 10369428 -3996831 -9518917 -2887841 8659926 12215310 5915651
42360 5915651 2722650 9476750 13497703 2857627 -11010141 -8611405 7195672 16011217
42352 16011217 11541543 7950301 14633352 24648244 31200960 36846828 41233538 37157330
42344 37157330 25467617 18149185 19720501 20826042 17176869 18198130 27689117 33126326
42336 33126326 26982960 22787603 33956965 50014829 52215778 42411783 36438425 36464465
42328 36464465 31951021 24562892 28693290 44824785 54073373 46228791 34671855 33833332
42320 33833332 38130238 35876858 30622770 32623441 37621438 31884523 15952995 6642968
42312 6642968 12528587 21178374 17188706 2831430 -7350561 -5570774 4470148 17172642
42304 17172642 29062005 34690479 29398108 18608873 15006828 22002616 28451447 25688625
42296 25688625 20798790 23385021 27060130 18241865 -267629 -10812782 -7153078 -2556053
42288 -2556053 -6005631 -6626784 7089531 25647890 30944806 22012734 12971976 10453287
42280 10453287 9166220 7777090 12007523 19372408 16803047 573292 -13538205 -9121333
42272 -9121333 9566105 23539021 21103564 6815944 -7216953 -11754113 -4566211 9330896
42264 9330896 21685479 28487086 32253697 35374716 35417437 30857361 27146805 30787057
42256 30787057 39222256 43087516 38726139 32716182 32082648 34664850 32649533 22991612
42248 22991612 10228519 -314081 -7586938 -11405380 -8340302 3772072 18655403
42241 18655403 25520481 22009285 17298343 18821452 21781894 17415398 6462477 -2914050
42233 -2914050 -6300772 -3349438 8844849 30230213 46636355 39012795 8765258 -18529236
42225 -18529236 -21998885 -7711564 5786600 12827012 18996997 22678962 15286874 -696237
42217 -696237 -8889450 1183111 21123590 34994309 36150859 28334529 16819717 5215976
42209 5215976 -2068794 -958804 7439620 16249000 19125853 16655742 14745211 15849681
42201 15849681 14288344 4074389 -9885806 -14742312 -5575978 8009763 14624912 14094715
42193 14094715 12885282 13353392 15017688 20708848 31589612 39452975 34666209 20836670
42185 20836670 11593504 12859204 18186801 21912913 25571560 28782509 25761366 16949197
42177 16949197 14054425 24987571 40354367 43565961 30740570 13402258 3776671
42170 3776671 3427080 5152254 1598276 -7331024 -13389742 -8318554 5470206 16288242
42162 16288242 16805368 11405847 7970529 8631576 12099444 17971794 22980029 19578422
42154 19578422 6075436 -6496553 -5739795 7222352 21856604 33499008 45245007
42147 45245007 56966501 63186946 62598532 60039179 56944569 48840732 35620869 25661167
42139 25661167 24302531 25104219 19236579 8994443 5007976 12331067 25419836 35746227
42131 35746227 38845192 34389413 25348779 18691868 21925470 35622098 52031395 63696901
42123 63696901 70881553 77587069 83524382 85499216 85042359 87085184 89694250 83470828
42115 83470828 66345574 51811273 53969788 68539916 78068664 73849997 62901917
42108 62901917 54400474 50776900 53604997 65490583 80537677 83850682 68382342 44364818
42100 44364818 25243921 12792391 3892685 2390315 12356935 25923016 30571862 25588825
42092 25588825 20385917 19201213 18196802 15582802 13908125 13692744 14610944 20522174
42084 20522174 32332697 38691837 27390854 5589361 -5301053 3587786 20086123
42077 20086123 30673459 34052883 32220248 24241859 15290413 16306461 25838289 27055795
42069 27055795 14058754 6649515 23191141 49723390 55199936 32783227 7443057
42062 7443057 2011103 11932267 18473258 14580120 9513030 13501841 24709824 31460963
42054 31460963 25674567 12971395 6750374 11851367 19272799 19576724 15080903 13687835
42046 13687835 16568377 18682554 17019156 11915878 4803669 1021378 9087403 28892655
42038 28892655 45819587 46030830 33385439 21908239 16864853 14847656 17046883 26656995
42030 26656995 35074894 28368014 10271299 2037469 13360198 28747297 31352673 26019655
42022 26019655 26393323 30673036 26128295 12195341 3142114 7434413 16859514 19178807
42014 19178807 12904655 6003968 5979406 14473618 27366345 37155074 37855629 29885257
42006 29885257 19060458 10562977 5801973 4809892 8061804 14182768 18636781 17870338
41998 17870338 14102140 13005708 15855522 16836337 10851621 2097501 79408 6381752
41990 6381752 10711998 3843003 -9356066 -15195911 -7680500 5766300 14565427 15407304
41982 15407304 11667182 7711400 6104681 6918297 7695766 6556226 6181438 11403305
41974 11403305 21558541 28805844 26293667 15414915 2869847 -7110288 -15058819 -22248615
41966 -22248615 -27294802 -27671522 -23732992 -19517913 -17936215 -16431804 -11456831 -7216901
41958 -7216901 -13007502 -28054959 -36630241 -26548622 -6986549 3284147 2396716 6365960
41950 6365960 22469222 36687136 34912658 24473728 23048086 33081773 39622824 31961076
41942 31961076 17083500 9554823 14422548 23296164 25055036 18527042 13626257 18537235
41934 18537235 27829514 29048592 21286179 18606636 30138714 44331526 41636846 19251302
41926 19251302 -5450390 -15331157 -9914996 -1001563 1146092 -5523007 -17150467 -28432043
41918 -28432043 -35225624 -35248259 -28293925 -16972748 -6191861 522628 3950176 6158980
41910 6158980 6182610 3286466 3142383 13152701 29952282 39340363 32775499 17592468
41902 17592468 6346122 2210575 306041 -2421906 -5405657 -8382851 -10871648 -10678162
41894 -10678162 -7304715 -2985019 2658800 12307847 21542723 19506016 6086345 -2467513
41886 -2467513 3652960 9749797 -3016794 -26852173 -36090652 -23732527 -8963844 -6724671
41878 -6724671 -9779680 -6873797 -425462 3135560 5365224 7462372 3078832 -8695347
41870 -8695347 -14429975 -3678110 13346140 18816579 11542882 4856014 5306949 7503679
41862 7503679 7658689 8355962 9479717 6796201 1822328 2686990 11899286 21473710 23162575
41853 23162575 16613041 5527261 -6443616 -13069894 -6933175 10820397 26906864
41846 26906864 27345897 10423037 -13690405 -32307105 -37152536 -27421965 -10873349 834273
41838 834273 1967876 -3480777 -9318916 -14265252 -18158973 -16075167 -3208733 16035680
41830 16035680 30777531 36033223 36506711 36953271 35221992 28368139 20268918 17557242
41822 17557242 20881454 25876809 31063265 38242248 44889937 43346193 31083614 16678059
41814 16678059 10710892 13695753 17831887 18619064 19077832 22681367 27755575 30872016
41806 30872016 31607815 30906007 27385658 18987443 7655668 -931794 -3500442 -2985282
41798 -2985282 -3884760 -4684357 1017132 13576317 21724941 14316228 -3551065 -14540768
41790 -14540768 -11619740 -7744214 -16995126 -34327832 -44027158 -42133051 -37101426 -30958260
41782 -30958260 -16339950 4281966 12789732 -1135173 -22490989 -29457289 -21664757
41775 -21664757 -16337458 -21010869 -25628739 -22054726 -16317548 -15906972 -16657653 -10784910
41767 -10784910 -328508 6601412 8536657 10555265 13496911 12170513 4830344 -3704576
41759 -3704576 -10944737 -21215675 -36094407 -46325981 -41272229 -24147099 -9469780
41752 -9469780 -4691687 -2340316 6610588 19257428 26495659 26263893 23280709 19542318
41744 19542318 14350361 11936344 18149500 27997744 27763184 15071105 6840835 17717741
41736 17717741 37247066 40829420 21978766 1535672 1323007 18298792 31655534
41729 31655534 29295140 18236746 10509026 8201288 6347234 4503905 8376719 20477419
41721 20477419 34617480 41889303 39567348 32439695 27150089 26394469 27006901 23197240
41713 23197240 13831656 6156564 8001479 15926991 17742100 9583731 2610406 6671181
41705 6671181 15216393 16173342 11540127 13179632 22248021 27507440 24400649 20603908
41697 20603908 19350449 12830791 -910774 -9203356 -3137244 7609070 10246231 8335527
41689 8335527 11854888 16965217 12365037 445912 -5400531 -2857461 -2976425 -9227551
41681 -9227551 -10813979 -1522705 9173658 10710790 5482687 977207 -1984247 -4955712
41673 -4955712 -4456950 1802959 7489400 5737026 345106 -262370 2492448 -1629137
41665 -1629137 -16098771 -31150115 -35227452 -27439299 -15858073 -7293610 -2337302 855260
41657 855260 1463409 -3266554 -12585528 -20026744 -19301193 -12175513 -7595567 -11743132 -20997364
41648 -20997364 -26193384 -22139620 -11282392 288053 7599841 8034435 1574277 -7648876
41640 -7648876 -12243244 -8490248 -2692186 -5250051 -15676631 -19835642 -8731289 5773636
41632 5773636 5288350 -7907236 -13079256 -2493161 6677860 356254 -9490191 -5161606
41624 -5161606 6903133 7051207 -4362622 -7604149 3825557 13904773 11727286 7767962
41616 7767962 13855158 24043620 26566188 21571835 15548237 8731954 -620162 -7770254
41608 -7770254 -7689253 -3114340 1518156 6497618 10121343 5759298 -5116136 -7923376
41600 -7923376 4818475 18255941 14756350 325662 -5308492 1036536 4574147 -957674
41592 -957674 -5266845 -2380443 -1009308 -7565003 -14263816 -12962510 -8748609 -9948911
41584 -9948911 -13660434 -11366639 -3036937 3652231 4618774 2199514 -818265 -3025567
41576 -3025567 -1383359 7357871 21048887 31462580 31052734 20178398 7638591 3222381
41568 3222381 8257883 14530826 14621150 11423742 13580214 22763763 30514476 28010620
41560 28010620 14828397 -2198623 -14943596 -19136434 -17843987 -19364541 -27198859 -33197781
41552 -33197781 -26280596 -7168423 11929745 21792903 23120858 19267972 11105370 1298462
41544 1298462 -4940015 -7048550 -9659963 -12766510 -9882931 -644221 4035307 -3000272
41536 -3000272 -12604139 -11348722 -844189 5435115 2068469 -2341611 29308 4884527
41528 4884527 3513507 -3886750 -8255770 -4198478 1444849 -3544646 -21205244 -38407015
41520 -38407015 -41180962 -30972661 -19942185 -12233271 -594302 16503773 26789176
41513 26789176 20418240 4170887 -9872091 -20914181 -33173166 -40913777 -35085497
41506 -35085497 -21470053 -16002756 -21018899 -20994072 -5679176 15782929 29507270 33777616
41498 33777616 33596891 28223476 14355728 -3399023 -14315413 -12456005 -1196238 10551081
41490 10551081 13640011 4706577 -9276744 -16590008 -13963542 -9109509 -7478094 -4285650
41482 -4285650 4683209 12140465 7902508 -6406678 -19655007 -24454488 -20470094 -9269283
41474 -9269283 4544233 10974754 4745009 -4185366 -2078865 7332383 6410574 -9748297
41466 -9748297 -24572073 -23563468 -13054184 -6223416 -2372607 6358073 15324167 10704886
41458 10704886 -8388720 -25228095 -26175825 -15650504 -6177522 -2334152 -510781 2097195
41450 2097195 5840851 12563160 23762623 35140481 38792317 32282750 21961683 16057797
41442 16057797 17356848 23513620 30704840 34344868 29748849 17026996 4007604 -1208415
41434 -1208415 -987986 -5541136 -17541227 -26215097 -22095327 -11652235 -8482906 -13084863
41426 -13084863 -12310499 -49289 12192485 10332219 -4744782 -21101625 -31165051
41419 -31165051 -35929604 -37885781 -37773148 -37215449 -38030848 -38501419 -34597834 -25037118 -12430214
41410 -12430214 -578417 7035752 8558243 6611638 7110826 12122013 17124023 18169823
41402 18169823 16549179 12040940 -1396893 -24938844 -45391889 -47226361 -32090017
41395 -32090017 -16466577 -11288277 -13789328 -18190529 -22573265 -23931688 -17968142 -7078626
41387 -7078626 1032367 5084162 10581563 16498813 13748215 1288098 -8486409 -6859337
41379 -6859337 -51855 3532200 5552311 8697926 7575234 -36694 -3854760 3335071
41371 3335071 10171387 2506027 -12602029 -16430336 -7806658 -3472194 -9607846 -12948664
41363 -12948664 -5118275 2510334 -1900829 -10504336 -7590176 6805789 17714490 16003826
41355 16003826 7472330 1544974 -121054 -771233 -103930 5596979 15257150 20207527
41347 20207527 14165723 3893563 2794913 12666312 20045021 15049834 5046492 1702494
41339 1702494 2853638 -754835 -6476110 -2670878 10436969 17983517 11775465 1767729
41331 1767729 1374032 11508660 24061235 32072152 31527954 21466549 7482061 -1886377
41323 -1886377 -5870254 -10795580 -16057755 -11530281 5410554 21212057 23327319 17373824
41315 17373824 16963852 23016944 24530536 16540897 6467177 2725442 5149460 7645847
41307 7645847 4871089 -4250967 -15673214 -22628036 -21368551 -14398204 -7628714 -6304964
41299 -6304964 -12907962 -24376732 -31567205 -27882286 -19271912 -18216751 -26232516 -31102617
41291 -31102617 -24355826 -11792533 -2041093 5375000 14259667 23551931 31952544 41102642
41283 41102642 46383311 35554642 7491206 -17804693 -21419057 -9976911 -3725889
41276 -3725889 -7296519 -8950005 -4378070 -2421587 -6594243 -8314028 -2754275 2593290
41268 2593290 485766 -5956420 -10353426 -10974295 -8095088 -2548091 217754 -5724854
41260 -5724854 -15065203 -13385918 4117837 24433615 32384270 27200705 18444823 12276658
41252 12276658 8010305 4020336 1370118 2460393 7399774 10309764 1882307 -18902224
41244 -18902224 -37950372 -38860022 -21939739 -2701427 7439483 9754474 8742647 5930021
41236 5930021 4557391 8642281 14336617 13308983 7572473 8512304 17045296 18688343
41228 18688343 5696315 -9110932 -10430621 -863884 7843648 13495584 20329886 25488528
41220 25488528 23274370 18308972 20418907 28221580 30132700 21487978 10180683 4741408
41212 4741408 5510732 8285800 9684452 8746531 8566176 14456232 25077706 29342654
41204 29342654 19673582 4524491 -1315358 4109655 10082803 9613303 4288180 -5475578
41196 -5475578 -21254796 -35639393 -33983153 -13304880 10634743 21743405 20705269
41189 20705269 17144645 13543195 7000138 1403899 5608653 19236803 30286607 30665192
41181 30665192 27312729 32074251 43859582 47960562 34597831 12873257 1455989
41174 1455989 7119346 17923090 18737740 8648945 -433583 455794 7202897 8067722
41166 8067722 -3188662 -20645511 -33082401 -37250422 -40755671 -48427708 -50784323 -35234275
41158 -35234275 -7343258 10988611 7745785 -6118043 -14810470 -16564319 -16249529 -12160496
41150 -12160496 -3128135 2043877 -1628291 -700416 18345117 41859026 42596156 19771658
41142 19771658 1823935 4915862 12815684 7880617 -1677357 -2228259 -2260094 -16230195
41134 -16230195 -33572710 -29872133 -4881454 14920985 13547284 3762297 2251225 5676949
41126 5676949 2352182 -6349184 -9931666 -6446869 -3528402 -4994971 -6999027 -7015804
41118 -7015804 -7999862 -11738290 -14017537 -9519927 1124709 11471216 15720686 14042414
41110 14042414 11312278 10762154 10243815 6475470 1434568 364005 3128343 2765432
41102 2765432 -4701716 -13854031 -17647341 -17279333 -17937771 -17901297 -10881096 543615 3584528
41093 3584528 -8233762 -24748845 -31516485 -26665555 -18308356 -10391827 -929800 8027388
41085 8027388 9746327 3752841 -1861581 -2055025 -760043 -2186520 -4713202 -7576163
41077 -7576163 -14435325 -24024036 -26597348 -18797938 -13615703 -23189152 -37425863 -34395762
41069 -34395762 -10367982 15063927 25095130 22751698 17993633 12082779 3353153 -2408114
41061 -2408114 1073242 8440006 7594671 -4981927 -20538312 -28460158 -26001785 -19635769
41053 -19635769 -19660636 -29943271 -40486492 -35944229 -15704880 1313009 -1326205 -16762608
41045 -16762608 -24632227 -16967945 -4050554 2949043 3407335 301349 -7064108 -18368294
41037 -18368294 -27410693 -27489291 -18515944 -6153931 3142978 5241693 551497 -5664807
41029 -5664807 -8867589 -11004558 -15676631 -18385759 -10021084 7624461 18857345 12360345
41021 12360345 -4717108 -17945262 -24318674 -30312252 -35908591 -32895412 -19474844 -5367704
41013 -5367704 1159711 2291246 2475603 634465 -2398433 2492776 19919441 35396817
41005 35396817 27734250 -2375683 -28722098 -29895135 -12817346 1623673 6753703
40998 6753703 11727952 20558226 24806820 18671092 8377979 1419149 -3422871 -8775338
40990 -8775338 -10287424 -4405189 1785161 -1277425 -10870902 -15393222 -11145173 -5737561
40982 -5737561 -4429775 -3454070 42315 1129046 -4055305 -10178226 -10703211 -8587812
40974 -8587812 -10945997 -16438033 -16705958 -9538067 -2292874 -880569 -2603771 -2799466
40966 -2799466 -2250939 -3396294 -3789202 656784 7631880 9248046 1743112 -9168353
40958 -9168353 -14282377 -10723353 -4585537 -3961626 -9784481 -14832169 -13326449 -9580732
40950 -9580732 -12025797 -18366226 -14707357 4876207 24866533 24830177 6589418 -7571202
40942 -7571202 -5262633 777407 -5752126 -20301859 -26708514 -22868799 -21709582 -28203946
40934 -28203946 -30874327 -20645585 -6218756 -2873148 -13154322 -26370755 -32821512
40927 -32821512 -31235949 -24580841 -15844868 -8780872 -7820543 -14461924 -24538323 -30101957
40919 -30101957 -25282257 -12233327 -919217 -43205 -7663168 -13681348 -11696995 -4229243
40911 -4229243 4117519 12169996 17669825 14121937 -488380 -15207229 -14849704 2104074
40903 2104074 20882290 27672697 23942025 20064770 19496663 16040859 6303972 -2562387
40895 -2562387 -2413293 2819933 1451145 -8532772 -15174355 -10070838 -1956127 -3986264
40887 -3986264 -13120847 -14241291 -3232159 7289175 7700503 3907707 4303895 5990225
40879 5990225 3166381 56365 4273578 13073498 17137443 14316221 9654820 5422803
40871 5422803 1927733 5125387 20375877 38446513 40853752 22903719 676415 -9610981
40863 -9610981 -9292092 -8236404 -7797056 -2804670 4816725 6071675 -948528 -6076070
40855 -6076070 -548594 9770907 10698886 -1793316 -15355248 -16163305 -5458238 4261824
40847 4261824 6615720 6522973 7851619 6245870 -770195 -5788425 -1957629 5216737
40839 5216737 5837384 301377 -3742753 -4547047 -5341870 -4082173 3020372 9725875 5758540
40830 5758540 -4982728 -6932166 3503260 11429808 5872330 -5403648 -11064103 -12931804
40822 -12931804 -17181076 -19872735 -13943537 -3726706 -597152 -8047712 -20156133 -30518166
40814 -30518166 -34526683 -28288215 -14674185 -5594249 -8444005 -14718658 -12370637 -4918301
40806 -4918301 -5743417 -15761745 -20606398 -11456811 3618774 12568573 12928976 7518359
40798 7518359 -4189117 -22716873 -41307831 -49079194 -41271966 -23818894 -8296661
40791 -8296661 -2657084 -5071348 -6589299 -1001074 9133545 17425846 21333855 21975829
40783 21975829 20128721 17049429 15993400 17768119 18049571 14449072 11758317 13089688
40775 13089688 11036872 -1941880 -17887658 -20951253 -10283577 -1958967 -5589349 -12204298
40767 -12204298 -10632928 -3591349 673991 2738368 8114624 15990688 21693906 25627805
40759 25627805 30440723 32748571 27039508 16290691 10038290 11638808 14672303 13234055
40751 13234055 9859514 10947968 18198984 27005221 31725390 31245414 29345976 29028506
40743 29028506 27169720 17930859 2212972 -10468663 -12210417 -5531988 803133 1541769
40735 1541769 -2357973 -7091184 -8267778 -3033136 5967372 11533442 10582453 8426335
40727 8426335 10047735 11340386 5341083 -6173193 -14946035 -18156361 -19746088 -20314661
40719 -20314661 -14791449 -2400744 9027011 12580026 10069595 6720495 4039811 2410858
40711 2410858 4819561 11399767 14447017 6906483 -5649801 -9901196 -3154699 842925
40703 842925 -10576176 -30540330 -38742650 -25413623 -2953068 8688127 3542054 -7744723
40695 -7744723 -13668172 -13409191 -11720035 -9094151 -2475361 7208305 14468385 16560597
40687 16560597 16602531 18037946 20110491 21077849 22020580 23573013 21683692 12259607 -267840
40678 -267840 -5058161 1922642 11680345 13400730 7921955 4009329 4191020 3203475 476329
40669 476329 2888481 10029752 7985661 -11107085 -31028410 -28255491 -4794941 11832342
40661 11832342 4328839 -14186837 -22701037 -20183180 -18737930 -20307906 -16620738 -7308656
40653 -7308656 -1796543 -3165333 -3752428 1152040 6628992 7721252 5530659 1017983
40645 1017983 -7366128 -16430803 -18182752 -11140870 -2790188 3042697 11038374 21480862
40637 21480862 24171379 14123024 3110269 3982672 11304545 10733408 1946763 -2674780
40629 -2674780 387753 1606541 -2506383 -1507012 11363667 25492334 25800541 12486730
40621 12486730 16832 407686 13131232 28041611 33691808 26196344 13840980 9460704
40613 9460704 15173019 19516194 13511020 3401184 1030655 6780964 10756615 8473146
40605 8473146 6362470 11380165 22520799 33576374 37718593 28606102 4923197 -22734487
40597 -22734487 -36530740 -28922229 -11800100 -2961299 -6467172 -11981244 -11120749 -6737128
40589 -6737128 -4736486 -3984075 340866 7084579 9473694 5051250 -756855 -3256557
40581 -3256557 -5120854 -9565471 -11456433 -3556218 9327146 12346767 492169 -12092299
40573 -12092299 -9519276 5380086 16401064 15161310 6892173 -2432884 -12925970 -23439008
40565 -23439008 -28467505 -26482575 -22467540 -18056945 -8379474 5774592 12255245 2462619
40557 2462619 -15513581 -27688026 -31288446 -31031972 -25578231 -11811251 1281819 -602616
40549 -602616 -15314174 -24403804 -18800590 -10021976 -9776576 -12630679 -8766159 -1669921
40541 -1669921 129243 165600 7545045 17799104 16067751 -254987 -15910571 -17980333
40533 -17980333 -10225189 -2822120 1836405 6306622 8873954 5517006 -2677624 -10806213
40525 -10806213 -16636855 -20372694 -19901308 -12219608 147149 8861017 8097742 1471624
40517 1471624 -1129715 5808207 16358011 18839415 10030321 260849 -387583 2389824
40509 2389824 -5427341 -23224881 -32624775 -23504336 -11466380 -17290869 -36895188 -47599478
40501 -47599478 -41255651 -33112674 -34942993 -37745504 -30591280 -20868094 -20800567 -24871937
40493 -24871937 -19164388 -7717660 -9117300 -25700847 -36120905 -26217840 -10632870
40486 -10632870 -11389681 -27011058 -37926319 -35660356 -30781317 -33403886 -40084824 -42638792
40478 -42638792 -39141617 -32227012 -24201723 -17423398 -13811586 -11977055 -10249466 -12627448
40470 -12627448 -23779321 -37026145 -37228067 -19951848 1179182 11883006 13316573
40463 13316573 13689433 12769323 5712959 -3523653 -5478945 -314884 2110409 -1961493
40455 -1961493 -5133029 -2358268 180178 -5136827 -15466380 -20976927 -16282461 -4375259
40447 -4375259 7666528 13721756 12191982 7227807 4375632 3874332 1114239 -5757868
40439 -5757868 -12837711 -16171825 -15952132 -13468459 -8835870 -4144806 -3875315 -8733413
40431 -8733413 -13233438 -13007119 -10914950 -12471614 -18664818 -26649917 -34032307 -38980436
40423 -38980436 -39536332 -36263258 -32262783 -27929064 -20388727 -11077314 -7161548 -10160433
40415 -10160433 -10373157 -717985 10105240 8661839 -3225996 -11097080 -8197552 -1062231
40407 -1062231 4348621 8590250 9243366 -100533 -16107976 -24193935 -18551497 -11974544
40399 -11974544 -16052373 -22373929 -16117327 -290479 8324265 3265591 -6160255 -11995773
40391 -11995773 -15566626 -16928410 -10625913 2993385 13906391 16530270 18393931 27370502
40383 27370502 38089055 39698141 31787769 23669215 20650933 19116616 14273868 6145034
40375 6145034 -2185112 -7389792 -7190345 -2693684 1399924 2127586 1643080 1632211 -1900721
40366 -1900721 -12083546 -22586868 -24211084 -19354491 -20498197 -32368895 -44735454 -47161454
40358 -47161454 -42625303 -39916401 -38960465 -32289531 -18134958 -3895120 3198744 2713460
40350 2713460 -1987078 -8059688 -13184085 -14995200 -12349417 -6163869 531085 2879205
40342 2879205 -2350303 -11335478 -15127713 -10762327 -6083534 -8142866 -11761701 -7890014
40334 -7890014 627707 2691534 -3120583 -6881036 -4852027 -4992738 -10471242 -12020501
40326 -12020501 -5385164 -2878626 -14503600 -28352747 -26279227 -12108901 -5640031 -11424607
40318 -11424607 -13776773 -5324160 -262511 -10336226 -24293680 -24239846 -11004785 512972
40310 512972 3532865 3164333 2831668 523642 -3047792 -4516111 -6054578 -12980238 -22548416
40301 -22548416 -25119795 -18108187 -9438902 -4877525 -1268050 3927875 5376958 -1882219
40293 -1882219 -13580239 -21847167 -24818719 -24874696 -21678254 -13349778 -1859401 8451175
40285 8451175 15915199 20729380 21940584 20375929 21562944 29003524 36074035 31902825
40277 31902825 15622096 -1682593 -9943610 -8784214 -2926432 2644542 300711 -17299857
40269 -17299857 -43773604 -55827753 -35731681 4090199 30117090 24332340 3186824
40262 3186824 -4254733 10602739 31212556 38400666 28585643 11581742 -752523 -2064861
40254 -2064861 5445249 12337568 10504417 2764078 82940 7330194 16429538 16899487
40246 16899487 8815107 580884 -2884847 -3729626 -4234181 -2868682 897026 2627855
40238 2627855 -2312470 -11308279 -15139583 -7673770 5968258 13376677 8361820 -1821142
40230 -1821142 -5801459 -2182852 1313203 1215316 2043188 5150339 4277667 -2133221 -4346308
40221 -4346308 3889353 13186046 13457495 12959279 25590737 43363311 41792274 15176726
40213 15176726 -12816589 -20654879 -13583462 -7277537 -3709951 2661300 8172539 6318604
40205 6318604 1938174 2626730 2859005 -6763039 -20128333 -23419235 -18621756 -19860828
40197 -19860828 -26975613 -23273372 -3321805 16392375 21612565 17913722 15423298 12142675
40189 12142675 3999913 -2391949 -658377 2362343 -1497332 -5508592 1867025 17195185
40181 17195185 27019030 28040346 27717212 27600941 21286632 8986095 -155458 -2694947
40173 -2694947 -5491238 -12358677 -17238783 -15033447 -9655000 -6468076 -4895994 -3242357
40165 -3242357 -3385021 -5734911 -6071760 -2186080 2171985 4166803 6539954 10916307
40157 10916307 12776350 8555597 2333419 80724 2302413 7126892 14247161 19756841
40149 19756841 14523326 -3236808 -19737694 -20762242 -10848775 -5706131 -8806043 -9625852
40141 -9625852 -4457033 -2445668 -6698968 -5853796 6122970 15932945 10304127 -1307998
40133 -1307998 -114140 11841119 13283875 -4853466 -26932116 -35284566 -29923575 -19300622
40125 -19300622 -6143147 7031755 10132053 -2785170 -20183036 -24449818 -13635972
40118 -13635972 -978188 4098032 2950956 -1861943 -9733149 -14809153 -8769587 5585379
40110 5585379 14782550 12889261 8222320 6769648 1215926 -14450498 -30092440 -31928078
40102 -31928078 -23458730 -20356094 -27097018 -31914408 -25904427 -15367669 -11064718 -13868495
40094 -13868495 -16478490 -14077947 -8448546 -4407522 -5456848 -11021244 -16026664 -15052862
40086 -15052862 -8289642 -1789955 -932515 -4959671 -8457630 -7363086 -3566705 -3471138
40078 -3471138 -10073661 -16607788 -12702758 922357 9762896 2977784 -11322361 -16043958
40070 -16043958 -7480165 1467897 148817 -6977523 -8664205 -599867 12269986 21104266
40062 21104266 18126643 2235325 -16965062 -25979635 -21735495 -14562204 -14280141 -19050027
40054 -19050027 -21843485 -21708759 -22113490 -22160849 -17005768 -6153341 4696607 10772637
40046 10772637 13022084 14736556 16352622 15391176 10801452 5973560 5746406 9612392
40038 9612392 10594156 4345180 -2977953 -1860080 6368374 10248237 4895006 -381984
40030 -381984 3969623 13247979 14873327 4529957 -10995513 -23306111 -27451177 -20819677
40022 -20819677 -5812318 7321428 9125346 3726238 5309884 19271024 33764344
40015 33764344 34202189 20912175 7130019 2509446 4131189 3328271 -3069658 -9943075
40007 -9943075 -10539860 -4429833 1565476 673977 -6180128 -11780082 -11875029 -10144084 -11667056
39998 -11667056 -14221404 -11139197 -2479018 3376174 2710892 4349012 16391990 29100895
39990 29100895 23331286 -1976389 -23214059 -20117078 89574 16634842 23619932
39983 23619932 29381091 33506159 24591911 3478983 -9895278 -1951397 15487852 22011164
39975 22011164 14506528 5475831 3355076 6086294 9456893 11228279 9706888 6337829
39967 6337829 6096064 8035130 1573930 -17660550 -34383953 -30217841 -11447668 -4544964
39959 -4544964 -21205881 -42123883 -42458458 -22375571 -2835732 1787878 -3999921 -9477281
39951 -9477281 -12001089 -15074824 -18597503 -18098137 -13313894 -10797538 -13709065 -14225469
39943 -14225469 -4477041 7443468 4501455 -13733721 -25998699 -18016463 -4179689
39936 -4179689 -7394796 -25937904 -37138784 -30637330 -20394454 -21610460 -31026975 -35562699
39928 -35562699 -28789511 -12920622 6120967 19801979 20967747 12130490 3643808 361585
39920 361585 -2464984 -6947906 -5937926 4855044 16245733 15919094 4966958 -4109058
39912 -4109058 -4071435 -774893 -3861144 -13984269 -21467998 -17562184 -5915026 677073
39904 677073 -3046206 -6723751 979867 14473725 17471260 4725952 -12977830 -24628116
39896 -24628116 -28475327 -25669920 -17107204 -8847602 -8138617 -10797604 -5201872 7881952
39888 7881952 14283299 10513287 11878693 26761752 39415032 32902012 15560134 7304696
39880 7304696 9686262 8471300 -243174 -5806676 -2764947 2757168 7053021 14117248
39872 14117248 25070775 34899920 41307697 45721436 45146424 34675011 18810800 8593863
39864 8593863 6221485 3717606 -2470804 -7810870 -11563583 -18453411 -25577704 -22326278
39856 -22326278 -8963222 -895113 -6055431 -11538219 -4432181 5230067 -2380140 -26421896
39848 -26421896 -43515835 -36532566 -13518439 4366707 4907570 -8282811 -23699765
39841 -23699765 -31528515 -28443580 -17688846 -5523023 3030081 5733282 2530400 -4675554
39833 -4675554 -12375714 -17692332 -20746990 -23865246 -28054889 -30737473 -27611354 -17310338
39825 -17310338 -3992438 5797890 9034272 7789761 5285051 3082495 2627579 5551788
39817 5551788 10096438 10969233 6246017 1214881 1168071 3153199 19234 -8800350 -15542152
39808 -15542152 -12943568 -1377858 12081599 18987719 15677562 7100429 2537008 5166887
39800 5166887 9190189 9439980 7972799 7058380 3288658 -3893221 -5384160 4958969
39792 4958969 16634014 14766489 2901688 -1382834 6554884 11863711 4578119 -4671604
39784 -4671604 -1720950 9944296 15600654 9839082 573713 -4236221 -5516194 -8648227
39776 -8648227 -14570569 -16694059 -7603962 9716748 20943684 16007220 2050778 -6866510
39768 -6866510 -8864764 -11790942 -15150400 -10538309 -1096934 -2464446 -17770775 -28385004
39760 -28385004 -19854361 -2746362 4646866 1888010 423311 2304568 1079584 -2553941
39752 -2553941 -1934898 2125649 3151942 1644482 2741896 3713094 -2475476 -12180471
39744 -12180471 -13495157 -4339855 4802352 7713363 9089542 11516271 8904818 -1209796
39736 -1209796 -9843198 -8813881 -2997589 -2651249 -9137341 -15599419 -17756726 -16614216
39728 -16614216 -12467436 -3584567 8054497 15347083 14236606 10982933 16193213 30149513
39720 30149513 39068530 31256482 13519022 2894204 3109450 1132200 -9588587 -16433825
39712 -16433825 -8135789 3841537 6094 -17363172 -26407228 -16794938 -2213225 1612670
39704 1612670 -2649834 -1837375 9536399 25687332 37399818 38671006 30964637 23397505
39696 23397505 22758612 22618182 10892699 -10289821 -23077528 -16776159 -2081324 3901639
39688 3901639 -2370778 -13365310 -23882249 -31807072 -32146015 -22272879 -10364433 -7483867
39680 -7483867 -11359980 -7858085 9195221 27437048 29430415 12818636 -6418962 -9787666
39672 -9787666 5860857 26002940 34138968 28898381 22582781 23365148 25556303 20742194
39664 20742194 11405622 5916043 4369201 -968691 -11766712 -19464329 -17440157 -10155049
39656 -10155049 -6518555 -9455887 -15642980 -20780013 -20885847 -12737880 1235194 11090665
39648 11090665 8620146 -2261586 -10135682 -11029635 -12166982 -18977129 -25627405 -23948725
39640 -23948725 -16510591 -12821283 -14336022 -11723127 1332191 18602183 29076551 29203373
39632 29203373 23554141 17449617 13679294 14158285 20043206 30140515 41238625 49420250
39624 49420250 50821443 44082851 33057825 23299208 14632824 2385929 -11913068 -18104466
39616 -18104466 -10854469 637244 3463828 -3057795 -9761176 -11755682 -11471000 -10582566
39608 -10582566 -8565587 -8165518 -12742038 -17843243 -14460083 -2176242 8757110 10076626
39600 10076626 3358029 -5533037 -12512082 -14988984 -13103892 -12380411 -17911566 -25456845
39592 -25456845 -26107201 -19491803 -13000741 -8320804 -440483 9197910 12507716 10862540
39584 10862540 15921962 27953918 29478377 11171083 -10792234 -17412276 -14060276 -17804043
39576 -17804043 -27732618 -28610223 -19068629 -14196415 -19184370 -20801253 -10626134 657206
39568 657206 850168 -5541278 -6835070 -1764821 3198496 7205890 14798240 25187302
39560 25187302 30515683 24606403 8652477 -10363963 -23307780 -23906273 -14996845 -7875342
39552 -7875342 -10805192 -19414011 -22605915 -16643405 -8534891 -5641787 -7005958 -6881002
39544 -6881002 -3140284 1022765 2146918 132173 -3071751 -5725964 -6261212 -3224351
39536 -3224351 2476997 6234569 3172487 -6748292 -18479810 -26466512 -28095760 -23918223
39528 -23918223 -17263804 -12594668 -10519191 -5403471 7002883 20247256 22968602 15757048
39520 15757048 13425524 24898462 38414948 35230460 13322844 -11534408 -25178743
39513 -25178743 -25855897 -17452372 -3614322 8692747 9964284 -891524 -11772396 -9693315
39505 -9693315 4367868 17050348 17716050 9023551 2753271 6501219 14967390 15711832
39497 15711832 4186202 -10354993 -16986097 -16784098 -17900808 -20341796 -15672314 -2398171
39489 -2398171 9096237 11352848 10381207 14734003 21484770 21554311 13982938 5797817
39481 5797817 558974 -3862096 -7432141 -7267974 -5464537 -8539671 -16285805 -19206111
39473 -19206111 -11568638 -573170 2974250 -1677049 -6546397 -6019479 -500182 8010007
39465 8010007 16990475 21398612 17623649 9679846 5225597 4910502 2209365 -5024614
39457 -5024614 -10310072 -8967056 -5727606 -7038173 -11656906 -14612608 -15309490 -15092321
39449 -15092321 -11425797 -2565527 5239065 4399550 -1184177 946546 14917696 30242173
39441 30242173 34370150 25320559 10363768 -1855602 -6439352 -5342457 -6867482 -16778200
39433 -16778200 -29391671 -33459126 -26898000 -18504577 -14959756 -14759016 -15774837 -18496322
39425 -18496322 -19070956 -10174956 6139043 16719328 14579058 8149865 6561307 6063450
39417 6063450 111086 -6717468 -6317031 -1470915 -881604 -4730534 -6144733 -2992500
39409 -2992500 1997801 8743477 17091745 20663240 14289919 4277736 541496 1912137
39401 1912137 512739 -2685658 584085 10642487 18891766 21279655 20546823 16104154
39393 16104154 5053642 -6558854 -7632843 679625 4842260 -934197 -7402025 -6859604
39385 -6859604 -3967094 -4498409 -5184253 -1542509 3838483 6926966 7597691 4808315 -4017067
39376 -4017067 -14074943 -14117850 -2407413 8244943 8175694 3936030 5988912 12511779
39368 12511779 14558431 10140984 3988010 -1496494 -7038166 -12266416 -16506755 -19395448
39360 -19395448 -16935007 -3825813 16009048 29640888 31155000 28125059 26125254 18543956
39352 18543956 1707848 -11399140 -7100609 6618313 9344110 -3632889 -17116119
39345 -17116119 -18818610 -12473019 -6803604 -3739576 -1297068 877159 2630946 3822988
39337 3822988 1972353 -4758758 -11505420 -10008286 780081 13028528 19727230 20402434
39329 20402434 16741771 9352373 1127167 -2366403 47918 1637714 -4233212 -14163046
39321 -14163046 -16609173 -4282064 17468263 35862227 42891662 40017971 31768195 20060593
39313 20060593 7456485 -94267 -440520 -989238 -8916934 -18627311 -18888929 -10363782
39305 -10363782 -4030379 -2755032 1276852 8669062 8349450 -2802679 -11095219 -6174632
39297 -6174632 3075327 3375622 -3842239 -9165233 -9974122 -7121686 1827818 13495764
39289 13495764 14454606 513217 -11162185 -5520826 6202448 5060100 -3743350 -1437266
39281 -1437266 9397598 8479614 -4854519 -7233400 9696158 22624449 11182588 -12530091
39273 -12530091 -24179520 -20283642 -14655067 -13879741 -13622059 -13058848 -17231294 -25735884
39265 -25735884 -30180369 -24935326 -14804678 -10197776 -15967005 -25195835 -25832085 -15371275
39257 -15371275 -4537790 -1609128 205154 10152186 21188107 18587846 4476772 -3341583
39249 -3341583 1765344 7180720 4332457 2314899 9263265 15620667 8816472 -5712052
39241 -5712052 -11158770 -1311267 14428288 24360386 25144898 21635950 20761524 23290742
39233 23290742 21142050 8345410 -6453164 -8190387 3326659 12047287 8105685 -847784
39225 -847784 -4681656 -3989132 -2519978 582450 3847468 1204664 -5618498 -4722642 7676019
39216 7676019 19116677 19920065 16899702 17651962 15821094 6321759 1951966 16617283
39208 16617283 40663686 51502985 44106899 33961207 32313276 34384515 32221066 26074433
39200 26074433 21261423 22151204 28788578 33765185 27015937 10146371 -1288823 2026890
39192 2026890 9644269 8408966 3013011 5616685 13780056 15173228 8030871 235473
39184 235473 -6771820 -15838512 -20338758 -11323028 3921481 9187795 3972965 1797236
39176 1797236 4808439 1362191 -9060709 -11193417 -772861 5388040 -3581124 -14262938
39168 -14262938 -10616020 1454508 5931839 1552329 -517050 3253830 5179520 -71640
39160 -71640 -8859938 -14333661 -12400450 -4281200 2520311 -367541 -11904993 -21184386
39152 -21184386 -20482893 -13499942 -7508919 -3619445 878268 5919598 8755836 6828905
39144 6828905 -1325798 -13195694 -19886952 -13732533 548302 10069422 10194742 7775190
39136 7775190 7003624 3547823 -3640548 -6580372 -504877 8372372 13703880 17656543
39128 17656543 21877942 20079405 8220051 -6686502 -16586870 -23071698 -29713417 -32572222
39120 -32572222 -28131078 -22445385 -21472559 -19555482 -9151388 4418957 10426730 9663451
39112 9663451 10831379 14108760 12296082 6278321 5191503 11033942 16352933 18390423
39104 18390423 22141239 26455837 21006827 3896880 -9397074 -4776026 9921382 13901752
39096 13901752 169561 -16725873 -20751645 -13579099 -8140530 -7842727 -1684113 17283049
39088 17283049 37099420 39741580 25332479 11547809 7577680 2166791 -15246755
39081 -15246755 -33755351 -34170207 -15716918 4746760 16695081 24206508 30424902 29423144
39073 29423144 18968598 9044949 9409856 16749820 22227579 25597106 32810343 42758404
39065 42758404 45594349 35404830 18566000 6994462 6283939 12923223 21377528 30352660
39057 30352660 40557647 48652068 48005117 37296588 24999473 21477987 27680033 34962397
39049 34962397 35718989 31038696 27343354 27764823 28167639 21816685 8406886 -2787258
39041 -2787258 -2145461 7884931 14796850 12389624 8722726 12969150 20727897 20562026
39033 20562026 10999574 1124868 -4050997 -7723213 -9556149 -1661810 17487323 34040732
39025 34040732 32925717 17036435 3814120 4023940 11569821 14870782 10715502 3214809
39017 3214809 -4817471 -12455482 -15176945 -7502390 6476416 12841735 4316170 -8256288
39009 -8256288 -9208089 617598 6718166 4345564 5241568 16308647 25499012 19619175
39001 19619175 5707348 822499 7252211 13273276 14984698 20161969 29369497 30602804
38993 30602804 19095145 8010905 9872201 18167537 18419585 10053664 5622228 12130763
38985 12130763 23833441 32531747 36042210 35519301 31140779 22718998 11386227 19546
38977 19546 -6512884 -3621271 7663989 19862682 26596731 28359808 27739139 23160750
38969 23160750 12994009 2559653 -463934 3129065 5083288 2510673 3067107 14372767
38961 14372767 32745179 45787878 44156830 29346826 11849443 2109983 1041617
38954 1041617 -316146 -9159674 -20505337 -23183800 -15233844 -6371077 -3846777 -3538204
38946 -3538204 932815 7319628 9381594 7186656 5264111 3894292 460807 -2141939
38938 -2141939 2739658 14241977 21849306 17126908 2462228 -13552714 -24439306 -28177820
38930 -28177820 -26775749 -25698168 -28996286 -33244754 -30941444 -20721089 -8532860 1316031
38922 1316031 8186214 7864221 -4807685 -21901419 -24291233 -6449836 12518215 14161355
38914 14161355 5646867 4351654 7774091 -547529 -19905749 -30267316 -23101618 -12844939
38906 -12844939 -11339370 -10349402 402051 14018265 17658476 11203260 3080946 -3295995
38898 -3295995 -8822877 -12769509 -16210883 -22876599 -29313314 -24809167 -9110525 2335781
38890 2335781 925381 -1092543 7757913 16762584 10541646 -4431956 -11451177 -11833854
38882 -11833854 -18161070 -26129805 -19726387 -2968710 1180237 -11906184 -18642229 -4348454
38874 -4348454 13324061 12484655 -480842 -3941746 6605367 17275567 19505734 18477168
38866 18477168 20039683 21838167 18565622 9267760 -1024109 -4622662 1131004 8525372
38858 8525372 6918392 -3802099 -13726313 -16577127 -13709042 -4908425 11775130 28594958
38850 28594958 31475701 20932824 14903889 22082496 27251306 15262433 -3999148 -10519965
38842 -10519965 -4226095 -2706788 -14139890 -28681691 -34465917 -28330712 -12657755 5351737
38834 5351737 13010268 4113600 -8829861 -7095885 9086888 20292903 14166340 -527212
38826 -527212 -9146112 -8507929 -3725563 1930755 6545554 6056340 -633158 -6482860 -3287808
38817 -3287808 6765449 11815255 4590643 -6637551 -5400385 13119274 33595368 37428040
38809 37428040 25486526 15002605 14046391 11832826 -584352 -13464614 -12800579 -889857
38801 -889857 10450993 18284202 24866586 22875373 3216123 -24755167 -39657977 -35877709
38793 -35877709 -27427021 -22139372 -11671596 6270549 15390111 3384065 -17160035
38786 -17160035 -25005268 -17792206 -9479334 -7817270 -9113449 -11285799 -17204997 -24557743
38778 -24557743 -24538796 -13959231 -593513 6809003 8365294 10268706 16021876 22862316
38770 22862316 25214254 20715696 13211992 8791639 8756344 9505193 10017115 14167038 22417341
38761 22417341 26969614 21514202 11947793 9499598 14693936 16559576 8659858 -2470772
38753 -2470772 -8419142 -10956220 -16566124 -23929131 -25509462 -20452893 -17010812 -19749978
38745 -19749978 -22308992 -18101161 -11506350 -10304101 -11590872 -6003849 5374025 10681494
38737 10681494 6211466 2691275 6286694 6429049 -5680197 -17138354 -8904135 13530283
38729 13530283 23899299 11286033 -5009119 -3481147 11299014 19162897 13072843
38722 13072843 4644312 5324418 13520390 20516678 21230651 17420203 14680210 17297666
38714 17297666 23652334 27078706 23304899 15799563 11315552 11340866 11037738 6733997
38706 6733997 1602524 1695792 7033960 10103373 6028954 1332372 6150727 18459880
38698 18459880 25569087 24122728 26519655 39040017 46091423 31525765 6709883 -2629589
38690 -2629589 6435075 12591749 6636080 3832762 12162991 14111431 -3201251 -21201268
38682 -21201268 -16134868 2611199 6536082 -7479697 -13855599 1245710 22082615
38675 22082615 31729840 35557894 44831157 54063769 49872030 32883307 16857255 10092517
38667 10092517 8508933 5644698 1204931 -797513 2641925 10788261 19524721 24826249
38659 24826249 26492332 26665612 25096802 19928147 13517146 11839955 15692519 17996169
38651 17996169 13895579 8673523 9935039 15360707 15420455 7433926 -544526 -1796866
38643 -1796866 -5513 -1338272 -2626769 4543646 19121497 28768046 25519941 15448513
38635 15448513 7292644 -1080069 -15441830 -29363434 -28740775 -13108714 -151743 -3920830
38627 -3920830 -18048269 -26722687 -24001951 -14670800 -2929762 10221698 21760771 27295322
38619 27295322 26028999 19904118 10053971 -1435367 -9742066 -12390031 -12856034 -14734402
38611 -14734402 -16571353 -16686271 -17007138 -16659693 -9360147 4844795 13054992 5535505
$$ [...]
##END NTUPLES=NMR SPECTRUM
##END=
