##TITLE=31Pdec_LR-677-BHCR1
 D2O, 24 sc
 22.7.2019
##JCAMPDX= 6.0         $$ Bruker NMR JCAMP-DX V2.0
##DATA TYPE= NMR SPECTRUM
##DATA CLASS= NTUPLES
##ORIGIN= UXNMR, Bruker Analytische Messtechnik GmbH
##OWNER= root
$$ XWIN-NMR		Version 3.5
$$ Mon Jul 22 16:35:14 2019 Russian Standard Time (UT+4h)  she@DPX200
##.OBSERVE FREQUENCY= 81.013821
##.OBSERVE NUCLEUS= ^31P
##.ACQUISITION MODE= SIMULTANEOUS
##.ACQUISITION SCHEME= undefined
##.AVERAGES= 24
##.DIGITISER RES= 17
##SPECTROMETER/DATA SYSTEM= spect
##.PULSE SEQUENCE= zgpg30
##.SOLVENT NAME= CDCl3
##.SHIFT REFERENCE= (INTERNAL, CDCl3, 0, 182.463)
##AUDIT TRAIL= $$ (NUMBER, WHEN, WHO, WHERE, WHAT)
$$ ##TITLE= Audit trail, XWIN-NMR		Version 3.5
$$ ##JCAMPDX= 5.01
$$ ##ORIGIN= Bruker BioSpin GmbH
$$ ##OWNER= she
$$ F:/spectra/data/she/nmr/P31/1/pdata/1/auditp.txt
$$ ##AUDIT TRAIL=  $$ (NUMBER, WHEN, WHO, WHERE, WHAT)
(   1,<2019-07-22 16:34:10.90 +0400>,<she>,<DPX200>,
      <created by zg, POWCHK disabled, PULCHK disabled
       configuration hash MD5:
       00 E9 B6 7A A2 85 ED C7 34 08 36 98 17 FE 4E 26
       data hash MD5: 32K
       B7 26 D9 76 74 B4 6B F2 2E 14 30 08 4E C0 9D 4D>)
(   2,<2019-07-22 16:34:14.71 +0400>,<she>,<DPX200>,
      <Start of raw data processing
       efp BC_mod = 2 LB = 1 FT_mod = 6 PKNL = 1 PHC0 = -2717.472 PHC1 = 92.19923 SI = 64K 
       data hash MD5: 64K
       04 FD 2D 00 54 9F 34 FD DA C0 8C 14 22 F4 53 89>)
(   3,<2019-07-22 16:34:33.37 +0400>,<she>,<DPX200>,
      <pk PHC0 = 146.8501 PHC1 = -5.2 
       data hash MD5: 64K
       F4 19 3B B4 67 50 F9 E5 7A A5 F2 B2 09 00 52 9A>)
(   4,<2019-07-22 16:34:37.34 +0400>,<she>,<DPX200>,
      <abs ABSG = 5 
       data hash MD5: 64K
       7C 22 F8 0C 5A 96 D1 78 2E 83 93 81 1D A5 CC 4A>)
$$ ##END=
$$ 
$$ hash MD5
$$ 6A 72 DE 8D CE 67 2F 82 EA F7 19 F7 40 C6 75 29
##$RELAX= 
##$RELAX= 
##$RELAX= 
##$RELAX= 
##$RELAX= 
##$RELAX= 
##$RELAX= 
##$RELAX= 
$$ Bruker specific parameters
$$ --------------------------
##$DU= <F:/spectra>
##$EXPNO= 1
##$NAME= <P31>
##$PROCNO= 1
##$TYPE= <nmr>
##$USER= <she>
##$AMP= (0..31)
100 100 100 100 100 100 100 100 100 100 100 100 100 100 100 100 100 100 
100 100 100 100 100 100 100 100 100 100 100 100 100 100 
##$AQSEQ= 0
##$AQ_mod= 1
##$AUNM= <au_zg>
##$AUTOPOS= <>
##$BF1= 81.014009
##$BF2= 200.13
##$BF3= 200.13
##$BF4= 200.13
##$BF5= 200.13
##$BF6= 200.13
##$BF7= 200.13
##$BF8= 200.13
##$BYTORDA= 1
##$CFDGTYP= 0
##$CFRGTYP= 5
##$CHEMSTR= <none>
##$CNST= (0..31)
1 1 145 1 1 1 1 1 1 1 1 1 1 1 1 1 1 1 1 1 1 1 1 1 1 1 1 1 1 1 1 1 
##$CPDPRG= <waltz16>
##$CPDPRG1= <>
##$CPDPRG2= <waltz16>
##$CPDPRG3= <>
##$CPDPRG4= <mlev>
##$CPDPRG5= <mlev>
##$CPDPRG6= <mlev>
##$CPDPRG7= <mlev>
##$CPDPRG8= <mlev>
##$CPDPRGB= <>
##$CPDPRGT= <>
##$D= (0..31)
0 1 0 0 0 0 0 0 0 0 0 0.03 2e-05 3e-06 0 0 0 0 0 0 0 0 0 0 0 0 0 0 0 0 
0 0 
##$DATE= 1563798850
##$DBL= (0..7)
120 120 120 11 120 120 24 19 
##$DBP= (0..7)
150 150 150 150 150 150 150 150 
##$DBP07= 0
##$DBPNAM0= <>
##$DBPNAM1= <>
##$DBPNAM2= <>
$$ [...]
##$SUBNAM3= <"">
##$SUBNAM4= <"">
##$SUBNAM5= <"">
##$SUBNAM6= <"">
##$SUBNAM7= <"">
##$SUBNAM8= <"">
##$SUBNAM9= <"">
##$SW= 369.568048894756
##$SWIBOX= (0..15)
0 1 3 0 0 0 0 0 0 0 0 0 0 0 0 0 
##$SW_h= 29940.119760479
##$TD= 32768
##$TD0= 1
##$TE= 0
##$TE2= 300
##$TE3= 300
##$TEG= 300
##$TL= (0..7)
0 120 53 12 22 120 120 120 
##$TP= (0..7)
150 150 150 150 150 150 150 150 
##$TP07= 0
##$TPNAME0= <>
##$TPNAME1= <>
##$TPNAME2= <>
##$TPNAME3= <>
##$TPNAME4= <>
##$TPNAME5= <>
##$TPNAME6= <>
##$TPNAME7= <>
##$TPOAL= (0..7)
0.5 0.5 0.5 0.5 0.5 0.5 0.5 0.5 
##$TPOFFS= (0..7)
0 0 0 0 0 0 0 0 
##$TUNHIN= 0
##$TUNHOUT= 0
##$TUNXOUT= 0
##$USERA1= <user>
##$USERA2= <user>
##$USERA3= <user>
##$USERA4= <user>
##$USERA5= <user>
##$V9= 5
##$VALIST= <valist>
##$VCLIST= <CCCCCCCCCCCCCCC>
##$VD= 0
##$VDLIST= <DDDDDDDDDDDDDDD>
##$VPLIST= <PPPPPPPPPPPPPPP>
##$VTLIST= <TTTTTTTTTTTTTTT>
##$WBST= 1024
##$WBSW= 4
##$XGAIN= (0..3)
0 0 0 0 
##$XL= 0
##$YL= 0
##$YMAX_a= 14136
##$YMIN_a= -16462
##$ZGOPTNS= <>
##$ZL1= 120
##$ZL2= 120
##$ZL3= 120
##$ZL4= 120
##$ABSF1= 182.463
##$ABSF2= -187.1042
##$ABSG= 5
##$ABSL= 3
##$ALPHA= 0
##$AQORDER= 0
##$ASSFAC= 0
##$ASSFACI= 0
##$ASSFACX= 0
##$ASSWID= 0
##$AUNMP= <proc_1d>
##$AZFE= 0.1
##$AZFW= 0.5
##$BCFW= 0
##$BC_mod= 2
##$BYTORDP= 0
##$COROFFS= 0
##$CY= -3
##$DATMOD= 1
##$DC= 0
##$DFILT= <>
##$DTYPP= 0
##$F1P= 0
##$F2P= 0
##$FCOR= 1
##$FTSIZE= 65536
##$FT_mod= 6
##$GAMMA= 0
##$GB= 0
##$INTBC= 1
##$INTSCL= 5.30512e-09
##$ISEN= 30
##$LB= 1
##$LEV0= 0
##$LPBIN= 0
##$MAXI= 10000
##$MC2= 0
##$MEAN= 0
##$ME_mod= 0
##$MI= 50
##$NCOEF= 0
##$NC_proc= -5
##$NLEV= 6
##$NOISF1= 182.463
##$NOISF2= 159.3651
##$NSP= 0
##$NTH_PI= 0
##$NZP= 0
##$OFFSET= 182.463
##$PC= 4
##$PHC0= -2570.622
##$PHC1= 86.99923
##$PH_mod= 1
##$PKNL= yes
##$PPARMOD= 0
##$PSCAL= 0
##$PSIGN= 0
##$REVERSE= no
##$SF= 81.0140089999434
##$SI= 65536
##$SIGF1= 159.3651
##$SIGF2= -187.1042
##$SINO= 113.3802
##$SIOLD= 16384
##$SREGLST= <1H.CDCl3>
##$SSB= 0
##$STSI= 65536
##$STSR= 0
##$SW_p= 29940.119760479
##$SYMM= 0
##$S_DEV= 0
##$TDeff= 32768
##$TDoff= 0
##$TI= <>
##$TILT= no
##$TM1= 0
##$TM2= 0
##$TOPLEV= 0
##$USERP1= <user>
##$USERP2= <user>
##$USERP3= <user>
##$USERP4= <user>
##$USERP5= <user>
##$WDW= 1
##$XDIM= 65536
##$YMAX_p= 311640185
##$YMIN_p= -31225857
$$ End of Bruker specific parameters
$$ ---------------------------------
##NTUPLES= NMR SPECTRUM
##VAR_NAME=  FREQUENCY,     SPECTRUM/REAL,   SPECTRUM/IMAG
##SYMBOL=    X,             R,               I
##VAR_TYPE=  INDEPENDENT,   DEPENDENT,       DEPENDENT
##VAR_FORM=  AFFN,          ASDF,            ASDF
##VAR_DIM=   65536,         65536,           65536
##UNITS=     HZ,            ARBITRARY UNITS, ARBITRARY UNITS
##FACTOR=    0.456856943014862, 1,           1
##FIRST=     14782.0589164792, 0,            0
##LAST=      -15158.0608439998, 0,           0
##MIN=       -15158.0608439998, -31225857,   0
##MAX=       14782.0589164792, 311640185,    0
$$ Real data points
##PAGE= N=1
##DATA TABLE= (X++(R..R)), XYDATA
$$ [...]
$$ plain form
41306 1772730 2199821 2099664 1638326 1143819 634574 132073 -26421 288141 540266
41297 540266 249620 -133942 110033 612953 245715 -1058681 -1894422 -1275427 16136
41288 16136 673739 635297 700759 1011748 1002118 562553 197244 90049 -55648 -242721
41278 -242721 -126192 207091 269857 105546 305925 883200 1033593 406189 -252006 -247704
41268 -247704 32119 -92438 -431265 -351559 75404 218052 -27435 -118224 148345 244866
41258 244866 -272029 -1055492 -1375589 -977187 -279611 184429 327095 424842 568422 458124
41248 458124 -51951 -453420 -95680 850136 1487586 1365859 984719 898905 932140 718799
41238 718799 489890 699076 1188124 1350971 974714 392216 -71863 -305877 -168335 443712
$$ packed form
41306A772730M27091j00157m61338m94507n09245n02501j58494L14562K52125
41297E40266k90646l83562K43975N02920l67238j304396q35741O18995J291563
41288A6136O57603l8442O5462L10989r630m39565l65309j07195j45697j87073
41278b42721J16529L33283O2766j64311K00379N77275J50393o27404o58195M302
41268b47704K79823j24557l38827P9706M26963J42648k45487r0789K66569R6521
41258B44866n16895p83463l20097L98402O97576M64040J42666R7747J43580j10298
41248D58124n10075m01469L57740R45816O37450j21727l81140q5814L3235k13341
41238G18799k28909K09186M89048J62847l76257n82498m64079k34014J37542O12047
$$ plain form
41228 443712 1281188 1897966 2103559 1953570 1453837 712976 241227 520116 1244209 1530236
41218 1530236 1021449 310060 34311 -35855 -633935 -1888946 -2968765 -2963265 -1962529
41209 -1962529 -989751 -770383 -875403 -458523 410145 836259 520513 217082 461177
41200 461177 744810 576701 502903 1153528 1964334 1973558 1404759 1206820 1347912 995368
41190 995368 317822 521520 1749052 2467024 1684592 516227 571734 1757599 2738114
41181 2738114 2887731 2684830 2557214 2378981 2073911 1997303 2615595 4054842 5775263
41172 5775263 6601216 5641301 3463640 1713973 1212572 1189928 835956 589989 1077665
41163 1077665 1744625 1723243 1350863 1528209 2067485 2043377 1460674 1154136 1187122 811681
$$ packed form
41228D43712Q37476O16778K05593j49989m99733p40861m71749K78889P24093K86027
41218A530236n08787p11389k75749p0166n98080j255011j079819N500J000736
41209a962529R72778K19368j05020M16880Q68668M26114l15746l03431K44095
41200D61177K83633j68109p3798O50625Q10806R224n68799j97939J41092l52544
41190I95368o77546K03698J227532P17972p82432j168365N5507J185865R80515
41181B738114J49617k02901j27616j78233l05070p6608O18292J439247J720421
41172E775263Q25953r59915k177661j749667n01401k2644l53972k45967M87676
41163A077665O66960k1382l72380J77346N39276k4108n82703l06538L2986l75441
$$ plain form
41153 811681 45220 -195911 245308 420857 -39914 -322505 -23846 58755 -528870 -904589
41143 -904589 -340046 460860 654466 716935 1338150 1833357 1192152 49811 -51659 920697
41133 920697 1440165 783400 -99551 -316589 -179305 -131276 156763 897375 1465107 1402930
41123 1402930 1283603 1663990 1920909 1207356 78685 -63627 935817 1639725 1079603
41114 1079603 177403 444090 1876829 3005574 2872805 2138549 1943618 2284992 2137811
41105 2137811 1012262 -283606 -670911 -132863 409000 355985 117164 492042 1670312
41096 1670312 2964920 3432509 2769266 1680015 1244408 1778326 2499282 2508559 1825202
41087 1825202 1096518 600760 149079 -178882 353 520420 535964 -333043 -1284417 -1264925
$$ packed form
41153H11681p66461k41131M41219J75549m60771k82591K98659Q2601n87625l75719
41143i04589N64543Q00906J93606O2469O21215M95207o41205j142341j01470R72356
41133I20697N19468o56765q82951k17038J37284M8029K88039P40612N67732o2177
41123A402930j19327L80387K56919p13553j128671j42312R99444P03908n60122
41114A079603r02200K66687J432739J128745j32769p34256j94931L41374j47181
41105B137811j125549j295868l87305N38048N41863n3015k38821L74878J178270
41096A670312J294608M67589o63243j089251m35607N33918P20956R277o83357
41087A825202p28684m95758m51681l27961J79235N20067J5544q69007r51374J9492
$$ plain form
41077 -1264925 -248582 881108 1431098 1423976 1249436 1236034 1446146 1580535 1259783 639709
41067 639709 405889 799401 1063934 425010 -702004 -1161446 -530960 555862 1444929
41058 1444929 2029444 2242243 1819629 880099 92119 -108815 -4031 -17701 -139613 -209833
41048 -209833 -297965 -448121 -450683 -198891 94457 306241 606462 985533 1089485 878141
41038 878141 885739 1343307 1594732 1016253 54449 -369297 -136231 119185 19952 -382478
41028 -382478 -1164052 -2323873 -3145832 -2755108 -1402288 -296949 -26630 -46521 77818
41019 77818 -26646 -525704 -660609 171430 1304660 1615001 1020850 413762 391485 772830
41009 772830 1161347 1290548 897358 -94350 -1206239 -1713935 -1410302 -733580 -160130
$$ packed form
41077a264925J016343J129690N49990p122j74540j3402K10112J34389l20752o20074
41067F39709k33820L93512K64533o38924j127014m59442O30486J086822Q89067
41058A444929N84515K12799m22614r39530p87980k00934J04784j3670j21912p0220
41048b09833q8132j50156k562K51792K93348K11784L00221L79071J03952k11344
41038H78141P598M57568K51425n78479r61804m23746K33066K55416r9233m02430
41028c82478p81574j159821q21959L90724J352820J105339K70319j9891J24339
41019G7818j04464m99058j34905Q32039J133230L10341n94151o07088k2277L81345
41009G72830L88517J29201l93190r91708j111889n07696L03633O76722N73450
$$ plain form
41000 -160130 192010 404768 589410 909723 1460409 2041945 2258955 1906818 1188196 596954
40990 596954 604608 1259038 2023319 2284211 2111915 2139868 2534360 2585249 1679290 233449
40980 233449 -806375 -1047035 -783945 -433966 -326658 -655721 -1050981 -607039 950254
40971 950254 2490748 2712900 1889832 1454099 1976374 2570237 2368659 1600831 957908
40962 957908 740442 920113 1302297 1383790 775086 -36746 -117298 543094 949239 605756
40952 605756 118164 -24749 -159448 -424585 -198132 663366 1118419 462133 -421732 -465195
40942 -465195 -168737 -585053 -1284277 -953906 334813 1132027 867036 517984 779329
40933 779329 1031153 626648 -66084 -533214 -939702 -1398497 -1377283 -628088 63492 -108195
$$ packed form
41000a60130L52140K12758J84642L20313N50686N81536K17010l52137p18622n91242
40990E96954P654O54430P64281K60892j72296K7953L94492N0889r05959j445841
40980B33449j039824k40660K63090L49979J07308l29063l95260M43942J557293
40971I50254J540494K22152q23068m35733N22275N93863k01578p67828o42923
40962I57908k17466J79671L82184Q1493o08704q11832q0552O60392M06145l43483
40952F05756m87592j42913j34699k65137K26453Q61498M55053o56286q83865m3463
40942d65195K96458m16316o99224L30371J288719P97214k64991l49052K61345
40933G79329K51824m04505o92732m67130m06488m58795K1214P49195O91580j71687
$$ plain form
40923 -108195 -784786 -1065499 -843903 -719507 -886107 -894464 -429959 278425 813098 933436
40913 933436 667014 325444 242901 243701 -291850 -1447685 -2235627 -1630078 51974 1423263
40903 1423263 1656408 1288414 1317714 2004115 2792246 3071224 2709240 1995160 1321915 933105
40893 933105 814951 740476 467968 9217 -290443 -95969 423480 668510 361171 -34377
40883 -34377 42278 453111 706811 885288 1524610 2567741 3193667 2912068 2152768 1477416
40873 1477416 894832 374095 352895 1115549 2150963 2745720 2841423 2762901 2526262 2047343
40863 2047343 1652722 1684445 1878174 1788080 1522680 1370594 1062235 266287 -472909 -327996
40853 -327996 382741 468397 -312716 -822065 -299999 479870 437065 -242924 -521204 19629
$$ packed form
40923a08195o76591k80713K21596J24396j66600q357M64505P08384N34673J20338
40913I33436k66422l41570q2543Q00n35551j155835p87942O05549J682052J371289
40903A423263K33145l67994K9300O86401P88131K78978l61984p14080o73245l88810
40893I33105j18154p4475k72508m58751k99660J94474N19449K45030l07339l95548
40883c4377P6655M10833K53700J78477O39322J043131O25926k81599p59300o75352
40873A477416n82584n20737k1200P62654J035414N94757R5703p8522k36639m78919
40863B047343l94621L1723J93729r0094k65400j52086l08359p95948p39196J44913
40853c27996P10737Q5656p81113n09349N22066P79869m2805o79989k78280N40833
$$ plain form
40843 19629 835293 1275120 1187889 822656 564162 682893 1079779 1383941 1416318 1331974
40833 1331974 1252624 1117997 969018 919049 745617 83161 -792651 -1041918 -461757 78034
40823 78034 -94298 -395638 122684 1345057 2313580 2509216 2138102 1435837 540491 -71047
40813 -71047 109500 788937 1067679 632311 156998 326199 969348 1403939 1267966 794726
40803 794726 466536 471936 400164 -340156 -1570661 -2168917 -1338504 242962 1188965 1107029
40793 1107029 791023 841497 985230 866947 647891 531974 418295 316271 450806 714928
40783 714928 717133 589545 908558 1504793 1359554 253713 -524693 -6409 848033 532982
40773 532982 -687990 -1237635 -671998 -225225 -830065 -1884408 -2334623 -1944127 -1078844
$$ packed form
40843A9629Q15664M39827q7231l65233k58494J18731L96886L04162L2377q4344
40833A331974p9350j34627j48979m9969j73432o62456q75812k49267N80161N39791
40823G8034j72332l01340N18322J222373R68523J95636l71114p02265q95346o11538
40813g1047J80547O79437K78742m35368m75313J69201O43149M34591j35973m73240
40803G94726l28190N400p1772p40320j230505n98256Q30413J581466R46003q1936
40793A107029l16006N0474J43733j18283k19056j15917j13679j02024J34535K64122
40783G14928K205j27588L19013N96235j45239j105841p78406N18284Q54442l15051
40773E32982j220972n49645N65637M46773o04840j054343m50215L90496Q65283
$$ plain form
40764 -1078844 -149617 268111 -385355 -1742324 -2443942 -1653335 -181576 477167 -133112
40755 -133112 -1199098 -1790455 -1687421 -1257330 -980409 -1006794 -932111 -257091 722294 951347
40745 951347 -34578 -1271595 -1505755 -816077 -337716 -560633 -788313 -371645 379624
40736 379624 878502 1168263 1607970 2090393 2183182 1875490 1628317 1646972 1542700 915172
40726 915172 12567 -470196 -214258 347947 619772 649762 1056535 2095347 3126572
40717 3126572 3289295 2525746 1611781 1255200 1502297 1995499 2403015 2486963 2127596 1512126
40707 1512126 1057362 953068 1003800 1082042 1428863 2211435 3042084 3339895 3043115 2561790
40697 2561790 2095524 1459031 643675 81503 110805 511919 848552 1008208 1105073 1088904
$$ packed form
40764a078844R29227M17728o53466j356969p01618P90607J471759O58743o10279
40755a33112j065986n91357J03034M30091K76921k6385P4683O75020R79385K29053
40745I51347r85925j237017k34160O89678M78361k22917k27680M16668P51269
40736C79624M98878K89761M39707M82423R2789l07692k47173J8655j04272o27528
40726I15172r02605m82763K55938N62205K71825K9990M06773J038812J031225
40717C126572J62723p63549r13965l56581K47097M93202M07516Q3948l59367o15470
40707A512126m54764j04294N0732P8242L46821P82572Q30649K97811k96780m81325
40697B561790m66266o36493q15356n62172K9302M01114L36633J59656R6865j6169
$$ plain form
40687 1088904 851334 585293 583530 689806 422489 -239452 -664201 -430177 16622 -36683
40677 -36683 -587100 -984430 -812914 -226004 504039 1226375 1656547 1435625 662979 -53888
40667 -53888 -306105 -252051 -83441 370710 1129755 1631637 1391501 785676 549952 664861
40657 664861 410637 -471178 -1318307 -1411686 -787072 14586 575370 755967 579961 205067
40647 205067 -199549 -618387 -971356 -814402 197463 1467971 1761027 715142 -506688
40638 -506688 -588899 347313 1097857 982817 434049 125638 181956 319437 282975 16529
40628 16529 -289046 -297174 65361 411919 441095 478875 962881 1542217 1415140 633312
40618 633312 265716 889565 1625194 1313905 191405 -399708 184881 1149742 1455155
$$ packed form
40687A088904k37570k66041j763J06276k67317o61941m24749K34024M46799n3305
40677c6683n50417l97330J71516N86910P30043P22336M30172k20922p72646p16867
40667e3888k52217N4054J68610M54151P59045N01882k40136o05825k35724J14909
40657F64861k54224q81815q47129r3379O24614Q01658N60784J80597j76006l74894
40647B05067m04616m18838l52969J56954J011865J270508K93056j045885j221830
40638e06688q2211R36212P50544j15040n48768l08411N6318J37481l6462k66446
40628A6529l05575q128L62535L46558K9176L7780M84006N79336j27077p81828
40618F33312l67596O23849P35629l11289j122500n91113N84589R64861L05413
$$ plain form
40609 1455155 1083636 717012 601288 342373 -227106 -560779 -104595 800654 1198274
40600 1198274 731184 153337 362439 1218167 1741316 1376127 581896 102211 101125 247572
40590 247572 265666 46428 -497092 -1218419 -1515141 -847267 439123 1270795 1068721 462054
40580 462054 458444 1158736 1726439 1529267 813304 140716 -363062 -867791 -1267075 -1228676
40570 -1228676 -760289 -319322 -283220 -595240 -990129 -1276549 -1313438 -1029720 -633616 -509149
40560 -509149 -687900 -695058 -195596 449410 630858 345456 192394 515376 906971 710540
40550 710540 -163421 -1050171 -1140162 -292982 755163 1109609 639257 -24652 -374573 -477375
40540 -477375 -421199 68840 982580 1501535 848776 -586600 -1690251 -2027560 -2059306 -2068918
$$ packed form
40609A455155l71519l66624j15724k58915n69479l33673M56184R05249L97620
40600A198274m67090n77847K09102Q55728N23149l65189p94231m79685j086J46447
40590B47572J8094k19238n43520p21327k96722O67874J286390Q31672k02074o06667
40580D62054l610P00292N67703j97172p15963o72588n03778n04729l99284L8399
40570a228676M68387M40967L6102l12020l94889k86420l6889K83718L96104J24467
40560e09149j78751p158M99462O45006J81448k85402j53062L22982L91595j96431
40550G10540q73961q86750q9991Q47180J048145L54446m70352o63909l49921j02802
40540d77375N6176M90039R13740N18955o52759j435376j103651l37309l1746r612
$$ plain form
40530 -2068918 -1775858 -1135365 -637739 -500643 -324035 106526 417129 446445 679429 1346195
40520 1346195 1826497 1624033 1256441 1366246 1542684 1011581 81874 -202223 305169
40511 305169 669558 394275 65991 189333 309207 -195731 -1118315 -1766916 -1842742 -1491451
40501 -1491451 -853433 -72444 447937 268159 -565102 -1412218 -1503241 -583622 734029
40492 734029 1372842 860354 -85126 -420357 -100827 51996 -233072 -224444 550791 1399410
40482 1399410 1410006 707077 62960 -271443 -539031 -598772 -25183 921804 1311930 763755
40472 763755 -57339 -462436 -618859 -976161 -1359426 -1252900 -713283 -372647 -544593 -812822
40462 -812822 -626583 17093 632729 801797 566862 384523 711317 1502299 2109362 1847893
$$ packed form
40530b068918K93060O40493M97626J37096J76608M30561L10603K9316K32984O66766
40520A346195M80302k02464l67592J09805J76438n31103r29707k84097N07392
40511C05169L64389k75283l28284J23342J19874n04938r22584o48601p5826L51291
40501a491451O38018P80989N20381j79778q33261q47116r1023R19619J317651
40492G34029O38813n12488r45480l35231L19530J52823k85068Q628P75235Q48619
40482A399410J0596p02929o44117l34403k67588n9741N73589R46987L90126n48175
40472G63755q21094m05097j56423l57302l83265J06526N39617L40636j71946k68229
40462h12822J86239O43676O15636J69068k34935j82339L26794P90982O07063k61469
$$ plain form
40452 1847893 734611 -452918 -901988 -462715 355777 903982 875293 491045 317838
40443 317838 717439 1356171 1473192 814617 56898 -5327 499509 721467 279820 -239560
40433 -239560 -130973 497065 936075 804033 465190 585751 1414261 2438871 2741109
40424 2741109 1894883 575653 5460 656898 1780875 2369847 2221811 1747782 1103295
40415 1103295 78007 -1234024 -2196500 -2248715 -1505669 -616348 -162250 -235372 -485082
40406 -485082 -523474 -278537 97758 552001 1067475 1318370 873713 -74508 -694660 -552759
40396 -552759 -179008 -201336 -471456 -615882 -848164 -1394103 -1622925 -859183 214577 229398
40386 229398 -785059 -1290506 -489017 611136 903779 702734 735427 744151 214076 -316620
$$ packed form
40452A847893j113282j187529m49070M39273Q18492N48205k8689l84248j73207
40443C17838L99601O38732J17021o58575p57719o2225N04836K21958m41647n19380
40433b39560J08587O28038M39010j32042l38843J20561Q28510J024610L02238
40424B741109q46226j319230n70193O51438J123977N88972j48036m74029o44487
40415A103295j025288j312031r62476n2215P43046Q89321M54098p3122k49710
40406d85082l8392K44937L76295M54243N15474K50895m44657r48221o20152J41901
40396e52759L73751k2328k70120j44426k32282n45939k28822P63742J073760J4821
40386B29398j014457n05447Q01489J100153K92643k01045L2693Q724n30075n30696
$$ plain form
40376 -316620 62522 1098158 1701339 1543589 1207347 916259 294824 -544870 -818778
40367 -818778 -304706 163764 -128616 -839911 -1246772 -1229064 -1085819 -877893 -517379 -212301
40357 -212301 -301566 -741425 -1088561 -947552 -292803 487111 738392 -2885 -1459163 -2687186
40347 -2687186 -2956202 -2477837 -2101968 -2373532 -3035569 -3396372 -3043093 -2179094 -1307254
40338 -1307254 -640666 33862 842522 1424581 1354923 832856 520007 651967 733886 282819
40328 282819 -510628 -1125709 -1394355 -1479336 -1393222 -1003623 -495100 -364374 -757288 -1135293
40318 -1135293 -930208 -374319 -278013 -940390 -1682507 -1711088 -1135463 -723701 -821730 -1022718
40308 -1022718 -916380 -635432 -474694 -436667 -451064 -661573 -1136493 -1582138 -1698573 -1590987
$$ packed form
40376c16620L79142J035636O03181j57750l36242k91088o21435q39694k73908
40367h18778N14072M68470k92380p11295m06861J7708J43245K07926L60514L05078
40357b12301q9265m39859l47136J41009O54749P79914K51281p41277j456278j228023
40347b687186k69016M78365L75869k71564o62037l60803L53279Q63999Q71840
40338a307254O66588O74528Q08660N82059o9658n22067l12849J31960Q1919m51067
40328B82819p93447o15081k68646q4981Q6114L89599N08523J30726l92914l78005
40318a135293K05085N55889R6306o62377p42117k8581N75625M11762r8029k00988
40308a022718J06338K80948J60738L8027j4397k10509m74920m45645j16435J07586
$$ plain form
40298 -1590987 -1509959 -1422090 -1166531 -807105 -501877 -247272 -43520 -34420 -194559 -240227
40288 -240227 -157702 -315573 -635587 -319554 903887 1939035 1721134 890792 811939 1288720
40278 1288720 808890 -900853 -2190916 -1847433 -686546 -33023 139856 579093 1264631
40269 1264631 1648150 1695276 1690354 1535190 1128123 920701 1233799 1541299 1309802 990931
40259 990931 1195715 1441968 905351 7277 -70599 720343 1244521 1061672 994165 1514700
40249 1514700 1837998 1190722 -19182 -938507 -1380899 -1597784 -1623202 -1466939 -1418167 -1595801
40239 -1595801 -1659383 -1437523 -1338847 -1638046 -1866027 -1491174 -754028 -187069 294182 1061068
40229 1061068 1760188 1465051 -44363 -1737494 -2294882 -1332125 387986 1688801 1898369
$$ packed form
40298a590987Q1028Q7869K55559L59426L05228K54605K03752R100j60139m5668
40288b40227Q2525j57871l20014L16033J223441J035148k17901q30342p8853M76781
40278A288720m79830j709743j290063L43483J160887O53523J72879M39237O85538
40269A264631L83519M7126m922j55164m07067k07422L13098L07500k31497l18871
40259I90931K04784K46253n36617q98074p7876P90942N24178j82849o7507N20535
40249A514700L23298o47276j209904r19325m42392k16885k5418J56263M8772j77634
40239a595801o3582K21860R8676k99199k27981L74853P37146N66959M81251P66886
40229A061068O99120k95137j509414j693131n57388R62757J720111J300815K09568
$$ plain form
40220 1898369 1309079 824253 1051645 1762296 2267272 2129438 1392358 393144 -395884
40211 -395884 -583386 -241672 91367 81446 67847 521956 1244363 1553476 1168035 432328
40201 432328 -291027 -933712 -1359477 -1227696 -482989 392940 907393 1068103 1119782 1058483
40191 1058483 772033 482246 594548 1063960 1272839 721834 -363492 -1305052 -1715551
40182 -1715551 -1751123 -1697325 -1609381 -1471214 -1433068 -1590418 -1633547 -1081309 47715 1080361
40172 1080361 1371049 939685 275985 -263933 -635012 -897949 -1181135 -1719442 -2526211
40163 -2526211 -3058989 -2675537 -1539374 -613028 -486168 -627150 -220311 583726 860660
40154 860660 244776 -615535 -1081112 -1327507 -1702577 -1834774 -1100866 233766 1119080
$$ packed form
40220A898369n89290m84826K27392P10651N04976j37834p37080r99214p89028
40211c95884j87502L41714L33039r921j3599M54109P22407L09113l85441p35707
40201D32328p23355o42685m25765J31781P44707Q75929N14453J60710N1679o1299
40191A058483k86450k89787J12302M69412K08879n51005j085326r41560m10499
40182a715551l5572N3798Q7944J38167L8146j57350m3129N52238J129024J032646
40172A080361K90688m31364o63700n39918l71079k62937k83186n38307q06769
40163b526211n32778L83452J136163R26346J26860j40982M06839Q04037K76934
40154H60660o15884q60311m65577k46395l75070j32197P33908J334632Q85314
$$ plain form
40145 1119080 1064974 718294 824419 1186363 1098216 388276 -518919 -1326426 -2050528 -2541525
40135 -2541525 -2384880 -1429457 -73094 1077808 1599104 1360844 619007 -13083 -89966
40126 -89966 139381 137550 -17608 266127 973497 1184846 306926 -1018456 -1791721 -1920042
40116 -1920042 -1935665 -1910431 -1532954 -1036096 -1051460 -1465333 -1360437 -403651 532081 596111
40106 596111 109621 -103607 42453 58142 -105634 -35615 260317 225565 -381336 -1112467
40096 -1112467 -1493198 -1537544 -1402826 -1036007 -471260 -62761 -45083 -166552 -131561 -126434
40086 -126434 -455000 -856544 -745989 -132852 222913 -260690 -1296738 -2169834 -2526633
40077 -2526633 -2460021 -2094266 -1476924 -796212 -360503 -293418 -416114 -449580 -225315 242089
$$ packed form
40145A119080n4106l46680J06125L61944q8147p09940r07195q07507p24102m90997
40135b541525J56645R55423J356363J150902N21296k38260p41837o32090p6883
40126h9966K29347j831j55158K83735P07370K11349q77920j325382p73265j28321
40116a920042j5623K5234L77477M96858j5364m13873J04896R56786R35732O4030
40106E96111m86490k13228J46060J5689j63776P0019K95932l4752o06901p31131
40096a112467l80731m4346J34718L66819N64747M08499J7678j21469L4991N127
40086a26434l28566m01544J10555O13137L55765m83603j036048q73096l56799
40077b526633O6612L65755O17342O80712M35709O7085j22696l3466K24265M67404
$$ plain form
40067 242089 728688 893205 579272 19497 -406919 -571581 -576978 -433007 -68717 307181
40057 307181 219826 -490034 -1331238 -1645507 -1285387 -618220 -19549 375162 527866 445125
40047 445125 312994 427027 871268 1394683 1646452 1407315 618616 -561758 -1652376
40038 -1652376 -2075054 -1715353 -1099354 -786971 -725221 -481376 -12299 197992 -163072 -785991
40028 -785991 -1191322 -1293989 -1198932 -743295 224441 1199055 1280580 306897 -751627 -886195
40018 -886195 -203605 412820 520244 473316 673427 1018761 1191176 1032396 487604 -398789
40008 -398789 -1215966 -1328422 -625364 169670 309480 -78922 -293324 -60657 236839 279371
39998 279371 242432 390188 646727 784930 756603 620185 347394 -103791 -669547 -1250728
$$ packed form
40067B42089M86599J64517l13933n59775m26416j64662n397J43971L64290L75898
40057C07181q7355p09860q41204l14269L60120O67167N98671L94711J52704q2741
40047D45125j32131J14033M44241N23415K51769k39137p88699j180374j090618
40038a652376m22678L59701O15999L12383O1750K43845M69077K10291l61064o22919
40028g85991m05331j02667R5057M55637R67736R74614Q1525r73683j058524j34568
40018h86195O82590O16425J07424m6928K00111L45334J72415j58780n44792q86393
40008c98789q17177j12456P03058P95034J39810l88402k14402K32667K97496M2532
39998B79371l6939J47756K56539J38203k8327j36418k72791m51185n65756n81181
$$ plain form
39988 -1250728 -1721008 -1795250 -1212146 -242350 355433 257343 139705 790316 1851222 2145891
39978 2145891 1317104 411042 497064 1315261 1806541 1521187 865764 263111 -191941 -348170
39968 -348170 -37999 395780 306774 -300852 -656976 -356333 29818 -100671 -428046 -304000
39958 -304000 183104 452378 408546 403563 424624 145537 -274385 -295286 29596 60493 -247824
39947 -247824 -117194 647250 941976 -154274 -1846967 -2529646 -1858843 -944390 -601482
39938 -601482 -441203 93093 694328 722510 199406 -311301 -527640 -622545 -683805 -488691
39928 -488691 68852 627811 652804 19215 -808106 -1190667 -865879 -84107 710430 1233437
39918 1233437 1437161 1404858 1240119 959379 457771 -291917 -1000122 -1248879 -1000511 -651498
$$ packed form
39988a250728m70280p4242N83104R69796N97783r8090j17638O50611J060906K94669
39978B145891q28787r06062Q6022Q18197M91280k85354o55423o02653m55052j56229
39968c48170L10171M33779q9006o07626l56124L00643L86151j30489l27375J24046
39958c04000M87104K69274m3832m983K1061k79087m19922k0901L24882L0897l08317
39947b47824J30630P64444K94726j096250j692693o82679O70803R14453L42908
39938f01482J60279N34296O01235K8182n23104n10707k16339r4905o1260J95114
39928d88691N57543N58959K4993o33589q27321l82561L24788P81772P94537N23007
39918A233437K03724l2303j64739k80740n01608p49688p08205k48757K48368L49013
$$ plain form
39908 -651498 -435849 -106568 503699 937296 610482 -299316 -990822 -1053546 -838545 -725340
39898 -725340 -533424 51611 813489 1120195 596789 -494155 -1456930 -1701904 -1256942
39889 -1256942 -762856 -721149 -756219 -14042 1599776 3037813 3251085 2335480 1197345
39880 1197345 445754 91821 39564 206890 210854 -389732 -1333776 -1659113 -780434 773933
39870 773933 1983068 2376090 2131712 1460901 432556 -638297 -1172445 -932838 -354408
39861 -354408 -23518 -4327 87158 470623 940454 1187998 1113890 759327 174431 -494479
39851 -494479 -969672 -1093981 -1013107 -927700 -788690 -485144 -214989 -276627 -468525 -167301
39841 -167301 752902 1504207 1332406 597380 325586 790598 1227052 1090126 861238 1132750
$$ packed form
39908f51498K15649L29281O10267M33597l26814r09798o91506o2724K15001J13205
39898g25340J91916N85035P61878L06706n23406j090944r62775k44974M44962
39889a256942M94086M1707l5070P42177J613818J438037K13272r15605j138135
39880A197345p51591l53933n2257J67326L964o00586r44044l25337Q78679J554367
39870G73933J209135L93022k44378o70811j028345j070853n34148K39607N78430
39861c54408L30890J9191R1485L83465M69831K47544p4108l54563n84896o68910
39851d94479m75193j24309Q0874Q5407J39010L03546K70155o1638j91898L01224
39841a67301R20203P51305j71801p35026k71794M65012M36454j36926k28888K71512
$$ plain form
39831 1132750 1496931 1113587 96675 -532663 -307504 95173 -4719 -311162 -217810 143143
39821 143143 211077 6441 80984 571247 988672 978566 674084 215950 -455170 -1131481
39811 -1131481 -1264279 -702127 -34129 184431 162655 429084 994470 1425823 1536229 1532151
39801 1532151 1570880 1567695 1413900 1104204 706191 407969 433755 681915 697524 342166
39791 342166 215325 902899 1959151 2234143 1277601 -78345 -683278 -233603 666025
39782 666025 1264474 1297927 1080930 1111783 1498511 1829938 1774438 1608662 1782568 2114869
39772 2114869 1966614 1250409 717913 1045212 2053657 3027838 3411319 3008443 1949213
39763 1949213 757346 86381 50394 85956 -257956 -723721 -862740 -802277 -1018079 -1526704
$$ packed form
39831A132750L64181l83344j016912o29338K25159M02677r9892l06443R3352L60953
39821A43143O7934k04636P4543M90263M17425j0106l04482m58134o71120o76311
39811a131481j32798N62152O67998K18560k1776K66429N65386M31353J10406m078
39801A532151L8729l185j53795l09696l98013k98222K5786K48160J5609l55358
39791C42166j26841O87574J056252K74992r56542j355946o04933M49675Q99628
39782F66025N98449L3453k16997L0853L86728L31427n5500j65776J73906L32301
39772B114869j48255p16205n32496L27299J008445R74181L83481m02876j059230
39763A949213j191867o70965l5987L5562l43912m65765j39019O0463k15802n08625
$$ plain form
39753 -1526704 -1801401 -1487820 -831630 -356205 -390203 -923364 -1642010 -2022543 -1627679 -508109
39743 -508109 714288 1275278 887899 7111 -570114 -469878 -61219 93575 -36739
39734 -36739 -42182 227458 469482 478889 456834 606026 817901 997296 1328376 1901874 2365762
39723 2365762 2290196 1696441 959202 384885 130404 296916 800933 1331862 1679693 1885379
39713 1885379 1865604 1273367 122273 -808154 -753009 28072 563706 386958 -110206 -481316
39703 -481316 -758539 -1056572 -1215482 -1128387 -1011566 -1002800 -769003 95467 1366641 2223867
39693 2223867 2069746 1136091 145656 -520245 -1086853 -1791730 -2365229 -2428722 -2181386 -2162015
39683 -2162015 -2362603 -2192243 -1461068 -744118 -461385 -265762 186374 531990 429666
$$ packed form
39753a526704k74697L13581O56190M75425l3998n33161p18646l80533L94864J119570
39743e08109J222397N60990l87379q80788n77225J00236M08659J54794j30314
39734c6739n443K69640K42024R407k2055J49192K11875J79395L31080N73498M63888
39723B365762p5566n93755p37239n74317k54481J66512N04017N30929L47831K05686
39713A885379j9775n92237j151094r30427N5145P81081N35634j76748m97164l71110
39703d81316k77223k98033j58910Q7095J16821Q766K33797Q64470J271174Q57226
39693B223867j54121r33655r90435o65901n66608p04877n73499o3493K47336J9371
39683b162015k00588J70360P31175P16950K82733J95623M52136L45616j02324
$$ plain form
39674 429666 349883 749252 979690 141509 -1268053 -1822771 -1261038 -786720 -1045708 -1209344
39664 -1209344 -686478 -363247 -1026861 -1644838 -743181 1049765 1526904 37215 -1477264
39655 -1477264 -1191132 132958 446135 -608970 -1387656 -789644 216864 166426 -751197
39646 -751197 -1081101 -276895 567378 320339 -710850 -1393030 -1266788 -791273 -413369
39637 -413369 -96142 252722 478329 485468 500298 839894 1539023 2209828 2225616 1291503
39627 1291503 28916 -376884 464257 1470125 1355345 331878 -197793 442363 1435885
39618 1435885 1785594 1592732 1616919 2115509 2584566 2390202 1418563 311239 40655
39609 40655 859141 1764361 1600282 599439 21750 272463 468090 142818 113308 908576
$$ packed form
39674D29666p9783L99369K30438q38181j409562n54718N61733M74318k58988j63636
39664a209344N22866L23231o63614o17977R01657J792946M77139j489689j514479
39655a477264K86132J324090L13177j055105p78686N98012J006508n0438r17623
39646g51197l29904Q04206Q44273k47039j031189o82180J26242M75515L77904
39637d13369L17227L48864K25607P139J4830L39596O99129O70805J5788r34113
39627A291503j262587m05800Q41141J005868j14780j023467n29671O40156R93522
39618A435885L49709j92862K4187M98590M69057j94364r71639j107324k70584
39609D0655Q18486R05220j64079j000843n77689K50713J95627l25272k9510P95268
$$ plain form
39599 908576 1513157 834858 -406508 -603549 407045 1310705 1388752 1213076 1194021 844034
39589 844034 -29127 -555991 25472 1214406 1986332 2109377 2005242 1750740 1049138
39580 1049138 50396 -575966 -546535 -403229 -753477 -1387228 -1516066 -816874 106277 441734
39570 441734 112268 -284891 -358798 -334188 -501957 -688950 -566648 -207414 1127 -157825
39560 -157825 -582585 -1025575 -1199321 -929704 -427232 -142112 -132156 43488 511136 693476
39550 693476 244199 -194754 34631 339000 -337887 -1628400 -1877223 -406194 1467473
39541 1467473 2168769 1680494 995839 593975 305372 118240 171367 186593 -260122 -957953
39531 -957953 -1230805 -897116 -464514 -288870 -73921 593503 1577764 2281710 2219528 1421414
$$ packed form
39599I08576O04581o78299j241366j97041J010594R03660P8047j75676j9055l49987
39589H44034q73161n26864N81463J188934P71926J23045j04135k54502p01602
39580A049138r98742o26362K9431J43306l50248o33751j28838O99192R23151L35457
39570D41734l29466l97159p3907K4610j67769j86993J22302L59234K08541j58952
39560a57825m24760m42990j73746K69617N02472K85120R956J75644M67648J82340
39550F93476m49277m38953K29385L04369o76887j290513k48823J471029J873667
39541A467473P01296m88275o84655m01864k88603j87132N3127J5226m46715o97831
39531i57953k72852L33689M32602J75644K14949O67424R84261P03946o2182p98114
$$ plain form
39521 1421414 433590 -71870 107194 457367 275425 -525170 -1290146 -1333505 -607486 397098
39511 397098 1261669 1979040 2688840 3270497 3441561 3269653 3260002 3701516 4234383 4490173
39501 4490173 4889230 6135676 8048979 9808181 11508094 14396608 19068957 24685040
39493 24685040 31091950 40421723 54225033 68988862 76990861 73195407 60263508 45519947
39485 45519947 33929715 25490798 18537817 13017510 9781598 8511326 7872876 7071768
39477 7071768 6136680 5078443 3809050 2720798 2384257 2616085 2620646 2138748 1711298
39468 1711298 1662154 1609220 1303628 1196904 1642095 2129642 1974218 1359471 1028250 1205913
39458 1205913 1507870 1729881 1988719 2101778 1587977 488163 -441289 -665094 -517984
$$ packed form
39521A421414r87824n05460J79064L50173j81942q00595p64976m3359P26019J004584
39511C97098Q64571P17371P09800N81657J71064j71908r651M41514N32867K55790
39501D490173L99057J246446J913303J759202J699913K888514M672349N616083
39493B4685040O406910R329773J3803310J4763829Q001999l795454j2931899j4743561
39485D5519947j1590232q438917o952981n520307l235912j270272o38450q01108
39477G071768r35088j058237j269393j088252l36541K31828M561m81898m27450
39468A711298m9144n2934l05592j06724M45191M87547j55424o14747l31221J77663
39458A205913L01957K22011K58838J13059n13801j099814r29452k23805J47110
$$ plain form
39449 -517984 -581946 -822509 -759002 -232068 427725 894088 1148138 1283005 1267038 982861
39439 982861 392446 -382442 -1121970 -1665442 -1999842 -2151475 -2058624 -1682677 -1195091 -875012
39429 -875012 -835504 -1014495 -1361123 -1764681 -1856549 -1288560 -315668 308029 274257 221161
39419 221161 897117 2025124 2493950 1733552 481898 -68737 359983 977156 1068753
39410 1068753 832409 811510 898490 515380 -287267 -658845 -166849 488596 520373 240295
39400 240295 433173 967720 1005505 421252 -54365 -169697 -504893 -1177945 -1331686 -521246
39390 -521246 405437 636974 703653 1404376 2173169 1840016 628800 -36210 287533 454460
39380 454460 -366617 -1425156 -1638755 -1111467 -624065 -369981 -88612 63527 -249501
$$ packed form
39449e17984o3962k40563O3507N26934O59793M66363K54050J34867j5967k84177
39439I82861n90415p74888p39528n43472l34400j51633R2851L75947M87586L20079
39429h75012L9508j78991l46628m03558r1868N67989R72892O23697l3772n3096
39419B21161O75956J128007M68826p60398j251654n50635M28720O17173R1597
39410A068753k36344k0899Q6980l83110q02647l71578M91996O55445L1777k80078
39400B40295J92878N34547L7785n84253m75617j15332l35196o73052j53741Q10440
39390e21246R26683K31537O6679P00723P68793l33153j211216o65010L23743J66927
39380D54460q21077j058539k13599N27288M87402K54084K81369J52139l13028
$$ plain form
39371 -249501 -646521 -296082 847010 1814454 1846848 1270272 880786 927988 1077965 1051466
39361 1051466 850362 482821 -108014 -791601 -1237129 -1272803 -1049004 -737792 -298529 266854
39351 266854 633915 456913 -112689 -550064 -640970 -703830 -999713 -1269419 -1133375 -688657
39341 -688657 -334439 -139073 201948 756095 1082072 744763 -111276 -883081 -1109866 -830105
39331 -830105 -385078 25904 514426 1170852 1646719 1347619 199082 -1025514 -1442800
39322 -1442800 -985497 -280881 212659 443537 217094 -840256 -2413747 -3237733 -2407767
39313 -2407767 -688176 226109 -271314 -1131581 -1239639 -786998 -588730 -712198 -610507
39304 -610507 -274722 -271908 -615388 -579751 20564 283051 -419009 -1293011 -1238775 -537468
$$ packed form
39371b49501l97020L50439J143092R67444L2394n76576l89486M7202J49977k6499
39361A051466k01104l67541n90835o83587m45528l5674K23799L11212M39263N65383
39351B66854L67061j77002n69602m37375r0906o2860k95883k69706J36044M44718
39341f88657L54218J95366L41021N54147L25977l37309q56039p71805k26785K79761
39331h30105M45027M10982M88522O56426M75867k99100j148537j224596m17286
39322a442800M57303P04616M93540K30878k26443j057350j573491q23986Q29966
39313b407767J719591R14285m97423q60267j08058M52641J98268j23468J01691
39304f10507L35785K814l43480L5637O00315K62487p02060q74002N4236P01307
$$ plain form
39294 -537468 -309803 -589662 -278663 857406 1545949 968277 142195 354375 1141494
39285 1141494 1117994 278582 15292 872987 1681915 1341920 334841 -234937 -262280 -412357
39275 -412357 -752554 -587534 357511 1352429 1526866 900263 265188 234052 627684 768721
39265 768721 233466 -758216 -1666253 -2196296 -2395988 -2293006 -1782653 -1008935 -517058 -657572
39255 -657572 -997936 -788118 -41834 347569 -162085 -857116 -621414 524410 1406270
39246 1406270 1274717 700956 559091 747154 542912 -180084 -846494 -1099381 -1061763 -751111
39236 -751111 -67868 547866 356174 -463862 -701629 253295 1438186 1652495 1077760
39227 1077760 699356 647101 189121 -807943 -1481570 -1184064 -259675 629415 1278240 1741376
$$ packed form
39294e37468K27665k79859L10999J136069O88543n77672q26082K12180P87119
39285A141494k3500q39412k63290Q57695Q08928l39995j007079n69778k7343j50077
39275d12357l40197J65020R45045R94918J74437o26603o35075l1136L93632J41037
39265G68721n35255r91682r08037n30043j99692J02982N10353P73718M91877j40514
39255f57572l40364K09818P46284L89403n09654o95031K35702J145824Q81860
39246A406270j31553n73761j41865J88063k04242p22996o66410k52887L7618L10652
39236g51111O83243O15734j91692q20036k37767R54924J184891K14309n74735
39227A077760l78404n2255m57980r97064o73627K97506R24389Q89090O48825M63136
$$ plain form
39217 1741376 1905665 1647574 1139022 726636 607387 663060 527458 -11515 -500291 -71765
39207 -71765 1376002 2636228 2480965 1240239 338766 406603 719277 535092 61368
39198 61368 -166628 -60842 227404 616642 826270 404957 -568540 -1299905 -1133403 -182918
39188 -182918 1042616 2063490 2313592 1364252 -336586 -1606558 -1840490 -1583410 -1453272
39179 -1453272 -1279385 -841317 -615900 -958627 -1194385 -487085 793251 1505776 1286837
39170 1286837 800040 615292 667488 747932 763815 516866 -101237 -689490 -710507 -258354
39160 -258354 93711 120571 41095 -91630 -441426 -893356 -1165251 -1374437 -1815464 -2194190
39150 -2194190 -1830442 -718455 326874 732903 703106 533229 134770 -444200 -687269
$$ packed form
39217A741376J64289k58091n08552m12386j19249N5673j35602n38973m88776M28526
39207g1765J447767J260226j55263j240726r01473O7837L12674j84185m73724
39198F1368k27996J05786K88246L89238K09628m21313r73497p31365J66502R50485
39188a82918J225534J020874K50102r49340j700838j269972k33932K57080J30138
39179a453272J73887M38068K25417l42727k35758P07300J280336P12525k18939
39170A286837m86797j84748N2196Q0444J5883k46949o18103n88253k1017M52153
39160b58354L52065K6860p9476j32725l49796m51930k71895k09186m41027l78726
39150b194190L63748J111987J045329M06029k9797j69877l98459n78970k43069
$$ plain form
39141 -687269 -248188 524511 1065277 1226009 1170279 1041971 1017468 1297490 1757665 1947312
39131 1947312 1676127 1250117 914171 478884 -209538 -817520 -898478 -465262 64382 253898
39121 253898 -151958 -1040981 -1786001 -1733016 -1063138 -683187 -992224 -1343554 -1154609 -909174
39111 -909174 -1335941 -2034800 -1823018 -366935 1314434 2082625 1805932 1094062 436740
39102 436740 -103043 -632416 -1123355 -1304679 -869498 85299 957180 1225365 1037549 941654
39092 941654 1158205 1442744 1547318 1427112 1066800 528722 148902 252882 665235 917683
39082 917683 925773 975244 1056845 846412 463936 543863 1231389 1780065 1621694 1226747
39072 1226747 1282236 1538868 1254562 426097 -295572 -746296 -1381204 -2223251 -2576625 -2057672
$$ packed form
39141f87269M39081P72699N40766J60732n5730j28308k4503K80022M60175J89647
39131A947312k71185m26010l35946m35287o88422o07982q0958M33216N29644J89516
39121B53898m05856q89023p45020N2985O69878L79951l09037l51330J88945K45435
39111i09174m26767o98859K11782J456083J681369P68191k76693p11870o57322
39102D36740n39783n29373m90939j81324M35181R54797Q71881K68185j87816r5895
39092I41654K16551K84539J04574j20206l60312n38078l79820J03980M12353K52448
39082I17683Q090M9471Q1601k10433l82476P9927O87526N48676j58371l94947
39072A226747N5489K56632k84306q28465p21669m50724o34908q42047l53374N18953
$$ plain form
39062 -2057672 -1179709 -588707 -353549 -326328 -518234 -667926 -106420 1292119 2493206
39053 2493206 2342063 976793 -358121 -673694 65990 1248943 2008170 1634172 310812
39044 310812 -767970 -701642 -64314 -20619 -547293 -561454 258674 945852 757661 127602
39034 127602 -284727 -468404 -483279 -28481 707309 688435 -580603 -2029574 -2331049 -1666859
39024 -1666859 -1223174 -1399826 -1577445 -1386850 -1163375 -1206439 -1454038 -1824345 -2105629 -1675138
39014 -1675138 -211561 1412197 1871295 1011002 -163138 -1054242 -1951935 -2812212 -2752688
39005 -2752688 -1312776 639996 1844050 1904365 1275116 646381 663791 1500200 2308206
38996 2308206 1883507 336258 -749309 -428858 225238 -278942 -1675078 -2466044 -2072483
$$ packed form
39062b057672Q77963N91002K35158K7221j91906j49692N61506J398539J201087
39053B493206j51143j365270j334914l15573P39684J182953P59227l73998j323360
39044C10812j078782O6328O37328M3695n26674j4161Q20128O87178j88191o30059
39034A27602m12329j83677j4875M54798P35790j8874j269038j448971l01475O64190
39024a666859M43685j76652j77619J90595K23475m3064k47599l70307k81284M30491
39014a675138J463577J623758M59098q60293j174140q91104q97693q60277N9524
39005b752688J439912J952772J204054O0315o29249o28735J7410Q36409Q08006
38996B308206m24699j547249j085567L20451O54096n04180j396136p90966L93561
$$ plain form
38987 -2072483 -1211491 -426695 421797 1165497 1147424 428818 49321 467671 690245 -227989
38977 -227989 -1562010 -1840316 -970528 -271769 -423447 -600489 -81263 383914 -257777
38968 -257777 -1515802 -1892849 -1086291 -408384 -750594 -1291375 -892584 160566 772757
38959 772757 764185 884160 1401970 1787162 1759800 1640359 1521266 1017128 86823 -716277
38949 -716277 -1095315 -1343220 -1536923 -1204753 -222676 676137 781944 229676 -437467 -896687
38939 -896687 -879159 -136682 903850 1182179 319128 -773015 -1203562 -1276781 -1602033 -1831472
38929 -1831472 -1328238 -496130 -270809 -648096 -869451 -808354 -962666 -1193660 -766678 219877
38919 219877 678639 156868 -455152 -293910 342962 761564 923460 1087171 1074158 613439
$$ packed form
38987b072483Q60992P84796Q48492P43700j8073p18606l79497M18350K22574r18234
38977b27989j334021k78306Q69788O98759j51678j77042N19226M65177o41691
38968b57777j258025l77047Q06558O77907l42210n40781L98791J053150O12191
38959G72757q572J19975N17810L85192k7362j19441j19093n04138r30305q03100
38949g16277l79038k47905j93703L32170R82077Q98813J05807n52268o67143m59220
38939h96687J7528P42477J040532K78329q63051j092143m30547p3219l25252k29439
38929a831472N03234Q32108K25321l77287k21355O1097j54312k30994M26982R86555
38919B19877M58762n21771o12020J61242O36872M18602J61896J63711j3013m60719
$$ plain form
38909 613439 862 -209051 79229 520205 793403 711035 180667 -590711 -1147954 -1341102
38899 -1341102 -1508038 -1840352 -1983545 -1635478 -1132302 -966096 -1042063 -925395 -581953 -337552
38889 -337552 -255421 -93805 175615 320999 341590 517338 851314 900152 394293 -279561
38879 -279561 -499912 -165675 209530 103797 -494618 -1169061 -1518993 -1451821 -1111266 -636686
38869 -636686 -55072 606836 1172695 1363892 1067001 553087 319960 596020 1032826 1025750
38859 1025750 351829 -620709 -1326648 -1440396 -976432 -254586 192746 33525 -395957
38850 -395957 -393076 138281 437225 -47773 -769864 -790954 -53012 712582 1150463 1588967
38840 1588967 2172902 2480976 2267675 1929924 1848367 1771146 1294716 590880 211102 411867
$$ packed form
38909F13439o12577k09913K88280M40976K73198q2368n30368p71378n57243j93148
38899a341102j66936l32314j43193L48067N03176J66206p5967J16668L43442K44401
38889c37552Q2131J61616K69420J45384K0591J75748L33976M8838n05859o73854
38879b79561k20351L34237L75205j05733n98415o74443l49932O7172L40555M74580
38869f36686N81614O61908N65859J91197k96891n13914k33127K76060M36806p076
38859A025750o73921r72538p05939j13748M63964P21846M47332j59221m29482
38850c95957K881N31357K98944m84998p22091k1090P37942P65594M37881M38504
38840A588967N83935L08074k13301l37751q1557p7221m76430p03836l79778K00765
$$ plain form
38830 411867 1057139 1959318 2885868 3364914 2961440 1837522 750955 369649 706200
38821 706200 1264187 1612783 1722103 1758165 1674981 1214546 404052 -176759 57778 946601
38811 946601 1713636 1870506 1628164 1324868 878917 115589 -659196 -839566 -241650 636107
38801 636107 1099755 836724 26704 -904360 -1538043 -1612546 -1140110 -463769 -66413 -130345
38791 -130345 -322003 -246974 -94745 -427278 -1183190 -1429023 -589316 488680 448836 -725704
38781 -725704 -1606598 -1208904 -175217 350939 334915 604372 1355161 1760670 1184429 148845
38771 148845 -285515 185805 847363 955896 611691 418942 526641 444837 -155429 -906807
38761 -906807 -1246485 -1091403 -695820 -178970 371295 625084 410253 211867 657207 1570143
$$ packed form
38830D11867O45272R02179R26550M79046m03474j123918j086567l81306L36551
38821G06200N57987L48596J09320L6062q3184m60435q10494n80811K34537Q88823
38811I46601P67035J56870k42342l03296m45951p63328p74785j80370N97916Q77757
38801F36107M63648k63031q10020r31064o33683p4503M72436O76341L97356o3932
38791a30345j91658P5029J52229l32533p55912k45833Q39707J077996l9844j174540
38781g25704q80894L97694J033687N26156j6024K69457P50789M05509n76241j035584
38771A48845m34360M71320O61558J08533l44205j92749J07699q1804o00266p51378
38761i06807l39678J55082L95583N16850N50265K53789k14831j98386M45340R12936
$$ plain form
38751 1570143 2162216 2157310 2056017 2189844 2211917 1770887 1072355 461942 -18922 -373955
38741 -373955 -483980 -495952 -802790 -1258249 -1016413 311774 1856171 2477340 2178587
38732 2178587 1855252 1901373 1807358 1113370 129649 -424305 -101724 1002177 2309746
38723 2309746 3046514 2797887 1896113 1084494 785002 837319 886390 814124 788652 1030008
38713 1030008 1537013 2006641 2084286 1685687 967969 110430 -589465 -563266 502775 1898443
38703 1898443 2288729 1218193 -307679 -1121644 -1219718 -1265417 -1342023 -1041440 -523315 -524726
38693 -524726 -1178297 -1593397 -984014 271482 1096384 970297 352484 -34734 412 141389
38683 141389 164915 238211 557674 965503 1199984 1346164 1622690 1794728 1348483 376045
$$ packed form
38751A570143N92073m906j01293J33827K2073m41030o98532o10413m80864l55033
38741c73955j10025j1972l06838m55459K41836J328187J544397O21169k98753
38732B178587l23335M6121r4015o93988r83721n53954L22581J103901J307569
38723B309746P36768k48627r01774q11619k99492N2317M9071p2266k5472K41356
38713A030008N07005M69628P7645l98599p17718q57539o99895K6199J066041J395668
38703A898443L90286j070536j525872q13965r8074m5699p6606L00583N18125j411
38693e24726o53571m15100O09383J255496Q24902j26087o17813l87218L5146J40977
38683A41389K3526P3296L19463M07829K34481J46180K76526J72038m46245r72438
$$ plain form
38673 376045 -275538 -51637 583455 868992 787977 862853 1180495 1231653 718491 37427
38663 37427 -197886 152503 695551 1015958 1088434 1107794 1002445 449340 -421550 -726143
38653 -726143 217091 1801383 2658012 2266447 1394794 905724 865961 983321 1121618 1086649
38643 1086649 672642 277783 690787 1845139 2608182 2336023 1794408 1879541 2280803
38634 2280803 2258252 1962996 1941841 1920332 1226284 95970 -528138 -360706 -477 108524
38624 108524 95894 102215 63058 46816 188921 344743 309034 205314 199958 142464 -28504
38613 -28504 43430 502682 846173 750193 720245 1152178 1419853 859623 42780 -38140
38603 -38140 462475 634445 291249 -137409 -694114 -1529059 -1887216 -982392 369655 565759
$$ packed form
38673C76045o51583K23901O35092K85537q1015P4876L17642N1158n13162o81064
38663C7427k35313L50389N43048L20407P2476J9360j05349n53105q70890l04593
38653g26143R43234J584292Q56629l91565q71653m89070l9763J17360J38297l4969
38643A086649m14007l94859M13004J154352P63043k72159n41615Q5133M01262
38634B280803k2551k95256k1155k1509o94048j130314o24108J67432L60229J09001
38624A08524j2630O321l9157j6242J42105J55822l5709j03720n356n7494j70968
38613b8504P1934M59252L43491r5980k9948M31933K67675n60230q16843q0920
38603c8140N00615J71970l43196m28658n56705q34945l58157R04824J352047J96104
$$ plain form
38593 565759 -427933 -1091735 -715189 -143819 -49238 -78888 -17042 -235015 -596840 -393118
38583 -393118 221185 184272 -629506 -1004760 -360878 337437 289318 63429 365850 918163
38573 918163 1300616 1652723 1828570 1161281 -163760 -814336 -228341 448824 189615
38564 189615 -467047 -697037 -737407 -893962 -592946 328339 706219 -142273 -893077 -101136
38554 -101136 1382105 1609466 433079 -561870 -576377 -337762 -456764 -566359 -212872
38545 -212872 556950 1596505 2731860 3446461 3300306 2613659 2075848 1840817 1599945
38536 1599945 1273351 1030265 896027 824461 821111 668124 86055 -543899 -437206 237095
38526 237095 288665 -637775 -1293448 -720718 237208 338958 -207041 -448892 -308794 -287005
$$ packed form
38593E65759r93692o63802L76546N71370R4581k9650O1846k17973l61825K03722
38583c93118O14303l6913q13778l75254O43882O98315m8119k25889L02421N52313
38573I18163L82453L52107J75847o67289j325041o50576N85995O77165k59209
38564A89615o56662k29990m0370j56555L01016R21285L77880q48492p50804P91941
38554a01136J483241K27361j176387r94949j4507K38615j19002j09595L53487
38545b12872P69822J039555J135355P14601j46155o86647n37811k35031k40872
38536A599945l26594k43086j34238p1566l350j52987n82069o29954J06693O74301
38526B37095N1570r26440o55673N72730R57926J01750n45999k41851J40098K1789
$$ plain form
38516 -287005 -352056 -302890 -521329 -1268628 -1921757 -1875130 -1426997 -922836 -42146 1135924
38506 1135924 1586860 995489 685149 1616855 2750373 2773854 2115632 1743013 1407605
38497 1407605 783690 872366 2331479 3781331 3799427 3250127 3558421 4154611 3931563
38488 3931563 3687403 4527044 5344992 4732331 3914549 4703576 5969116 5563902 4442015
38479 4442015 5128820 7193567 8173556 8057561 8760552 10052310 10380662 10877857 13833940
38470 13833940 18001574 20499181 22484289 27279278 33964445 39560417 46470034 59619423
38462 59619423 77537950 97547818 129721513 188792975 263854984 311640185 296496275
38455 296496275 230544165 159644728 114169436 88825948 67702025 48934976 38178627
$$ packed form
38516b87005o5051M9166k18439p47299o53129M6627M48133N04161Q80690J178070
38506A135924M50936n91371l10340R31706J133518K3481o58222l72619l35408
38497A407605o23915Q8676J459113J449852J8096n49300L08294N96190k23048
38488C931563k44160Q39641Q17948o12661q17782P89027J265540m05214j121887
38479D442015O86805K064747R79989j15995P02991J291758L28352M97195K956083
38470A3833940M167634K497607J985108M794989O685167N595972O909617J3149389
38462E9619423J7918527K0009868L2173695N9071462P5062009M7785201j5143910
38455B96496275o5952110p0899437m5475292k5343488k1123923j8767049j0756349
$$ plain form
38448 38178627 33381451 27912484 21333592 17453545 15979560 13693328 10877059 10092477
38440 10092477 10649348 9752492 7602497 6635024 6877268 6223606 4445979 3267021 3084122
38431 3084122 2778007 2224123 2230437 2503371 2114806 1445230 1490360 1870729 1547568 800384
38421 800384 556865 533533 -51034 -718703 -583111 -138733 -309608 -568661 22525 746168
38411 746168 327625 -603731 -383744 835235 1336911 700577 260609 758627 1525742
38402 1525742 2048831 2496469 2613829 1884120 909371 910548 1729239 2040721 1682459 1933716
38392 1933716 3157742 4028868 3706149 3069226 3021342 3093872 2622941 1960608 1558297 1035098
38382 1035098 168403 -242626 386383 1159458 820121 -428018 -1274776 -1078193 -324989
$$ packed form
38448C8178627m797176n468967o578892l880047j473985k286232k816269p84582
38440A0092477N56871q96856k149995r67473K42244o53662j777627j178958j82899
38431C084122l06115n53884O314K72934l88565o69576M5130L80369l23161p47184
38421H00384k43519k3332n84567o67669J35592M44378j70875k59053N91186P23643
38411G46168m18543r31356K19987J218979N01676o36334m39968M98018P67115
38402A525742N23089M47638J17360p29709r74749J177Q18691L11482l58262K51257
38392A933716J224026Q71126l22719o36923m7884P2530m70931o62333m02311n23199
38382A035098q66695m11029O29009P73075l39337j248139q46758J96583P53204
$$ plain form
38373 -324989 383165 849026 881904 243345 -858675 -1773522 -2052573 -1783653 -1312312 -936051
38363 -936051 -797995 -768109 -507365 47942 380428 -45740 -943972 -1337294 -656019 586279
38353 586279 1356465 1118328 165327 -799746 -1193574 -881367 -310401 -216841 -854577 -1562238
38343 -1562238 -1484480 -703747 -135150 -193326 -221530 396990 1226588 1492739 1247252 1028374
38333 1028374 811493 268935 -228549 -2498 630276 650858 32654 -135894 468127 756803
38323 756803 94097 -503836 7449 971609 1110403 510923 239273 504239 524487 -11742
38313 -11742 -556565 -721926 -659046 -412058 169355 800045 886470 414966 13377 45874
38303 45874 300450 621455 1170737 1930140 2530215 2725826 2609123 2324482 1974231 1707434
$$ packed form
38373c24989P08154M65861L2878o38559j102020r14847k79051K68920M71341L76261
38363i36051J38056K9886K60744N55307L32486m26168q98232l93322O81275J242298
38353E86279P70186k38137r53001r65073l93828L12207N70966R3560o37736p07661
38343a562238P7758P80733N68597n8176k8204O18520Q29598K66151k45487k18878
38333A028374k16881n42558m97484K26051O32774K0582o18204j68548O04021K88676
38323G56803o62706n97933N11285R64160J38794n99480k71650K64966K0248n36229
38313a1742n44823j65361O2880K46988N81413O30690Q6425m71504m01589L2497
38303D5874K54576L21005N49282P59403O00075J95611j16703k84641l50251k66797
$$ plain form
38293 1707434 1461981 838698 -203198 -817832 -231059 955851 1364645 747909 283067
38284 283067 722300 1272991 899054 -53012 -329156 508149 1565883 1789276 1148526
38275 1148526 528779 646297 1230808 1363080 609156 -424588 -864603 -653637 -508164
38266 -508164 -944169 -1747529 -2362654 -2449625 -2068300 -1583820 -1340361 -1243502 -858498 -117174
38256 -117174 429998 379671 41610 -208357 -590270 -1240068 -1403261 -318385 1358206
38247 1358206 2104490 1487996 528151 44186 -219355 -507108 -238404 1016512 2520056
38238 2520056 3107727 2548104 1599637 1026653 1018556 1325467 1556870 1469917 1188181 1023769
38228 1023769 1049907 1069686 947922 649159 78739 -653541 -980640 -532761 57068 -209446
$$ packed form
38293A707434k45453o23283j041896o14634N86773J186910M08794o16736m64842
38284B83067M39233N50691l73937r52066k76144Q37305J057734K23393o40750
38275A148526o19747J17518N84511J32272p53924j033744m40015K10966J45473
38266e08164m36005q03360o15125q6971L81325M84480K43459R6859L85004P41324
38256a17174N47172n0327l38061k49967l81913o49798j63193J084876J676591
38247A358206P46284o16494r59845m83965k63541k87753K68704J254916J503544
38238B520056N87671n59623r48467n72984q097L06911K31403q6953k81736j64412
38228A023769K6138J9779j21764k98763n70420p32280l27099M47879N89829k66514
$$ plain form
38218 -209446 -1222581 -1795385 -1337290 -580937 -300449 -237328 121911 511271 404135 22065
38208 22065 31752 523451 949842 910662 476657 -123629 -688305 -1001495 -963094 -723346
38198 -723346 -490876 -293576 -41763 299013 646291 790579 554751 170383 227838 843414
38188 843414 1200939 554554 -594449 -1120071 -835117 -466584 -243198 292378 1023565
38179 1023565 1141657 585597 293157 572454 548415 -181729 -715776 -456639 -183794 -505059
38169 -505059 -550901 540092 1989201 2609847 2636473 2827623 2720884 1553029 213968
38160 213968 329582 1670805 2319830 1417447 90518 -468410 -308596 96562 559139
38151 559139 778322 447712 -29061 -30789 83979 -464010 -1198761 -831995 480481 1013511
$$ packed form
38218b09446j013135n72804M58095P56353K80488O3121L59239L89360j07136l82070
38208B2065R687M91699M26391l9180m34005o00286n64676l13190L8401K39748
38198g23346K32470J97300K51813L40776L47278J44288k35828l84368N7455O15576
38188H43414L57525o46385j149003n25622K84954L68533K23386N35576P31187
38179A023565J18092n56060k92440K79297k4039p30144n34047K59137K72845l21265
38169e05059m5842J090993J449109O20646K6626J91150j06739j167855j339061
38160B13968J15614J341223O49025r02383j326929n58928J59814M05158M62577
38151E59139K19183l30610m76773j728J14768n47989p34751L66766J312476N33030
$$ plain form
38141 1013511 34398 -1134230 -1219290 -605362 -96998 400181 1032477 1241388 903480
38132 903480 939868 1689184 1947075 877088 -357359 -338367 341167 253012 -337948 -72290
38122 -72290 915691 1089271 127237 -533946 -108789 364462 -97728 -865917 -871163 -195587
38112 -195587 403589 702448 894844 935047 789442 821104 1197273 1371455 876196 227138
38102 227138 243211 730593 700256 -142329 -954463 -1003804 -647324 -634583 -921786 -765822
38092 -765822 160354 1283911 1827677 1572235 767440 -308300 -1340714 -1815723 -1405705
38083 -1405705 -513295 60674 101370 160005 570670 846923 486020 -107913 -169806 198343
38073 198343 93288 -868321 -1970424 -2340215 -1912923 -1179239 -474205 79566 304011
$$ packed form
38141A013511r79113j168628q5060O13928N08364M97179O32296K08911l37908
38132I03480L6388P49316K57891j069987j234447J8992O79534q8155n90960K65658
38122g2290R87981J73580r62034o61183M25157M73251m62190p68189n246O75576
38112a95587N99176K98859J92396M0203j45605L1662L76169J74182m95259o49058
38102B27138J6073M87382l0337q42585q12134m9341L56480J2741k87203J55964
38092g65822R26176J123557N43766k55442q04795j075740j032414m75009M10018
38083a405705Q92410N73969M0696N8635M10665K76253l60903n93933o1893L68149
38073A98343j05055r61609j102103l69791M27292P33684P05034N53771K24445
$$ plain form
38064 304011 144464 -63276 48914 342576 384992 134334 -17224 97229 180937 59377
38054 59377 71800 539443 1135549 1229209 768722 393792 575212 957132 755137 -310980
38044 -310980 -1615687 -2155852 -1517844 -370339 152219 -286535 -798259 -436333 446828
38035 446828 610714 -340466 -1391456 -1538112 -1029008 -678975 -611507 -440768 -236618 -398174
38025 -398174 -762783 -724428 -205836 308316 710732 1346118 2005397 1825560 633824 -457779
38015 -457779 -454724 136562 54280 -977172 -1974821 -2005706 -1160810 -240639 77709 -289374
38005 -289374 -897498 -1232072 -1178593 -981494 -784237 -500387 -177724 -95353 -334951 -607134
37995 -607134 -658663 -485771 -34268 818760 1793362 2259025 2027396 1557063 1126504 496512
$$ packed form
38064C04011j59547k07740J12190K93662M2416k50658j51558J14453Q3708j21560
38054E9377J2423M67643N96106R3660m60487l74930J81420L81920k01995j066117
38044c10980j304707n40165O38008J147505N22558m38754n11724L61926Q83161
38035D46828J63886r51180j050990j46656N09104L50033O7468J70739K04150j61556
38025c98174l64609L8355N18592N14152M02416O35386O59279j79837j191736j091603
38015d57779L055N91286q2282j031452r97649l0885Q44896R20171L18348l67083
38005b89374o08124l34574N3479J97099J97257K83850L22663Q2371k39598k72183
37995f07134n1529J72892M51503Q53028R74602M65663k31629m70333m30559o29992
$$ plain form
37985 496512 -237032 -291691 640371 1629151 1731072 1318166 1241098 1307860 805420 77580
37975 77580 123591 711959 414578 -1155051 -2512823 -2342372 -1244067 -653314 -880139
37966 -880139 -1126552 -873409 -346119 101010 296814 88628 -523340 -1144600 -1334348 -1136241
37956 -1136241 -917431 -801855 -619410 -313319 -28321 188876 472548 874138 1203916
37947 1203916 1191687 749499 98980 -364510 -442114 -355829 -445446 -673690 -679398 -333645
37937 -333645 62954 237393 307011 504569 745978 681104 120757 -670263 -1096501 -729208
37927 -729208 221105 1056459 1331530 1211871 937773 367534 -524391 -1160443 -1087454 -874155
37917 -874155 -1383192 -2274188 -2257098 -965146 445174 904140 698854 646662 838603 829368
$$ packed form
37985D96512p33544n4659R32062R88780J01921m12906p7068O6762n02440p27840
37975G7580M6011N88368k97381j569629j357772J70451J098305N90753k26825
37966h80139k46413K53143N27290M47129J95804k08186o11968o21260j89748J98107
37956a136241K18810J15576J82445L06091K84998K17197K83672M01590L29778
37947A203916j2229m42188o50519m63490p7604Q6285q9617k28244n708L45753
37937c33645L96599J74439O9618J97558K41409o4874n60347p91020m26238L67293
37927g29208R50313Q35354K75071j19659k74098n70239q91925o36052P2989K13299
37917h74155n09037q90996J7090J291952J410320M58966k05286n2192J91941r235
$$ plain form
37907 829368 443894 -187645 -890153 -1312859 -1113112 -616265 -571626 -909805 -694123 194205
37897 194205 497890 -441644 -1364635 -987203 -115136 -243566 -892479 -325311 1437806
37888 1437806 2438235 1772969 797275 810325 1328151 1472001 1500427 1899703 2210149 1904065
37878 1904065 1457127 1451863 1461768 921615 346815 526838 1129492 1299245 1131327 1301006
37868 1301006 1621004 1333586 668907 671351 1315437 1182368 -455022 -2345756 -2814049
37859 -2814049 -1832888 -750448 -438345 -542869 -436491 -177303 -264679 -768071 -1057848
37850 -1057848 -523694 574455 1273424 1009685 220624 -357365 -570397 -643921 -567078 -329366
37840 -329366 -417374 -1231417 -2169233 -2216937 -1446352 -937333 -1092898 -1157449 -780164 -834615
$$ packed form
37907H29368l85474o31539p02508m22706J99747M96847M4639l38179K15682Q88328
37897A94205L03685r39534r22991L77432Q72067j28430o48913N67168J763117
37888A437806J000429o65266r75694J3050N17826J43850K8426L99276L10446l06084
37878A904065m46938n264R905n40153n74800J80023O02654J69753j67918J69679
37868A301006L19998k87418o64679K444O44086j33069j637390j890734m68293
37859b814049R81161J082440L12103j04524J06378K59188q7376n03392k89777
37850a057848N34154J098149O98969k63739p89061n77989k13032p3524P6843K37712
37840c29366q8008q14043r37816m7704P70585N09019j55565o4551L77285n4451
$$ plain form
37830 -834615 -1885091 -2869445 -2414523 -790395 572630 1026727 1006961 769352 155138
37821 155138 -452205 -256884 618344 1060945 571764 -74733 -148590 71225 135309 227251
37811 227251 498786 537184 236778 303662 1013172 1335486 396678 -934610 -1217486 -634277
37801 -634277 -539469 -1130156 -1216348 -390273 228882 -110321 -624065 -451655 -30381 -120324
37791 -120324 -483917 -506656 -291390 -153254 216376 1020219 1449399 683958 -674859 -1366021
37781 -1366021 -1295285 -1345541 -1641348 -1455608 -870542 -994275 -2069380 -2732920 -1933602 -521284
37771 -521284 -15123 -575233 -1156532 -1117375 -682651 -122132 561838 1161678 1260712 808778
37761 808778 174178 -388535 -831858 -950343 -565609 -158718 -620523 -2021821 -3192163
$$ packed form
37830h34615j050476r84354M54922J624128J363025M54097j9766k37609o14214
37821A55138o07343J95321Q75228M42601m89181o46497p3857K19815O4084R1942
37811B27251K71535L8398l00406O6884P09510L22314r38808j331288k82876N83209
37801f34277R4808n90687q6192Q26075O19155l39203n13744J72410M21274q9943
37791a20324l63593k2739K15266J38136L69630Q03843M29180p65441j358817o91162
37781a366021P0736n0256k95807J85740N85066j23733j075105o63540P99318J412318
37771e21284N06161n60110n81299L9157M34724N60519O83970N99840R9034m51934
37761H08778o34600n62713m43323j18485L84734M06891m61805j401298j170342
$$ plain form
37752 -3192163 -3060937 -2072617 -1632415 -2263325 -3009875 -2835876 -1951455 -1279118 -1083807
37743 -1083807 -839915 -263859 308051 636006 892314 1000621 445374 -744287 -1511599
37734 -1511599 -1013884 136731 685386 427209 190940 362003 435239 60756 -429175
37725 -429175 -734237 -995354 -1272323 -1397465 -1555820 -2163637 -2890146 -2723139 -1467871
37716 -1467871 -301265 -236437 -836204 -1142529 -1121799 -1320229 -1672940 -1623769 -1108449 -568378
37706 -568378 -205328 37492 -32357 -657299 -1564192 -2221087 -2499027 -2532827 -2196766 -1358247
37696 -1358247 -423427 13520 -115832 -514457 -1040655 -1464703 -1200430 -131277 724951
37687 724951 394090 -525519 -630459 211722 805007 576638 214410 193575 107634 -75392
$$ packed form
37752c192163J31226R88320M40202o30910p46550J73999Q84421O72337J95311
37743a083807K43892N76056N71910L27955K56308J08307n55247j189661p67312
37734a511599M97715J150615N48655k58177k36269J71063P3236l74483m89931
37725d29175l05062k61117k76969j25142j58355o07817p26509J67007J255268
37716a467871J166606O4828n99767l06325K0730j98430l52711M9171N15320N40071
37706e68378L63050K42820o9849o24942r06893o56895k77940l3800L36061Q38519
37696a358247R34820M36947j29352l98625n26198m24048K64273J069153Q56228
37687G24951l30861r19609j04940Q42181N93285k28369l62228k0835q5941j83026
$$ plain form
37677 -75392 499798 2030439 3174519 2730659 1353119 576059 771117 1087945 957050
37668 957050 624608 408751 317890 368710 613697 871646 912960 806262 694922 482329
37658 482329 178574 227165 899726 1620337 1563845 824733 343552 648603 1252589 1428373
37648 1428373 1096163 694836 473542 208858 -390046 -1141456 -1438465 -981362 -295291
37639 -295291 -147047 -506489 -601762 -74617 543093 745217 775051 991519 1126162 794290
37629 794290 287921 174309 419815 578153 593624 729610 881013 682627 257328 175971
37619 175971 594946 1003653 962459 632402 412029 385332 297312 -77563 -605298 -842961
37609 -842961 -609585 -474149 -1178839 -2404844 -2762519 -1466968 566567 1880743 2145776
$$ packed form
37677g5392N75190J530641J144080m43860j377540p77060J95058L16828j30895
37668I57050l32442k15857r0861N0820K44987K57949M1314j06698j11340k12593
37658D82329l03755M8591O72561P20611n6492p39112m81181L05051O03986J75784
37648A428373l32210m01327k21294k64684n98904p51410k97009M57103O86071
37639b95291J48244l59442r5273N27145O17710K02124K9834K16468J34643l31872
37629G94290n06369j13612K45506J58338J5471J35986J51403j98386m25299q1357
37619A75971M18975M08707m1194l30057k20373k6697q8020l74875n27735k37663
37609h42961K33376J35436p04690j226005l57675J295551K033535J314176K65033
$$ plain form
37600 2145776 1953782 1551335 794920 20834 -145116 216582 453526 426166 565066 910998
37590 910998 1045233 964486 1057343 1190395 831802 143528 -127776 45410 -41079 -338315
37580 -338315 112389 1406204 2215917 1731103 886806 741109 821619 257811 -454566 -241452
37570 -241452 650580 1003145 563021 276868 658521 1123480 1068404 629347 181521 -142278
37560 -142278 -295046 -308853 -477860 -971668 -1352524 -1099101 -456478 -54553 134734 598018
37550 598018 1151714 1024538 173532 -488267 -463987 -329040 -591196 -779300 -296249 495596
37540 495596 760379 351556 -144947 -284974 -177685 -180369 -528342 -1099543 -1354079 -841983
37530 -841983 14294 132986 -829240 -1767779 -1403833 65646 1255154 1331594 753203
$$ packed form
37600B145776j91994m02447p56415p74086j65950L61698K36944k7360J38900L45932
37590I10998J34235q0747R2857J33052l58593o88274k71304J73186q6489k97236
37580c38315M50704J293815Q09713m84814q44297j45697Q0510n63808p12377K13114
37570b41452Q92032L52565m40124k86153L81653M64959n5076m39057m47826l23799
37560a42278j52768j3807j69007m93808l80856K53423O42623M01925J89287M63284
37550E98018N53696j27176q51006o61799K4280J34947k62156j88104M83051P91845
37540D95596K64783m08823m96503j40027J07289k684l47973n71201k54536N12096
37530h41983Q56277J18692r62226r38539L63946J469479J189508P6440n78391
$$ plain form
37521 753203 318520 257014 471687 960039 1501229 1413583 276901 -1261488 -1997687 -1539819
37511 -1539819 -677439 -248857 -156509 120888 473402 294988 -400002 -713721 -16063 1143918
37501 1143918 1710321 1385592 755342 349930 104702 -266570 -830089 -1466191 -1995557
37492 -1995557 -2160641 -1773884 -1005595 -292744 127849 384655 632102 817635 873634 867915
37482 867915 826289 643757 328879 125380 205676 390707 338709 -82223 -696508 -1159523
37472 -1159523 -1129497 -513561 304092 658076 238709 -543951 -995185 -876507 -573926 -579808
37462 -579808 -959479 -1344184 -1346363 -926705 -380455 -26766 16981 -235248 -773789 -1513182
37452 -1513182 -2147500 -2266201 -1665681 -517333 710662 1471299 1466022 917165 374205
$$ packed form
37521G53203m34683o1506K14673M88352N41190q7646j136682j538389p36199M57868
37511a539819Q62380M28582R2348K77397L52514j78414o94990l13719O97658J159981
37501A143918N66403l24729o30250m05412k45228l71272n63519o36102n29366
37492a995557j65084L86757P68289P12851M20593K56806K47447J85533N5999n719
37482H67915m1626j82532l14878k03499Q0296J85031n1998m20932o14285m63015
37472a159523L0026O15936Q17653L53984m19367p82660m51234J18678L02581n882
37462e79808l79671l84705k179M19658N46250L53689M3747k52229n38541p39393
37452a513182o34318j18701O00520J148348J227995P60637n277n48857n42960
$$ plain form
37443 374205 93814 -191130 -692881 -1079273 -975863 -701279 -900942 -1508873 -1717531 -1097974
37433 -1097974 -158258 421219 552462 470169 256820 28674 103784 506369 703554 340488
37423 340488 -130383 -130800 58159 -297693 -1157989 -1657060 -1329630 -677580 -321371 -224277
37413 -224277 -82624 56762 28511 43408 463046 1232921 1915050 2183144 1987496 1377048
37403 1377048 535190 -84588 -100385 239047 232985 -335579 -778541 -341713 741173 1436287
37393 1436287 1121796 234858 -380842 -421177 -194700 -28029 48030 101369 111615 32367
37383 32367 -156934 -489904 -930710 -1235660 -1094458 -499772 135665 305816 -165689 -976236
37373 -976236 -1548676 -1498381 -1030195 -736259 -835908 -845249 -316345 348194 368655 -213233
$$ packed form
37443C74205k80391k84944n01751l86392J03410K74584j99663o07931k08658O19557
37433a097974R39716N79477J31243q2293k13349k28146P5110M02585J97185l63066
37423C40488m70871m17J88959l55852q60296m99071L27430O52050L56209R7094
37413b24277J41653J39386k8251J4897M19638P69875O82129K68094j95648o10448
37403A377048q41858o19778j5797L39432o062n68564m42962M36828J082886O95114
37393A436287l14491q86938o15700m0335K26477J66671P6059N3339J0246p9248
37383C2367j89301l32970m40806l04950J41202N94686O35437J70151m71505q10547
37373i76236n72440N0295M68186K93936r9649r341N28904O64539K0461n81888
$$ plain form
37363 -213233 -491986 -11472 551375 395978 -258210 -554339 -148412 554446 1048556 1096640
37353 1096640 658847 -24797 -428334 -317987 -193433 -624670 -1313614 -1481927 -1116395
37344 -1116395 -1005058 -1372063 -1349795 -303303 1028527 1440929 884318 385748 533050
37335 533050 845783 742914 412330 382606 731791 1141492 1422705 1553624 1377109 728128
37325 728128 -121899 -520367 -76882 923014 1793474 1980671 1371325 374341 -253235 -10065
37315 -10065 730426 986755 285454 -742007 -1133374 -695370 3761 462010 584862 378648
37305 378648 -116802 -588339 -673405 -501310 -539062 -837602 -947657 -671879 -307202 29742
37295 29742 640731 1464809 1726523 919262 -347142 -1060032 -988003 -623418 -358636 -337161
$$ packed form
37363b13233k78753M80514N62847j55397o54188k96129M05927P02858M94110M8084
37353A096640m37793o83644m03537J10347J24554m31237o88944j68313L65532
37344a116395J11337l67005K2268J046492J331830M12402n56611m98570J47302
37335E33050L12733j02869l30584k9724L49185M09701K81213J30919j76515o48981
37325G28128q50027l98468M43485R99896Q70460J87197o09346r96984o27576K43170
37315a0065P40491K56329p01301j027461l91367M38004O99131M58249J22852k06214
37305C78648m95450m71537q5066J72095l7752k98540j10055K75778L64677L36944
37295B9742O10989Q24078K61714q07261j266404p12890P2029L64585K64782K1475
$$ plain form
37285 -337161 -730914 -1419732 -1677139 -991895 -48819 -48387 -1084372 -2045239 -2186751 -1909174
37275 -1909174 -1752995 -1539001 -999222 -522901 -601319 -965809 -912846 -267378 479551 859828
37265 859828 850203 683334 559348 539112 551795 528915 552908 730660 947832 1014972 1038683
37254 1038683 1267497 1534177 1348612 730205 425144 926253 1687513 1774720 1038957 196387
37244 196387 -96966 171301 630935 984844 1157261 1221872 1252597 1202503 1005049 790080
37234 790080 776379 894461 806589 427077 113007 157335 398106 543932 581268 612249
37224 612249 587316 474319 413413 423421 232407 -313157 -950128 -1377424 -1596356 -1585715
37214 -1585715 -1089806 -196535 296443 -256538 -1342251 -1770917 -1061489 183254 1131671
$$ packed form
37285c37161l93753o88818k57407O85244R43076M32j035985r60867j41512K77577
37275a909174J56179K13994N39779M76321p8418l64490N2963O45468P46929L80277
37265H59828r625j66869j23986k0236J2683k2880K3993J77752K17172O7140K3711
37254A038683K28814K66680j85565o18407l05061N01109P61260Q7207p35763q42570
37244A96387k93353K68267M59634L53909J72417O4611L0725n0094j97454k14969
37234G90080j3701J18082q7872l79512l14070M4328K40771J45826L7336L0981
37224F12249k4933j12997o0906J0008j91014n45564o36971m27296k18932J0641
37214a585715M95909Q93271M92978n52981j085713m28666P09428J244743R48417
$$ plain form
37205 1131671 1370215 838098 -178376 -934718 -745674 215953 1089799 1358580 1242424
37196 1242424 1063700 814379 490533 287993 240444 141141 24679 232140 748703 964014
37186 964014 428397 -537669 -1302960 -1634241 -1635143 -1357250 -892740 -593084 -739269 -1077287
37176 -1077287 -1023697 -329954 645323 1283558 1225253 660445 197398 314701 882262 1358475
37166 1358475 1433335 1241365 992357 762281 670426 819966 940442 546538 -325265 -941904
37156 -941904 -694288 240178 1257389 1971725 2287364 2243337 2064655 1995693 1861866 1245347
37146 1245347 309992 -152710 140375 441128 101516 -435890 -469810 -239797 -406593 -814269
37136 -814269 -793940 -420747 -413900 -902297 -1318668 -1485929 -1748306 -1960294 -1481128 -447612
$$ packed form
37205A131671K38544n32117j016474p56342J89044R61627Q73846K68781j16156
37196A242424j78724k49321l23846k02540m7549r9303j16462K07461N16563K15311
37186I64014n35617r66066p65291l31281r02K77893M64510K99656j46185l38018
37176a077287N3590O93743R75277O38235n8305n64808m63047J17303N67561M76213
37166A358475P4860j91970k49008k30076r1855J49540J20476l93904q71803o16639
37156i41904K47616R34466J017211P14336L15639m4027j78682o8962j33827o16519
37146A245347r35355m62702K93085L00753l39612n37406l3920K30013j66796m07676
37136h14269K0329L73193O847m88397m16371j67261k62377k11988M79166J033516
$$ plain form
37126 -447612 38745 -552710 -1415923 -1681097 -1543278 -1529343 -1510892 -1188646 -843529 -828029
37116 -828029 -901328 -807402 -914199 -1466912 -1784105 -1161121 -160435 17776 -762018 -1439346
37106 -1439346 -1212318 -281380 733044 1279874 919553 -231098 -1172689 -1041894 -386426
37097 -386426 -461482 -1332598 -1836311 -1504550 -1201453 -1483768 -1709028 -1475126 -1624013 -2725865
37087 -2725865 -3624062 -2860163 -917547 335733 123681 -624176 -999953 -1125468 -1249693
37078 -1249693 -1048721 -336945 365866 513826 221069 -112460 -345470 -436791 -260957 54930
37068 54930 76055 -291637 -539650 -325470 -47093 -170341 -398121 -134257 481761 704632
37058 704632 303892 -124431 -121854 -39824 -393997 -984737 -1162409 -775079 -330138 -193475
$$ packed form
37126d47612M86357n91455q63213k65174J37819J3935J8451L22246L45117J5500
37116h28029p3299R3926j06797n52713l17193O22984J000686J78211p79794o77328
37106a439346K27028R30938J014424N46830l60321j150651r41591J30795O55468
37097c86426p5056q71116n03713L31761L03097k82315k25260K33902j48887j101852
37087b725865q98197P63899J942616J253280k12052p47857l75777j25515j24225
37078a249693K00972P11776P02811J47960k92757l33529k33010r1321J75834L15887
37068E4930K1125l67692k48013K14180K78377j23248k27780K63864O16018K22871
37058G04632m00740m28323K577Q2030l54173n90740j77672L87330M44941J36663
$$ plain form
37048 -193475 -117570 206752 516302 308363 -352249 -792233 -516644 297669 1121922 1542269
37038 1542269 1370717 729772 186526 347351 1041765 1341021 745942 -83508 -262771
37029 -262771 72276 88695 -493814 -1225272 -1802109 -2277365 -2433597 -1862283 -851509 -318479
37019 -318479 -507317 -562459 120522 879426 785503 55702 -325712 -15845 451612 624475
37009 624475 549791 303264 -147567 -499834 -181183 876321 1961613 2339906 1985445
37000 1985445 1369685 808941 286058 -249804 -701584 -963389 -1056742 -1015258 -726328 -104125
36990 -104125 526390 515720 -340236 -1324529 -1549630 -1102112 -891637 -1329767 -1813586 -1741953
36980 -1741953 -1365317 -1199473 -1194885 -1055161 -895807 -945080 -967279 -656178 -303206 -373698
$$ packed form
37048a93475P5905L24322L09550k07939o60612m39984K75589Q14313Q24253M20347
37038A542269j71552o40945n43246J60825O94414K99256n95079q29450j79263
37029b62771L35047J6419n82509p31458n76837m75256j56232N71314J010774N33030
37019c18479j88838n5142O82981P58904r3923p29801l81414L09867M67457J72863
37009F24475p4684k46527m50831l52267L18651J057504J085292L78293l54461
37000A985445o15760n60744n22883n35862m51780k61805r3353M1484K88930O22203
36990a04125O30515j0670q55956r84293k25101M47518K10475m38130m83819P1633
36980a741953L76636J65844M588J39724J59354m9273k2199L11101L52972p0492
$$ plain form
36970 -373698 -646523 -504461 65169 489403 535948 477932 375598 -8617 -488996 -436924
36960 -436924 274113 958178 1030807 684397 387916 214908 -36350 -431866 -836216 -988807
36950 -988807 -635891 48580 308674 -330441 -1136450 -891905 390262 1333006 1007985
36941 1007985 22543 -561907 -545177 -327545 -135646 -134170 -626072 -1460639 -1809257 -1192327
36931 -1192327 -222145 271519 272754 112048 -309613 -959513 -1004654 172017 1697719 2110109
36921 2110109 1294540 379772 -121517 -771753 -1732452 -2174252 -1626180 -833048 -661329
36912 -661329 -973362 -1174134 -1173794 -1210036 -1296951 -1426109 -1815603 -2410310 -2591430 -1946643
36902 -1946643 -955440 -382707 -331981 -394819 -365486 -233045 215078 1122622 2064137 2422121
$$ packed form
36970c73698k72825J42062N69630M24234M6545n8016j02334l84215m80379N2072
36960d36924P11037O84065P2629l46410k96481j73008k51258l95516m04350j52591
36950i88807L52916O84471K60094o39115q06009K44545J282167R42744l25021
36941A007985r85442n84450J6730K17632J91899J476m91902q34567l48618O16930
36931a192327R70182M93664J235j60706m21661o49900m5141J176671J525702M12390
36921B110109q15569r14768n01289o50236r60699m41800N48072P93132J71719
36912f61329l12033k00772L40l6242q6915j29158l89494n94707j81120O44787
36902a946643R91203N72733N0726o2838K9333J32441M48123R07544R41515L57984
$$ plain form
36892 2422121 2179656 1807597 1469383 919238 158643 -413441 -601536 -630972 -622536 -355580
36882 -355580 221566 686973 649800 248918 -104867 -196527 16810 560083 1222885 1456518
36872 1456518 928762 71637 -320674 -2730 550000 817173 689103 269810 -291721
36863 -291721 -644170 -380859 378229 922987 790958 343617 154523 166436 -50749 -464513
36853 -464513 -608313 -338216 46784 412685 883883 1285797 1191237 694347 420420 471055
36843 471055 111454 -1010945 -2049818 -2046290 -1286706 -821581 -1048678 -1550318 -1966530 -2158402
36833 -2158402 -1785675 -696059 389654 571319 119027 100032 621867 649140 -136259
36824 -136259 -588522 88719 908536 503576 -815206 -1533706 -1041411 -211823 -76394
$$ packed form
36892B422121k42465l72059l38214n50145p60595n72084j88095k9436Q436K66956
36882c55580N77146M65407l7173m00882l53785r1660K13337N43273O62802K33633
36872A456518n27756q57125l92311L17944N52730K67173j28070m19293n61531
36863b91721l52449K63311P59088N44758j32029m47341j89094J1913k17185m13764
36853d64513j43800K70097L85000L65901M71198M01914r4560m96890k73927N0635
36843D71055l59601j122399j038873L528P59584M65125k27097n01640m16212j91872
36833b158402L72727J089616J085713J81665m52292j8995N21835K7273p85399
36824a36259m52263O77241Q19817m04960j318782p18500M92295Q29588J35429
$$ plain form
36815 -76394 -819874 -1982461 -2857247 -2764665 -1681918 -544158 -225022 -342964 123844
36806 123844 1149674 1589287 936391 142076 255657 1092800 1803252 2056766 2013397 1663643
36796 1663643 934627 150216 -254463 -296612 -232397 -26445 435844 838569 746436 309272
36786 309272 66294 105683 19007 -293916 -397408 -33468 503473 905188 1224389 1445585
36776 1445585 1231791 536737 40696 423727 1438488 2236830 2480265 2565367 2745446
36767 2745446 2615173 1730513 359780 -735065 -1120508 -1029409 -936294 -1020524 -1096391 -940280
36757 -940280 -571824 -196025 69530 308473 612270 874869 896672 658419 371565 242847
36747 242847 275039 320150 254356 55389 -252567 -648570 -1035680 -1137704 -670361 210563
$$ packed form
36815g6394p43480j162587q74786R2582J082747J137760L19136j17942M66808
36806A23844J025830M39613o52896p94315J13581Q37143P10452K53514m3369l49754
36796A663643p29016p84411m04679m2149O4215K05952M62289M02725r2133m37164
36786C09272k42978L9389q6676l12923j03492L63940N36941M01715L19201K21196
36776A445585k13794o95054m96041L83031J014761P98342K43435Q5102J80079
36767B745446j30273q84660j370733j094845l85443R1099R3115q4230p5867J56111
36757i40280L68456L75799K65555K38943L03797K62599K1803k38253k86854j28718
36747B42847L2192M5111o5794j98967l07956l96003l87110j02024M67343Q80924
$$ plain form
36737 210563 783334 418731 -631073 -1455272 -1574597 -1413723 -1528068 -1836238 -1965455
36728 -1965455 -1913176 -1852152 -1614908 -982725 -275000 -6809 -77375 49229 421008 539901
36718 539901 220470 -196168 -507415 -757980 -628917 349638 1703746 2074618 850018
36709 850018 -1062331 -2531523 -3358034 -3567815 -2656364 -587392 1281586 1555536 648325
36700 648325 88122 308155 366888 -289223 -1069553 -1356699 -1244307 -923711 -319864 394057
36690 394057 797495 971325 1384476 1823552 1391345 -61724 -1406324 -1625809 -1008635
36681 -1008635 -511911 -620627 -1236239 -1989723 -2249111 -1531399 -336364 170533 -253360
36672 -253360 -493158 213453 1045372 889930 60449 -302315 11632 206356 -140015 -637364
$$ packed form
36737B10563N72771l64603j049804q24199j19325J60874j14345l08170j29217
36728a965455N2279O1024K37244O32183P07725K68191p0566J26604L71779J18893
36718E39901l19431m16638l11247k50565J29063R78555J354108L70872j224600
36709H50018j912349j469192q26511k09781R11451K068972J868978K73950r07211
36700F48325n60203K20033N8733o56111p80330k87146J12392L20596O03847P13921
36690C94057M03438J73830M13151M39076m32207j453069j344600k19485O17174
36681a008635M96724j08716o15612p53484k59388P17712J195035N06897m23893
36672b53360k39798P06611Q31919j55442q29481l62764L13947J94724l46371m97349
$$ plain form
36662 -637364 -913136 -1003702 -936871 -656623 -368629 -357665 -503316 -509647 -492189 -779716 -1274383
36651 -1274383 -1591875 -1705500 -1846370 -1871052 -1370744 -409569 403306 613988 278905 -293345
36641 -293345 -725855 -657906 -136026 235230 34060 -276205 62527 998683 1757163 1869223
36631 1869223 1507662 971000 502992 480109 1066847 1767553 1982469 1853666 1842403 1720652
36621 1720652 931072 -202711 -745543 -672325 -929832 -1735480 -2052883 -1290147 -373188
36612 -373188 -342031 -803923 -710454 -8208 451061 255723 -177873 -373026 -265526 -13892
36602 -13892 178056 180351 193687 597731 1244067 1354354 585320 -235704 -28440 1163796
36592 1163796 2257605 2381544 1582088 508242 -148096 -92307 291175 294926 -196714 -529875
$$ packed form
36662f37364k75772r0566O6831K80248K87994J0964j45651o331J7458k87527m94667
36651a274383l17492j13625j40870k4682N00308R61175Q12875K10682l35083n72250
36641b93345m32510O7949N21880L71256k01170l10265L38732R36156P58480J12060
36631A869223l61561n36662m68008k2883N86738P00706K14916j28803j1263j21751
36621A720652p89580j133783n42832P3218k57507q05648l17403P62736R16959
36612c73188L1157m61892R3469P02246M59269j95338m33596j95153J07500K51634
36602a3892J91948K295J3336M04044O46336J10287p69034q21024K07264J192236
36592A163796J093809J23939p99456j073846o56338N5789L83482L751m91640l33161
$$ plain form
36582 -529875 -341942 -228990 -791502 -1590430 -1839679 -1650127 -1608825 -1475906 -497276 1038650
36572 1038650 1828876 1434609 953990 1255968 1605320 917933 -409934 -1019686 -539426
36563 -539426 85444 144288 5189 153509 266888 -194233 -1012205 -1459596 -1287566 -920042
36553 -920042 -740790 -678428 -550059 -391284 -282271 -153982 56163 298751 610679 1140813
36543 1140813 1764370 1954148 1376585 464678 55503 496375 1349754 1919761 1866648 1413032
36533 1413032 1161363 1568580 2373668 2730272 2164725 1160163 470171 165313 -176726
36524 -176726 -638269 -933149 -1008650 -1010214 -783133 -121978 574629 672915 294024 117621
36514 117621 216193 35518 -386716 -279593 495101 1049425 901657 692361 861543 761269
$$ packed form
36582e29875J87933J12952n62512p98928k49249J89552M1302J32919R78630J535926
36572A038650P90226l94267m80619L01978L49352o87387j327867o09752M80260
36563e39426O24870N8844j39099J48320J13379m61121q17972m47391J72030L67524
36553i20042J79252O2362J28369J58775J09013J28289K10145K42588L11928N30134
36543A140813O23557J89778n77563r11907m09175M40872Q53379N70007n3113m53616
36533A413032k51669M07217Q05088L56604n65547j004562o89992l04858l42039
36524a76726m61543k94880p5501j564K27081O61155O96607R8286l78891j76403
36514A17621R8572j80675m22234J07123P74694N54324j47768k09296J69182j00274
$$ plain form
36504 761269 -40955 -642468 -129733 804238 832131 20597 -370351 249772 1327155 2281212
36494 2281212 2931353 2978300 2209405 1195769 778930 913683 966476 989813 1574888 2511260
36484 2511260 2833143 2333365 1844983 1788602 1622410 1093751 878234 1435915 2221492 2586632
36474 2586632 2570259 2274226 1409026 110695 -699337 -559172 -302170 -811785 -1608832
36465 -1608832 -1591085 -669812 257608 609290 503026 91845 -600849 -1257987 -1436405 -1168049
36455 -1168049 -812325 -396892 265661 869791 754735 -100389 -850358 -852935 -497530 -589223
36445 -589223 -1216646 -1697974 -1578956 -1198641 -1036304 -881632 -211832 688809 750906 -372604
36435 -372604 -1523001 -1473542 -609714 -208446 -436176 -368871 35777 -456815 -2224356 -3667795
$$ packed form
36504G61269q02224o01513N12735R33971K7893q11534l90948O20123J077383R54057
36494B281212O50141M6947p68895j013636m16839J34753N2793K3337N85075R36372
36484B511260L21883m99778m88382n6381j66192n28659k15517N57681P85577L65140
36474B586632j6373k96033q65200j298331q10032J40165K57002n09615p97047
36465a608832J7747R21273R27420L51682j06264m11181o92694o57138j78418K68356
36455a168049L55724M15433O62553O04130j15056q55124p49969k577L55405r1693
36445e89223o27423m81328J19018L80315J62337J54672O69800R00641O2097j123510
36435c72604j150397M9459Q63828M01268k27730O7305M04648m92592j767541j443439
$$ plain form
36425 -3667795 -3255032 -1672934 -754421 -967367 -1251726 -947790 -556122 -596406 -857471
36416 -857471 -1019345 -1167889 -1402273 -1541986 -1453620 -1224362 -914163 -536443 -276149 -300095
36406 -300095 -398905 -257310 -539 -20273 -374870 -829641 -1298735 -1691772 -1582231 -785935
36396 -785935 -90415 -474939 -1588984 -2022043 -1325742 -721241 -1265889 -2273597 -2408334
36387 -2408334 -1676600 -1278847 -1729897 -2171647 -1741073 -827601 -494200 -1044487 -1679258
36378 -1679258 -1521906 -580504 475335 1209577 1707353 2031604 1930128 1384962 1009644
36369 1009644 1324915 1848515 1592336 497182 -327320 -62359 734682 968778 474138
36360 474138 19031 51685 128484 -283026 -978529 -1355230 -1279494 -1158828 -1182116 -951645
$$ packed form
36425c667795M12763J582098R18513k12946k84359L03936L91668m0284k61065
36416h57471j61874j48544k34384j39713Q8366K29258L10199L77720K60294k3946
36406c00095r8810J41595K56771j9734l54597m54771m69094l93037J09541P96296
36396g85935O95520l84524j114045m33059O96301O04501n44648j007708j34737
36387b408334P31734L97753m51050m41750M30574R13472L33401n50287o34771
36378a679258J57352R41402J055839P34242M97776L24251j01476n45166l75318
36369A009644L15271N23600k56179j095154q24502K64961P97041K34096m94640
36360D74138m55107L2654P6799m11510o95503l76701P5736J20666k3288K30471
$$ plain form
36350 -951645 -122334 902260 1331532 951600 301364 -122833 -360194 -542694 -479801 -43890
36340 -43890 415685 478330 231256 76229 194839 529274 963554 1124683 409377 -1211748
36330 -1211748 -2749111 -3218461 -2832475 -2440946 -2093026 -1152565 244803 999544 589872
36321 589872 -196662 -502531 -474002 -557587 -558558 -127183 433338 597670 415859 205711
36311 205711 -128543 -752506 -1245134 -1099453 -676462 -826296 -1565842 -1901185 -1142942 198874
36301 198874 1078200 1039337 447332 -68059 -128636 247884 767312 1102903 1095294 804330
36291 804330 494718 539151 1080027 1717509 1830818 1338386 791242 523702 160195 -650962
36281 -650962 -1422688 -1327015 -326820 726408 1058854 606859 -201795 -816938 -783707 -109352
$$ packed form
36350i51645Q29311J024594M29272l79932o50236m24197k37361j82500O2893M35911
36340d3890M59575O2645k47074j55027J18610L34435M34280J61129p15306j621125
36330a211748j537363m69350L85986L91529L47920R40461J397368P54741m09672
36321E89872p86534l05869K8529q3585r71M31375N60521J64332j81811k10148
36311B05711l34254o23963m92628J45681M22991j49834p39546l35343P58243J341816
36301A98874Q79326l8863n92005n15391o0577L76520N19428L35591p609k90964
36291H04330l09612M4433N40876O37482J13309m92432n47144k67540l63507q11157
36281f50962p71726R5673J000195J053228L32446m51995q08654o15143L3231O74355
$$ plain form
36271 -109352 536789 416056 -428871 -1265577 -1582978 -1499513 -1307288 -1129961 -1101544 -1357497
36261 -1357497 -1675947 -1591920 -1062046 -576362 -421502 -335347 -165631 -294489 -899908 -1274905
36251 -1274905 -628207 615763 1098017 230779 -1027447 -1410249 -843517 -240544 -137930
36242 -137930 -169110 113762 503619 533523 225771 5948 9104 -105834 -627502 -1408773
36232 -1408773 -2065331 -2263577 -1779395 -654493 552625 1045743 591579 -210513 -661865
36223 -661865 -655736 -410564 56412 747260 1304535 1352402 1023549 655757 197214 -506280
36213 -506280 -1081342 -1061503 -836412 -1236794 -2062796 -2046261 -708775 684918 732123 -291421
36203 -291421 -1063275 -1075154 -842997 -601940 31894 1006491 1479251 929984 -66218 -593909
$$ packed form
36271a09352O46141j20733q44927q36706l17401Q3465J92225J77327K8417k55953
36261a357497l18450Q4027N29874M85684J54860Q6155J69716j28858o05419l74997
36251a274905O46698J243970M82254q67238j258226l82802N66732O02973J02614
36242a37930l1180K82872L89857K9904l07752k19823L156j14938n21668p81271
36232a408773o56558j98246M84182J124902J207118M93118m54164q02092m51352
36223f61865O129K45172M66976O90848N57275M7867l28853l67792m58543p03494
36213e06280n75062J9839K25091m00382q26002J6535J337486J393693M7205j023544
36203b91421p71854j1879K32157K41057O33834R74597M72760n49267r96202n27691
$$ plain form
36193 -593909 -415978 99285 568063 716737 363214 -266367 -527536 -111697 446024 434394
36183 434394 -99250 -514131 -443177 -26198 495031 869759 735043 90287 -247303 530534
36173 530534 1887823 2323149 1349825 182747 -51651 131006 -358895 -1327195 -1657748
36164 -1657748 -1140608 -701956 -850221 -1064132 -930662 -815209 -1000887 -1088974 -743480 -222721
36154 -222721 311652 1159472 2152875 2262340 1008855 -465449 -775219 -197518 -86616
36145 -86616 -785549 -1358628 -1234219 -825127 -435286 189297 917321 1023404 417051 33385
36135 33385 398013 771665 442400 -54555 70793 435748 176675 -461698 -482933 123360
36125 123360 267709 -488145 -1220822 -1093944 -556180 -470902 -768614 -749828 -331094 -159737
$$ packed form
36193e93909J77931N15263M68778J48674l53523o29581k61169M15839N57721j1630
36183D34394n33644m14881P0954M16979N21229L74728j34716o44756l37590P77837
36173E30534J357289M35326r73324j167078k34398J82657m89901r68300l30553
36164a657748N17140M38652j48265k13911J33470J15453j85678q8087L45494N20759
36154b22721N34373Q47820R93403J09465j253485j474304l09770N77701J10902
36145h6616o98933n73079J24409M09092L89841O24583P28024J06083o06353l83666
36135C3385L64628L73652l29265m96955J25348L64955k59073o38373k1235O06293
36125A23360J44349p55854p32677J26878N37764Q5278k97712J8786M18734J71357
$$ plain form
36115 -159737 -530549 -893062 -669096 -83696 202509 64060 66862 597427 1212250 1158948
36105 1158948 385517 -352270 -441732 -137796 -147113 -706134 -1308082 -1269637 -438378 589172
36095 589172 929515 286074 -610691 -753572 -136205 182234 -445008 -1267055 -1211817 -509162
36085 -509162 -374886 -1209762 -2082436 -2202349 -1962949 -2001137 -2033705 -1473533 -706315 -733718
36075 -733718 -1624316 -2270985 -1911085 -1081772 -649097 -580746 -326366 71575 82523 -264302
36065 -264302 -304005 145065 357820 -220675 -1094796 -1455284 -1346956 -1457935 -2005899 -2504188
36055 -2504188 -2538952 -2155343 -1511149 -786320 -447452 -882641 -1626101 -1692214 -968303 -513368
36045 -513368 -1009919 -1664304 -1351512 -284025 303314 -198888 -1255994 -2103820 -2383335
$$ packed form
36115a59737l70812l62513K23966N85400K86205j38449K802N30565O14823n3302
36105A158948p73431p37787q9462L03936r317n59021o01948L8445Q31259J027550
36095E89172L40343o43441q96765j42881O17367L18439o27242q22047N5238P02655
36085e09162J34276q34876q72674j19913K39400l8188l2568N60172P67218k7403
36075g33718q90598o46669L59900Q29313M32675O8351K54380L97941J0948l46825
36065b64302l9703M49070K12755n78495q74121l60488J08328j10979n47964m98289
36055b504188l4764L83609O44194P24829L38868m35189p43460o6113P23911M54935
36045e13368m96551o54385L12792J067487N87339n02202j057106q47826k79515
$$ plain form
36036 -2383335 -2001427 -1196111 -743314 -1291254 -2367478 -2770871 -2096196 -1164661 -774296
36027 -774296 -779071 -695118 -480693 -291317 -98442 -24384 -484059 -1464169 -2154176 -1876411
36017 -1876411 -1018341 -497767 -609672 -911827 -962953 -659978 -88784 465857 569586 130326
36007 130326 -392212 -646139 -902203 -1454780 -1939198 -1864072 -1447361 -1217174 -1119454 -819525
35997 -819525 -579698 -884153 -1378918 -1250897 -635001 -513249 -1090768 -1494002 -1422752 -1788616
35987 -1788616 -2995340 -3790590 -2927426 -1126708 -165044 -521238 -1132068 -1184612 -908802
35978 -908802 -595929 -3605 941825 1720199 1889040 1583550 1077426 407775 -303988 -705444
35968 -705444 -711842 -709383 -953412 -1154569 -968295 -537929 -217913 -54811 95369 143645
$$ packed form
36036b383335L81908Q05316M52797n47940j076224m03393O74675R31535L90365
36027g74296m775Q3953K14425J89376J92875P4058m59675r80110o90007K77765
36017a876411Q58070N20574j11905l02155n1126L02975N71194N54641J03729m39260
36007A30326n22538k53927k56064n52577m84418P5126M16711K30187R7720K99929
35997h19525K39827l04455m94765J28021O15896J21752n77519m03234P1250l65864
35987a788616j206724p95250Q63164J800718R61664l56194o10830n2544K75810
35978i08802L12873N92324R45430P78374J68841l05490n06124o69651p11763m01456
35968g05444o398K459k44029k01157J86274M30366L20016J63102J50180M8276
$$ plain form
35958 143645 -153214 -737882 -1170735 -1092996 -678073 -519414 -955550 -1514701 -1327475 -307880
35948 -307880 428774 -182089 -1698534 -2607153 -2178502 -1203460 -764029 -974838 -1235062
35939 -1235062 -1097202 -488625 401521 1045575 878103 90975 -371361 -66253 243447
35930 243447 -274650 -1212768 -1519400 -1039914 -616779 -821294 -1375497 -1770633 -1739968 -1156857
35920 -1156857 -165014 601530 611620 233631 248134 632927 668267 248193 79048 359082
35910 359082 332727 -352709 -851468 -417535 317251 242889 -654173 -1539294 -2095049 -2635919
35900 -2635919 -3111064 -3033640 -2430004 -1946031 -1827435 -1580539 -927185 -393022 -501302 -887678
35890 -887678 -755142 25560 751895 805290 375635 119461 259754 302536 -213548 -911322
$$ packed form
35958A43645k96859n84668m32853P7739M14923J58659m36136n59151J87226J019595
35948c07880P36654o10863j516445r08619M28651R75042M39431k10809k60224
35939a235062J37860O08577Q90146O44054j67472p87128m62336L05108L09700
35930B43447n18097r38118l06632M79486M23135k04515n54203l95136L0665N83111
35920a156857R91843P66544J0090l77989J4503L84793L5340m20074j69145K80034
35910C59082k6355o85436m98759M33933P34786p4362q97062q85121n55755n40870
35900b635919m75145P7424O03636M83973J18596K46896O53354N34163j08280l86376
35890h87678J32536P80702P26335N3395m29655k56174J40293M2782n16084o97774
$$ plain form
35880 -911322 -946915 -210641 388479 146782 -440152 -473012 -66889 -193734 -1179041 -2149816
35870 -2149816 -2198618 -1474793 -787055 -591082 -743615 -910784 -818496 -310736 458980 973986
35860 973986 790236 36834 -681762 -880047 -596392 -236796 -96105 -58103 199054 704955
35850 704955 1066365 961409 574446 280714 59585 -387910 -980500 -1167514 -628886 295515
35840 295515 1057482 1477224 1642324 1487433 819575 -249951 -1132004 -1181899 -351499 647863
35830 647863 1010505 672206 220477 -40831 -410825 -910853 -774562 461351 1866485
35821 1866485 2120583 1370187 952761 1292484 1371616 630489 55083 602029 1648687
35812 1648687 2023637 1728009 1496586 1293733 525429 -582780 -1090334 -791796 -473399
$$ packed form
35880i11322l5593P36274N99120k41697n86934l2860M06123j26845r85307r70775
35870b149816m8802P23825O87738J95973j52533j67169R2288N07760P69716N15006
35860I73986j83750p53402p18596j98285K83655L59596J40691L8002K57157N05901
35850G04955L61410j04956l86963k93732k21129m47495n92590j87014N38628R24401
35840B95515P61967M19742J65100j54891o67858j069526q82053m9895Q30400R99362
35830F47863L62642l38299m51729k61308l69994n00028J36291J235913J405134
35821A866485K54098p50396m17426L39723P9132p41127n75406N46946J046658
35812A648687L74950k95628k31423k02853p68304j108209n07554K98538L18397
$$ plain form
35803 -473399 -640278 -947065 -1022873 -963859 -813469 -390852 104926 80111 -549761 -1082729
35793 -1082729 -964686 -467311 -195409 -393353 -872691 -1145940 -637578 623189 1590451
35784 1590451 1292397 291462 23942 613123 654592 -407523 -1144476 -286780 1277064
35775 1277064 1906821 1622466 1623308 2063955 1944690 970602 -35819 -604596 -1080656 -1462408
35765 -1462408 -1181142 -405087 -220452 -904054 -1210285 -193094 1246694 1595465 785512
35756 785512 5694 -80672 89092 5961 -215201 -269126 -173330 -162452 -362012 -626471
35746 -626471 -610431 -169469 254750 28242 -771845 -1377094 -1468118 -1587489 -1985839 -1903544
35736 -1903544 -826354 267190 65530 -1078435 -1573624 -877298 -45915 113138 95095
$$ packed form
35803d73399j66879l06787p5808N9014J50390M22617M95778k4815o29872n32968
35793a082729J18043M97375K71902j97944m79338k73249N08362J260767R67262
35784A590451k98054j000935k67520N89181M1469j062115p36953Q57696J563844
35775A277064O29757k84355Q42M40647j19265r74088j006421n68777m76060l81752
35765a462408K81266P76055J84635o83602l06231J017191J439788L48771q09953
35756G85512p79818q6366J69764q3131k21162n3925R5796J0878j99560k64459
35746f26471J6040M40962M24219k26508q00087o05249r1024j19371l98350Q2295
35736a903544J077190J093544k01660j143965m95189O96326Q31383J59053j8043
$$ plain form
35727 95095 460746 777971 523822 54997 -152955 -417068 -1091811 -1599483 -1247327 -512334
35717 -512334 -408098 -861162 -844317 -50114 667556 644803 188408 -245339 -683248 -1026938
35707 -1026938 -718649 325972 1137028 826392 -126294 -517333 -100377 213359 -159817
35698 -159817 -623894 -408437 162467 55952 -943672 -1713477 -1075548 736757 2313186
35689 2313186 2637505 1940031 985831 191052 -211061 168439 1264376 2031124 1512817
35680 1512817 330750 70918 1072642 1913733 1471187 397763 -128317 -121269 -296128
35671 -296128 -661490 -775559 -886747 -1561537 -2435360 -2589063 -2095162 -1938289 -2325611 -2370029
35661 -2370029 -1713657 -1134650 -1041072 -700795 227294 659916 -255556 -1462655 -1386127 -321682
$$ packed form
35727I5095L65651L17225k54149m68825k07952k64113o74743n07672L52156P34993
35717e12334J04236m53064J6845P94203P17670k2753m56395m33747m37909l43690
35707a026938L08289J044621Q11056l10636r52686l91039M16956L13736l73176
35698a59817m64077K15457N70904j06515r99624p69805O37929J812305J576429
35689B313186L24319o97474r54200p94779m02113L79500J095937P66748n18307
35680A512817j182067k59832J001724Q41091m42546j073424n26080P048j74859
35671b96128l65362j14069j11188o74790q73823j53703M93901J56873l87322m4418
35661b370029O56372N79007R3578L40277R28089M32622r15472j207099P6528J064445
$$ plain form
35651 -321682 131319 -311318 -271695 868078 1831261 1383213 104976 -684658 -833637
35642 -833637 -1128355 -1760324 -2129437 -1967184 -1694281 -1637024 -1659839 -1678263 -1854082 -2090145
35632 -2090145 -1937432 -1287025 -635733 -317058 52394 879586 1739434 1873498 1384507
35623 1384507 1181702 1600080 1803646 1016715 -210646 -678814 -221442 117288 -322278
35614 -322278 -852302 -525299 407001 830693 338093 -259923 -76174 764314 1435542 1432230
35604 1432230 956400 477847 226967 122412 17917 -73623 -25303 147696 212327 25959
35594 25959 -218555 -286433 -309477 -543996 -789649 -558936 53338 232410 -460635 -1320772
35584 -1320772 -1364782 -658496 -143192 -278294 -564533 -489771 -246562 -213944 -320556 -372277
$$ packed form
35651c21682M53001m42637L9623J139773R63183m48048j278237p89634j48979
35642h33637k94718o31969l69113J62253K72903N7257k2815j8424j75819k36063
35632b090145J52713O50407O51292L18675L69452Q27192Q59848J34064m88991
35623A384507k02805M18378K03566p86931j227361m68168M57372L38730m39566
35614c22278n30024L27003R32300M23692m92600n98016J83749Q40488O71228l312
35604A432230m75830m78553k50880j04555j04495r1540M8320J72999O4631j86368
35594B5959k44514o7878k3044k34519k45653K30713O12274J79072o93045q60137
35584a320772m4010P06286N15304j35102k86239P4762K43209L2618j06612n1721
$$ [...]
##END NTUPLES=NMR SPECTRUM
##END=
