##TITLE=31Pdec_LR-675-R2-H1
 D2O, 24 sc
 2.7.2019
##JCAMPDX= 6.0         $$ Bruker NMR JCAMP-DX V2.0
##DATA TYPE= NMR SPECTRUM
##DATA CLASS= NTUPLES
##ORIGIN= UXNMR, Bruker Analytische Messtechnik GmbH
##OWNER= root
$$ XWIN-NMR		Version 3.5
$$ Tue Jul  2 15:28:14 2019 Russian Standard Time (UT+4h)  she@DPX200
##.OBSERVE FREQUENCY= 81.013821
##.OBSERVE NUCLEUS= ^31P
##.ACQUISITION MODE= SIMULTANEOUS
##.ACQUISITION SCHEME= undefined
##.AVERAGES= 24
##.DIGITISER RES= 17
##SPECTROMETER/DATA SYSTEM= spect
##.PULSE SEQUENCE= zgpg30
##.SOLVENT NAME= CDCl3
##.SHIFT REFERENCE= (INTERNAL, CDCl3, 0, 182.463)
##AUDIT TRAIL= $$ (NUMBER, WHEN, WHO, WHERE, WHAT)
$$ ##TITLE= Audit trail, XWIN-NMR		Version 3.5
$$ ##JCAMPDX= 5.01
$$ ##ORIGIN= Bruker BioSpin GmbH
$$ ##OWNER= she
$$ F:/spectra/data/she/nmr/P31/1/pdata/1/auditp.txt
$$ ##AUDIT TRAIL=  $$ (NUMBER, WHEN, WHO, WHERE, WHAT)
(   1,<2019-07-02 15:27:22.37 +0400>,<she>,<DPX200>,
      <created by zg, POWCHK disabled, PULCHK disabled
       configuration hash MD5:
       00 E9 B6 7A A2 85 ED C7 34 08 36 98 17 FE 4E 26
       data hash MD5: 32K
       1F 13 08 AE 80 F4 5C D0 3C 8A 84 DE B4 30 51 ED>)
(   2,<2019-07-02 15:27:24.90 +0400>,<she>,<DPX200>,
      <Start of raw data processing
       efp BC_mod = 2 LB = 1 FT_mod = 6 PKNL = 1 PHC0 = -2584.571 PHC1 = 112.3988 SI = 64K 
       data hash MD5: 64K
       E4 E0 02 A8 1B F2 66 44 CD 2B 6B 7C 3B 2D 5C 83>)
(   3,<2019-07-02 15:27:34.03 +0400>,<she>,<DPX200>,
      <pk PHC0 = 6.079568 PHC1 = 0 
       data hash MD5: 64K
       D5 52 A2 7C 33 60 A1 F6 85 D9 84 B2 71 2E 70 C0>)
(   4,<2019-07-02 15:27:37.70 +0400>,<she>,<DPX200>,
      <abs ABSG = 5 
       data hash MD5: 64K
       57 A7 62 F4 8D 98 94 26 47 4F 83 4E 3E 86 F8 0D>)
$$ ##END=
$$ 
$$ hash MD5
$$ 1C 7A 54 43 0D FA 1B 44 B9 6F 1A D7 8E C1 7A 4D
##$RELAX= 
##$RELAX= 
##$RELAX= 
##$RELAX= 
##$RELAX= 
##$RELAX= 
##$RELAX= 
##$RELAX= 
$$ Bruker specific parameters
$$ --------------------------
##$DU= <F:/spectra>
##$EXPNO= 1
##$NAME= <P31>
##$PROCNO= 1
##$TYPE= <nmr>
##$USER= <she>
##$AMP= (0..31)
100 100 100 100 100 100 100 100 100 100 100 100 100 100 100 100 100 100 
100 100 100 100 100 100 100 100 100 100 100 100 100 100 
##$AQSEQ= 0
##$AQ_mod= 1
##$AUNM= <au_zg>
##$AUTOPOS= <>
##$BF1= 81.014009
##$BF2= 200.13
##$BF3= 200.13
##$BF4= 200.13
##$BF5= 200.13
##$BF6= 200.13
##$BF7= 200.13
##$BF8= 200.13
##$BYTORDA= 1
##$CFDGTYP= 0
##$CFRGTYP= 5
##$CHEMSTR= <none>
##$CNST= (0..31)
1 1 145 1 1 1 1 1 1 1 1 1 1 1 1 1 1 1 1 1 1 1 1 1 1 1 1 1 1 1 1 1 
##$CPDPRG= <waltz16>
##$CPDPRG1= <>
##$CPDPRG2= <waltz16>
##$CPDPRG3= <>
##$CPDPRG4= <mlev>
##$CPDPRG5= <mlev>
##$CPDPRG6= <mlev>
##$CPDPRG7= <mlev>
##$CPDPRG8= <mlev>
##$CPDPRGB= <>
##$CPDPRGT= <>
##$D= (0..31)
0 1 0 0 0 0 0 0 0 0 0 0.03 2e-05 3e-06 0 0 0 0 0 0 0 0 0 0 0 0 0 0 0 0 
0 0 
##$DATE= 1562066841
##$DBL= (0..7)
120 120 120 11 120 120 24 19 
##$DBP= (0..7)
150 150 150 150 150 150 150 150 
##$DBP07= 0
##$DBPNAM0= <>
##$DBPNAM1= <>
##$DBPNAM2= <>
$$ [...]
##$SUBNAM3= <"">
##$SUBNAM4= <"">
##$SUBNAM5= <"">
##$SUBNAM6= <"">
##$SUBNAM7= <"">
##$SUBNAM8= <"">
##$SUBNAM9= <"">
##$SW= 369.568048894756
##$SWIBOX= (0..15)
0 1 3 0 0 0 0 0 0 0 0 0 0 0 0 0 
##$SW_h= 29940.119760479
##$TD= 32768
##$TD0= 1
##$TE= 0
##$TE2= 300
##$TE3= 300
##$TEG= 300
##$TL= (0..7)
0 120 53 12 22 120 120 120 
##$TP= (0..7)
150 150 150 150 150 150 150 150 
##$TP07= 0
##$TPNAME0= <>
##$TPNAME1= <>
##$TPNAME2= <>
##$TPNAME3= <>
##$TPNAME4= <>
##$TPNAME5= <>
##$TPNAME6= <>
##$TPNAME7= <>
##$TPOAL= (0..7)
0.5 0.5 0.5 0.5 0.5 0.5 0.5 0.5 
##$TPOFFS= (0..7)
0 0 0 0 0 0 0 0 
##$TUNHIN= 0
##$TUNHOUT= 0
##$TUNXOUT= 0
##$USERA1= <user>
##$USERA2= <user>
##$USERA3= <user>
##$USERA4= <user>
##$USERA5= <user>
##$V9= 5
##$VALIST= <valist>
##$VCLIST= <CCCCCCCCCCCCCCC>
##$VD= 0
##$VDLIST= <DDDDDDDDDDDDDDD>
##$VPLIST= <PPPPPPPPPPPPPPP>
##$VTLIST= <TTTTTTTTTTTTTTT>
##$WBST= 1024
##$WBSW= 4
##$XGAIN= (0..3)
0 0 0 0 
##$XL= 0
##$YL= 0
##$YMAX_a= 104048
##$YMIN_a= -106130
##$ZGOPTNS= <>
##$ZL1= 120
##$ZL2= 120
##$ZL3= 120
##$ZL4= 120
##$ABSF1= 182.463
##$ABSF2= -187.1042
##$ABSG= 5
##$ABSL= 3
##$ALPHA= 0
##$AQORDER= 0
##$ASSFAC= 0
##$ASSFACI= 0
##$ASSFACX= 0
##$ASSWID= 0
##$AUNMP= <proc_1d>
##$AZFE= 0.1
##$AZFW= 0.5
##$BCFW= 0
##$BC_mod= 2
##$BYTORDP= 0
##$COROFFS= 0
##$CY= -3
##$DATMOD= 1
##$DC= 0
##$DFILT= <>
##$DTYPP= 0
##$F1P= 0
##$F2P= 0
##$FCOR= 1
##$FTSIZE= 65536
##$FT_mod= 6
##$GAMMA= 0
##$GB= 0
##$INTBC= 1
##$INTSCL= 5.30512e-09
##$ISEN= 30
##$LB= 1
##$LEV0= 0
##$LPBIN= 0
##$MAXI= 10000
##$MC2= 0
##$MEAN= 0
##$ME_mod= 0
##$MI= 50
##$NCOEF= 0
##$NC_proc= -2
##$NLEV= 6
##$NOISF1= 182.463
##$NOISF2= 159.3651
##$NSP= 0
##$NTH_PI= 0
##$NZP= 0
##$OFFSET= 182.463
##$PC= 4
##$PHC0= -2578.491
##$PHC1= 112.3988
##$PH_mod= 1
##$PKNL= yes
##$PPARMOD= 0
##$PSCAL= 0
##$PSIGN= 0
##$REVERSE= no
##$SF= 81.0140089999434
##$SI= 65536
##$SIGF1= 159.3651
##$SIGF2= -187.1042
##$SINO= 113.3802
##$SIOLD= 16384
##$SREGLST= <1H.CDCl3>
##$SSB= 0
##$STSI= 65536
##$STSR= 0
##$SW_p= 29940.119760479
##$SYMM= 0
##$S_DEV= 0
##$TDeff= 32768
##$TDoff= 0
##$TI= <>
##$TILT= no
##$TM1= 0
##$TM2= 0
##$TOPLEV= 0
##$USERP1= <user>
##$USERP2= <user>
##$USERP3= <user>
##$USERP4= <user>
##$USERP5= <user>
##$WDW= 1
##$XDIM= 65536
##$YMAX_p= 354571626
##$YMIN_p= -4270116
$$ End of Bruker specific parameters
$$ ---------------------------------
##NTUPLES= NMR SPECTRUM
##VAR_NAME=  FREQUENCY,     SPECTRUM/REAL,   SPECTRUM/IMAG
##SYMBOL=    X,             R,               I
##VAR_TYPE=  INDEPENDENT,   DEPENDENT,       DEPENDENT
##VAR_FORM=  AFFN,          ASDF,            ASDF
##VAR_DIM=   65536,         65536,           65536
##UNITS=     HZ,            ARBITRARY UNITS, ARBITRARY UNITS
##FACTOR=    0.456856943014862, 1,           1
##FIRST=     14782.0589164792, 0,            0
##LAST=      -15158.0608439998, 0,           0
##MIN=       -15158.0608439998, -4270116,    0
##MAX=       14782.0589164792, 354571626,    0
$$ Real data points
##PAGE= N=1
##DATA TABLE= (X++(R..R)), XYDATA
$$ [...]
$$ plain form
42949 -131032 -117871 -122495 -115299 -97100 -96042 -130113 -186319 -222073 -192307 -104286 -39699 -84758
42937 -84758 -236433 -406293 -506585 -499761 -390292 -229013 -113293 -112171 -184862 -230884 -217926
42926 -217926 -194880 -187162 -167834 -142020 -161920 -224934 -249351 -199802 -152625 -176095 -219768 -193500
42914 -193500 -98303 -7229 39136 52046 47145 37684 43034 54966 32330 -27703 -61305 -28559
42902 -28559 21908 32805 22770 27046 16713 -43259 -111832 -136625 -150543 -206423 -258925 -220468
42890 -220468 -107690 -24668 -18437 -54602 -115468 -206678 -276961 -255670 -178667 -160013 -226092
42879 -226092 -294679 -330059 -385149 -461095 -471859 -408942 -399214 -508586 -614522 -587884 -494658
42868 -494658 -479189 -524431 -486869 -339878 -224872 -238990 -300890 -284307 -197035 -151853 -197724
$$ packed form
42949a31032J3161m624P196J8199J058l4071n6206l5754K9766Q8021O4587m5059
42937h4758j51675j69860j00292O824J09469J61279J15720J122p2691m6022J2958
42926b17926K3046P718J9328K5814j9900o3014k4417M9549M7177k3470m3673K6268
42914a93500R5197R1074M6365J2910m901r461N350J1932k2636o0033l3602L2746
42902b8559N0467J0897j0035M276j0333n9972o8573k4793j3918n5880n2502L8457
42890b20468J12778Q3022O231l6165o0866r1210p0283K1291P7003J8654o6079
42879b26092o8587l5380n5090p5946j0764O2917R728j09372j05936K6638R3226
42868d94658J5469m5242L7562J46991J15006j4118o1900J6583Q7272M5182m5871
$$ plain form
42857 -197724 -251499 -208699 -82111 8521 -15916 -101069 -145164 -132648 -113595 -82081 15988
42846 15988 143551 163594 29713 -118022 -134500 -64527 -52678 -120798 -158293 -108099 -41047
42835 -41047 -36273 -86139 -142861 -182912 -199105 -187202 -161452 -138045 -95754 -2498 112957 168850
42823 168850 123785 22127 -56603 -52675 57003 230377 345455 291695 105887 -47375
42813 -47375 -66034 -17956 -11498 -28141 28935 156029 229012 180010 97008 89272 126462 102547
42801 102547 20839 -2647 67161 108810 27823 -85326 -85941 5850 46084 -10511 -73511 -96231
42789 -96231 -135515 -199293 -189381 -68789 46394 49820 -18507 -89042 -187522 -321426 -366123
42778 -366123 -229042 -40286 -591 -95436 -143650 -92629 -63104 -99556 -83804 51727 205195
$$ packed form
42857a97724n3775M2800J26588R0632k4437q5153m4095J2516J9053L1514R8069
42846A5988J27563K0043j33881j47735j6478O9973J1849o8120l7495N0194O7052
42835d1047M774m9866n6722m0051j6193J1903K5750K3407M2291R3256J15455N5893
42823A68850m5065j01658p8730L928J09678J73374J15078n3760j85808j53262
42813d7375j8659M8078O458j6643N7076J27094P2983m9002q3002p736L7190k3915
42801A02547q1708k3486O9808M1649q0987j13149o15R1791M0234n6595o3000k2720
42789i6231l9284o3778R912J20592J15183L426o8327p0535r8480j33904m4697
42778c66123J37081J88756L9695r4845m8214N1021K9525l6452J5752J35531J53468
$$ plain form
42767 205195 276838 307873 360058 387483 330174 233926 175700 147506 106793 76392 103115
42756 103115 163590 191880 171110 139166 131069 153637 180204 146617 9345 -166933 -252423
42745 -252423 -218342 -177066 -206722 -229641 -148109 -20031 15893 -47960 -68530 47584 213986
42734 213986 271922 180483 56116 27182 82903 104485 42373 -8225 43944 137121 153857
42723 153857 111212 118330 170205 144981 21653 -64074 -28947 46363 75294 81717 84483 25032
42711 25032 -91319 -135286 -51186 30355 1755 -49281 -19275 16747 -32730 -69830 22362
42700 22362 130517 75122 -72892 -102737 -24522 -35541 -151033 -164950 -7997 138520 155410
42689 155410 149998 210489 237976 150833 48453 32940 46906 23846 29541 108176 145234 44504
$$ packed form
42767B05195P1643L1035N2185K7425n7309r6248n8226k8194m0713l0401K6723
42756A03115O0475K8290k0770l1944q097K2568K6567l3587j37272j76278q5490
42745b52423L4081M1276k9656k2919Q1532J28078L5924o3853k0570J16114J66402
42734B13986N7936r1439j24367k8934N5721K1582o2112n0598N2169R3177J6736
42723A53857m2645P118N1875k5224j23328q5727L5127P5310K8931O423K766n9451
42711B5032j16351m3967Q4100Q1541k8600n1036L0006L6022m9477l7100R2192
42700B2362J08155n5395j48014k9845P8215j1019j15492j3917J56953J46517J6890
42689A55410n412O0491K7487q7143j02380j5513J3966k3060N695P8635L7058j00730
$$ plain form
42677 44504 -89558 -105806 -28502 28385 56902 98415 90584 -42219 -207240 -233016 -111581
42666 -111581 4824 27239 7249 6906 26365 55982 83509 58550 -41648 -128090 -94022
42655 -94022 23213 89799 70715 53370 78608 79546 13857 -57517 -62076 2244 103314 209072
42643 209072 265114 227376 145162 124799 175049 172677 31881 -159645 -230893 -112701 107383
42632 107383 280127 313816 231899 140319 119357 144373 141425 105846 105087 161162 201478 155856
42620 155856 47110 -49750 -94800 -94875 -66198 -26834 -5347 -19828 -52521 -65155 -37843 13715
42608 13715 54071 59721 39773 19819 4944 -20107 -48081 -42597 4707 50305 63668 72477
42596 72477 101183 114824 85521 65843 111753 168766 137390 36977 -7809 45902 98445
$$ packed form
42677D4504j34062j6248P7304N6887K8517M1513p831j32803j65021k5776J21435
42666a11581J16405K2415j9990l43J9459K9617K7527k4959j00198q6442L4068
42655i4022J17235O6586j9084j7345K5238R38o5689p1374m559O4320J01070J05758
42643B09072N6042l7738q2214k0363N0250k372j40796j91526p1248J18192K20084
42632A07383J72744L3689q1917r1580k0962K5016k948l5579p59N6075M0316m5622
42620A55856j08746r6860m5050p5K8677L9364K1487j4481l2693j2634K7312N1558
42608A3715M0356N650j9948j9954j4875k5051k7974N484M7304M5598J3363Q809
42596G2477K8706J3641k9303j9678M5910N7013l1376j00413m4786N3711N2543
$$ plain form
42585 98445 70158 21465 49171 142085 212297 217521 183430 138681 90570 47924 18607 -8427
42573 -8427 -45875 -80579 -85257 -50371 4866 41131 21100 -53029 -128117 -154238 -138251 -107464
42561 -107464 -47863 53590 125509 72690 -62830 -108424 16047 170189 166323 9291 -123473
42550 -123473 -108697 -2822 52675 -8298 -116915 -140544 -16772 173976 292142 293691 250430
42539 250430 214137 146832 23302 -91901 -143547 -179199 -247316 -273376 -163462 10118 68706
42528 68706 -29136 -138144 -143240 -97340 -94274 -124585 -139257 -163613 -244311 -338007 -357262 -304161
42516 -304161 -263697 -266465 -243956 -139278 7601 115794 149953 116735 27771 -79026 -116411
42505 -116411 -19541 157416 278437 276459 211813 155925 85501 -44624 -176690 -197452 -103358
$$ packed form
42585I8445k8287m8693K7706R2914P0212N224l4091m4749m8111m2646k9317k7034
42573h427l7448l4704m678L4886N5237L6265k0031p4129p5088k6121J5987L0787
42561a07464N9601J01453P1919n2819j35520m5594J24471J54142l866j57032j32764
42550a23473J4776J05875N5497o0973j08617k3629J23772J90748J18166J549m3261
42539B50430l6293o7305j23530j15203n1646l5652o8117k6060J09914J73580N8588
42528F8706r7842j09008n096M5900L066l0311j4672k4356q0698r3696j9255N3101
42516c04161M0464k768K2509J04678J46879J08193L4159l3218q8964j06797l7385
42505a16411R6870J76957J21021j978o4646n5888p0424j30125j32066k0762R4094
$$ plain form
42494 -103358 -21341 -42526 -123767 -194098 -267192 -371333 -436446 -355297 -136136 92141 220377
42483 220377 234194 166175 61989 -5627 13843 59560 8782 -143948 -244828 -181583 -47836
42472 -47836 -15583 -97490 -148981 -90183 -4479 12831 -4645 24105 80117 75171 811 -50846
42460 -50846 -25157 18673 4430 -51879 -80640 -60618 -20598 32152 112641 192103 206109 153317
42448 153317 126571 201768 330433 389146 324202 211845 172814 244979 345588 360532 272882
42437 272882 183312 181238 227856 225692 182992 210606 331094 397434 279399 55922 -77402
42426 -77402 -49859 35946 71390 49259 4658 -43396 -63054 -12670 83995 133715 86858 -380
42414 -380 -49437 -46057 -9551 56196 127272 136058 54860 -35126 -30622 60531 139853 154478 140220
$$ packed form
42494a03358Q2017k1185q1241p0331p3094j04141o5113Q1149K19161K28277J28236
42483B20377J3817o8019j04186o7616J9470M5717n0778j52730j00880O3245J33747
42472d7836L2253q1907n1491N8798Q5704J7310j7476K8750N6012m946p4360n1657
42460e0846K5689M3830j4243n6309k8761K0022M0020N2750Q0489P9462J4006n2792
42448A53317k6746P5197J28665N8713o4944j12357l9031P2165J00609J4944q7650
42437B72882q9570k074M6618k164m2700K7614J20488O6340j18035k23477j33324
42426g7402K7543Q5805L5444k2131m4601m8054j9658N0384R6665M9720m6857q7238
42414c80m9057L380L6506O5747P1076Q786q1198q9986M504R1153P9322J4625j4258
$$ plain form
42401 140220 130570 98194 13592 -90664 -149269 -130362 -50584 50599 130058 155927 129865
42390 129865 89118 72280 86420 112077 128844 128205 113042 95721 89223 91136 84253 62003
42378 62003 42797 44418 53150 40735 9757 -6553 2384 5624 -10537 233 79529 175620
42366 175620 185169 89714 -16276 -56937 -63617 -86697 -92395 -30164 46111 29594 -78747 -162842
42354 -162842 -156546 -121297 -131519 -171959 -194065 -196783 -194715 -169696 -115120 -76152 -84723 -100325
42342 -100325 -76379 -41415 -47691 -76457 -63860 6988 100776 180874 202455 106201 -91094
42331 -91094 -242881 -221860 -100103 -60720 -140128 -193438 -127904 -20999 40718 89742 160518
42320 160518 182363 109759 49514 113809 223999 217064 99435 28722 58216 72023 85
$$ packed form
42401A40220r650l2376q4602j04256n8605J8907P9778J01183P9459K5869k6062
42390A29865m0747j6838J4140K5657J6767o39j5163j7321o498J913o883k2250
42378F2003j9206J621Q732j2415l0978j6310Q937L240j6161J0770P9296R6091
42366A75620R549r5455j05990m0661o680k3080n698O2231P6275j6517j08341q4095
42354a62842O296L5249j0222m0440k2106k718K068K5019N4576L8968q571j5602
42342a00325K3946L4964o276k8766J2597P0848R3788Q0098K1581r6254j97295
42331i1094j51787K1021J21757L9383p9408n3310O5534J06905O1717M9024P0776
42320A60518K1845p2604o0245O4295J10190o935j17629p0713K9494J3807p1938
$$ plain form
42309 85 -67002 -45779 -4876 -44458 -129591 -153436 -106640 -77928 -111843 -153838 -134425 -50286
42297 -50286 36200 45347 -51493 -181905 -223796 -141072 -29077 9964 -17864 -55256 -96191
42286 -96191 -150682 -168361 -107421 -44673 -94906 -230660 -306684 -271737 -226264 -239647 -244384 -172686
42274 -172686 -74434 -14985 34918 106405 129415 46355 -51474 -44317 16388 -9924 -100357 -80857
42262 -80857 87721 218364 169792 55159 59689 161196 178758 45685 -110828 -159431 -114525
42251 -114525 -68566 -62856 -71962 -65726 -42303 -18275 -8787 -9927 -553 23908 30539 -10429 -73106
42238 -73106 -100538 -79413 -49737 -36464 -19531 8413 2256 -74774 -177094 -212520 -148220 -42242
42226 -42242 32634 58205 52465 21806 -33857 -86744 -92281 -40831 25136 53335 25401 -43489
$$ packed form
42309H5o7087K1223M0903l9582q5133k3845M6796K8712l3915m1995J9413Q4139
42297e0286Q6486R147r6840j30412m1891Q2724J11995L9041k7828l7392m0935
42286i6191n4491j7679O0940O2748n0233j35754p6024L4947M5473j3383m737P1698
42274a72686R8252N9449M9903P1487K3010q3060r7829P157O0705k6312r0433J9500
42262h0857J68578J30643m8572j14633M530J01507J7562j33073j56513m8603M4906
42251a14525M5959N710r106O236K3423K4028R488j140R374K4461O631m0968o2677
42238g3106k7432K1125K9676J3273J6933K7944o157p7030j02320l5426O4300J05978
42226d2242P4876K5571n740l0659n5663n2887n537N1450O5967K8199k7934o8890
$$ plain form
42214 -43489 -125218 -186628 -197659 -155932 -100748 -86863 -138092 -224498 -280343 -253068 -155822 -70913
42202 -70913 -72049 -134487 -155562 -82996 12719 25741 -55270 -145288 -168899 -122653 -46537 15656
42190 15656 28766 -14746 -79752 -122154 -135194 -135509 -122299 -93259 -80160 -109463 -141105 -115423
42178 -115423 -53859 -32948 -56779 -50355 1274 15708 -36115 -50453 52550 179124 177755
42167 177755 51238 -59630 -76258 -55825 -69439 -109377 -137181 -144809 -140874 -131495 -134210 -169961
42155 -169961 -234824 -311190 -388868 -433180 -373222 -200942 -49962 -66472 -203493 -260390 -149903
42144 -149903 -4860 31779 2466 30730 116855 155661 106040 26615 -33441 -69305 -51745
42133 -51745 64631 235438 320846 240558 79361 -12614 12073 75814 92016 48786 -17074
$$ packed form
42214d3489q1729o1410j1031M1727N5184J3885n1229q6406n5845K7275R7246Q4909
42202g0913j136o2438k1075P2566R5715J3022q1011r0018k3611M6246P6116O2193
42190A5656J3110m3512o5006m2402j3040l15J3210K9040J3099k9303l1642K5682
42178a15423O1564K0911k3831O424N1629J4434n1823j4338J03003J26574j369
42167A77755j26517j10868j6628K0433j3614l9938k7804p628L935R379k715l5751
42155a69961o4863p6366p7678m4312N9958J72280J50980j6510j37021n6897J10487
42144a49903J45043L6639k9313K8264Q6125L8806m9621p9425o0056l5864J7560
42133e1745J16376J70807Q5408q0288j61197r1975K4687O3741J6202m3230o5860
$$ plain form
42122 -17074 -77716 -124438 -148171 -139625 -106990 -75333 -62836 -66143 -71141 -67241 -48406 -17976
42110 -17976 -3683 -46770 -150889 -254961 -288003 -245544 -180629 -126488 -72174 -18026 -408
42099 -408 -33773 -72402 -69172 -41494 -37795 -63891 -89433 -109801 -148350 -201633 -235936 -245325 -260935
42086 -260935 -284694 -265899 -178791 -81018 -46915 -71543 -95631 -104002 -127432 -150164 -106653 -6313
42074 -6313 29192 -67079 -172385 -123134 32235 69854 -99812 -299069 -326629 -209587 -109276
42063 -109276 -81633 -72181 -77507 -140668 -206787 -157542 -12648 65113 16058 -21945 54126 136073
42051 136073 84007 -40430 -78612 -32787 -42000 -130914 -164565 -79433 1594 -41996 -142660
42040 -142660 -144857 -24440 85498 65080 -65096 -186570 -212601 -169842 -162438 -247052 -348210
$$ packed form
42122a7074o0642m6722k3733Q546L2635L1657J2497l307m998L900J8835L0430
42110a7976J4293m3087j04119j04072l3042M2459O4915N4141N4314N4148J7618
42099d08l3365l8629L230K7678L699k6096k5542k0368l8549n3283l4303r389j5610
42086b60935k3759J8795Q7108R7773L4103k4628k4088q371k3430k2732M3511J00340
42074f313L5505r6271j05306M9251J55369L7619j69666j99257k7560J17042J00311
42063a09276K7643R452n326o3161o6119M9245J44894P7761m9055l8003P6071Q1947
42051A36073n2066j24437l8182M5825r213q8914l3651Q5132Q1027m3590j00664
42040a42660k197J20417J09938k0418j30176j21474k6031M2759P404q4614j01158
$$ plain form
42029 -348210 -332851 -177253 -13927 16615 -78317 -177300 -202897 -187328 -188182 -205317 -210041 -208887
42017 -208887 -228604 -259380 -267992 -265044 -299447 -368205 -394675 -339789 -276493 -285302 -324002 -295601
42005 -295601 -216828 -200968 -272364 -330028 -329094 -356601 -451301 -486253 -355561 -171620 -123739
41994 -123739 -210460 -275992 -268300 -280010 -338081 -339679 -241751 -153549 -171161 -251414 -320665 -383831
41982 -383831 -443059 -428452 -316344 -220652 -250552 -348239 -380400 -331164 -288412 -285983 -283305 -276234
41970 -276234 -304285 -348229 -332501 -248210 -182174 -197990 -259954 -295581 -271539 -194781 -102481
41959 -102481 -64261 -125684 -224530 -226767 -82572 101677 184392 144921 83185 92255 171230
41948 171230 256212 306270 344808 415524 506948 547129 489433 380200 315427 347417 453674
$$ packed form
42029c48210J5359J55598J63326L0542r4932r8983k5597J5569q54j7135m724J154
42017b08887j9717l0776q612K948l4403o8758k6470N4886O3296q809l8700K8401
42005b95601P8773J5860p1396n7664R34k7507r4700l4952J30692J83941M7881
41994a23739q6721o5532P692j1710n8071j598R7928Q8202j7612q0253o9251o3166
41982c83831n9228J4607J12108R5692k9900r7687l2161M9236M2752K429K678P071
41970b76234k8051m3944J5728Q4291O6036j5816o1964l5627K4042P6758R2300
41959a02481L8220o1423r8846k237J44195J84249Q2715l9471o1736R070P8975
41948A71230Q4982N0058L8538P0716R1424M0181n7696j09233o4773L1990J06257
$$ plain form
41937 453674 566833 607296 532271 406157 380888 533084 749597 858165 847900 855262 936822
41926 936822 985205 911559 791570 751112 795973 846887 876432 907870 919465 859151 745755
41915 745755 661141 634312 614728 574433 555876 585644 610656 571750 493823 445269 434345
41904 434345 405816 336321 277654 287083 354342 426888 481055 530257 575909 597425 597564 609463
41892 609463 632877 609025 506238 396885 381729 447177 471240 385803 261364 193398 168682
41881 168682 108332 5407 -57809 -28323 47572 96527 115166 154482 222832 248321 159525
41870 159525 -14266 -156499 -182429 -114234 -23089 62167 148158 216465 238747 240299 274855
41859 274855 332002 344816 302143 268420 262216 206124 51700 -129060 -244982 -299140 -319942
$$ packed form
41937D53674J13159M0463p5025j26114k5269J52196K16513J08568j0265P362Q1560
41926I36822M8383p3646j19989m0458M4861N0914K9545L1438J1595o0314j13396
41915G45755q4614k6829j9584m0295j8557K9768K5012l8906p7927m8554j0924
41904D34345k8529o9495n8667R429O7259P2546N4167M9202M5652K1516J39J1899
41892F09463K3414k3852j02787j09353j5156O5448K4063q5437j24439o7966k4716
41881A68682o0350j02925o3216K9486P5895M8955J8639L9316O8350K5489q8796
41870A59525j73791j42233k5930O8195R1145Q5256Q5991O8307K2282J552L4556
41859B74855N7147J2814m2673l3723o204n6092j54424j80760j15922n4158k0802
$$ plain form
41848 -319942 -262029 -91645 89312 141848 86057 62311 106095 108755 22108 -48271 -11185
41837 -11185 79859 140600 183512 236256 235845 127275 -921 -13946 66186 81555 -37452
41826 -37452 -181154 -217317 -146430 -61161 -21373 -19372 -26407 -24170 -4570 29549 62277 71352
41814 71352 37486 -40797 -127599 -163334 -128288 -80835 -93861 -155158 -173313 -94453 24522
41803 24522 83195 52699 -6040 -27198 -8890 11504 20305 29073 18375 -66737 -226717 -349959
41791 -349959 -313611 -140870 8661 22612 -53253 -112961 -125091 -114688 -74867 18893 134945
41780 134945 207672 228136 246023 282415 303239 286511 260394 259716 285586 318468 338818 331775
41768 331775 300104 267929 246732 216425 170461 146055 161923 164707 106398 42807 67509 163656
$$ packed form
41848c19942N7913J70384J80957N2536n5791k3746M3784K660q6647p0379L7086
41837a1185R1044O0741M2912N2744m11j08570j28196j3025Q0132J5369j19007
41826c7452j43702l6163P0887Q5269L9788K001p035K237J9600L4119L2728R075
41814G1352l3866p8283q6802l5735L5046M7453j3026o1297j8155P8860J18975
41803B4522N8673l0496n8739k1158J8308K0394Q801Q768j0698q5112j59980j23242
41791c49959L6348J72741J49531J3951p5865n9708j2130J0403L9821R3760J16052
41780A34945P2727K0464J7887L6392K0824j6728k6117o78K5870L2882K0350p043
41768C31775l1671l2175k1197l0307m5964k4406J5868K784n8309o3591K4702R6147
$$ plain form
41756 163656 216424 173057 96251 49863 28351 17808 27775 33038 -16926 -90142 -70760 83347
41744 83347 271020 388707 449927 503773 528671 486545 404805 327178 255491 207880 242485
41733 242485 337348 348462 204922 56432 84916 237227 302591 214394 110705 107248 169700
41722 169700 224091 249104 231686 159552 90138 112445 210142 268729 241723 201596 205530 224943
41710 224943 230736 228908 188096 62732 -81229 -108065 -24257 7234 -70661 -101158 30980
41699 30980 199830 232313 160241 115297 91354 2779 -100123 -80257 48533 120221 57959
41688 57959 -44106 -95681 -117674 -141466 -130995 -55568 53198 154437 232890 263682 220386
41677 220386 132251 61899 23516 -5495 -7346 49612 120555 126410 81682 67809 81339 37435
$$ packed form
41756A63656N2768m3367p6806m6388k1512j0543R967N263m9964p3216J9382J54107
41744H3347J87673J17687O1220N3846K4898m2126q1740p7627p1687m7611L4605
41733B42485R4863J1114j43540j48490K8484J52311O5364q8197j03689l457O2452
41722A69700N4391K5013j7418p2134o9414K2307R7697N8587k7006m0127L934J9413
41710B24943N793j828m0812j25364j43961k6836Q3808L1491p7895l0497J32138
41699C0980J68850L2483p2072m4944k3943q8575j02902J9866J28790P1688o2262
41688E7959j02065n1575k1993k3792J0471P5427J08766J01239P8453L0792m3296
41677B20386q8135p0352l8383k9011j851N6958P0943N855m4728j3873J3530m3904
$$ plain form
41665 37435 -62443 -106575 -52493 8060 15777 36340 113926 168805 140969 115554 183102 269099
41653 269099 236436 94209 -25906 -61171 -63830 -78554 -85991 -65276 -23712 35805 108923
41642 108923 161633 166883 149091 139145 120939 80136 54710 63094 40421 -57793 -143374 -105117
41630 -105117 9545 55969 12019 -9167 39328 85091 108228 193330 340040 383814 222975
41619 222975 3215 -60915 34810 123612 127769 124922 167937 188687 120854 9477 -60426
41608 -60426 -74389 -71156 -61691 -23623 41333 91772 94990 68250 59170 88801 127791 142807
41596 142807 155858 221382 334526 406700 369476 271003 217633 234363 240418 168183 53118
41585 53118 -17772 -9605 37447 66894 59251 34634 23814 40548 75706 112831 139413 137949
$$ packed form
41665C7435r9878m4132N4082O0553P717K0563P7586N4879k7836k5415O7548Q5997
41653B69099l2663j42227j20115l5265k659j4724p437K0715M1564N9517P3118
41642A08923N2710N250j7792r946j8206m0803k5426Q384k2673r8214q5581L8257
41630a05117J14662M6424m3950k1186M8495M5763K3137Q5102J46710M3774j60839
41619B22975k19760o4130R5725Q8802M157k847M3015K0750o7833j11377o9903
41608f0426j3963L233R465L8068O4956N0439L218k6740r080K9631L8990J5016
41596A42807J3051O5524J13144P2174l7224r8473n3370J6730O055p2235j15065
41585E3118p0890Q167M7052K9447p643k4617j0820J6734L5158L7125K6582j464
$$ plain form
41573 137949 85309 -14608 -108211 -134894 -93530 -35723 9901 68200 157090 235424 243415 172236
41561 172236 63761 -38053 -102207 -98331 -18177 91243 158711 160786 128847 84227 16453
41550 16453 -58180 -74645 -1410 95973 132129 119953 145494 228605 278820 213245 62898
41539 62898 -72946 -135490 -129471 -74434 11130 87514 106760 60832 -7097 -44907 -31990 13886
41527 13886 50267 39973 -9674 -46551 -36558 -13676 -33878 -88210 -105296 -46001 45814 103803
41515 103803 116226 118806 135125 152669 150402 130468 120114 143970 191096 218746 203615 176727
41503 176727 180407 201202 184302 111918 21111 -61609 -148251 -231828 -261177 -218234 -175309 -219845
41491 -219845 -351982 -513809 -696405 -947930 -1274929 -1599377 -1833858 -1956708 -1995014 -1969839
$$ packed form
41573A37949n2640r9917r3603k6683M1364N7807M5624N8299Q8890P8334P991p1179
41561A72236j08475j01814o4154L876Q0154J09420O7468K075l1939m4620o7774
41550A6453p4633j6465P3235R7383L6156j2176K5541Q3111N0215o5575j50347
41539F2898j35844o2544O019N5037Q5564P6384J9246m5928o7929l7810J2917M5876
41527A3886L6381j0294m9647l6877R993K2882k0202n4332j7086N9295R1815N7989
41515A03803J2423K580J6319J7544k267j9934j0354K3856M7126K7650j5131k6888
41503A76727L680K0795j6900p2384r0807q2720q6642q3577k9349M2943M2925m4536
41491b19845j32137j61827j82596k51525l26999l24448k34481j22850l8306K5175
$$ plain form
41481 -1969839 -1879872 -1716538 -1483299 -1219708 -1004921 -900440 -877659 -836928 -717794 -563552
41471 -563552 -460086 -440418 -472006 -510287 -532587 -533649 -516997 -487566 -439780 -366727 -294203
41460 -294203 -279802 -346743 -433789 -449641 -378406 -299292 -293484 -356978 -417934 -419484 -366129 -297871
41448 -297871 -240513 -191597 -150056 -143677 -206730 -323115 -410349 -386128 -254280 -107634 -37996
41437 -37996 -54374 -96644 -114861 -114572 -124406 -143246 -142558 -116526 -101412 -128423 -176927 -201986 -196888
41424 -196888 -189893 -179186 -124466 -32191 1990 -99461 -265864 -333060 -246539 -141972 -176075
41413 -176075 -325460 -422505 -374406 -271075 -255942 -351292 -457381 -487329 -443126 -365911 -272122
41402 -272122 -164621 -68469 -16039 -6892 -11396 -11693 -16436 -34787 -56800 -65967 -58735 -47536 -50349
$$ packed form
41481a969839Q9967J63334K33239K63591K14787J04481K2781M0731J19134J54242
41471e63552J03466J9668l1588l8281k2300j062J6652K9431M7786P3053P2524
41460b94203J4401o6941q7046j5852P1235P9114N808o3494o0956j550N3355O8258
41448b97871N7358M8916M1541O379o3053j16385q7234K4221J31848J46646O9638
41437c7996j6378m2270j8217K89r834j8840O88K6032J5114k7011m8504k5059N098
41424a96888O995J0707N4720R2275L4181j01451j66403o7196Q6521J04567l4103
41413a76075j49385r7045M8099J03331J5133r5350j06089k9948M4203P7215R3789
41402b72122J07501R6152N2430R147m504k97m743j8351k2013r167P232J1199k813
$$ plain form
41389 -50349 -71355 -83979 -50852 18242 51913 3472 -64927 -49342 41627 80194 -432 -105584
41377 -105584 -126517 -107311 -154488 -233094 -198719 -32227 107302 108242 45809 19918 -10913
41366 -10913 -109741 -185150 -107055 52733 81968 -62638 -182836 -128057 -1310 15361 -83716
41355 -83716 -165434 -163894 -117875 -51162 51062 152420 164955 60998 -88456 -199212 -237447
41344 -237447 -203143 -124767 -74434 -110399 -188586 -203360 -132585 -65314 -61865 -70797 -27038 47332
41332 47332 96378 112159 99112 27848 -92687 -158451 -88018 42751 92061 51156 30011
41321 30011 53402 17674 -109416 -188626 -101171 65681 142684 116884 110424 155195 141937
41310 141937 21938 -76196 -14207 154590 249750 191767 72269 3570 -11240 -29262 -61751
$$ packed form
41389e0349k1006j2624L3127O9094L3671m8441o8399J5585R0969L8567q0626j05152
41377a05584k0933J9206m7177p8606L4375J66492J39529R40o2433k5891l0831
41366a0913r8828p5409P8095J59788K9235j44606j20198N4779J26747J6671r9077
41355h3716q1718J540M6019O6713J02224J01358J2535j03957j49454j10756l8235
41344b37447L4304P8376N0333l5965p8187j4774P0775O7271L449q932M3759P4370
41332D7332M9046J5781j3047p1264j20535o5764P0433J30769M9310m0905k1145
41321C0011K3391l5728j27090p9210Q7455J66852P7003k5800o460M4771j3258
41310A41937j19999r8134O1989J68797R5160n7983j19498o8699j4810j8022l2489
$$ plain form
41299 -61751 -76781 -71068 -71729 -70805 -20011 88593 185806 206225 172710 154038 159131 130279 41370
41286 41370 -55815 -104714 -114786 -126219 -143396 -146759 -143098 -154222 -169593 -160243 -135400 -135128 -161566
41273 -161566 -167005 -125662 -71788 -43943 -35170 -30558 -52291 -118298 -183268 -179965 -113932 -61606
41261 -61606 -65920 -86053 -73407 -49264 -64117 -108997 -119958 -66764 8284 48845 43624 11991
41249 11991 -30625 -63018 -46857 26922 94137 72582 -36140 -150688 -221763 -272341 -298094
41238 -298094 -213195 19308 258677 310464 178284 71139 124210 230710 229343 155512 177288
41227 177288 330393 460338 439179 319956 232016 213884 209732 170539 97775 21865 -16376
41216 -16376 10269 77616 126999 144566 179339 250147 289655 235733 133488 79254 93732
$$ packed form
41299f1751j5030N713o61R24N0794J08604R7213K0419l3515j8672N093k8852q8909
41286D1370r7185m8899j0072j1433j7177l363L661j1124j5371R350K4843K72k6438
41273a61566n439M1343N3874K7845Q773M612k1733o6007o4970L303O6033N2326
41261f1606m314k0133J2646K4143j4853m4880j0961N3194P5048M0561n221l1633
41249A1991m2616l2393J6161P3779O7215k1555j08722j14548p1075n0578k5753
41238b98094Q4899K32503K39369N1787j32180j07145N3071J06500j367p3831K1776
41227A77288J53105J29945k1159j19223q7940j8132m152l9193p2764p5910l8241
41216a6376K6645O7347M9383J7567L4773P0808L9508n3922j02245n4234J4478
$$ plain form
41205 93732 119730 121212 107723 74954 5820 -66994 -83557 -55631 -59081 -103051 -96972 5071
41193 5071 114725 137827 120978 173646 288675 349073 301481 216425 161560 114945 45068
41182 45068 -8678 -254 37064 41305 21825 33571 68634 53239 -34586 -111267 -87306 18085
41170 18085 98493 78363 -16624 -96916 -98981 -44197 -14675 -59656 -128160 -120066 -6638 134441
41158 134441 213734 215981 170990 93590 14 -61975 -65377 -56603 -85849 -112210 -64943 19194
41146 19194 31438 -26166 -17826 118949 263973 293110 258504 277675 328476 297301 186420
41135 186420 121272 153071 191496 157906 87463 42526 26838 28234 57021 97075 96007 43125
41123 43125 -13670 -52831 -95256 -113853 -38177 105504 177698 118506 40303 41512 50764 -24090
$$ packed form
41205I3732K5998J482j3489l2769o9134p2814j6563K7926l450m3970O079J02043
41193E071J09654K3102j6849N2668J15029O0398m7592q5056n4865m6615o9877
41182D5068n3746Q424L7318M241j9480J1746L5063j5395q7825p6681K3961J05391
41170A8085Q0408k0130r4987q0292k065N4784K9522m4981o8504Q094J13428J41079
41158A34441P9293K247m4991p7400r3576o1989l402Q774k9246k6361M7267Q4137
41146A9194J2244n7604Q340J36775J45024K9137l4606J9171N0801l1175j10881
41135A86420o5148L1799L8425l3590p0443m4937j5688J396K8787M0054j068n2882
41123D3125n6795l9161m2425j8597P5676J43681P2194n9192p8203J209R252p4854
$$ plain form
41111 -24090 -108293 -81476 -1024 -18491 -118973 -141966 -58497 -27514 -131975 -239749 -209894
41100 -209894 -90971 -13852 -3119 -5203 -16786 -67023 -120638 -105136 -18995 61616 76240
41089 76240 33488 -14338 -19821 14091 25161 -28660 -78197 -9736 155364 248661 178470 62218
41077 62218 44692 79855 25783 -104466 -147865 -44654 64402 40761 -67902 -118332 -68375
41066 -68375 -296 15898 5394 31837 107596 184051 213257 194032 154584 119140 120409 218014
41054 218014 440339 702700 853151 830176 717505 618966 559283 550015 645757 837315 977564
41043 977564 948145 847053 863967 999149 1070479 1002524 930876 968933 1040029 1035908 998721
41032 998721 1016268 1042088 972600 848678 828895 966663 1136260 1200327 1158978 1105155 1101968
$$ packed form
41111b4090q4203K6817Q0452j7467j00482k2993Q3469L0983j04461j07774K9855
41100b09894J18923P7119J0733k084j1583n0237n3615J5502Q6141Q0611J4624
41089G6240m2752m7826n483L3912J1070n3821m9537O8461J65100R3297p0191j16252
41077F2218j7526L5163n4072j30249m3399J03211J09056k3641j08663n0430M9957
41066f8375O8079J6194j0504K6443P5759P6455K9206j9225l9448l5444J269R7605
41054B18014K22325K62361J50451k2975j12671r8539n9683r268R5742J91558J40249
41043I77564k9419j01092J6914J35182P1330o7955p1648L8057P1096m121l7187
41032I98721J7547K5820o9488j23922j9783J37768J69597O4067m1349n3823l187
$$ plain form
41021 1101968 1138906 1167928 1155248 1113058 1082429 1074238 1049693 984141 918797 908443 943235
41010 943235 964969 932955 827878 630703 371008 169361 138367 235737 298947 244178 152584
40999 152584 130714 166092 176465 140721 107529 102102 93261 51664 -10960 -72347 -134334 -206462
40987 -206462 -269022 -273468 -190294 -54493 52468 78811 50648 32098 55309 110185 175519
40976 175519 217876 182615 51748 -89135 -113392 -6851 103096 105555 34984 -2459 23368
40965 23368 54703 45042 3474 -42545 -71179 -65462 -38942 -45478 -109976 -168707 -143612 -62928
40953 -62928 -31725 -81592 -131218 -113175 -56658 -9293 42431 116958 166414 134077 44670 -29038
40941 -29038 -61681 -74748 -65778 -8476 83401 154882 176460 164729 138077 96638 42931 -19029
$$ packed form
41021A101968L6938K9022j2680m2190l0629q191k4545o5552o5344j0354L4792
41010I43235K1734l2014j05077j97175k59695k01647l0994R7370O3210n4769r1594
40999A52584k1870L5378J0373l5744l3192n427q841m1597o2624o1387o1987p2128
40987b06462o2560m446Q3174J35801J06961K6343k8163j8550K3211N4876O5334
40976A75519M2357l5261j30867j40883k4257J06541J09947K459p0571l7443K5827
40965B3368L1335r661m1568m6019k8634N717K6520o536o4498n8731K5095Q0684
40953f2928L1203m9867m9626J8043N6517M7365N1724P4527M9456l2337q9407p3708
40941b9038l2643j3067Q970N7302R1877P1481K1578j1731k6652m1439n3707o1960
$$ plain form
40929 -19029 -94244 -162269 -156170 -42387 93358 120350 23219 -93548 -162636 -214086 -258931
40918 -258931 -233764 -124965 -40545 -64309 -120802 -90672 5960 59570 55235 72567 121707
40907 121707 117482 30650 -58841 -90604 -95956 -102486 -71852 10950 75630 58396 -13225 -81418
40895 -81418 -133758 -164243 -135687 -49031 19906 26467 30240 78406 88861 -37668 -239083 -351570
40883 -351570 -325493 -258708 -222498 -183351 -113744 -52735 -13044 58677 168336 219596 147275
40872 147275 26463 -32132 -31397 -46223 -83977 -83627 -30796 16228 13469 -24685 -64561 -74437
40860 -74437 -17160 106243 207222 184438 65592 -2191 62399 168460 179574 86670 -9936
40849 -9936 -47158 -49820 -54245 -63299 -86200 -149100 -233969 -263631 -194340 -88825 -48297 -88780
$$ packed form
40929a9029p5215o8025O099J13783J35745K6992r7131j16767o9088n1450m4845
40918b58931K5167J08799Q4420k3764n6493L0130R6632N3610m335J7332M9140
40907A21707m225q6832q9491l1763n352o530L0634Q2802O4680j7234p1621o8193
40895h1418n2340l0485K8556Q6656O8937O561L773M8166J0455j26529k01415j12487
40883c51570K6077O6785L6210L9147O9607O1009L9691P1721J09659N1260p2321
40872A47275j20812n8595P35j4826l7754L50N2831M7024k759l8154l9876r876
40860g4437N7277J23403J00979k2784j18846o7783O4590J06061J1114r2904r6606
40849i936l7222k662m425r054k2901o2900q4869k9662O9291J05515M0528m0483
$$ plain form
40837 -88780 -130570 -105456 -32446 20171 16114 -18099 -24568 30603 119634 173463 157234 115810
40825 115810 116732 160551 192390 198474 229303 306110 366152 346072 272673 215679 185416 140868
40813 140868 77544 37658 36193 40593 30483 19971 11179 -14953 -43116 -18521 69338 146990
40801 146990 143438 82834 50021 86762 157603 199650 174832 93170 18478 31889 146839
40790 146839 266124 266302 135199 -5417 -31044 52432 129862 121385 69701 60703 87186 54031
40778 54031 -69132 -173496 -148460 -39815 17200 -7995 -24217 8708 21713 -9741 11116
40767 11116 138043 257470 253283 205809 268273 395851 382790 179363 -7369 7999 161668
40756 161668 286637 357710 455160 565431 580174 485461 413368 464403 571063 591772 483953
$$ packed form
40837h8780m1790K5114P3010N2617m057l4213o469N5171Q9031N3829j6229m1424
40825A15810R22M3819L1839O084L0829P6807O0042k0080p3399n6994l0263m4548
40813A40868o3324l9886j465M400j0110j0512q792k6132k8163K4595Q7859P7652
40801A46990l552o0604l2813L6741P0841M2047k4818q1662p4692J3411J14950
40790A46839J19285J78j31103j40616k5627Q3476P7430q477n1684q998K6483l3155
40778E4031j23163j04364K5036J08645N7015k5195j6222L2925J3005l1454K0857
40767A1116J26927J19427m187m7474O2464J27578j3061k03427j86732J5368J53669
40756A61668J24969P1073R7450J10271J4743r4713p2093N1035J06660K0709j07819
$$ plain form
40745 483953 331319 230413 197407 179748 128897 57070 30895 103371 245658 357029 354865
40734 354865 251432 135256 83800 104111 150971 181178 180399 152835 107010 53846 4261
40723 4261 -35368 -56390 -41887 10477 59611 47970 -25956 -90658 -81012 -11113 56172 84115
40711 84115 74871 39278 615 3659 63351 118513 94849 5135 -70964 -92514 -73822 -15123
40699 -15123 84892 149136 77367 -84448 -155700 -66147 35493 12282 -46820 14814 150229
40688 150229 182357 98850 67040 147217 195782 116541 25523 59888 170515 234666 258833
40677 258833 318707 376320 321916 168810 55938 52978 91270 105250 122550 173656 211147
40666 211147 175409 76415 -33481 -116896 -152234 -131081 -82096 -46329 -12205 60246 135599
$$ packed form
40745D83953j52634j00906l3006j7659n0851p1827k6175P2476J42287J11371k164
40734C54865j03433j16176n1456K0311M6860L0207p79k7564m5825n3164m9585
40723D261l9629k1022J4503N2364M9134j1641p3926o4702R646O9899O7285K7943
40711H4115r244l5593l8663L044N9692N5162k3664q9714p6099k1550J8692N8699
40699a5123J00015O4244p1769j61815p1252Q9553J01640k3211n9102O1634J35415
40688A50229L2128q3507l1810Q0177M8565p9241r1018L4365J10627O4151K4167
40677B58833N9874N7613n4404j53106j12872k960L8292J3980J7300N1106L7491
40666B11147l5738r8994j09896q3415l5338K1153M8985L5767L4124P2451P5353
$$ plain form
40655 135599 116601 6846 -40204 80239 257266 305193 214636 135149 137408 140112 89080
40644 89080 62224 129255 221021 231210 170418 121612 97553 47413 -25022 -57689 -41319 -33578
40632 -33578 -46629 -17137 73481 137822 107627 53868 93742 208490 248576 132563 -34593
40621 -34593 -81729 33068 191811 263276 237281 205206 234262 286296 265888 137609 -21480
40610 -21480 -95702 -50988 31361 43580 -35164 -121404 -119700 -21584 95133 158446 171395 178522
40598 178522 189895 179328 154248 172259 255945 331121 303846 186451 93267 104773 182611
40587 182611 235673 227603 189347 156654 133362 104899 59254 -182 -45091 -37926 23179 89069
40575 89069 111230 94901 77865 76352 86699 123094 203479 297420 337240 294955 209269 126583
$$ packed form
40655A35599j8998j09755m7050J20443J77027M7927r0557p9487K259K704n1032
40644H9080k6856O7031R1766J0189o0792m8806k4059n0140p2435l2667J6370P741
40632c3578j3051K9492R0618O4341l0195n3759L9874J14748M0086j16013j67156
40621c4593m7136J14797J58743P1465k5995l2075K9056N2034k0408j28279j59089
40610b1480p4222M4714Q2349J2219p8744q6240J704R8116J16717O3313J2949P127
40598A78522J1373j0567k5080J8011Q3686P5176k7275j17395r3184J1506P7838
40587A82611N3062q070l8256l2693k3292k8463m5645n9436m4909P165O1105O5890
40575H9069K2161j6329j7036j513J0347L6395Q0385R3941L9820m2285q5686q2686
$$ plain form
40563 126583 62194 35667 83753 193071 267944 228192 114114 33179 19411 13230 -24630
40552 -24630 -56874 -47241 -23740 -23159 -25206 7696 60818 89747 90940 98803 121904 128873 100273
40539 100273 59539 46933 84802 163937 241130 260797 210087 145698 132547 159385 150372 61973
40527 61973 -62683 -135416 -89286 85767 325805 510255 549425 471013 378547 319555 255113
40516 255113 174233 154418 249208 378625 414042 342212 266701 261486 300827 333116 345907
40505 345907 338648 297381 228230 167789 131453 92778 40760 16067 56178 135622 193483 197253
40493 197253 155449 95396 55048 66053 111831 129571 89110 42733 55008 108415 131314
40482 131314 104995 82785 100093 123359 107733 59962 18452 4908 20298 58734 98669
$$ packed form
40563A26583o4389k6527M8086J09318P4873l9752j14078q0935j3768o181l7860
40552b4630l2244R633K3501N81k047L2902N3122K8929J193P863K3101O969k8600
40539A00273m0734j2606L7869P9135P7193J9667n0710o4389j3151K6838r013q8399
40527F1973j24656p2733M6130J75053K40038J84450L9170p8412r2466n8992o4442
40516B55113q0880j9815R4790J29417L5417p1830p5511n215L9341L2289J2791
40505C45907p259m1267o9151o0441l6336l8675n2018k4693M0111P9444N7861L770
40493A97253m1804o0053m0348J1005M5778J7740m0461m6377J2275N3407K2899
40482A31314k6319k2210J7308K3266j5626m7771m1510j3544J5390L8436L9935
$$ plain form
40471 98669 106162 75767 46355 46243 45647 4742 -47258 -36789 44044 109064 91211 39113 49124
40458 49124 126824 183302 172373 159718 217189 306342 334993 300058 290744 345404 390008 356819
40446 356819 291402 276024 298765 285441 238557 246084 338541 428902 438257 407384 421137 477478
40434 477478 508054 493605 471726 441440 353455 214443 116177 117305 162451 170729 144267 121527
40422 121527 78013 -28720 -140493 -140697 -33250 30499 -41149 -137762 -94382 84272 249617
40411 249617 322212 362542 428363 479571 471411 450935 487974 563099 595274 553148 479606 424968
40399 424968 409608 439541 507034 580079 634671 692449 784795 886757 934329 908288 854600
40388 854600 816209 791026 767962 754898 745326 697140 581399 434612 334467 327361 388702
$$ packed form
40471I8669P493l0395k9412j12n96m0905n2000J0469Q0833O5020j7853n2098J0011
40458D9124P7700N6478j0929j2655N7471Q9153K8651l4935r314N4660M4604l3189
40446C56819o5417j5378K2741j3324m6884P527R2457R0361R355l0873J3753N6341
40434D77478L0576j4449k1879l0286q7985j39012r8266J128M5146Q278k6462k2740
40422A21527m3514j06733j11773k04J07447O3749p1648r6613M3380J78654J65345
40411B49617P2595M0330O5821N1208q160k0476L7039P5125L2175m2126p3542n4638
40399D24968j5360K9933O7493P3045N4592N7778R2346J01962M7572k6041n3688
40388H54600l8391k5183k3064j3064r572m8186j15741j46787j00145p106O1341
$$ plain form
40377 388702 447076 449994 420721 438971 539255 647652 668293 618478 603002 644117 628326
40366 628326 474219 274804 188081 232963 289493 282489 262956 291367 332287 315703 245531
40355 245531 187972 178126 190170 194626 201288 229868 263171 258008 204045 145387 121623 108021
40343 108021 59110 6783 47522 200200 341956 351363 271100 244607 313367 374576 349617
40332 349617 297935 319329 414767 501801 523125 486133 424652 369710 341040 331239 311369 274372
40320 274372 249859 255059 263144 248533 229461 227794 216604 155006 60080 469 21149 101898
40308 101898 181814 203959 154453 84917 79838 173581 309268 392784 366131 225022 17298
40297 17298 -151160 -174599 -66658 31103 22444 -16283 38823 163401 227757 204836 198932
$$ packed form
40377C88702N8374K918k9273J8250J00284J08397K0641m9815j5476M1115j5791
40366F28326j54107j99415q6723M4882N6530p004j9533K8411M0920j6584p0172
40355B45531n7559r846J2044M456O662K8580L3303n163n3963n8658k3764j3602
40343A08021m8911n2327M0739J52678J41756R407q0263k6493O8760O1209k4959
40332C49617n1682K1394R5438Q7034K1324l6992o1481n4942k8670r801j9870l6997
40320B74372k4513N200Q085j4611j9072j667j1190o1598r4926n9611K0680Q0749
40308A01898P9916K2145m9506o9536n079R3743J35687Q3516k6653j41109k07724
40297A7298j68458k3439J07941R7761q659l8727N5106J24578O4356k2921n904
$$ plain form
40286 198932 256562 286412 221437 144614 167960 263128 304025 238789 142539 114137 171499
40275 171499 240577 224503 105455 -14582 -19081 71808 127264 103253 115928 255425 419887
40264 419887 439817 311385 190501 176975 214066 206312 142535 79465 72636 144519 267288
40253 267288 361128 351722 237020 69097 -106728 -246155 -275738 -155438 33781 150813
40243 150813 155874 137988 170883 220977 222151 168785 104258 77678 130712 257838 360879
40232 360879 324859 169876 43709 27896 47745 27807 26192 119977 248848 295208 260845
40221 260845 236200 233386 188737 118373 122513 207335 240807 150277 50349 80894 195705 223129
40209 223129 107265 -14909 9669 169494 317475 338428 249954 153794 125227 159783 202888
$$ packed form
40286A98932N7630K9850o4975p6823K3346R5168M0897o5236r6250k8402N7362
40275A71499O9078j6074j19048j20037m499R0889N5456k4011J2675J39497J64462
40264D19887J9930j28432j20884j3526L7091p754o3777o3070o829P1883J22769
40253B67288R3840r406j14702j67923j75825j39427k9583J20300J89219J17032
40243A50813N061j7886L2895N0094J174n3366o4527k6580N3034J27126J03041
40232C60879l6020j54983j26167j5813J9849j9938j615R3785J28871M6360l4363
40221B60845k4645k814m4649p0364M140Q4822L3472r0530r9928L0545J14811K7424
40209B23129j15864j22174K4578J59825J47981K0953q8474r6160k8567L4556M3105
$$ plain form
40198 202888 204704 152754 81074 51603 94660 158060 154291 77112 21448 48105 82877 21497
40186 21497 -100999 -139511 -35699 105158 157841 121607 86711 120085 220826 331816 358553
40175 358553 237821 37470 -68409 13451 174581 232845 144153 18867 -38677 -22947
40165 -22947 27367 89142 145700 184596 220635 267058 281003 208146 94630 69808 175509
40154 175509 290463 290858 223293 230793 345516 457326 483412 465265 466849 469189 431750 396083
40142 396083 441920 559654 645083 630022 558093 512348 519546 556457 608281 674674 735902
40131 735902 755516 717997 642545 566616 533524 576510 680945 774011 792907 762008 761819 819376
40119 819376 876213 876422 834620 790448 748201 707489 711291 799942 936475 1039332 1081803 1099292
$$ packed form
40198B02888J816n1950p1680k9471M3057O3400l769p7179n5664K6657L4772o1380
40186B1497j22496l8512J03812J40857N2683l6234l4896L3374J00741J10990K6737
40175C58553j20732k00351j05879Q1860J61130N8264q8692j25286n7544J5730
40165b2947N0314O1775N6558L8896L6039M6423J3945p2857j13516k4822J05701
40154A75509J14954L95o7565P500J14723J11810K6086j8147J584K340l7439l5667
40142C96083M5837J17734Q5429j5061p1929m5745P198L6911N1824O6393O1228
40131G35902J9614l7519p5452p5929l3092M2986J04435R3066J8896l0899j89N7557
40119H19376N6837K09m1802m4172m2247m0712L802Q8651J36533J02857M2471J7489
$$ plain form
40107 1099292 1102275 1055440 962037 896727 910026 952998 948816 899100 862161 855386 842603 802969
40095 802969 749410 684573 601316 527466 502662 499600 440074 315553 219638 218303 258085 263018
40083 263018 254664 288427 321425 257723 112623 17458 42182 115417 154532 175614 219131
40072 219131 257656 255858 250724 281962 296564 221728 96507 25871 23459 11126 -27786 -17005
40060 -17005 62281 109146 55476 -17071 -364 71307 78765 5124 -42061 8735 105831 166629
40048 166629 177986 170367 156207 142400 159986 226010 298206 319766 298463 287375 285858 223777
40036 223777 77039 -55234 -51769 76190 200764 244804 255265 287509 302497 244760 160659
40025 160659 148390 215903 274435 263196 198228 105207 444 -51509 30200 211631 341633
$$ packed form
40107A099292K983m6835r3403o5310J3299M2972m182m9716l6939o775j2783l9634
40095H02969n3559o4837q3257p3850k4804l062n9526j24521r5915j335L9782M933
40083B63018q354L3763L2998o3702j45100r5165K4724P3235L9115K1082M3517
40072B19131L8525j798n134L1238J4602p4836j25221p0636k412j2333l8912J0781
40060a7005P9286M6865n3670p2547J6707P1671P458p3641m7185N0796R7096O0798
40048A66629J1357p619j4160j3807J7586O6024P2196K1560k1303j1088j517o2081
40036B23777j46738j32273L465J27959J24574M4040J0461L2244J4988n7737q4101
40025A60659j2269O7513N8532j1239o4968r3021j04763n1953Q1709J81431J30002
$$ plain form
40014 341633 337083 280525 266268 249374 155305 57560 95599 242993 312273 215459 85618
40003 85618 79355 164518 190467 102814 -6885 -41279 -3723 43672 67345 74483 65288 17194
39991 17194 -65640 -112361 -43995 114417 230496 215846 140308 133692 206211 253449 229233
39980 229233 205333 229890 235313 160744 81929 114071 229375 286242 236092 190410 247629
39969 247629 345823 355587 262864 176917 173264 206432 194780 131652 76145 72582 123015 215226
39957 215226 324736 392813 357317 226811 90172 32934 69506 164795 277396 357577 353426
39946 353426 268706 183266 164475 180788 154398 77481 15001 4781 22967 50394 104495
39935 104495 187073 258928 292835 307344 325600 340078 337280 320562 294367 264186 260192 311456
$$ packed form
40014C41633m550n6558j4257j6894r4069r7745L8039J47394O9280r6814j29841
40003H5618o263Q5163K5949q7653j09699l4394L7556M7395K3673P138r195m8094
39991A7194q2834m6721O8366J58412J16079j4650p5538o616P2519M7238k4216
39980B29233k3900K4557N423p4569p8815L2142J15304N6867n0150m5682N7219
39969B47629R8194R764r2723q5947l653L3168j1652o3128n5507l563N0433R2211
39957B15226J09510O8077l5496j30506j36639n7238L6572R5289J12601Q0181m151
39946C53426q4720q5440j8791J6313k6390p6917o2480j0220J8186K7427N4101
39935A04495Q2578P1855L3907J4509J8256J4478k798j6718k6195l0181l994N1264
$$ plain form
39923 311456 382802 393615 326039 263573 291303 403017 533302 628463 653921 594373 500146
39912 500146 480136 580699 705000 719653 620469 528139 530254 589632 613373 563346 484454
39901 484454 451140 494183 570832 616028 623071 637222 659055 615400 472672 326254 304877
39890 304877 410700 524278 557965 538150 534378 569809 620750 662785 694117 726419 755007
39879 755007 738997 643724 516823 467076 524179 576702 519318 412682 402052 505069 592329
39868 592329 583361 551642 599503 719471 829898 878244 855795 766720 643357 559997 578500
39857 578500 688885 825630 924809 957206 939996 930039 970670 1034366 1058457 1043624 1058709
39846 1058709 1128026 1181563 1161606 1120626 1149389 1242816 1304673 1273541 1185062 1104875 1047334
$$ packed form
39923C11456P1346J0813o7576o2466K7730J11714J30285R5161K5458n9548r4227
39912E00146k0010J00563J24301J4653r9184r2330K115N9378K3741n0027p8892
39901D84454l3314M3043P6649M5196P043J4151K1833m3655j42728j46418k1377
39890C04877J05823J13578L3687j9815l772L5431N0941M2035L1332L2302K8588
39879G55007j6010r5273j26901m9747N7103N2523n7384j06636j0630J03017Q7260
39868E92329q968l1719M7861J19968J10427M8346k2449q9075j23363q3360J8503
39857E78500J10385J36745R9179L2397j7210r957M0631O3696K4091j4833J5085
39846A058709O9317N3537j9957m0980K8763R3427O1857l1132q8479q0187n7541
$$ plain form
39835 1047334 981776 897057 835387 851425 937290 1008027 987090 894325 812473 775362 742903
39824 742903 691620 662745 687455 722500 711842 673766 671554 720412 775837 803682 816936 846970
39812 846970 914472 1024901 1158880 1267337 1306888 1287414 1267192 1297676 1383409 1493176 1599415
39801 1599415 1705597 1834747 1987712 2128107 2234137 2353337 2560645 2856263 3155183
39792 3155183 3401351 3648492 3997170 4492921 5127479 5906716 6866905 8043308 9475077
39783 9475077 11237332 13414601 16000797 18795982 21364841 23108153 23491712 22357534
39775 22357534 20072659 17329999 14741119 12575494 10820652 9393961 8251002 7350934
39767 7350934 6625856 6036763 5624640 5446893 5454313 5472752 5334638 5010771 4595426 4187832
$$ packed form
39835A047334o5558q4719o1670J6038Q5865P0737k0937r2765q1852l7111l2459
39824G42903n1283k8875K4710L5045j0658l8076k212M8858N5425K7845J3254L0034
39812H46970O7502J10429J33979J08457L9551j9474k0222L0484Q5733J09767J06239
39801A599415J06182J29150J52965J40395J06030J19200K07308K95618K98920
39792C155183K46168K47141L48678M95751O34558P79237R60189J176403J431769
39783I475077J762255K177269K586196K795185K568859J743312L83559j134178
39775B2357534k284875k742660k588880k165625j754842j426691j142959r00068
39767G350934p25078n89093m12123j77747P420J8439j38114l23867m15345m07594
$$ plain form
39757 4187832 3816984 3461680 3105926 2774625 2526805 2393230 2311332 2169272 1944594 1741141
39747 1741141 1639479 1582973 1496575 1445235 1540456 1727286 1822464 1769999 1701994 1713248 1735836
39736 1735836 1702610 1678639 1726363 1772711 1739643 1705598 1795330 1976293 2103084 2123594 2113626
39725 2113626 2132059 2161802 2187754 2229484 2290896 2356225 2433697 2535170 2623545 2648989 2629709
39714 2629709 2636526 2704593 2808364 2909184 2987340 3049882 3139125 3298989 3506637 3687658
39704 3687658 3822677 3969281 4151026 4316193 4449561 4623911 4885873 5196231 5536469
39695 5536469 5946397 6392758 6755735 7034605 7394820 7899249 8389519 8784695 9280167
39686 9280167 10040854 10912681 11709017 12590706 13836125 15384858 16975595 18644497 20714085
$$ packed form
39757D187832l70848l55304l55754l31301k47820j33575q1898j42060k24678k03453
39747A741141j01662n6506q6398n1340R5221J86830R5178n2465o8005J1254K2588
39736A735836l3226k3971M7724M6348l3068l4045Q9732J80963J26791K0510r968
39725B113626J8433K9743K5952M1730O1412O5329P7472J01473Q8375K5444j9280
39714B629709O817O8067J03771J00820P8156O2542Q9243J59864K07648J81021
39704C687658J35019J46604J81745J65167J33368J74350K61962L10358L40238
39695E536469M09928M46361L62977K78870L60215N04429M90270L95176M95472
39686I280167P60687Q71827P96336Q81689J245419J548733J590737J668902K069588
$$ plain form
39677 20714085 23335002 26397907 29871352 33887358 38548633 44035989 50886899 59815618
39669 59815618 71342091 86002024 104794633 128963577 159529179 197372401 242573417
39662 242573417 291365155 333355846 354571626 346469596 312685081 266110595 219431043
39655 219431043 178849991 145244183 118090774 96890802 80562927 67647099 57286520
39648 57286520 49231999 43041599 37988281 33677583 30145245 27318848 24835610 22427104
39640 22427104 20126335 18048531 16226210 14666942 13349664 12163450 11021708 9999339
39632 9999339 9203458 8579871 8005399 7480054 7052867 6652053 6184741 5730496 5437358
39623 5437358 5279111 5101448 4862650 4649762 4497075 4365457 4273422 4279158 4344086 4360012
$$ packed form
39677B0714085K620917L062905L473445M016006M661275N487356O850910Q928719
39669E9815618J1526473J4659933J8792609K4168944L0565602L7843222M5201016
39662B42573417M8791738M1990691K1215780q102030l3784515m6574486m6679552
39655B19431043m0581052l3605808k7153409k1199972j6327875j2915828j0360579
39648E7286520q054521o190400n053318m310698l532338k826397k483238k408506
39640B2427104k300769k077804j822321j559268j317278j186214j141742j022369
39632I999339p95881o23587n74472n25345m27187m00814m67312m54245k93138
39623E437358j58247j77663k38798k12888j52687j31618r2035N736O4928J5926
$$ plain form
39613 4360012 4300518 4224372 4160274 4108051 4111513 4206416 4339970 4457631 4608810 4846547 5106367
39602 5106367 5335085 5660154 6259606 7129713 8159302 9371552 10905231 12823151 15138404
39593 15138404 17918943 21036655 23804795 25219786 24748669 22728308 19938731 17005991
39585 17005991 14285763 12006057 10237391 8831182 7602140 6534823 5699281 5062287
39577 5062287 4527769 4086367 3772755 3526886 3246472 2950358 2751163 2669843 2600475 2473684
39567 2473684 2350722 2323707 2398659 2512707 2615823 2702950 2792876 2894909 2982641 2997908
39557 2997908 2895411 2683376 2413390 2140992 1903778 1719958 1590614 1506357 1452440 1400780
39547 1400780 1313088 1178066 1033457 920810 835499 761623 731831 786911 884349 923895 877163
$$ packed form
39613D360012n9494p6146o4098n2223L462R4903J33554J17661J51179K37737K59820
39602E106367K28718L25069N99452Q70107J029589J212250J533679J917920K315253
39593A5138404K780539L117712K768140J414991m71117k020361k789577k932740
39585A7005991k720228k279706j768666j406209j229042j067317q35542o36994
39577E062287n34518m41402l13612k45869k80414k96114j99195q1320o9368j26791
39567B473684j22962k7015P4952J14048J03116Q7127Q9926J02033Q7732J5267
39557B997908j02497k12035k69986k72398k37214j83820j29344q4257n3917n1660
39547A400780q7692j35022j44609j12647q5311p3876k9792N5080R7438L9546m6732
$$ plain form
39536 877163 819670 810330 810245 762797 697788 701523 806718 945653 1002495 910862 726807 595587
39524 595587 603378 676633 685636 624533 599279 645011 670416 610888 523497 476614 447559 398872
39512 398872 366711 395585 461224 533060 634847 762022 823797 770772 704424 739762 823272
39501 823272 823549 750886 725626 751641 703789 566286 504036 620960 798295 878224 884208
39490 884208 928118 992730 966833 856479 799618 860406 951436 1001549 1070135 1213465 1340055
39479 1340055 1316257 1166184 1049383 1052967 1114155 1154762 1177452 1186746 1121607 949391 757233
39468 757233 658234 647861 638955 604057 586991 593427 576803 539221 544587 604812 641885 599878
39456 599878 518722 459574 428964 415789 430512 461421 462628 437659 464953 578297 687366
$$ packed form
39536H77163n7493r340q5m7448o5009L735J05195J38935N6842r1633j84055j31220
39524E95587P791P3255R003o1103k5254M5732K5405n9528q7391m6883k9055m8687
39512C98872l2161K8874O5639P1836J01787J27175O1775n3025o6348L5338Q3510
39501H23272K77p2663k5260K6015m7852j37503o2250J16924J77335P9929N984
39490H84208M3910O4612k5897j10354n6861O0788R1030N0113O8586J43330J26590
39479A340055k3798j50073j16801L584O1188M0607K2690R294o5139j72216j92158
39468G57233r8999j0373q906l4898j7066O436j6624l7582N366O0225L7073m2007
39456E99878q1156n9148l0610j3175J4723L0909J207k4969K7294J13344J09069
$$ plain form
39445 687366 689277 604306 527348 496919 492582 512959 562349 594901 571995 555270 640838 804566
39433 804566 911919 894589 829299 821293 891137 1004973 1141817 1290889 1437577 1586813
39423 1586813 1757165 1933340 2078394 2210740 2400251 2653951 2882239 3044941 3271652
39414 3271652 3744739 4484565 5345374 6236160 7259306 8589688 10293651 12344547 14749937
39405 14749937 17493495 20272268 22404753 23180299 22370071 20360506 17793916 15150780
39397 15150780 12662529 10454328 8615007 7154734 6011265 5119878 4425252 3844066
39389 3844066 3298656 2799043 2425422 2209995 2085614 1963644 1813856 1653935 1508483
39380 1508483 1398537 1331018 1275867 1183624 1044999 912534 852004 884347 968290 1020657 972654
$$ packed form
39445F87366J911q4971p6958l0429m337K0377M9390L2552k2906j6725Q5568J63728
39433H04566J07353j7330o5290q006O9844J13836J36844J49072J46688J49236
39423A586813J70352J76175J45054J32346J89511K53700K28288J62702K26711
39414C271652M73087P39826Q60809Q90786J023146J330382J703963K050896K405390
39405A4749937K743558K778773K132485P75546q10228k009565k566590k643136
39397A5150780k488251k208201j839321j460273j143469q91387o94626n81186
39389C844066n45410m99613l73621k15427j24381j21970j49788j59921j45452
39380A508483j09946o7519n5151r2243j38625j32465o0530L2343Q3943N2367m8003
$$ plain form
39369 972654 841322 730084 719794 776783 810805 793834 756562 694434 571327 419119 334830
39358 334830 347733 374996 351766 324959 358838 415225 403731 313273 225177 214464 286634
39347 286634 388258 434221 352924 160547 -23748 -85916 -32086 41978 75823 86785 99672
39336 99672 98064 63148 15518 -10315 -11158 -13698 -38558 -77764 -100067 -71270 22203 158168
39324 158168 283714 340307 297195 176565 50453 112 60973 195541 315059 336381
39314 336381 240701 90874 -18741 -39422 12106 104797 227854 360295 451925 476229 471650
39303 471650 483866 492460 447774 361151 300151 303997 357425 434595 508872 532226 473113 368326
39291 368326 272494 175210 52141 -25052 47269 220735 310466 243051 161604 207290 313363
$$ packed form
39369I72654j31332j11238j0290N6989L4022j6971l7272o2128j23107j52208q4289
39358C34830J2903K7263k3230k6807L3879N6387j1494r0458q8096j0713P2170
39347B86634J01624M5963q1297j92377j84295o2168N3830P4064L3845J0962J2887
39336I9672j608l4916m7630k5833q43k540k4860l9206k2303K8797R3473J35965
39324A58168J25546N6593m3112j20630j26112n0341O0861J34568J19518K1322
39314C36381r5680j49827j09615k0681N1528R2691J23057J32441R1630K4304m579
39303D71650J2216Q594m4686q6623o1000L846N3428P7170P4277K3354n9113j04787
39291C68326r5832r7284j23069p7193P2321J73466Q9731o7415q1447M5686J06073
$$ plain form
39280 313363 324315 230344 156101 166189 204241 206697 174340 134188 110404 129074 186856 227527
39268 227527 211140 186448 227674 317556 364213 324367 243418 179413 148385 141025 139611 123131
39256 123131 98273 107551 165136 217277 217501 199414 210547 221167 182627 134082 149258 204355
39244 204355 208137 148714 97763 77104 45370 23723 97625 257127 366309 351963 306602
39233 306602 330897 382507 376754 349533 406752 562251 729619 845420 910080 928557 900555
39222 900555 867160 890743 977422 1072583 1136425 1174638 1192066 1168043 1094511 1002587 933643
39211 933643 906704 924272 984661 1066385 1111566 1056232 899971 737832 688618 773407 892748
39200 892748 949785 961782 1003752 1074625 1095599 1037077 965126 938932 934695 910569 886154 903125
$$ packed form
39280C13363J0952r3971p4243J0088L8052K456l2357m0152k3784J8670N7782M0671
39268B27527j6387k4692M1226Q9882M6657l9846q0949o4005l1028p360j414j6480
39256A23131k4858R278N7585N2141K24j8087J1133J0620l8540m8545J5176N5097
39244B04355L782n9423n0951k0659l1734k1647P3902J59502J09182j4346m5361
39233C06602K4295N1610n753k7221N7219J55499J67368J15801O4660J8477k8002
39222I00555l3395K3583Q6679R5161O3842L8213J7428k4023p3532r1924o8944
39211I33643k6939J7568O0389Q1724M5181n5334j56261j62139m9214Q4789J19341
39200H92748N7037J1997M1970P0873K0974n8522p1951k6194m237k4126k4415J6971
$$ plain form
39188 903125 944338 946735 883187 797037 756707 784764 824709 791838 682233 600875 625533
39177 625533 675233 608511 442118 349629 413727 507549 489225 397484 356675 383710 406934
39166 406934 405585 403907 375810 286589 202135 228089 351092 461415 522645 583779 618820
39155 618820 512876 261620 42067 -5184 46162 49246 8884 38918 154896 251594 274618
39144 274618 280911 305244 285866 179752 58355 10244 13567 -5037 -28830 24156 145063
39133 145063 218328 192266 160782 214004 298743 315902 282211 278723 286703 216596 95139 77054
39121 77054 228858 422184 501739 459623 382665 324990 306613 348264 421870 441113 381922
39110 381922 334545 353371 350355 250079 156283 212202 359845 411174 331293 274527 333196
$$ packed form
39188I03125M1213K397o3548q6150m0330K8057L9945l2871j09605q1358K4658
39177F25533M9700o6722j66393r2489O4098R3822j8324r1741m0809K7035K3224
39166D06934j349j678k8097q9221q4454K5954J23003J10323O1230O1134L5041
39155F18820j05944k51256k19553m7251N1346L084m0362L0034J15978R6698K3024
39144B74618O293K4333j9378j06114j21397m8111L323j8604k3793N2986J20907
39133A45063P3265k6062l1484N3222Q4739J7159l3691l488P980p0107j21457j8085
39121G7054J51804J93326P9555m2116p6958n7675j8377M1651P3606J9243n9191
39110C81922m7377J8826l016j00276r3796N5919J47643N1329p9881n6766N8669
$$ plain form
39099 333196 421047 441576 416998 393618 355036 299273 288733 349874 412946 411407 359122 287467
39087 287467 204089 155863 213766 331951 347298 209109 90196 155551 326527 411646 384822
39076 384822 371636 409286 395398 279865 156877 128148 185481 269570 356958 445138 515775
39065 515775 551546 550795 512753 447964 400363 408366 447782 466737 468967 500158 557929 586756
39053 586756 565840 530499 497811 444972 377324 342855 354117 366921 364003 382709 419608 389156
39041 389156 244717 79488 27843 102298 199858 239405 217353 152024 64736 17427 73695
39030 73695 187095 206779 54368 -155777 -240705 -164063 -54762 -20889 -29695 -2791 43176
39019 43176 24212 -67663 -124853 -49766 122097 255276 256392 163502 97654 136856 242005
$$ packed form
39099C33196Q7851K0529k4578k3380l8582n5763j0540O1141O3072j539n2285p1655
39087B87467q3378m8226N7903J18185J5347j38189j18913O5355J70976Q5119k6824
39076C84822j3186L7650j3888j15533j22988k8729N7333Q4089Q7388Q8180P0637
39065E15775L5771p51l8042o4789m7601Q003L9416J8955K230L1191N7771K8827
39053E86756k0916l5341l2688n2839o7648l4469J1262J2804k918J8706L6899l0452
39041C89156j44439j65229n1645P4455R7560L9547k2052o5329q7288m7309N6268
39030G3695J13400J9684j52411k10145q4928P6642J09301L3873q806K6904M5967
39019D3176j8964r1875n7190P5087J71863J33179J116r2890o5848L9202J05149
$$ plain form
39008 242005 306190 264906 139507 -14210 -150344 -216559 -167245 -50361 -19220 -162833
38998 -162833 -355042 -382493 -220420 -64401 -64453 -149973 -176751 -134371 -114512 -153696 -209092
38987 -209092 -239717 -222219 -129618 20310 134674 144974 98553 74859 63359 16329 -33889
38976 -33889 -26726 355 -33247 -97277 -88757 -10705 32285 18402 34357 95650 102158 21898
38964 21898 -37919 -16561 -8125 -86773 -155395 -88324 75622 201493 237747 216434 153000
38953 153000 63831 18190 57081 117246 139983 180765 288119 358165 276368 148723 196555
38942 196555 424425 582397 497734 279995 139283 148957 263875 439868 630563 756917
38932 756917 782932 768920 777871 782249 724933 614771 497775 386989 285862 233256 258101
$$ packed form
39008B42005O4185m1284j25399j53717j36134o6215M9314J16884L1141j43613
38998a62833j92209k7451J62073J56019n2q5520k6778M2380J9859l9184n5396
38987b09092l0625J7498R2601J49928J14364J0300m6421k3694j1500m7030n0218
38976c3889P163K7081l3602o4030Q520P8052M2990j3883J5955O1293O508q0260
38964B1898n9817K1358Q436p8648o8622O7071J63946J25871L6254k1313o3434
38953A53000q9169m5641L8891O0165K2737M0782J07354P0046q1797j27645M7832
38942A96555K27870J57972q4663k17739j40712R674J14918J75993J90695J26354
38932G56917K6015j4012Q951M378n7316j10162j16996j10786j01127n2606K4845
$$ plain form
38921 258101 323453 369629 378198 351348 279330 181223 123860 136638 157092 128962 102306 153531
38909 153531 250296 292570 260348 219268 193152 138346 51595 -2370 128 -2249 -50205 -95496
38897 -95496 -88945 -66670 -86596 -130168 -130851 -65983 36754 154586 270234 334374 290439 144799
38885 144799 -25481 -139509 -164207 -112727 -29032 29138 29108 -5846 -23742 864 56842 124249
38873 124249 176319 167888 76626 -35343 -56213 46717 170214 185295 80234 -44674 -105643
38862 -105643 -109048 -96592 -69428 -349 100266 169757 155855 78241 9224 -8735 -9070 -49853
38850 -49853 -130490 -190053 -187271 -142829 -88730 -21989 55490 94461 57037 -6338 -12963 23153
38838 23153 2451 -97584 -156860 -66646 116089 243306 262126 241237 231145 192424 81535
$$ packed form
38921B58101O5352M6176Q569k6850p2018r8107n7363J2778K0454k8130k6656N1225
38909A53531R6765M2274l2222m1080k6116n4806q6751n3965K498k377m7956m5291
38897i5496O551K2275j9926m3572o83O4868J02737J17832J15648O4140m3935j45640
38885A44799j70280j14028k4698N1480Q3695N8170l0l4954j7896K4606N5978O7407
38873A24249N2070q431r1262j11969k0870J02930J23497J5081j05061j24908o0969
38862a05643l405J2456K7164O9079J00615O9491j3902p7614o9017j7959l35m0783
38850d9853q0637n9563K782M4442N4099O6741P7479L8971l7424o3375o625L6116
38838B3153k0702j00035n9276R0214J82735J27217J8820k0889j0092l8721j10889
$$ plain form
38827 81535 -65892 -174755 -208618 -179022 -114288 -47611 -5687 18955 61986 132550 189288
38816 189288 194208 166692 155172 171132 180885 156462 109173 70106 53065 45178 34572 41978
38804 41978 104077 207711 264427 196861 50060 -35490 15354 119061 132628 18323 -123365
38793 -123365 -168076 -87965 28947 59473 -41317 -192450 -267867 -230708 -159818 -138026 -159677
38782 -159677 -169346 -140253 -74503 29150 155026 249613 273453 250626 222911 187955 133538
38771 133538 90898 82823 56359 -41357 -142847 -124359 5160 90273 36532 -68146 -88325
38760 -88325 -7479 102784 198377 264787 263753 175508 70746 54939 141236 239620 269970
38749 269970 231708 162938 86160 9498 -55263 -94176 -97267 -62176 280 75757 167076 278563
$$ packed form
38827H1535j47427j08863l3863K9596O4734O6677M1924K4642M3031P0564N6738
38816A89288M920k7516j1520J5960R753k4423m7289l9067j7041p887j0606P406
38804D1978O2099J03634N6716o7566j46801q5550N0844J03707J3567j14305j41688
38793a23365m4711Q0111J16912L0526j00790j51133p5417L7159P0890K1792k1651
38782a59677r669K9093O5750J03653J25876R4587K3840k2827k7715l4956n4417
38771A33538m2640q075k6464r7716j01490J8488J29519Q5113n3741j04678k0179
38760h8325Q0846J10263R5593O6410j034q8245j04762j5807Q6297R8384L0350
38749B69970l8262o8770p6778p6662o4761l8913l091L5091O2456P5477R1319J11487
$$ plain form
38737 278563 370838 376197 288102 189759 151296 143586 109593 75104 106075 178078 180968 64013
38725 64013 -98269 -203225 -220126 -177256 -115486 -83359 -118706 -194496 -225592 -167098 -72063
38714 -72063 -18720 -14104 -7799 23614 46180 15579 -68079 -146854 -142562 -32490 104094 148606
38702 148606 71630 -30430 -46313 34328 137537 197629 194393 129795 23116 -74593 -106482
38691 -106482 -63483 8509 57547 65002 40826 5098 -18276 -8936 30542 64085 47787 -18501
38679 -18501 -73065 -54540 13100 39537 -4314 -32145 26082 89775 27031 -129620 -195174
38668 -195174 -91335 33111 16835 -88639 -121246 -59262 -30797 -101233 -187480 -196052 -133767
38657 -133767 -53476 14401 41194 -2882 -85634 -118431 -71255 -17827 -17861 -20333 49998 161147
$$ packed form
38737B78563R2275N359q8095r8343l8463p710l3993l4489L0971P2003K890j16955
38725F4013j62282j04956j6901M2870O1770L2127l5347p5790l1096N8494R5035
38714g2063N3343M616O305L1413K2566l0601q3658p8775M292J10072J36584M4512
38702A48606p6976j02060j5883Q0641J03209O0092l236o4598j06679r7709l1889
38691a06482M2999P1992M9038P455k4176l5728k3374R340L9478L3543j6298o6288
38679a8501n4564J8525O7640K6437m3851k7831N8227O3693o2744j56651o5554
38668a95174J03839J24446j6276j05474l2607O1984K8465p0436q6247q572O2285
38657a33767Q0291O7877K6793m4076q2752l2797M7176N3428l4k472P0331J11149
$$ plain form
38645 161147 207665 150743 52589 -18297 -49905 -54380 -35589 -6507 6292 -4297 -20103 -37199
38633 -37199 -75899 -133291 -161780 -125250 -50700 10716 52933 100894 140300 122803 54911 18610
38621 18610 61747 120599 114289 74059 88743 140162 109133 -26071 -113985 -29465 140376
38610 140376 214016 160902 110032 141115 195254 203707 185486 174675 149107 91438 47694 60415
38598 60415 96460 101543 83693 83368 95940 86532 61021 61968 98554 128701 115585 70645 37296
38585 37296 50180 105151 155415 149632 88919 32647 34871 90643 155126 194643 207159 215208
38573 215208 251700 331910 430497 506601 549313 566047 534368 419667 245511 84949 -32147
38562 -32147 -135984 -222337 -226178 -135735 -50112 -52119 -89300 -62083 22739 74426 55413 7315
$$ packed form
38645A61147M6518n6922r8154p0886l1608m475J8791K9082J2799j0589j5806j7096
38633c7199l8700n7392k8489L6530P4550O1416M2217M7961L9406j7497o7892l6301
38621A8610M3137N8852o310m0230J4684N1419l1029j35204q7914Q4520J69841
38610A40376P3640n3114n0870L1083N4139Q453j8221j0811k5568n7669m3744J2721
38598F0415L6045N083j7850l25J2572r408k5511R47L6586L0147j3116m4940l3349
38585C7296J2884N4971N0264n783o0713n6272K224N5772O4483L9517J2516Q049
38573B15208L6492Q0210R8587P6104M2712J6734l1679j14701j74156j60562j17096
38562c2147j03837q6353l841R0443Q5623k007l7181K7217Q4822N1687j9013m8098
$$ plain form
38550 7315 -32902 -55988 -39930 26940 94033 101279 73834 84385 134260 161343 158654 184797
38538 184797 247734 280444 258147 241250 259316 244093 141767 21066 -8769 48644 78131
38527 78131 3850 -108598 -116816 42094 272836 421303 456919 510354 698618 970914 1190883
38516 1190883 1310189 1360118 1319992 1135421 864240 660498 582562 545055 494644 490336 547744
38505 547744 552073 431365 295935 280862 343147 349162 292771 283171 355252 429622 448777 433738
38493 433738 405784 354891 290649 237071 176779 81502 -8377 -20581 34545 70105 43108
38482 43108 -14515 -83519 -180568 -278966 -302126 -234969 -166827 -177792 -235542 -245334 -164848 -39966
38470 -39966 45780 42046 -22931 -64636 -32231 39696 96283 135202 155414 87974 -110854 -316980
$$ packed form
38550G315m0217k3086J6058O6870O7093P246k7445J0551M9875K7083k689K6143
38538A84797O2937L2710k2297j6897J8066j5223j02326j20701k9835N7413K9487
38527G8131p4281j12448q218J58910K30742J48467L5616N3435J88264K72296K19969
38516A190883J19306M9929m0126j84571k71181k03742p7936l7507n0411m308N7408
38505E47744M329j20708j35430j5073O2285O015n6391r600P2081P4370J9155j5039
38493D33738k7954n0893o4242n3578o0292r5277q9879j2204N5126L5560k6997
38482D3108n7623o9004r7049r8398k3160O7157O8142j0965n7750r792Q0486J24882
38470c9966Q5746l734o4977m1705L2405P1927N6587L8919K0212o7440j98828k06126
$$ plain form
38458 -316980 -324520 -108009 117203 152996 38577 -55204 -58042 -27269 -5191 29087 69486
38447 69486 45904 -82104 -244420 -317834 -258515 -154435 -133693 -224752 -328255 -336115 -246980
38436 -246980 -136139 -49138 19066 65566 74279 64406 70622 71067 11709 -85688 -123595 -65476
38424 -65476 6104 6879 -47359 -101790 -151649 -208352 -236051 -192953 -100310 -12566 50804 97008
38412 97008 118810 108481 79466 33215 -55479 -177014 -257422 -244699 -185047 -157051 -165462 -156784
38400 -156784 -107451 -40174 17399 38375 -3501 -84927 -123045 -74415 -3223 14847 9667 53120
38388 53120 118143 105751 2239 -89423 -84123 -1601 85566 116565 55339 -79839 -192666
38377 -192666 -193874 -120376 -92348 -144692 -190076 -166023 -118712 -99597 -72961 9428 113633
$$ packed form
38458c16980p540K16511K25212L5793j14419r3781k838L0773K2078L4278M0399
38447F9486k3582j28008j62316p3414N9319J04080K0742r1059j03503p860Q9135
38436b46980J10841Q7001O8204M6500Q713r873O216M45n9358r7397l7907N8119
38424f5476P1580P75n4238n4431m9859n6703k7699M3098R2643Q7744O3370M6204
38412I7008K1802j0329k9015m6251q8694j21535q0408J2723N9652K7996q411Q678
38400a56784M9333O7277N7573K0976m1876q1426l8118M8630P1192J8070n180M3453
38388E3120O5023j2392j03512r1662N300Q2522Q7167L0999o1226j35178j12827
38377a92666j208P3498K8028n2344m5384K4053M7311J9115K6636Q2389J04205
$$ plain form
38366 113633 173356 182138 171411 141993 84833 35634 38719 73579 79953 49949 40008 85990
38354 85990 149695 164373 109875 31808 -5031 18294 53018 33461 -49952 -143999 -198728 -215635
38342 -215635 -223067 -229871 -220103 -180992 -127405 -101539 -132495 -179425 -148651 -15311 102280 67968
38330 67968 -80589 -160470 -83230 35547 57267 12611 25840 119622 203741 221163 198673
38319 198673 167528 138488 158569 286347 479231 596264 565615 483353 490036 601057 721455
38308 721455 791849 847209 936929 1046685 1115559 1098726 1003842 888210 823214 838841 898641
38297 898641 946085 970482 1000118 1035666 1037088 996514 979035 1044758 1153256 1201343 1157506
38286 1157506 1108663 1154456 1290296 1415501 1429551 1305008 1099897 923042 855131 871509
$$ packed form
38366A13633N9723Q782j0727k9418n7160m9199L085L4860O374l0004r941M5982
38354H5990O3705J4678n4498p8067l6839K3325L4724j9557q3413r4047n4729j6907
38342b15635p432o804R768L9111N3587K5866l0956m6930L0774J33340J17591l4312
38330F7968j48557p9881P7240J18777K1720m4656J3229R3782Q4119J7422k2490
38319A98673l1145k9040K0081J27778J92884J17033l0649q2262O683J11021J20398
38308G21455P0394N5360Q9720J09756O8874j6833r4884j15632o4996J5627N9800
38297H98641M7444K4397K9636L5548J422m0574j7479O5723J08498M8087m3837
38286A157506m8843M5793J35840J25205J4050j24543k05111j76855o7911J6378
$$ plain form
38276 871509 866346 780453 674828 643833 691653 745338 761094 753655 734315 688187 616666 544268
38264 544268 476926 405122 347193 327877 311926 233112 106223 33127 64324 127447 138900
38253 138900 117833 127974 162758 162399 111308 47494 -6276 -57805 -103140 -125970 -135817 -159157
38241 -159157 -193758 -212125 -208438 -205386 -213744 -214907 -185072 -118699 -35486 22920 23242 -14174 -25006
38228 -25006 22981 92029 135950 164149 211698 278973 336049 354666 306166 176462 26457
38217 26457 -19959 84900 232576 292138 275578 276009 285058 201969 23709 -106731 -84920
38206 -84920 24247 93005 85286 48937 24332 24004 52021 85082 72414 2872 -62439 -65013
38194 -65013 -19820 25142 57419 86441 104509 109150 125859 161661 178468 164945 183483 269791
$$ packed form
38276H71509n163q5893j05625l0995M7820N3685J5756p439j9340m6128p1521p2398
38264E44268o7342p1804n7929j9316j5951p8814j26889p3096L1197O3123J1453
38253A38900k1067J0141L4784l59n1091o3814n3770n1529m5335k2830r847k3340
38241a59157l4601j8367L687L052q358j163K9835O6373Q3213N8406L22l7416j0832
38228b5006M7987O9048M3921K8199M7549O7275N7076J8617m8500j29704j50005
38217B6457m6416J04859J47676N9562j6560M31R049q3089j78260j30440K1811
38206h4920J09167O8758p719l6349k4605l28K8017L3061j2668o9542o5311k574
38194f5013M5193M4962L2277K9022J8068M641J6709L5802J6807j3523J8538Q6308
$$ plain form
38182 269791 329266 237246 32579 -97961 -52694 64640 103640 57940 22284 25687 11904
38171 11904 -33827 -44065 20617 101102 122922 91600 54998 19826 -29911 -65901 -46236 -2759
38159 -2759 -16210 -94650 -156820 -160898 -164576 -206267 -206438 -71613 150216 308366 325398 256831
38147 256831 186583 141145 111407 88720 61565 26396 10857 43141 100377 134155 139182 144952
38135 144952 154917 159244 191609 289306 399557 417359 328541 226197 173811 154919 177322
38124 177322 296815 475838 544034 402828 180943 78772 128279 218125 291394 379239
38114 379239 465888 466758 365838 263714 245249 275232 267330 203161 142950 145720 204330 252697
38102 252697 240907 207575 243167 358753 442468 395403 259933 145755 79508 20912 -12162
$$ packed form
38182B69791N9475r2020k04667j30540M5267J17334L9000m5700l5656L403j3783
38171A1904m5731j0238O4682Q0485K1820l1322l6602l5172m9737l5990J9665M3477
38159b759j3451p8440o2170m078l678m1691j71J34825K21829J58150J7032o8567
38147B56831p0248m5438k9738k2687k7155l5169j5539L2284N7236L3778N027N770
38135A44952R965M327L2365R7697J10251J7802q8818j02344n2386j8892K2403
38124A77322J19493J79023O8196j41206k21885j02171M9507Q9846P3269Q7845
38114C79239Q6649Q70j00920j02124j8465K9983p902o4169o0211K770N8610M8367
38102B52697j1790l3332L5592J15586Q3715m7065j35470j14178o6247n8596l3074
$$ plain form
38091 -12162 40494 141249 157552 45161 -73703 -70363 32769 122595 143499 118022 72401
38080 72401 15078 -37495 -74757 -115902 -171749 -200611 -154062 -58725 1528 -3385 -1735 83742
38068 83742 213185 251679 131960 -44996 -125311 -101361 -112424 -222554 -299234 -202189 -18097
38057 -18097 29155 -118199 -282030 -301943 -215083 -124774 -32179 88923 158590 85175 -56904
38046 -56904 -100144 -30805 -14749 -141657 -279797 -265004 -130800 -41093 -56220 -91614 -91345
38035 -91345 -109462 -179930 -218660 -141219 -9581 42290 -1040 -30600 -451 -5027 -120030
38024 -120030 -261916 -289776 -191048 -80198 -46054 -84062 -159978 -251810 -322430 -324735 -254821
38013 -254821 -154881 -62282 -935 -6192 -88250 -175083 -170323 -79537 -5812 -6472 -33097 -35682
$$ packed form
38091a2162N2656J00755J6303j12391j18864L340J03132Q9826K0904k5477m5621
38080G2401n7323n2573l7262m1145n5847k8862M6549R5337O0253m913J650Q5477
38068H3742J29443L8494j19719j76956q0315K3950j1063j10130p6680R7045J84092
38057a8097M7252j47354j63831j9913Q6860R0309R2595J21102O9667p3415j42079
38046e6904m3240O9339J6056j26908j38140J4793J34204Q9707j5127l5394K69
38035i1345j8117p0468l8730P7441J31638N1871m3330k9560L0149m576j15003
38024a20030j41886k7860R8728J10850L4144l8008p5916r1832p0620k305O9914
38013b54821R9940R2599O1347n257q2058q6833M760R0786P3725o60k6625k585
$$ plain form
38001 -35682 -40152 -79482 -124572 -138926 -139437 -145676 -125030 -51698 25283 40162 5965 -10710
37989 -10710 9551 20340 -16286 -79527 -111750 -69684 32237 118483 121348 64283 36837 75442
37977 75442 122504 122242 91898 65285 35075 -738 858 63876 142941 187011 194043 155469
37965 155469 30045 -151327 -239546 -134796 57449 149984 107912 42536 11688 -35054 -117714
37954 -117714 -167046 -131560 -42762 49856 125637 164758 157238 144162 166006 175311 94748 -49542
37942 -49542 -163926 -243083 -349743 -437306 -368828 -166335 -63140 -198291 -401970 -420019
37932 -420019 -243340 -67697 -7015 -6611 -735 1362 -9264 -5382 14719 19683 12657 28365
37920 28365 53908 28137 -64708 -164930 -215594 -215980 -186447 -133489 -65782 -4041 36913 47119
$$ packed form
38001c5682m470l9330m5090j4354n11o239K0646P3332P6981J4879l4197j6675
37989a0710K0261J0789l6626o3241l2223M2066J01921Q6246K865n7065k7446L8605
37977G5442M7062k62l0344k6613l0210l5813J596O3018P9065M4070P032l8574
37965A55469j25424j81372q8219J04750J92245R2535m2072o5376l0848m6742q2660
37954a17714m9332L5486Q8798R2618P5781L9121p520j3076K1844R305q0563j44290
37942d9542j14384p9157j06660q7563O8478K02493J03195j35151k03679j8049
37932d20019J76679J75643O0682M04N876K097j0626L882K0101M964p026J5708
37920B8365K5543k5771r2845j00222n0664l86K9533N2958O7707O1741M0954J0206
$$ plain form
37908 47119 8561 -78653 -164875 -189755 -152132 -105775 -93516 -120901 -176448 -229648 -226657 -149340
37896 -149340 -72440 -97231 -222374 -340674 -373194 -345309 -314376 -288096 -249826 -212533 -201841
37885 -201841 -214246 -226400 -224455 -202521 -161279 -132243 -169057 -276819 -373105 -363352 -249919
37874 -249919 -130596 -87254 -108275 -131583 -133797 -145846 -188373 -229212 -227093 -196561 -193508 -237644
37862 -237644 -286231 -296066 -276594 -262292 -267564 -297547 -369049 -479056 -577873 -621723 -637310 -685790
37850 -685790 -771283 -835406 -843165 -828164 -846199 -922105 -1045245 -1180239 -1282627 -1345615 -1432219
37839 -1432219 -1615182 -1876425 -2103601 -2186918 -2081159 -1791346 -1373866 -960109 -691017 -581531
37829 -581531 -509013 -377848 -236210 -180205 -202292 -204821 -125499 19304 186506 330452 395139
$$ packed form
37908D7119l8558q7214q6222k4880L7623M6357J2259k7385n5547n3200K991P7317
37896a49340P6900k4791j25143j18300l2520K7885L0933K6280L8270L7293J0692
37885b01841j2405j2154J945K1934M1242K9036l6814j07762r6286R753J13433
37874b49919J19323M3342k1021k3308k214j2049m2527m0839K119L0532L053m4136
37862b37644m8587r835J9472J4302n272k9983p1502j10007r8817m3850j5587m8480
37850f85790q5493o4123p759J5001j8035p5906j23140j34994j02388o2988q6604
37839a432219j82963k61243k27176q3317J05759K89813M17480M13757K69092J09486
37829e81531P2518J31165J41638N6005k2087k529P9322J44803J67202J43946O4687
$$ plain form
37818 395139 356014 266075 198947 152984 76735 -17800 -49462 9181 84388 113530 132191
37807 132191 192554 252862 226575 117762 30799 40721 114792 179915 215974 248456 281609
37796 281609 283326 232818 152409 83113 43860 23195 2593 -21439 -37126 -32050 -2731 49631
37784 49631 124454 212373 281737 289774 219225 99296 -16855 -87782 -90693 -13693 128572
37773 128572 276079 355909 347094 290216 225083 149926 56654 -30988 -83679 -99609 -79981
37762 -79981 -10002 88080 124000 39204 -79897 -79854 57282 178259 155818 34008 -73096
37751 -73096 -138391 -193445 -213512 -145941 -27839 37143 24558 12640 42806 57147 19156
37740 19156 6549 108285 283418 401372 398397 328226 271042 252322 248874 222664 144525
$$ packed form
37818C95139l9125q9939o7128m5963p6249r4535l1662N8643P5207K9142J8661
37807A32191O0363O0308k6287j08813q6963R922P4071O5123L6059L2482L3153
37796B81609J717n0508q0409o9296l9253k0665k0602k4032j5687N076K9319N2362
37784D9631P4823Q7919O9364Q037p0549j19929j16151p0927k911P7000J42265
37773A28572J47507P9830q815n6878o5133p5157r3272q7642n2691j5930J9628
37762g9981O9979R8082L5920q4796j19101M3J37136J20977k2441j21810j07104
37751g3096o5295n5054k0067O7571J18102O4982j2585j1918L0166J4341l7991
37740A9156j2607J01736J75133J17954k975p0171n7184j8720l448k6210p8139
$$ plain form
37729 144525 27675 -59339 -55878 8800 39152 -11735 -93940 -139007 -134163 -90526 6479 155244
37717 155244 276968 269397 128490 -36275 -121843 -122758 -87359 -34348 44812 129372 166758
37706 166758 129767 48246 -19680 -31591 18055 97524 156728 164403 131638 92522 68754 63668
37694 63668 77053 104249 128452 136347 135495 134782 117907 66513 3655 -22032 1628 38520 60109
37681 60109 77691 108016 140433 152489 129394 61155 -39964 -108268 -64843 76999 191849
37670 191849 173968 56776 -45875 -87104 -115872 -172253 -218192 -188202 -72569 63233 126221
37659 126221 72146 -42184 -97234 -30646 95900 176828 181594 152696 119673 81897 58024
37648 58024 72160 87035 30755 -87248 -156903 -97084 51534 192407 275009 297925 270014
$$ packed form
37729A44525j16850q7014L461O4678L0352n0887q2205m5067M844M3637R7005J48765
37717A55244J21724p571j40907j64765q5568r15L5399N3011P9160Q4560L7386
37706A66758l6991q1521o7926j1911M9646P9469N9204P675l2765l9116k3768n086
37694F3668J3385K7196K4203P895q52p13j6875n1394o2858k5687K3660L6892K1589
37681F0109J7582L0325L2417J2056k3095o8239j01119o8304M3425J41842J14850
37670A91849j7881j17192j02651m1229k8768n6381m5939K9990J15633J35802O2988
37659A26221n4075j14330n5050O6588J26546Q0928M766k8898l3023l7776k3873
37648E8024J4136J4875n6280j18003o9655N9819J48618J40873Q2602K2916k7911
$$ plain form
37637 270014 217911 189840 205143 230441 237422 243147 259855 254564 202530 133251 75413 7128
37625 7128 -81277 -127065 -72591 35433 103127 117357 137939 187784 234722 262810 273643 232984
37613 232984 113030 -19716 -61789 -19249 10539 6661 45098 126308 129962 12609 -84100
37602 -84100 -27632 109689 167966 127395 89058 93441 98763 102382 144643 208633 246829 296118
37590 296118 428244 582815 599081 448548 295300 267869 299928 271197 185144 108904 39847
37579 39847 -48332 -98408 -34864 101032 192275 198835 172471 145368 107968 82001 105557 142556
37567 142556 112071 22355 -25165 10864 55492 50678 43661 85708 134544 131880 100746 81004
37555 81004 37543 -62039 -129692 -45983 144777 259786 224459 171684 232007 329958 294782
$$ packed form
37637B70014n2103k8071J5303K5298O981N725J6708n291n2034o9279n7838o8285
37625G128q8405m5788N4474J08024O7694J4230K0582M9845M6938K8088J0833m0659
37613B32984j19954j32746m2073M2540K9788l878L8437Q1210L654j17353r6709
37602h4100N6468J37321N8277m0571l8337M383N322L619M2261O3990L8196M9289
37590B96118J32126J54571J6266j50533j53248k7431L2059k8731q6053p6240o9057
37579C9847q8179n0076O3544J35896R1243O560k6364k7103l7400k5967K3556L6999
37567A42556l0485q9716m7520L6029M4628m814p017M2047M8836k664l1134j9742
37555H1004m3461r9582o7653Q3709J90760J15009l5327n2775O0323R7951l5176
$$ plain form
37544 294782 117022 -25437 5173 154142 276199 306541 278072 227905 161876 95457 62776
37533 62776 69573 75488 40426 -30452 -91939 -89601 9021 180146 334932 378758 294444 145355
37521 145355 -2219 -119177 -175160 -128924 793 108314 105729 23844 -46523 -80412 -117297
37510 -117297 -161999 -175761 -163392 -178978 -227141 -242793 -197730 -143733 -107990 -32498 114102
37499 114102 238136 226645 108505 16144 9697 34201 46552 82946 168270 241338 230264
37488 230264 158746 117663 144811 182772 165785 113033 103035 161689 217778 198891 138280 126768
37476 126768 171158 184496 137263 121892 202452 283774 231307 71383 -39303 -21280 59444
37465 59444 121165 151568 155365 129447 113768 159291 215942 167495 22848 -49912 49051 208575
$$ packed form
37544B94782j77760j42459L0610J48969J22057L0342k8469n0167o6029o6419l2681
37533F2776O797N915l5062p0878o1487K338R8622J71125J54786M3826q4314j49089
37521A45355j47574j16958n5983M6236J29717J07521k585q1885p0367l3889l6885
37510a17297m4702j3762J2369j5586m8163j5652M5063N3997L5743P5492J46600
37499A14102J24034j1491j18140r2361o447K4504J2351L6394Q5324P3068j1074
37488B30264p1518m1083K7148L7961j6987n2752r998N8654N6089j8887o0611j1512
37476A26768M4390J3338m7233j5371Q0560Q1322n2467j59924j10686J8023Q0724
37465E9444O1721L0403L797k5918j5679M5523N6651m8447j44647p2760R8963J59524
$$ plain form
37453 208575 285073 308332 379121 456520 415682 274162 187449 216073 254416 222343 183211
37442 183211 211479 265808 276871 269153 302262 351975 342039 263174 183149 154596 175718 231678
37430 231678 315649 404415 457145 452387 406738 354205 319181 305253 301327 302778 321987 360599
37418 360599 382839 355038 309048 314241 375717 420022 407941 396683 443370 507563 518700 496500
37406 496500 522274 611510 696396 731275 741196 762079 803720 879195 993813 1085459 1057475
37395 1057475 912150 779710 760289 801099 798231 760493 774989 839854 844182 728703 568191
37384 568191 455925 392358 347425 355044 450225 554059 534662 389214 264953 264096 315397
37373 315397 298147 218960 177517 201146 216135 175917 120902 92999 74739 43327 8393
$$ packed form
37453B08575P6498K3259P0789P7399m0838j41520q6713K8624L8343l2073l9132
37442A83211K8268N4329J1063p718L3109M9713r936p8865q0025k8553K1122N5960
37430B31678Q3971Q8766N2730m758m5649n2533l5024j3928l926J451J9209L8612
37418C60599K2240k7801m5990N193O1476M4305j2081j1258M6687O4193J1137k2200
37406D96500K5774Q9236Q4886L4879R921K0883M1641P5475J14618R1646k7984
37395A057475j45325j32440j9421M0810k868l7738J4496O4865M328j15479j60512
37384E68191j12266o3567m4933P619R5181J03834j9397j45448j24261q57N1301
37373C15397j7250p9187m1443K3629J4989m0218n5015k7903j8260l1412l4934
$$ plain form
37362 8393 -41449 -150117 -296863 -365653 -293571 -189295 -203529 -319177 -381701 -325659 -254867
37351 -254867 -280324 -384984 -486782 -543203 -545521 -492304 -426085 -424264 -492234 -531000 -473544
37340 -473544 -384865 -353882 -358987 -335788 -309128 -332410 -344583 -241769 -82191 -54215 -203327
37329 -203327 -347953 -342031 -277527 -308901 -390371 -345497 -146271 34666 53940 -44778 -126921
37318 -126921 -123453 -59273 -1872 -14577 -103795 -192573 -200580 -156440 -161232 -233621 -283413 -268349
37306 -268349 -272608 -361535 -449236 -409633 -260965 -134949 -98235 -110384 -137162 -189209 -243304
37295 -243304 -238918 -182589 -155961 -182215 -183858 -126547 -102323 -183542 -279114 -251904 -130593 -79427
37283 -79427 -168359 -290988 -327390 -283060 -228154 -189559 -162736 -166226 -215391 -272969 -280566 -227314
$$ packed form
37362H393m9842j08668j46746o8790P2082J04276j4234j15648o2524N6042P0792
37351b54867k5457j04660j01798n6421k318N3217O6219J821o7970l8766N7456
37340d73544Q8679L0983n105K3199K6660k3282j2173J02814J59578K7976j49112
37329b03327j44626N922O4504l1374q1470M4874J99226J80937J9274r8718q2143
37318a26921L468O4180N7401j2705q9218q8778q007M4140m792p2389m9792J5064
37306b68349m259q8927q7701L9603J48668J26016L6714j2149k6778n2047n4095
37295b43304M386N6329K6628k6254j643N7311K4224q1219r5572K7210J21311N1166
37283g9427q8932j22629l6402M4330N4906L8595K6823l490m9165n7578p597N3252
$$ plain form
37271 -227314 -157643 -127975 -170582 -266313 -334256 -293330 -165038 -69636 -81499 -136348 -132758
37260 -132758 -75613 -44697 -55748 -44918 12737 57975 40676 -13264 -57039 -83971 -97514
37249 -97514 -71359 12440 110704 143996 70333 -75214 -199706 -215068 -116095 580 31684
37238 31684 -17444 -56668 -46050 -38197 -69191 -87975 -43577 24230 47362 32270 27509 26187
37226 26187 -17198 -89689 -120048 -78613 -11306 32655 49524 50702 39170 28380 36602 51519
37214 51519 44093 21959 17435 15838 -40705 -152717 -227642 -190676 -90412 -42468 -88587 -159140
37202 -159140 -171242 -125234 -91480 -118489 -169470 -158483 -52220 78798 129048 68662 -37258
37191 -37258 -109889 -125434 -106478 -82032 -66280 -52698 -23758 16690 30780 -6755 -64002 -90526
$$ packed form
37271b27314O9671K9668m2607r5731o7943M0926J28292R5402j1863n4849L590
37260a32758N7145L0916j1051J0830N7655M5238j7299n3940m3775k6932j3543
37249i7514K6155Q3799R8264L3292p3663j45547j24492j5362R8973J16675L1104
37238C1684m9128l9224J0618P853l0994j8784M4398O7807K3132j5092m761j322
37226B6187m3385p2491l0359M1435O7307M3961J6869J178j1532j0790Q222J4917
37214E1519p426k2134m524j597n6543j12012p4925L6966J00264M7944m6119p0553
37202a59140j2102M6008L3754k7009n0981J0987J06263J31018N0250o0386j05920
37191c7258p2631j5545J8956K4446J5752J3582K8940M0448J4090l7535n7247k6524
$$ plain form
37179 -90526 -83876 -70249 -37806 43480 140483 172442 120991 52189 11312 -26070 -71234 -77334
37167 -77334 -27328 10407 -21321 -78386 -88194 -58892 -46691 -59927 -65039 -50583 -22641 23512
37155 23512 67547 50432 -33736 -87677 -38127 38935 21298 -74704 -128159 -103095 -75829 -80951
37143 -80951 -63336 -1446 45709 47103 42354 40949 -6646 -91498 -117876 -59115 -30573 -118777
37131 -118777 -232904 -231148 -120737 -17049 43529 123103 233137 288838 233859 119058 22905
37120 22905 -40144 -93841 -132203 -126774 -85689 -63645 -98025 -151529 -146465 -64739 18121 30401
37108 30401 5106 26747 96077 127579 88750 54331 86207 136610 122929 37766 -68665
37097 -68665 -161971 -226253 -243215 -220619 -195123 -164194 -77257 55163 121367 53982 -55487
$$ packed form
37179i0526O650J3627L2443Q1286R7003L1959n1451o8802m0877l7382m5164o100
37167g7334N0006L7735l1728n7065r808K9302J2201j3236n112J4456K7942M6153
37155B3512M4035j7115q4168n3941M9550P7062j7637r6002n3455K5064K7266n122
37143h0951J7615O1890M7155J394m749j405m7595q4852k6378N8761K8542q8204
37131a18777j14127J756J10411J03688O0578P9574J10034N5701n4979j14801r6153
37120B2905o3049n3697l8362N429M1085K2044l4380n3504N064Q1726Q2860J2280
37108C0401k5295K1641O9330L1502l8829l4419L1876N0403j3681q5163j06431
37097f8665r3306o4282j6962K2596K5496L0929Q6937J32420O6204o7385j09469
$$ plain form
37086 -55487 -79932 -31803 -10396 -30732 -29019 -263 6300 11982 84214 179219 156934 -4253
37074 -4253 -139211 -109989 16156 78253 28706 -51578 -87257 -79415 -70853 -94977 -142672 -157024
37062 -157024 -92216 12411 66846 48099 16791 -742 -62756 -201186 -338523 -378275 -321109
37051 -321109 -231270 -140074 -47309 24294 43301 13983 -40028 -104189 -146191 -112015 -6628
37040 -6628 68454 29899 -67707 -100797 -45522 -3955 -65390 -203645 -319304 -340885 -280035
37029 -280035 -213502 -204135 -226959 -204078 -125872 -75784 -95572 -103348 -25461 56504 6651 -147448
37017 -147448 -225569 -133636 22680 95538 64244 -3236 -67587 -120832 -131901 -78930 -18675
37006 -18675 -46459 -169497 -267050 -211227 -18747 144511 128000 -42261 -191826 -187512 -61948
$$ packed form
37086e5487k4445M8129K1407k0336J713K8756O563N682P2232R5005k2285j61187
37074d253j34958K9222J26145O2097m9547q0284l5679P842Q562k4124m7695j4352
37062a57024O4808J04627N4435j8747l1308j7533o2014j38430j37337l9752N7166
37051c21109Q9839R1196R2765P1603J9007k9318n4011o4161m2002L4176J05387
37040f628P5082l8555r7606l3090N5275M1567o1435j38255j15659k1581O0850
37029b80035O6533R367k2824K2881P8206N0088j9788p776P7887Q1965m9853j54099
37017a47448p8121R1933J56316P2858l1294o7480o4351n3245j1069N2971O0255
37006a8675k7784j23038r7553N5823J92480J63258j6511j70261j49565M314J25564
$$ plain form
36995 -61948 62748 119289 115835 59359 -61944 -223784 -356790 -402890 -344396 -191949 1926
36984 1926 130029 104816 -37719 -162813 -183144 -138667 -123431 -177780 -261495 -294631 -224981
36973 -224981 -93369 -16161 -50513 -103106 -51394 65568 85763 -40429 -175513 -197056 -157893
36962 -157893 -170410 -227555 -238240 -181353 -124080 -110847 -113494 -88378 -36733 -12969 -82750 -235146
36950 -235146 -337296 -257877 -59149 37990 -63053 -196723 -170905 -36080 8461 -100332
36940 -100332 -247053 -336401 -378769 -388460 -344244 -268615 -222128 -197824 -132227 -35779 5684
36929 5684 -18408 -14700 53822 99665 58331 -6326 -12330 20244 31857 22828 14967 -14052 -82948
36916 -82948 -152933 -187453 -208164 -233085 -224881 -164818 -110437 -107916 -111278 -63834 3188 31691
$$ packed form
36995f1948J24696N6541l454n6476j21303j61840j33006m6100N8494J52447J93875
36984A926J28103k5213j42535j25094k0331M4477J5236n4349q3715l3136O9650
36973b24981J31612P7208l4352n2593N1712J16962K0195j26192j35084k1543L9163
36962a57893j2517n7145j0685N6887N7273J3233k647K5116N1645K3764o9781j52396
36950b35146j02150P9419J98728R7139j01043j33670K5818J34825M4541j08793
36940a00332j46721q9348m2368r691M4216P5629M6487K4304O5597R6448M1463
36929E684k4092L708O8522M5843m1334o4657o004L2574J1613r029p861k9019o8896
36916h2948o9985l4520k0711k4921Q204O0063N4381K521l362M7444O7022K8503
$$ plain form
36904 31691 31744 31853 3642 -65298 -90661 -566 128205 168194 129585 113807 117781 46858 -84388
36891 -84388 -136180 -60639 20084 4410 -60822 -105590 -153483 -229762 -272792 -235374 -175970 -151409
36879 -151409 -111314 -6366 84277 58940 -37179 -79992 -59691 -70079 -128762 -149475 -101530
36868 -101530 -65826 -97292 -139743 -125026 -70776 -28149 -190 35864 74802 97103 100463 87505
36856 87505 58587 38606 66452 130822 160139 108128 13348 -53604 -65186 -34822 15213 49346
36844 49346 25295 -49684 -101030 -70562 6576 49294 27696 -31155 -103615 -175562 -207914 -167466
36832 -167466 -93516 -63729 -76722 -38964 91370 209061 179393 23215 -91344 -49455 81579
36821 81579 153423 117061 51537 37611 66279 83967 75714 66120 65405 57931 37684 16021 -12595
$$ packed form
36904C1691N3J09k8211o8940k5363R0095J28771L9989l8609j5778L974p0923j31246
36891h4388n1792P5541Q0723j5674o5232m4768m7893p6279m3030L7418N9404K4561
36879a51409M0095J04948R0643k5337r6119m2813K0301j0388n8683k0713M7945
36868a01530L5704l1466m2451J4717N4250M2627K7959L6054L8938K2301L360j2958
36856H7505k8918j9981K7846O4370K9317n2011r4780o6952j1582L0364N0035L4133
36844D9346k4051p4979n1346L0468P7138M2718k1598n8851p2460p1947l2352M0448
36832a67466P3950K9787j2993L7758J30334J17691k9668j56178j14559M1889J31034
36821H1579P1844l6362o5524j3926K8668J7688q253r594p15p474k0247k1663k8616
$$ plain form
36808 -12595 -78617 -190511 -299101 -334607 -279286 -187968 -129262 -112587 -85642 -9619 78679
36797 78679 105947 61917 21720 48179 106850 116645 59970 -6853 -39009 -40527 -15673 51044
36785 51044 140303 178820 118712 3569 -85534 -127194 -163565 -222593 -277398 -283383 -227521 -137040
36773 -137040 -56688 -18796 -23073 -42364 -49751 -37991 -19745 -20995 -63741 -134249 -182230 -183183
36761 -183183 -183971 -236388 -298506 -273899 -155239 -46785 -17107 -15612 16451 39858 -1083 -62984
36749 -62984 -64847 -17784 2889 -16991 -25489 387 43793 105888 182384 213038 159722 103936
36737 103936 141069 201986 134375 -37387 -111151 -8385 102381 65216 -50383 -111662 -137133
36726 -137133 -190424 -190841 -28499 203675 292259 191938 56480 -3307 -15409 597 85757
$$ packed form
36808a2595o6022j11894j08590l5506N5321R1318N8706J6675K6945P6023Q8298
36797G8679K7268m4030m0197K6459N8671R795n6675o6823l2156j518K4854O6717
36785E1044Q9259L8517o0108j15143q9103m1660l6371n9028n4805n985N5862R0481
36773a37040Q0352L7892m277j9291p387J1760J8246j250m2746p0508m7981r53
36761a83183p88n2417o2118K4607J18660J08454K9678J495L2063K3407m0941o1901
36749f2984j863M7063K0673j9880q498K5876M3406O2095P6496L0654n3316n5786
36737A03936L7133O0917o7611j71762p3764J02766J10766l7165j15599o1279k5471
36726a37133n3291m17J62342K32174Q8584j00321j35458n9787j2102J6006Q5160
$$ plain form
36715 85757 200865 207713 72304 -52637 -37138 51710 75819 18509 -50890 -110087 -166365
36704 -166365 -179564 -123343 -72006 -108133 -181770 -180598 -113197 -95341 -160343 -214098 -198993 -175587
36692 -175587 -191889 -183676 -82697 56730 126649 110803 79478 72489 66771 43400 10179 -41560
36680 -41560 -131619 -227282 -245099 -144894 16955 149923 209192 195555 123744 31753 -14189
36669 -14189 19000 75484 69089 179 -38041 11336 81333 63722 -44798 -125819 -71745 96028
36657 96028 253731 302127 250881 180812 140633 102308 24554 -67239 -103706 -70183 -33673
36646 -33673 -49993 -89426 -95227 -77698 -87972 -117665 -103041 -41851 -28224 -122884 -244092 -259063
36634 -259063 -163143 -93081 -148191 -261578 -292593 -209907 -120442 -116778 -159068 -149204 -82611 -56639
$$ packed form
36715H5757J15108O848j35409j24941J5499Q8848K4109n7310o9399n9197n6278
36704a66365j3199N6221N1337l6127p3637J172O7401J7856o5002n3755J5105K3406
36692a75587j6302Q213J00979J39427O9919j5846l1325o989n718k3371l3221n1739
36680d1560r0059r5663j7817J00205J61849J32968N9269j3637p1811r1991m5942
36669a4189L3189N6484o395o8910l8220M9377O9997j7611j08520q1021N4074J67773
36657I6028J57703M8396n1246p0069m0179l8325p7754r1793l6467L3523L6510
36646c3673j6320l9433n801J7529j0274k9693J4624O1190J3627r4660j21208j4971
36634b59063R5920P0062n5110j13387l1015Q2686Q9465L664m2290R864O6593K5972
$$ plain form
36622 -56639 -123447 -201194 -173221 -35356 107727 172685 168597 141239 102046 34164 -62483
36611 -62483 -153664 -188436 -137364 -32637 41367 29949 -28135 -55172 -38705 -28931 -41832 -35883
36599 -35883 5525 44526 65055 97476 128054 74606 -75115 -180694 -107359 82855 208562
36588 208562 207086 174845 178547 162305 80745 3226 8486 57910 60445 14271 -23 55013
36576 55013 126498 145655 98367 21541 -34726 -44248 -30168 -44010 -99571 -150263 -158356 -154459
36564 -154459 -183413 -217238 -183607 -76446 24570 61573 74286 137509 255236 351074 352431
36553 352431 262815 156327 110589 136354 167379 131860 38634 -23636 17862 139660 247760
36542 247760 270722 214028 133020 71439 29919 -13972 -62099 -79763 -33298 57112 118171
$$ packed form
36622e6639o6808p7747K7973J37865J43083O4958m088k7358l9193o7882r6647
36611f2483r1181l4772N1072J04727P4004j1418n8084k7037J6467R774j2901N949
36599c5883M1408L9001K0529L2421L0578n3448j49721j05579P3335J90214J25707
36588B08562j476l2241L702j6242q1560p7519N260M9424K535m6174j4294N5036
36576E5013P1485J9157m7288p6826n6267r522J4080j3842n5561n0692q093L897
36564a54459k8954l3825L3631J07161J01016L7003J2713O3223J17727R5838J357
36553C52431q9616j06488m5738K5765L1025l5519r3226o2270M1498J21798J08100
36542B47760K2962n6694q1008o1581m1520m3891m8127j7664M6465R0410O1059
$$ plain form
36531 118171 89033 -19104 -136251 -199785 -199362 -166238 -137987 -137164 -165603 -201321 -205620 -154034
36519 -154034 -70380 -17612 -39001 -112235 -175140 -190947 -168035 -120096 -42799 53754 122411
36508 122411 122921 72824 22293 -8480 -28866 -24578 42538 166619 271887 282127 194270 68581
36496 68581 -28196 -58799 -31001 2195 -7118 -31484 6219 108812 168681 113171 25783 31770
36484 31770 103998 99507 -20032 -135125 -162024 -166044 -216033 -250585 -196140 -121736 -141528 -222719
36472 -222719 -234568 -158984 -101715 -94187 -42462 83454 154195 57027 -139787 -288573 -345055
36461 -345055 -357315 -342135 -279444 -194528 -150643 -171242 -232123 -305006 -353826 -332830 -258363
36450 -258363 -234214 -321489 -430676 -441779 -386033 -387305 -457379 -493754 -469216 -460699 -470261 -392211
$$ packed form
36531A18171k9138j08137j17147o3534M23L3124K8251Q23k8439l5718m299N1586
36519a54034Q3654N2768k1389p3234o2905j5807K2912M7939P7297R6553O8657
36508A22411N10n0097n0531l0773k0386M288O7116J24081J05268J0240q7857j25689
36496F8581r6777l0603K7798L3196r313k4366L7703J02593N9869n5510q7388N987
36484C1770P2228m491j19539j15093k6899m020m9989l4552N4445P4404j9792q1191
36472b22719j1849P5584N7269P528N1725J25916P0741r7168j96814j48786n6482
36461c45055j2260J5180O2691Q4916M3885k0599o0881p2883m8820K0996P4467
36450b58363K4149q7275j09187j1103N5746j272p0074l6375K4538Q517r562P8050
$$ plain form
36438 -392211 -218064 -102609 -128447 -164741 -92473 -23866 -121123 -307783 -372194 -300028 -278546
36427 -278546 -374858 -434862 -352249 -232639 -195388 -186740 -116483 -38989 -47251 -90236 -62053 -8860
36415 -8860 -72481 -247805 -365308 -337204 -271893 -291831 -365020 -393715 -368638 -339682 -305226
36404 -305226 -237058 -175498 -189652 -249113 -238277 -123297 -18510 -36785 -134779 -171036 -85906
36393 -85906 40470 99460 64184 -17851 -89148 -114263 -83590 -17043 50614 104590 152480
$$ packed form
36438c92211J74147J15455k5838l6294P2268O8607r7257j86660o4411P2166K1482
36427b78546r6312o0004Q2613J19610L7251Q648P0257P7494q262m2985K8183N3193
36415h860o3621j75324j17503K8104O5311j9938p3189k8695K5077K8956L4456
36404c05226O8168O1560j4154n9461J0836J14980J04787j8275r7994l6257Q5130
36393h5906J26376N8990l5276q2035p1297k5115L0673O6547O7657N3976M7890
$$ [...]
##END NTUPLES=NMR SPECTRUM
##END=
