##TITLE=31Pdec_LR-675-R2-C3
 , 24 sc
 6.6.2019
##JCAMPDX= 6.0         $$ Bruker NMR JCAMP-DX V2.0
##DATA TYPE= NMR SPECTRUM
##DATA CLASS= NTUPLES
##ORIGIN= UXNMR, Bruker Analytische Messtechnik GmbH
##OWNER= root
$$ XWIN-NMR		Version 3.5
$$ Thu Jun  6 14:40:01 2019 Russian Standard Time (UT+4h)  she@DPX200
##.OBSERVE FREQUENCY= 81.013821
##.OBSERVE NUCLEUS= ^31P
##.ACQUISITION MODE= SIMULTANEOUS
##.ACQUISITION SCHEME= undefined
##.AVERAGES= 24
##.DIGITISER RES= 17
##SPECTROMETER/DATA SYSTEM= spect
##.PULSE SEQUENCE= zgpg30
##.SOLVENT NAME= DMSO
##.SHIFT REFERENCE= (INTERNAL, DMSO, 0, 182.463)
##AUDIT TRAIL= $$ (NUMBER, WHEN, WHO, WHERE, WHAT)
$$ ##TITLE= Audit trail, XWIN-NMR		Version 3.5
$$ ##JCAMPDX= 5.01
$$ ##ORIGIN= Bruker BioSpin GmbH
$$ ##OWNER= she
$$ F:/spectra/data/she/nmr/P31/1/pdata/1/auditp.txt
$$ ##AUDIT TRAIL=  $$ (NUMBER, WHEN, WHO, WHERE, WHAT)
(   1,<2019-06-06 14:39:00.34 +0400>,<she>,<DPX200>,
      <created by zg, POWCHK disabled, PULCHK disabled
       configuration hash MD5:
       00 E9 B6 7A A2 85 ED C7 34 08 36 98 17 FE 4E 26
       data hash MD5: 32K
       2F 33 3F FE 21 DD FC 66 87 96 24 2A 94 30 03 66>)
(   2,<2019-06-06 14:39:04.59 +0400>,<she>,<DPX200>,
      <Start of raw data processing
       efp BC_mod = 2 LB = 1 FT_mod = 6 PKNL = 1 PHC0 = -2167.177 PHC1 = 47.39912 SI = 64K 
       data hash MD5: 64K
       FD A8 61 B3 87 F4 11 FC AC C6 D6 45 CB 0B D4 B0>)
(   3,<2019-06-06 14:39:21.87 +0400>,<she>,<DPX200>,
      <pk PHC0 = -6.998623 PHC1 = 6.200001 
       data hash MD5: 64K
       2A D8 7E 14 CF B5 75 53 EE 73 13 A8 38 5B E1 81>)
$$ ##END=
$$ 
$$ hash MD5
$$ D8 4E 85 0A 6C 25 63 4E 72 4C CC A0 F0 B7 3D 2C
##$RELAX= 
##$RELAX= 
##$RELAX= 
##$RELAX= 
##$RELAX= 
##$RELAX= 
##$RELAX= 
##$RELAX= 
$$ Bruker specific parameters
$$ --------------------------
##$DU= <F:/spectra>
##$EXPNO= 1
##$NAME= <P31>
##$PROCNO= 1
##$TYPE= <nmr>
##$USER= <she>
##$AMP= (0..31)
100 100 100 100 100 100 100 100 100 100 100 100 100 100 100 100 100 100 
100 100 100 100 100 100 100 100 100 100 100 100 100 100 
##$AQSEQ= 0
##$AQ_mod= 1
##$AUNM= <au_zg>
##$AUTOPOS= <>
##$BF1= 81.014009
##$BF2= 200.13
##$BF3= 200.13
##$BF4= 200.13
##$BF5= 200.13
##$BF6= 200.13
##$BF7= 200.13
##$BF8= 200.13
##$BYTORDA= 1
##$CFDGTYP= 0
##$CFRGTYP= 5
##$CHEMSTR= <none>
##$CNST= (0..31)
1 1 145 1 1 1 1 1 1 1 1 1 1 1 1 1 1 1 1 1 1 1 1 1 1 1 1 1 1 1 1 1 
##$CPDPRG= <waltz16>
##$CPDPRG1= <>
##$CPDPRG2= <waltz16>
##$CPDPRG3= <>
##$CPDPRG4= <mlev>
##$CPDPRG5= <mlev>
##$CPDPRG6= <mlev>
##$CPDPRG7= <mlev>
##$CPDPRG8= <mlev>
##$CPDPRGB= <>
##$CPDPRGT= <>
##$D= (0..31)
0 1 0 0 0 0 0 0 0 0 0 0.03 2e-05 3e-06 0 0 0 0 0 0 0 0 0 0 0 0 0 0 0 0 
0 0 
##$DATE= 1559817539
##$DBL= (0..7)
120 120 120 11 120 120 24 19 
##$DBP= (0..7)
150 150 150 150 150 150 150 150 
##$DBP07= 0
##$DBPNAM0= <>
##$DBPNAM1= <>
##$DBPNAM2= <>
##$DBPNAM3= <>
##$DBPNAM4= <>
##$DBPNAM5= <>
##$DBPNAM6= <>
##$DBPNAM7= <>
##$DBPOAL= (0..7)
0.5 0.5 0.5 0.5 0.5 0.5 0.5 0.5 
##$DBPOFFS= (0..7)
$$ [...]
##$SUBNAM2= <"">
##$SUBNAM3= <"">
##$SUBNAM4= <"">
##$SUBNAM5= <"">
##$SUBNAM6= <"">
##$SUBNAM7= <"">
##$SUBNAM8= <"">
##$SUBNAM9= <"">
##$SW= 369.568048894756
##$SWIBOX= (0..15)
0 1 3 0 0 0 0 0 0 0 0 0 0 0 0 0 
##$SW_h= 29940.119760479
##$TD= 32768
##$TD0= 1
##$TE= 0
##$TE2= 300
##$TE3= 300
##$TEG= 300
##$TL= (0..7)
0 120 53 12 22 120 120 120 
##$TP= (0..7)
150 150 150 150 150 150 150 150 
##$TP07= 0
##$TPNAME0= <>
##$TPNAME1= <>
##$TPNAME2= <>
##$TPNAME3= <>
##$TPNAME4= <>
##$TPNAME5= <>
##$TPNAME6= <>
##$TPNAME7= <>
##$TPOAL= (0..7)
0.5 0.5 0.5 0.5 0.5 0.5 0.5 0.5 
##$TPOFFS= (0..7)
0 0 0 0 0 0 0 0 
##$TUNHIN= 0
##$TUNHOUT= 0
##$TUNXOUT= 0
##$USERA1= <user>
##$USERA2= <user>
##$USERA3= <user>
##$USERA4= <user>
##$USERA5= <user>
##$V9= 5
##$VALIST= <valist>
##$VCLIST= <CCCCCCCCCCCCCCC>
##$VD= 0
##$VDLIST= <DDDDDDDDDDDDDDD>
##$VPLIST= <PPPPPPPPPPPPPPP>
##$VTLIST= <TTTTTTTTTTTTTTT>
##$WBST= 1024
##$WBSW= 4
##$XGAIN= (0..3)
0 0 0 0 
##$XL= 0
##$YL= 0
##$YMAX_a= 15303
##$YMIN_a= -6671
##$ZGOPTNS= <>
##$ZL1= 120
##$ZL2= 120
##$ZL3= 120
##$ZL4= 120
##$ABSF1= 0
##$ABSF2= 0
##$ABSG= 0
##$ABSL= 0
##$ALPHA= 0
##$AQORDER= 0
##$ASSFAC= 0
##$ASSFACI= 0
##$ASSFACX= 0
##$ASSWID= 0
##$AUNMP= <proc_1d>
##$AZFE= 0.1
##$AZFW= 0.5
##$BCFW= 0
##$BC_mod= 2
##$BYTORDP= 0
##$COROFFS= 0
##$CY= -3
##$DATMOD= 1
##$DC= 0
##$DFILT= <>
##$DTYPP= 0
##$F1P= 0
##$F2P= 0
##$FCOR= 1
##$FTSIZE= 65536
##$FT_mod= 6
##$GAMMA= 0
##$GB= 0
##$INTBC= 1
##$INTSCL= 5.30512e-09
##$ISEN= 30
##$LB= 1
##$LEV0= 0
##$LPBIN= 0
##$MAXI= 10000
##$MC2= 0
##$MEAN= 0
##$ME_mod= 0
##$MI= 50
##$NCOEF= 0
##$NC_proc= -7
##$NLEV= 6
##$NOISF1= 182.463
##$NOISF2= 159.3651
##$NSP= 0
##$NTH_PI= 0
##$NZP= 0
##$OFFSET= 182.463
##$PC= 4
##$PHC0= -2174.176
##$PHC1= 53.59912
##$PH_mod= 1
##$PKNL= yes
##$PPARMOD= 0
##$PSCAL= 0
##$PSIGN= 0
##$REVERSE= no
##$SF= 81.0140089999434
##$SI= 65536
##$SIGF1= 159.3651
##$SIGF2= -187.1042
##$SINO= 113.3802
##$SIOLD= 16384
##$SREGLST= <1H.CDCl3>
##$SSB= 0
##$STSI= 65536
##$STSR= 0
##$SW_p= 29940.119760479
##$SYMM= 0
##$S_DEV= 0
##$TDeff= 32768
##$TDoff= 0
##$TI= <>
##$TILT= no
##$TM1= 0
##$TM2= 0
##$TOPLEV= 0
##$USERP1= <user>
##$USERP2= <user>
##$USERP3= <user>
##$USERP4= <user>
##$USERP5= <user>
##$WDW= 1
##$XDIM= 65536
##$YMAX_p= 325325729
##$YMIN_p= -50406724
$$ End of Bruker specific parameters
$$ ---------------------------------
##NTUPLES= NMR SPECTRUM
##VAR_NAME=  FREQUENCY,     SPECTRUM/REAL,   SPECTRUM/IMAG
##SYMBOL=    X,             R,               I
##VAR_TYPE=  INDEPENDENT,   DEPENDENT,       DEPENDENT
##VAR_FORM=  AFFN,          ASDF,            ASDF
##VAR_DIM=   65536,         65536,           65536
##UNITS=     HZ,            ARBITRARY UNITS, ARBITRARY UNITS
##FACTOR=    0.456856943014862, 1,           1
##FIRST=     14782.0589164792, 0,            0
##LAST=      -15158.0608439998, 0,           0
##MIN=       -15158.0608439998, -50406724,   0
##MAX=       14782.0589164792, 325325729,    0
$$ Real data points
##PAGE= N=1
##DATA TABLE= (X++(R..R)), XYDATA
$$ [...]
$$ plain form
37237 -436436 -1554243 -2093597 -130055 881207 -2803579 -8368874 -9487421 -5276733
37229 -5276733 -1491559 -2456783 -5914586 -7181699 -5332624 -3389603 -3990047 -6354073
37221 -6354073 -7189024 -4385023 102999 2158057 888158 -824 2065111 4061585
37213 4061585 2034997 -1816617 -1613795 3085374 5922699 2778730 -2610231 -4579346
37205 -4579346 -3082981 -1867176 -2056135 -1738705 -487744 -90537 -787533 -338087 2207664
37196 2207664 4470445 3925342 1346135 -470004 -209481 1368676 3531774 6153422
37188 6153422 8064339 7031013 2807349 -1162128 -1085248 2570455 5699321 5625630 3439861
37179 3439861 1125331 -983102 -2737538 -2788270 -827625 592307 -1030252 -4460347
$$ packed form
37237d36436j117807n39354J963542J011262l684786n565295j118547M210688
37229e276733L785174r65224l457803j267113J849075J943021o00444k364026
37221f354073q34951K804001M488022K055058j269899q88982K065935J996474
37213D061585k026588l851614K02822M699169K837325l143969n388961j969115
37205d579346J496365J215805j88959L17430J250961L97207o96996M49446K545751
37196B207664K262781n45103k579207j816139K60523J578157K163098K621648
37188F153422J910917j033326m223664l969477P6880L655703L128866p3691k185769
37179C439861k314530k108433j754436n0732J960645J419932j622559l430095
$$ plain form
37171 -4460347 -6139675 -4455042 -711779 3021122 4943321 3750007 457669 -1168403
37163 -1168403 998911 3691240 2381943 -1641706 -2671401 867931 4025493 2907001
37155 2907001 212264 638366 4272226 7661592 8913870 8528724 6932397 4394627
37147 4394627 2525284 3044578 5164326 6108905 4285053 803091 -1965341 -2681993 -2244948
37138 -2244948 -2741542 -4437927 -4540944 -914300 3752642 4775307 2375585 1432492 3318028
37129 3318028 3145578 -1928333 -6691754 -5092750 183102 1368222 -3120016 -7376233
37121 -7376233 -7506195 -6140701 -6277547 -6237523 -3503310 357978 1776832 -7120 -2582727
37112 -2582727 -3337775 -1277661 2593792 5485768 4945801 1821384 -434403 -221219 339864
$$ packed form
37171d460347j679328J684633L743263L732901J922199j193314l292338j626072
37163a168403K167314K692329j309297m023649j029695L539332L157562j118492
37155B907001k694737M26102L633860L389366J252278l85146j596327k537770
37147D394627j869343N19294K119748R44579j823852l481962k768432p16652M37045
37138b244948m96594j696385j03017L626644M666942J022665k399722r43093J885536
37129C318028j72450n073911m763421J599004N275852J185120m488238m256217
37121g376233j29962J365494j36846M0024K734213L861288J418854j783952k575607
37112b582727p55048K060114L871453K891976n39967l124417k255787K13184N61083
$$ plain form
37103 339864 -924439 -2747660 -2358295 492900 3284739 3801079 2066057 -278946 -1433495
37094 -1433495 -607716 1530364 3752180 5611734 7155108 7552648 5616233 2030704
37086 2030704 -660211 -1163701 -1008106 -1922598 -3131976 -2841532 -1407642 -1149320 -3146693
37077 -3146693 -5685461 -6188457 -3818240 164240 4019676 6912986 8682609 8905062
37069 8905062 7200846 4626386 3411971 4223017 4764168 2720126 -762809 -2653379
37061 -2653379 -2586123 -3118514 -5152452 -6072355 -3836607 -436432 782597 -517644 -2212972
37052 -2212972 -3268413 -4108535 -4004582 -972954 4903866 10044874 10754995 7348488 3755694
37043 3755694 3185402 5133408 6926576 7165493 6421944 5023447 2255542 -1396878 -3307601
$$ packed form
37103C39864j264303j823221L89365K851195K791839N16340j735022k345003j154549
37094a433495Q25779K138080K221816J859554J543374L97540j936415l585529
37086B030704k690915n03490J55595r14492j209378K90444J433890K58322j997373
37077c146693k538768n02996K370217L982480L855436K893310J769623K22453
37069H905062j704216k574460j214415Q11046N41151k044042l482935j890570
37061b653379O7256n32391k033938r19903K235748L400175J219029j300241j695328
37052b212972j055441q40122J03953L031628N876820N141008P10121l406507l592794
37043C755694n70292J948006J793168K38917p43549j398497k767905l652420j910723
$$ plain form
37034 -3307601 -2056267 -291648 -1532158 -4795375 -5526451 -1987143 2477960 4339530
37026 4339530 3882809 2884892 1379491 -933871 -2425744 -1438603 954500 2426576 2448629
37017 2448629 1840568 680318 -1030186 -1861208 -635114 1311053 1942270 1624153 1828659
37008 1828659 1827696 -66886 -2504602 -2049215 1434678 3866128 2605337 -44590 -667250
36999 -667250 578177 1316392 1128324 1864528 4565610 8058870 10455913 10834895 9652112
36990 9652112 8300177 7956556 8384258 8384398 7635237 7001262 6513070 4425135 -499079
36981 -499079 -6618002 -10601067 -10616225 -7515955 -3461944 -333693 1044462 1222720 1537330
36972 1537330 2548533 3521166 4063559 5259016 7775003 9657124 8171265 4019158
$$ packed form
37034c307601J251334J764619j240510l263217p31076L539308M465103J861570
37026D339530m56721r97917j505401k313362j491873R87141K393103J472076K2053
37017B448629o08061j160250j710504q31022J226094J946167O31217l18117K04506
37008A828659r63j894582k437716M55387L483893K431450j260791k649927o22660
36999f67250J245427P38215j88068P36204K701082L493260K397043L78982j182783
36990I652112j351935l43621M27702J40p49161o33975m88192k087935m924214
36981d99079o118923l983065j5158L100270M054011L128251J378155J78258L14610
36972A537330J011203R72633N42393J195457K515987J882121j485859m152107
$$ plain form
36964 4019158 1566408 3747536 8253826 10294625 8220476 4701589 2707233 2242590
36956 2242590 1645376 619456 621240 2556163 5111291 5731878 3088888 -1500279 -5169988
36947 -5169988 -6102655 -4789013 -2566183 215425 3467442 5577123 4567127 1438675
36939 1438675 47785 2318218 5526117 6092824 4208018 2371769 1099188 -799604
36931 -799604 -2864779 -3599469 -3915915 -5966252 -8471191 -7642469 -3613835 -1166338 -2158958
36922 -2158958 -2185402 2039039 6652304 6598274 3801430 3726667 6338490 6859679 4454574
36913 4454574 3539356 5936780 7996066 7399009 7263462 10396568 13861391 13100209 8640929
36904 8640929 5010859 4607122 5761946 5994887 4693784 2896770 1930248 1949486 1410313
$$ packed form
36964D019158k452750K181128M506290K040799k074149l518887j994356m64643
36956B242590n97214j025920J784J934923K555128O20587k642990m589167l669709
36947e169988r32667J313642K222830K781608L252017K109681j009996l128452
36939A438675j390890K270433L207899N66707j884806j836249j272581j898792
36931g99604k065175p34690l16446k050337k504939Q28722M028634K447497r92620
36922b158958k6444M224441M613265n4030k796844p4763K611823N21189k405105
36913D454574r15218K397424K059286n97057j35547L133106L464823p61182m459280
36904H640929l630070m03737J154824K32941j301103j797014r66522J9238n39173
$$ plain form
36895 1410313 -749035 -2229802 863034 8254433 14140182 13673470 8758687 5042845
36887 5042845 4851911 5810578 5324587 3433981 1266780 -912837 -3398545 -5990170 -7739859
36878 -7739859 -7504554 -5167668 -2459770 -1491743 -2116793 -2204196 -1060459 -637608 -2263276
36869 -2263276 -4225393 -4266798 -2708635 -1234439 -181246 926294 1575729 1137849 349501
36860 349501 -24708 -706032 -2167221 -3045814 -2561324 -2649510 -4801840 -6564065 -4780928
36851 -4780928 -1021085 327796 -1282159 -2169375 -736172 317801 -1002611 -3017860
36843 -3017860 -4006912 -4997809 -6789523 -7434088 -5199288 -1568142 1047244 2432045 3228683
36834 3228683 2647539 101439 -2474591 -2545335 -311841 1872081 2505182 1689046 42912
$$ packed form
36895A410313k159348j480767L092836P391399N885749m66712m914783l715842
36887E042845j90934R58667m85991j890606k167201k179617k485708k591625j749689
36878g739859K35305K336886K707898R68027o25050q7403J143737M22851j625668
36869b263276j962117m1405J558163J474196J053193J107540O49435m37880p88348
36860C49501l74209o81324j461189q78593M84490q8186k152330j762225J783137
36851d780928L759843J348881j609955q87216J433203J053973j320412k015249
36843c017860r89052r90897j791714o44565K234800L631146K615386J384801P96638
36834C228683n81144k546100k576030p0744K233494K183922O33101q16136j646134
$$ plain form
36825 42912 -1315692 -776707 1907634 4569178 4951884 3172502 609998 -2146684 -4553434
36816 -4553434 -5006854 -2803765 61221 1390960 1817947 2825918 3217783 952271 -2344221
36807 -2344221 -2587046 939908 4646567 6034205 6244044 6151021 3989477 -789955 -4756814
36798 -4756814 -4810448 -2777210 -2201428 -2417384 3126 4533643 5937043 1495211 -4455532
36789 -4455532 -5599697 -1325557 3233529 4135288 3043597 3913056 7001798 8288105
36781 8288105 5042488 -14955 -2064856 -879520 -1211965 -5525348 -9263888 -6274512
36773 -6274512 2545063 9608611 9714047 5415940 2284848 1889305 1762093 309712 -1176291
36764 -1176291 -996959 652402 2157696 2133937 562263 -1073024 -1154521 138119 1191359
$$ packed form
36825D2912j358604N38985K684341K661544L82706j779382k562504k756682k406750
36816d553434m53420K203089K864986J329739M26987J007971L91865k265512l296492
36807b344221k42825L526954L706659J387638K09839r3023k161544m779432l966859
36798d756814n3634K033238N75782k15956K420510M530517J403400m441832n950743
36789d455532j144165M274140M559086R01759j091691Q69459L088742J286307
36781H288105l245617n057443k049901J185336l32445m313383l738540K989376
36773f274512Q819575P063548J05436m298107l131092l95543j27212j452381j486003
36764a176291J79332J649361J505294k3759j571674j635287q1497J292640J053240
$$ plain form
36755 1191359 1693267 3227092 5880675 6502313 3014804 -1138800 -481690 5052406 9964450
36746 9964450 10759104 9594499 9127843 8025679 4467427 629960 -339616 270755 -1305533
36737 -1305533 -4849499 -6027628 -3063128 461738 878746 -743656 -1189818 -115627
36729 -115627 274570 -565180 -474302 1963263 4994815 5882397 4484580 3241895 3754124
36720 3754124 4924154 5282908 5649744 7464878 9216886 7499677 2283668 -1924378
36712 -1924378 -2035799 -713475 -1848701 -3990428 -2374227 3495697 8818001 10347584
36704 10347584 9822424 9136989 6456448 184239 -6319653 -7983600 -4815993 -2002697
36696 -2002697 -3291862 -6884774 -8272883 -5213187 698474 6047520 8507889 8402166
$$ packed form
36755A191359N01908J533825K653583O21638l487509m153604O57110N534096M912044
36746I964450P94654j164605m66656j102164l558252l837467r69576O10371j576288
36737a305533l543966j178129K964500L524866M17008j622402m46162J074191
36729a15627L90197q39750R0878K437565L031552Q87582j397817j242685N12229
36720C754124J170030L58754L66836J815134J752008j717209n216009m208046
36712a924378j11421J322324j135226k141727J616201N869924N322304J529583
36704A0347584n25160o85435k680541o272209o503892j663947L167607K813296
36696b002697j289165l592912j388109L059696N911661N349046K460369j05723
$$ plain form
36688 8402166 7807086 8090478 8709164 8570601 7590038 6150742 4014598 1066076 -1390960
36679 -1390960 -1510727 861429 3805913 5239492 4484472 2104016 -797465 -2845173
36671 -2845173 -2804081 -438893 3019609 5471172 5208225 1967554 -2875145 -7078952 -8775085
36662 -8775085 -7480404 -4443548 -1881421 -1057566 -916645 376672 2229435 1635586 -2381496
36653 -2381496 -6178228 -5702748 -2047460 212785 -438031 -1229526 -641141 -998605 -3782401
36644 -3782401 -6011213 -4288140 -80391 2179532 890203 -1580310 -2568356 -1357801
36636 -1357801 1599042 5248052 7819880 8010211 6346170 4333325 2760788 1727098
36628 1727098 1260450 777817 -790572 -3051076 -3764678 -1796428 1227899 3658811 5968377
$$ packed form
36688H402166n95080K83392O18686j38563r80563j439296k136144k948522k457036
36679a390960j19767K372156K944484J433579p55020k380456k901481k047708
36671b845173M1092K365188L458502K451563k62947l240671m842699m203807j696133
36662h775085J294681L036856K562127Q23855J40921J293317J852763n93849m017082
36653b381496l796732M75480L655288K260245o50816p91495N88385l57464k783796
36644c782401k228812J723073M207749K259923j289329k470513r88046J210555
36636a357801K956843L649010K571828J90331j664041k012845j572537j033690
36628A727098m66648m82633j568389k260504p13602J968250L024327K430912K309566
$$ plain form
36619 5968377 8147742 7693360 3452419 -743879 -339298 3395880 5215430 3439199
36611 3439199 1341338 1364552 2370434 2913654 3058852 2449972 689495 122902 3670082
36602 3670082 8908780 9315581 3365396 -2466180 -2585693 409202 987386 -800404 -816147
36593 -816147 1846907 4072914 4053774 3034130 2187510 1456029 1393446 2977198 5447242
36584 5447242 6908307 7091059 7266697 7653279 7201536 5783210 4363876 3133535 1641909
36575 1641909 651558 1492512 3312177 3212483 -64981 -4102347 -5208856 -2075858 3083093
36566 3083093 6344215 5363264 1677971 -774067 -62272 1905533 2679754 2382573 1829885
36557 1829885 -89494 -4034429 -6902127 -4975474 77013 2523191 376693 -2138365
$$ packed form
36619E968377K179365m54382m240941m196298M04581L735178J819550j776231
36611C439199k097861K3214J005882N43220J45198o08880j760477n66593L547180
36602C670082N238698M06801n950185n831576j19513K994895N78184j787790j5743
36593h16147K663054K226007j9140j019644q46620p31481o2583J583752K470044
36584E447242J461065J82752J75638L86582m51743j418326j419334j230341j491626
36575A641909r90351Q40954J819665r9694l277464m037366j106509L132998N158951
36566C083093L261122r80951l685293k452038P11795J967805P74221k97181n52688
36557A829885j919379l944935k867698J926653N052487K446178k146498k515058
$$ plain form
36549 -2138365 -1164850 1613212 2507563 1198796 -333434 -1783760 -4061967 -6253074
36541 -6253074 -6414851 -5109890 -5250254 -7946558 -10639303 -10176222 -6400781 -1941617 701446
36532 701446 1221258 1128994 1851650 3261179 4089414 3612265 2355485 1022865 -421844
36523 -421844 -2003785 -2792654 -1710427 885989 3245813 3965085 3236032 2325375 2169892
36514 2169892 2589716 2735560 2196632 1453576 1019558 488721 -858126 -2608211 -3352222
36505 -3352222 -2553517 -1308524 -657088 -88230 1296887 2890707 3255710 2507503 2518044
36496 2518044 4254209 6094534 5721296 3035018 200809 -901948 -279519 1071074
36488 1071074 2526993 3810458 4441413 4079530 3134482 2393694 2165204 2185720 2098455
$$ packed form
36549b138365R73515K778062Q94351j308767j532230j450326k278207k191107
36541f253074j61777J304961j40364k696304k692745M63081L775441M459164K643063
36532G01446N19812r2264P22656J409529Q28235m77149j256780j332620j444709
36523d21844j581941p88869J082227K596416K359824P19272p29053r10657j55483
36514B169892M19824J45844n38928p43056m34018n30837j346847j750085p44011
36505c352222P98705J244993O51436N68858J385117J593820L65003p48207J0541
36496B518044J736165J840325l73238k686278k834209j102757O22429J350593
36488A071074J455919J283465O30955l61883r45048p40788k28490K0516q7265
$$ plain form
36479 2098455 1637181 784013 198255 792942 2174082 2423108 625729 -1341448 -1297428
36470 -1297428 -165634 -446972 -1782809 -1330636 978965 1360678 -1810797 -4487585 -2582713
36461 -2582713 1682045 3106605 1434136 1276540 4484411 7274611 6069994 2320318
36453 2320318 -369543 -906663 -333602 840677 2421609 3134190 1939786 136678 116942
36444 116942 2121523 3704862 2547325 -1184140 -5401538 -8288469 -9601721 -10015025
36436 -10015025 -9593406 -7563091 -3873113 -142609 1862378 2096938 1541765 380204
36428 380204 -1604862 -3353800 -3174288 -1070756 1235013 2547800 2776910 1615302 -1027960
36419 -1027960 -3196914 -2142362 1822815 5072328 5228026 3788715 3197572 3535393 3465915
$$ packed form
36479B098455m61274q53168n85758N94687J381140K49026j797379j967177M4020
36470a297428J131794k81338j335837M52173K309601L81713l171475k676788J904872
36461b582713M264758J424560j672469j57596L207871K790200j204617l749676
36453B320318k689861n37120N73061J174279J580932P12581j194404j803108j9736
36444A16942K004581J583339j157537l731465m217398k886931j313252m13304
36436a0015025M21619K030315L689978L730504K004987K34560n55173j161561
36428C80204j985066j748938J79512K103532K305769J312787K29110j161608k643262
36419a027960k168954J054552L965177L249513J55698j439311n91143L37821o9478
$$ plain form
36410 3465915 2491614 877901 -998963 -2186150 -1825076 -997962 -1627266 -2934497 -2115590
36401 -2115590 432873 601141 -2511401 -3551797 1381509 7791043 8673291 4753999
36393 4753999 2989786 6066971 9427742 8987311 6225245 4273274 3684303 3933185 5133360
36384 5133360 6189926 4579048 69988 -4055971 -5269925 -4712098 -4346721 -4007133 -3038082
36375 -3038082 -2128677 -1482885 261537 3113573 4236320 1879367 -1406194 -2199645 -972714
36366 -972714 -578031 -1611858 -2422593 -2649579 -3479361 -4708095 -4517973 -2464361 -382016
36357 -382016 127014 -576621 -1207924 -971950 177542 1676808 2858180 3909427 5547595
36348 5547595 7139822 6756844 4398958 3267809 5656161 9151069 9525553 6126496
$$ packed form
36410C465915r74301j613713j876864j187187L61074Q27114o29304j307231Q18907
36401b115590K548463J68268l112542j040396M933306O409534Q82248l919292
36393D753999j764213L077185L360771m40431k762066j951971n88971K48882J200175
36384E133360J056566j610878m509060m125959j213954N57827L65377L39588R69051
36375c038082R09405O45792J744422K852036J122747k356953l285561p93451J226931
36366i72714L94683j033827q10735k26986q29782j228734J90122K053612K082345
36357c82016N09030p03635o31303K35974J149492J499266J181372J051247J638168
36348E547595J592227l82978k357886j131149K388352L494908L74484l399057
$$ plain form
36340 6126496 1584211 -2470167 -5800896 -6619478 -2749075 3773766 7492349 6321540
36332 6321540 3961020 3981281 5144096 4847510 3797943 4079490 5060213 4708628 3481881
36323 3481881 3619945 5401174 6959112 7263844 6746876 5500875 3416280 1823725 2491273
36314 2491273 4835175 6121160 4531319 482010 -4582539 -8783353 -9888884 -7312543
36306 -7312543 -3785976 -2528078 -2878274 -1422181 2572220 5916297 6122267 4074995
36298 4074995 1275778 -2189687 -5493932 -6271545 -4161775 -2195264 -2186256 -1631923 1719016
36289 1719016 4883840 3310378 -1991023 -5230237 -3408060 549179 2300696 522547
36281 522547 -3386771 -7002268 -7810861 -5125071 -1489682 185481 775820 3257704 6942252
$$ packed form
36340F126496m542285m054378l330729q18582L870403O522841L718583j170809
36332F321540k360520K0261J162815k96586j049567K81547R80723l51585j226747
36323C481881J38064J781229J557938L04732n16968j246001k084595j592555O67548
36314B491273K343902J285985j589841m049309n064549m200814j105531K576341
36306g312543L526567J257898l50196J456093L994401L344077K05970k047272
36298D074995k799217l465465l304245p77613K109770J966511R008N54333L350939
36289A719016L164824j573462n301401l239214J822177L957239J751517j778149
36281E22547l909318l615497q08593K685790L635389J675163N90339K481884L684548
$$ plain form
36272 6942252 7292793 2638632 -2650964 -3752601 -1128085 1618317 2958426 3775453
36264 3775453 4445263 4468887 3985323 3401403 2344658 677859 -541320 -661888 -633249
36255 -633249 -1024486 -574567 1288901 2289134 243267 -3238020 -4837891 -4349507 -4472715
36246 -4472715 -6333571 -8084152 -7871212 -5638178 -1956320 2536159 6359698 7980349
36238 7980349 7540075 6076243 3405306 -1080867 -5845335 -7844593 -5853586 -1328335
36230 -1328335 3530589 6499281 5268066 -112067 -5288318 -5687684 -2331272 225352
36222 225352 1404192 4921360 10741975 12727026 7466394 337674 -1830450 -304627
36214 -304627 -1258452 -5539080 -7700841 -4777493 -354111 1371923 1160504 2120508 4486392
$$ packed form
36272F942252L50541m654161n289596j101637K624516K746402J340109Q17027
36264C775453O69810K3624m83564n83920j056745j666799j219179j20568K8639
36255f33249l91237M49919J863468J000233k045867l481287j599871M88384j23208
36246d472715j860856j750581K12940K233034L681858M492479L823539J620651
36238G980349m40274j463832k670937m486173m764468j999258J991007M525251
36230a328335M858924K968692j231215n380133n176251l99366L356412K556624
36222B25352J178840L517168N820615J985051n260632p128720k168124J525823
36214c04627r53825m280628k161761K923348M423382J726034k11419R60004K365884
$$ plain form
36205 4486392 5616848 3921835 721422 -1658973 -2516129 -3063601 -4194561 -4585371 -2224395
36196 -2224395 2111770 4783554 3740113 1253855 583471 1602645 1952280 1118933 605969
36187 605969 854599 905165 833395 1622187 2501087 1347187 -1618537 -3246289 -1606957
36178 -1606957 1651861 4293172 6475398 8972010 10353720 8428059 3809968 -59337
36170 -59337 -596117 1565781 4133092 5952608 7449161 8636173 7907574 3944394 -1459774
36161 -1459774 -4230228 -2555705 869577 2492784 2278996 2429000 3182330 2967709 2134677
36152 2134677 2914723 5145636 5593779 2977290 468094 1079415 3299552 3919497 2901575
36143 2901575 2325561 2257606 1357828 762721 3347053 8619612 11896116 10062469 5586807
$$ packed form
36205D486392J130456j695013l200413k380395q57156n47472j130960l90810K360976
36196b224395M336165K671784j043441k486258o70384J019174L49635q33347n12964
36187F05969K48630N0566p1770P88792Q78900j153900k965724j627752J639332
36178a606957L258818K641311K182226K496612J381710j925661m618091l869305
36170e9337n36780K161898K567311J819516J496553J187012p28599l963180n404168
36161a459774k770454J674523L425282J623207k13788J50004P53330k14621q33032
36152B134677P80046K230913M48143k616489k509196O11321K220137O19945j017922
36143B901575n76014o7955q99778n95107K584332N272559L276504j833647m475662
$$ plain form
36134 5586807 3035166 3543484 4677243 4293666 2276453 -842481 -4613393 -7733782
36126 -7733782 -8172064 -5083336 228892 5659194 9730061 11364550 9587097 4776101
36118 4776101 -306934 -2212780 48001 4145106 6790015 6414266 3718345 642801
36110 642801 -858994 85119 2723845 5468665 7235622 7536020 5765816 1911423 -2020781
36101 -2020781 -3258713 -1735720 -452214 -1320931 -2776353 -3136934 -3871203 -6667897 -9285624
36092 -9285624 -8277288 -4890692 -3764317 -5566697 -5696198 -1842448 1713135 287807
36084 287807 -4330667 -6964897 -6413905 -5463520 -5066880 -3234748 267731 2527890 2149632
36075 2149632 1837510 4167264 7233857 7191937 3885110 1181139 1698904 3557169 3418777
$$ packed form
36134E586807k551641N08318J133759l83577k017213l118934l770912l120389
36126g733782m38282L088728N312228N430302M070867J634489j777453m810996
36118D776101n083035j905846K260781M097105K644909l75749k695921l075544
36110F42801j501795R44113K638726K744820J766957L00398j770204l854393l932204
36101b020781j237932J522993J283506q68717j455422l60581p34269k796694k617727
36092i285624J008336L386596J126375j802380j29501L853750L555583j425328
36084B87807m618474k634230N50992R50385L96640J832132L502479K260159l78258
36075B149632l12122K329754L066593m1920l306827k703971N17765J858265j38392
$$ plain form
36066 3418777 1152823 -414774 107030 802302 -223671 -1700837 -1347947 253054 777406
36057 777406 593382 2562964 6736814 8921833 6547222 2787389 1972347 3507324 3912338
36048 3912338 2828341 2584416 2847267 668201 -3768995 -6213782 -4651318 -2287938
36040 -2287938 -1983834 -1583884 1934715 6699255 8393437 6741051 5378423 5920229 6240919
36031 6240919 5020274 4129940 4969955 5517049 3410031 100928 -661332 2205436 5808403
36022 5808403 6842851 4831236 1766524 54034 1104235 4467438 7604154 7736787
36014 7736787 4994469 2793919 3856100 6669743 7624963 6176805 5518813 7591370
36006 7591370 9880687 8948307 5414520 2931366 2892261 2883617 850877 -1537305 -1100111
$$ packed form
36066C418777k265954j567597N21804O95272j025973j477166L52890J601001N24352
36057G77406j84024J969582M173850K185019k374611l759833q15042J534977M05014
36048C912338j083997k43925K62851k179066m437196k444787J562464K363380
36040b287938L04104L99950L518599M764540J694182j652386j362628N41806L20690
36031F240919j220645q90334Q40015N47094k107018l309103p62260K866768L602967
36022E808403J034448k011615l064712j712490J050201L363203L136716J32633
36014G736787k742318k200550J062181K813643R55220j448158o57992K072557
36006G591370K289317r32380l533787k483154l9105q644k032740k388182M37194
$$ plain form
35997 -1100111 2582965 6679652 8524980 8333918 8263025 9400272 10305291 8820080 4992835
35988 4992835 1248041 -687410 -1820731 -3761444 -5650595 -5112144 -1852319 1789781
35980 1789781 3968016 4810090 4306119 1248334 -4191235 -8773680 -9201427 -5875221 -1951262
35971 -1951262 525728 1862569 2815940 3405229 3564160 3480194 3208661 2955736 3415320
35962 3415320 4721564 5589779 4830577 3145939 1859404 561848 -1819236 -4039574
35954 -4039574 -3471054 -456494 1290314 75061 -783976 2195038 6918158 8137450
35946 8137450 4779625 1362510 1628049 3904386 4431216 2949713 2407661 4049310 5572492
35937 5572492 4775729 2990078 3230329 5695413 6957815 4133814 -1363033 -5313583
$$ packed form
35997a100111L683076M096687J845328j91062p0893J137247R05019j485211l827245
35988D992835l744794j935451j133321j940713j889151N38451L259825L642100
35980A789781K178235Q42074n03971l057785n439569m582445m27747L326206L923959
35971a951262K476990J336841R53371N89289J58931q3966k71533k52925M59584
35962C415320J306244Q68215p59202j684638j286535j297556k381084k220338
35954d039574N68520L014560J746808j215253q59037K979014M723120J219292
35946H137450l357825l417115K65539K276337N26830j481503n42052J641649J523182
35937E572492p96763j785651K40251K465084J262402k824001n496847l950550
$$ plain form
35929 -5313583 -5429437 -3417225 -2304448 -2877298 -3332960 -1680783 2206084 6445263 8490279
35920 8490279 7166961 4020677 2087664 2547370 3174711 1173125 -2931050 -5641365
35912 -5641365 -4696562 -1473159 1100315 1566705 242351 -2037728 -4234090 -5099771 -4308193
35903 -4308193 -3278936 -3730181 -5493636 -6640965 -5700716 -3057539 -383599 560311 -1161544
35894 -1161544 -4966041 -8903109 -11153573 -11347664 -10037863 -7547439 -4307213 -1685410
35886 -1685410 -988455 -1802989 -2768686 -3839834 -6006632 -8627945 -9166502 -6481019 -2573220
35877 -2573220 150235 1752219 3443365 4860884 4615752 2700041 420291 -1626382
35869 -1626382 -3740756 -5543352 -5942042 -4750820 -2949014 -1309312 -9317 613149
$$ packed form
35929e313583j15854K012212J112777n72850m55662J652177L886867M239179K045016
35920H490279j323318l146284j933013M59706O27341k001586m104175k710315
35912e641365R44803L223403K573474M66390j324354k280079k196362q65681P91578
35903d308193J029257m51245j763455j147329R40249K643177K673940R43910j721855
35894a161544l804497l937068k250464j94091J309801K490424L240226K621803
35886a685410O96955q14534r65697j071148k166798k621313n38557K685483L907799
35877b573220K723455J601984J691146J417519k45132j915711k279750k046673
35869a626382k114374j802596l98690J191222J801806J639702J299995O22466
$$ plain form
35861 613149 440074 593158 2299324 4514283 4547951 1757090 -1086790 -1242088 476268
35852 476268 979103 -1005224 -3458321 -3607486 -1047422 1940538 2953261 2101441 1674504
35843 1674504 3054491 4862674 4990336 3477057 1826471 219224 -2356070 -5270938
35835 -5270938 -6059464 -3811839 -674179 975993 909715 -319758 -2821406 -5863423 -7031351
35826 -7031351 -5013842 -1726263 344770 1427020 2950509 4357100 4203494 3327984
35818 3327984 3802641 5226043 5160794 3180060 1391508 683221 -359787 -2045292 -2307474
35809 -2307474 -343900 1288523 241502 -2106117 -2853955 -1666586 -458921 -164376
35801 -164376 2209 632494 1290252 1409587 911029 269539 535192 2267150 3825982
$$ packed form
35861F13149j73075J53084J706166K214959L3668k790861k843880j55298J718356
35852D76268N02835j984327k453097j49165K560064K987960J012723q51820m26937
35843A674504J379987J808183J27662j513279j650586j607247k575294k914868
35835e270938p88526K247625L137660J650172o6278j229473k501648l042017j167928
35826g031351K017509L287579K071033J082250J523489J406591j53606q75510
35818C327984M74657J423402o5249j980734j788552p08287j043008j685505k62182
35809b307474J963574J632423j047021k347619p47838J187369J207665K94545
35801a64376J66585O30285O57758J19335m98558o41490K65653J731958J558832
$$ plain form
35792 3825982 2384352 -2169840 -6182479 -6826705 -5861075 -6413592 -7815548 -6973938 -3838071
35783 -3838071 -1581051 -1340680 -779277 1161344 1939003 -175751 -2645046 -2354497 -326983
35774 -326983 295127 -756015 -1159139 -228238 582737 1137013 3101574 6227225 7174754
35765 7174754 3706268 -1938165 -5547727 -5521603 -3501120 -1598113 -669885 -700343 -1231475
35756 -1231475 -1473902 -1180640 -1374453 -3141325 -5706207 -6889332 -5854213 -4364201 -4511188
35747 -4511188 -5828848 -5765954 -3082351 252826 1315656 -100257 -1171855 404168
35739 404168 3644176 5798159 5691262 4287089 2553580 561909 -1216750 -1591765 -382858
35730 -382858 1021806 1684040 2198285 2750544 1891576 -992352 -3541082 -3178899 -1064893
$$ packed form
35792C825982j441630m554192m012639o44226R65630n52517j401956Q41610L135867
35783c838071K257020K40371N61403J940621P77659k114754k469295K90549K027514
35774c26983O22110j051142m03124R30901Q10975N54276J964561L125651R47529
35765G174754l468486n644433l609562K6124K020483J903007R28228l0458n31132
35756a231475k42427K93262j93813j766872k564882j183125J035119J490012j46987
35747d511188j317660O2894K683603L335177J062830j415913j071598J576023
35739D04168L240008K153983j06897j404173j733509j991671j778659l75015J208907
35730c82858J404664O62234N14245N52259q58968k883928k548730L62183K114006
$$ plain form
35721 -1064893 -583172 -2314953 -3447598 -2326389 -463825 834285 2667703 5593760
35713 5593760 7217678 5264461 1237229 -1543165 -2207699 -2126080 -1611383 222271 2800102
35704 2800102 4220119 4227630 4505140 5550098 5617843 3552301 687582 -977074 -943346
35695 -943346 102671 1242434 1403701 63923 -1622945 -2061306 -1900222 -3306329 -5938415
35686 -5938415 -6369566 -3041100 804134 1388633 -575731 -1856479 -1909483 -2794769 -4861871
35677 -4861871 -6083342 -5666973 -5048222 -4762779 -3434671 -987616 -10487 -2018109 -4342433
35668 -4342433 -2951781 2527288 8240624 10047136 6977043 1441245 -2917218 -3973590
35660 -3973590 -2509024 -667014 913378 3300554 6418312 7825972 5629947 1300987
$$ packed form
35721a064893M81721j731781j132645J121209J862564J298110J833418K926057
35713E593760J623918j953217m027232k780394o64534Q1619N14697J833654K577831
35704B800102J420017P511K77510J044958O7745k065542k864719j664656L3728
35695i43346J046017J139763J61267j339778j686868m38361J61084j406107k632086
35686e938415m31151L328466L845234N84499j964364j280748n3004q85286k067102
35677d861871j221471M16369O18751K85443J328108K447055R77129k007622k324324
35668d342433J390652N479069N713336J806512l070093n535798m358463j056372
35660c973590J464566J842010J580392K387176L117758J407660k196025m328960
$$ plain form
35652 1300987 -2006962 -3081010 -2938505 -2139606 139873 4053175 7684469 8653094 6649777
35643 6649777 3855114 2802688 3795247 4612392 3283004 885700 355364 2324432 3903229
35634 3903229 2616830 -105829 -1021540 646610 2953439 4194714 3891294 1676460
35626 1676460 -2033338 -4476335 -2655638 2330803 5680576 4667195 1789841 923605
35618 923605 2416910 3630821 2733760 237532 -2172635 -2936404 -1618532 371114 979173
35609 979173 10845 -956440 -1505938 -2875992 -4586175 -3658710 552766 3687003 1896802
35600 1896802 -2178611 -2998317 -158849 1780515 893385 162255 1400802 1920109 -570260
35591 -570260 -3853145 -4868987 -4296276 -4330886 -4398017 -2492522 874653 3398877 4590636
$$ packed form
35652A300987l307949j074048J42505P98899K279479L913302L631294R68625k003317
35643F649777k794663j052426R92559Q17145j329388k397304n30336J969068J578797
35634C903229j286399k722659r15711J668150K306829J241275l03420k214834
35626A676460l709798k442997J820697M986441L349773j013381k877354q66236
35618I23605J493305J213911q97061k496228k410167p63769J317872J989646O08059
35609I79173r68328r67285n49498j370054j710183R27465M211476L134237j790201
35600A896802m075413q19706K839468J939364q87130p31130J238547N19307k490369
35591e70260l282885j015842N72711l4610o7131J905495L367175K524224J191759
$$ plain form
35582 4590636 5523730 5679874 3317884 -869276 -3355896 -1948064 1504329 3326641
35574 3326641 1712933 -2159231 -5566120 -6490150 -5297009 -4268328 -4925302 -6277473
35566 -6277473 -6408081 -4904740 -2641390 -223116 1814263 2307785 982036 -86380
35558 -86380 1246758 3876340 4682141 2785478 234476 -1269705 -1669815 -730782 1896252
35549 1896252 4343390 3638974 271877 -1614365 -110431 1708191 993614 -412026
35541 -412026 109763 652826 -2269693 -7264956 -9225917 -6528799 -2824547 -1389881 -1627442
35532 -1627442 -1983816 -2580187 -3383210 -2942705 -929615 593495 416248 415406 2373957
35523 2373957 4636298 4534968 2581895 1349975 1157382 -6432 -2406259 -3466181
$$ packed form
35582D590636R33094J56144k361990m187160k486620J407832L452393J822312
35574C326641j613708l872164l406889r24030J193141J028681o56974j352171
35566f277473j30608J503341K263350K418274K037379M93522j325749j068416
35558h6380J333138K629582Q05801j896663k551002j504181m00110R39033K627034
35549A896252K447138p04416l367097j886242J503934J818622p14577j405640
35541d12026N21789N43063k922519m995263j960961K697118L704252J434666k37561
35532a627442l56374n96371q03023M40505K013090J523110j77247q42J958551
35523B373957K262341j01330j953073j231920j92593j163814k399827j059922
$$ plain form
35515 -3466181 -1504790 1864569 4219238 5272139 5893875 5748073 3870396 1012421
35507 1012421 -473375 622451 2963160 4495339 4790573 4841163 5086713 4692134 2911301
35498 2911301 277576 -2145358 -4098339 -5883126 -7155907 -7065127 -5629235 -3902602
35490 -3902602 -2588834 -1663517 -1606093 -3322839 -5981904 -6806208 -4757454 -2811440 -4069379
35481 -4069379 -6710016 -6044145 -1450007 2283211 1503276 -1755112 -3633764 -3883289 -4631115
35472 -4631115 -5879612 -5643729 -3646526 -1751930 -988242 -778806 -870944 -1363694 -988771
35463 -988771 1674494 5022397 5599309 3254753 1971945 4106060 6860327 6746217 4938142
35454 4938142 5156151 7816228 9515190 7873503 4240124 1523034 1279506 2967913
$$ packed form
35515c466181J961391L369359K354669J052901O21736j45802j877677k857975
35507A012421j485796J095826K340709J532179K95234N0590K45550l94579j780833
35498B911301k633725k422934j952981j784787j272781R0780J435892J726633
35490c902602J313768R25317N7424j716746k659065q24304K048754J946014j257939
35481d069379k640637O65871M594138L733218p79935l258388j878652k49525p47826
35472d631115j248497K35883J997203J894596P63688K09436r2138m92750L74923
35463i88771K663265L347903N76912k344556j282808K134115K754267j14110j808075
35454D938142K18009K660077J698962j641687l633379k717090k43528J688407
$$ plain form
35446 2967913 4492528 3620272 264221 -2954829 -3731323 -2999344 -3285379 -5006595 -6455390
35437 -6455390 -6730651 -6184521 -4385056 -593918 3514941 4709685 2690757 861610
35429 861610 1308384 1871274 194246 -1962002 -1347434 1547933 3106722 1791907 -160466
35420 -160466 -285143 1315431 3056557 3685961 2564311 46774 -1784091 -598434 3001184
35411 3001184 5384694 4261951 1845185 2020024 5154925 7604152 6359537 2534445
35403 2534445 -368886 -477900 1045284 1947564 1285912 -6811 -384878 505406 1170592
35394 1170592 -128955 -2863241 -4202091 -2457686 183862 16848 -3187571 -5469210
35386 -5469210 -3676931 622305 3641542 4322914 4672061 5806336 6210092 4606989 2603263
$$ packed form
35446B967913J524615q72256l356051l219050p76494P31979k86035j721216j448795
35437f455390k75261N46130J799465L791138M108859J194744k018928j829147
35429H61610M46774N62890j677028k156248O14568K895367J558789j314815j952373
35420a60466j24677J600574J741126O29404j121650k517537j830865J185657L599618
35411C001184K383510j122743k416766J74839L134901K449227j244615l825092
35403B534445k903331j09014J523184R02280o61652j292723l78067Q90284O65186
35394A170592j299547k734286j338850J744405K641548j67014l204419k281639
35386e469210J792279M299236L019237O81372L49147J134275M03756j603103k003726
$$ plain form
35377 2603263 2829912 5149542 6396403 4370264 980692 92747 2395360 4197817
35369 4197817 2430411 -852379 -1360785 1024620 2167410 185598 -1959475 -1962854 -2110056
35360 -2110056 -4532442 -6134335 -2902190 2950736 5296754 2550339 -1238994 -3354191
35352 -3354191 -5162147 -7406233 -8068723 -6452040 -4732799 -3747690 -1701773 1214637
35344 1214637 1834509 -52744 -17671 3479508 5184991 1248008 -3500629 -2292950 3301581
35335 3301581 6429069 5622162 5145295 5895880 3706287 -2347144 -6876048 -5930974 -2485601
35326 -2485601 -1268013 -2326889 -2849334 -2124932 -1415377 -909540 328663 2387651 4371115
35317 4371115 5519807 5475171 4359137 3169878 3011667 3685900 4282180 4989594 6575353
$$ packed form
35377B603263K26649K319630J246861k026139l389572q87945K302613J802457
35369D197817j767406l282790n08406K385405J142790j981812k145073l379j47202
35360b110056k422386j601893L232145N852926K346018k746415l789333k115197
35352c354191j807956k244086o62490J616683J719241R85109K045917K916410
35344A214637O19872j887253L5073L497179J705483l936983m748637J207679N594531
35335C301581L127488q06907m76867P50585k189593o053431m528904R45074L445373
35326b485601J217588j058876n22445P24402P09555N05837J238203K058988J983464
35317D371115J148692m4636j116034j189259j58211O74233N96280P07414J585759
$$ plain form
35308 6575353 8245281 8163883 6173572 3831102 1709944 -893173 -3365655 -3614612 -1260325
35299 -1260325 1349058 2176412 1607372 991348 1027746 1961644 3410518 3887019 2604930
35290 2604930 1532952 3074951 5986164 6651384 4297928 1574984 77361 -771761
35282 -771761 -304319 3206770 8025951 9498248 6742960 4073359 3922608 3576090 1497446
35273 1497446 1196654 4740083 7580634 5054131 -60237 -1990193 -547160 616944
35265 616944 1436618 4529910 8530105 9044639 6003587 3990000 4813015 5262161 3219104
35256 3219104 992122 972542 2033807 1989011 637478 -802082 -901957 1508387 5435080
35247 5435080 6763952 2658718 -3457776 -5266150 -1793860 1987879 2919274 3081421
$$ packed form
35308F575353J669928q1398j990311k342470k121158k603117k472482k48957K354287
35299a260325K609383Q27354n69040o16024L6398R33898J448874M76501j282089
35290B604930j071978J541999K911213O65220k353456k722944j497623q49122
35282g71761M67442L511089M819181J472297k755288k669601j50751l46518k078644
35273A497446l00792L543429K840551k526503n114368j929956J443033J164104
35265F16944Q19674L093292M000195N14534l041052k013587Q23015M49146k043057
35256C219104k226982j9580J061265m4796j351533j439560r9875K410344L926693
35247E435080J328872m105234o116494j808374L472290L781739R31395J62147
$$ plain form
35239 3081421 4542399 5836723 5754216 6015006 7465839 7575563 4659597 1130075 -478417
35230 -478417 -1467893 -3645717 -5004458 -2625379 2147172 5280269 5512330 4769006 4084630
35221 4084630 2511353 -214053 -2824776 -4427086 -5091868 -4673470 -2899941 -380848
35213 -380848 2062869 4477045 6603159 6704324 3808155 299360 -453625 1168026 1568277
35204 1568277 -371978 -1146973 2277188 7559023 9596552 6978106 3338426 2293101
35196 2293101 3346917 3916458 3611664 4301644 6419074 7721464 6630444 4775682 4470254
35187 4470254 5035976 3948129 1089836 -631196 669718 3214435 3913399 2060210
35179 2060210 -267201 -814379 486355 1627066 1105443 344131 2248156 6630753 9110221
$$ packed form
35239C081421J460978J294324q2507K60790J450833J09724k915966l529522j608492
35230d78417r89476k177824j358741K379079M772551L133097K32061p43324o84376
35221D084630j573277k725406k610723j602310o64782M18398J773529K519093
35213c80848K443717K414176K126114J01165k896169l508795p52985J621651M00251
35204A568277j940255p74995L424161N281835K037529k618446l639680j045325
35196B293101J053816N69541l04794O89980K117430J302390j091020j854762l05428
35187D470254N65722j087847k858293j721032J300914K544717O98964j853189
35179B060210k327411n47178J300734J140711n21623p61312J904025M382597K479468
$$ plain form
35170 9110221 6664556 2440351 1780256 4626223 5940719 3478240 569154 140990
35162 140990 485426 -771390 -2344730 -1971659 -500123 -90970 -517333 -369114 -169459
35153 -169459 -1160243 -2322506 -1680609 312903 1502140 1438809 1408774 1565145 646485
35144 646485 -1565995 -3778395 -5253232 -6496369 -7727177 -8056366 -6314965 -2039373
35136 -2039373 3794115 8560358 9905745 8670779 8083997 9080226 8963127 6328435 4066329
35127 4066329 4480073 4560947 543017 -5070696 -6403438 -3198830 -1210396 -3189764 -5127962
35118 -5127962 -3256866 285457 1697154 1330954 1673599 2471448 1800184 234961 123204
35109 123204 1416679 1668981 265049 -346143 1510992 3991818 4312615 2735204 2188057
$$ packed form
35170I110221k445665m224205o60095K845967J314496k462479k909086m28164
35162A40990L44436j256816j573340L73071J471536M09153m26363J48219J99655
35153a69459r90784j162263O41897J993512J189237o3331l0035J56371r18660
35144F46485k212480k212400j474837j243137j230808l29189J741401M275592
35136b039373N833488M766243J345387j234966n86782R96229j17099k634692k262106
35127D066329M13744Q0874m017930n613713j332742L204608J988434j979368j938198
35118e127962J871096L542323J411697l66200L42645P97849o71264j565223j11757
35109A23204J293475K52302j403932o11192J857135K480826L20797j577411n47147
$$ plain form
35100 2188057 4134406 6470843 6431958 4592544 4290815 6979348 9941639 9670145 6126230
35091 6126230 2177281 -91742 -675843 -80055 1291799 2262806 1469875 -772357 -2713749
35082 -2713749 -3507366 -3912619 -4583548 -5144543 -5162999 -4737889 -4082765 -3697581 -4523291 -6397688
35072 -6397688 -7068121 -4899263 -1937993 -1488228 -2919599 -2351167 1022381 3205111 1675580
35063 1675580 -315733 1390628 5476835 7165150 5060619 2474686 2474307 4640447 6743766
35054 6743766 7081423 4863144 487100 -3966019 -6171652 -6051040 -5575484 -5892940 -6138487
35045 -6138487 -5485260 -4724035 -4795159 -4971119 -3873898 -1737070 -260183 -159884 -68686
35036 -68686 1538985 4129275 5731731 5419521 4103680 2829946 1495065 -195593 -1596685
$$ packed form
35100B188057J946349K336437l8885j839414l01729K688533K962291k71494l543915
35091F126230l948949k269023n84101N95788J371854R71007p92931k242232j941392
35082b713749p93617m05253o70929n60995j8456M25110O55124L85184q25710j874397
35072f397688o70433K168858K961270M49765j431371N68432L373548K182730j529531
35063A675580j991313J706361M086207J688315k104531k585933l79K166140K103319
35054F743766L37657k218279m376044m453119k205633J20612M75556l17456k45547
35045f138487O53227P61225p1124j75960J097221K136828J476887J00299R1198
35036f8686J607671K590290J602456l12210j315841j273734j334881j690658j401092
$$ plain form
35027 -1596685 -1928599 -1435898 -659787 776226 3362639 6166565 7593612 7576882 7587916
35018 7587916 8367721 8960629 8239444 6199120 3413109 262181 -2876162 -5421912 -6859130
35009 -6859130 -6787842 -4991145 -2114744 233910 996636 734778 255942 -896974 -3216947
35000 -3216947 -5552021 -6514794 -6637822 -6984738 -6621584 -4189688 -1185365 -331121 -949878
34991 -949878 303994 3673425 5100966 1987288 -3311720 -7159172 -8525523 -7763241
34983 -7763241 -5051319 -2008013 -1337497 -2526093 -1409713 3210775 6227337 3160848
34975 3160848 -2932671 -5979746 -5498937 -5365154 -5903123 -3504746 1875672 4925498 2512422
34966 2512422 -1691405 -2704645 -871367 -86561 -1757132 -3666210 -3932921 -3433301 -3921493
$$ packed form
35027a596685l31914M92701P76111J436013K586413K803926J427047j6730J1034
35018G587916P79805N92908p21185k040324k786011l150928l138343k545750j437218
35009f859130P1288J796697K876401K348654P62726k61858m78836j152916k319973
35000c216947k335074r62773j23028l46916L63154K431896L004323Q54244o18757
34991i49878J253872L369431J427541l113678n299008l847452j366351P62282
34983g763241K711922L043306O70516j188596J116380M620488L016562l066489
34975C160848o093519l047075M80809J33783n37969K398377N380418L049826k413076
34966B512422m203827j013240J833278P84806j670571j909078k66711M99620m88192
$$ plain form
34957 -3921493 -5229026 -5241664 -2561345 1388961 3700232 3491898 2968107 4286516 6489759
34948 6489759 6679310 3463730 -1786242 -6336378 -7834479 -5686397 -1806378 833793
34940 833793 1166492 487606 -260064 -1472675 -2486930 -1296498 1571440 2206089 -861894
34931 -861894 -3151323 -311825 4987660 6825397 4742064 3640755 6026830 9436940
34923 9436940 11239541 11085498 8666548 4044727 463912 1620894 5384774 5557074
34915 5557074 1115606 -1902257 192921 3188161 2204717 -603641 -184697 3204405
34907 3204405 4890014 2921803 -39320 -1175805 -643376 -566254 -2734244 -6577496 -8687365
34898 -8687365 -6250093 -1553463 -77645 -3073181 -5847947 -5142553 -3646165 -4244155
$$ packed form
34957c921493j307533j2638K680319L950306K311271k08334n23791J318409K203243
34948F489759J89551l215580n249972m550136j498101K148082L880019K640171
34940H33793L32699o78886p47670j212611j014255J190432K867938O34649l067983
34931h61894k289429K839498N299485J837737k083333j101309K386075L410110
34923I436940J802601j54043k418950m621821l580815J156982L763880J72300
34915E557074m441468l017863K095178K995240r83444k808358M18944L389102
34907C204405J685609j968211k961123j136485N32429P7122k167990l843252k109869
34898h687365K437272M696630J475818k995536k774766P05394J496388n97990
$$ plain form
34890 -4244155 -4610559 -2086067 226796 -1937179 -6216751 -6809391 -3815565 -2888132 -6004244
34881 -6004244 -8998309 -8994684 -8273455 -8947029 -9078632 -6789750 -4110739 -3753609 -5021161
34872 -5021161 -5667123 -5562655 -5995866 -6928913 -7102779 -5917311 -3884205 -2110765 -1907869
34863 -1907869 -3526336 -4896107 -3416810 517660 3759334 4648945 4687858 5212552 5056248
34854 5056248 3012295 287640 -1378152 -2151513 -2723298 -2188512 413992 3518795 4227903
34845 4227903 1708863 -2167355 -5122093 -6057458 -4924895 -2459129 168625 2418863
34837 2418863 4703822 6882893 7358846 4999727 1329961 -735170 -206778 1184655
34829 1184655 1429884 196867 -1821313 -4216616 -6708287 -8303176 -7647311 -4575906
$$ packed form
34890d244155l66404K524492K312863k163975m279572n92640K993826R27433l116112
34881f004244k994065L625P21229o73574j31603K288882K679011L57130j267552
34872e021161o45962J04468m33211r33047j73866J185468K033106J773440K02896
34863a907869j618467j369771J479297L934470L241674Q89611L8913N24694j56304
34854E056248k043953k724655j665792p73361n71785N34786K602504L104803P09108
34845D227903k519040l876218k954738r35365J132563K465766K627754K250238
34837B418863K284959K179071M75953k359119l669766k065131N28392J391433
34829A184655K45229j233017k018180k395303k491671j594889O55865L071405
$$ plain form
34821 -4575906 -929665 853421 250968 -754747 -156124 1553887 2340036 1739500 1464639
34812 1464639 2562768 3568568 2581137 95540 -1712251 -2128832 -2828989 -5280365 -8282150
34803 -8282150 -9065351 -6678178 -3310749 -1635110 -1478814 -457153 2102857 3738579
34795 3738579 2484167 278090 612663 3606220 5901424 5430090 3794000 3312510 4003293
34786 4003293 4600207 4633588 4143810 2937075 1552965 1491230 2878982 3308666 968476
34777 968476 -2156557 -2558756 -165038 1578786 902519 401416 3013626 7080865 7875976
34768 7875976 3894230 -718696 -1305931 1272547 2071351 -839324 -3706516 -2813565 64148
34759 64148 899210 15984 1062062 3935056 3961041 -289799 -3249075 173965 6981951
$$ packed form
34821d575906L646241J783086o02453j005715N98623J710011P86149o00536k74861
34812A464639J098129J005800r87431k485597j807791m16581p00157k451376l001785
34803h282150p83201K387173L367429J675639J56296J021661K560010J635722
34795C738579j254412k206077L34573K993557K295204m71334j636090m81490O90783
34786D003293N96914L3381m89778j206735j384110o1735J387752M29684k340190
34777I68476l125033m02199K393718J743824o76267n01103K612210M067239P95111
34768G875976l981746m612926n87235K578478P98804k910675k867192Q92951K877713
34759F4148Q35062q83226J046078K872994K5985m250840k959276L423040O807986
$$ plain form
34750 6981951 10288935 8748576 6935509 7481511 8060848 6664888 5078908 5289808 6124726
34741 6124726 5812668 5152915 5625571 6339927 5398752 2990293 807689 -640783 -1890348
34732 -1890348 -2387284 -934292 1722459 2952631 1519906 -829631 -1876439 -1736786
34724 -1736786 -2080748 -3399424 -4409841 -4059033 -2897034 -1943327 -988862 1046116 4229503
34715 4229503 7013643 7872188 6979764 5823541 5505696 5822140 5739147 4503712 2621239
34706 2621239 1830196 3370914 6017113 6959566 5421135 4148052 5901687 9491040
34698 9491040 11237526 9831092 7451466 6032782 4860192 2677500 41795 -1691105
34690 -1691105 -2014413 -510121 3915380 11060611 17670263 19849362 17290680 13670562
$$ packed form
34750F981951L306984j540359j813067N46002N79337j395960j585980K10900Q34918
34741F124726l12058o59753M72656P14356r41175k408459k182604j448472j249565
34732a890348m96936J452992K656751J230172j432725k349537j046808J39653
34724a736786l43962j318676j010417L50808J161999R53707R54465K034978L183387
34715D229503K784140Q58545q92424j156223l17845L16444q2993j235435j882473
34706B621239p91043J540718K646199R42453j538431j273083J753635L589353
34698I491040J746486j406434k379626j418684j172590k182692k635705j732900
34690a691105l23308J504292M425501P145231O609652K179099k558682l620118
$$ plain form
34682 13670562 12719215 14884331 17779915 18857962 17475455 15087285 13640537 13557561
34674 13557561 13571835 12735836 11798166 11986786 13319644 15129913 17509711 20913882 24756604
34665 24756604 27786483 29762132 31563492 33705560 35933409 38335022 41663018 46282155
34657 46282155 51760247 57802638 64853838 73587219 84405720 97484013 112824701 130545754
34649 130545754 151622605 177615615 208615995 241985445 273982910 301447756 320452837
34642 320452837 325325729 312738024 286706211 255973487 225656177 194816491 163176838
34635 163176838 135667905 116960629 104599609 91855686 76104347 60713986 49509692
34628 49509692 43061142 40175065 39368594 38307452 34932736 30099228 26662055 25319514
$$ packed form
34682A3670562r51347K165116K895584J078047j382507k388170j446748q2976
34674A3557561J4274q35999r37670J88620J332858J810269K379798L404171L842722
34665B4756604L029879J975649J801360K142068K227849K401613L327996M619137
34657D6282155N478092O042391P051200Q733381J0818501J3078293J5340688J7721053
34649A30545754K1076851K5993010L1000380L3369450L1997465K7464846J9005081
34642C20452837M872892j2587705k6031813l0732724l0317310l0839686l1639653
34635A63176838k7508933j8707276j2361020j2743923j5751339j5390361j1204294
34628D9509692o448550k886077q06471j061142l374716m833508l437173j342541
$$ plain form
34620 25319514 23790734 20572596 16669700 12794689 8021178 2796683 296889 2452364
34612 2452364 6922187 10410879 12909912 15937214 18405120 17597055 13454774 8854155
34604 8854155 5959434 4931224 5721609 8074727 9761003 8050164 3646393 257502
34596 257502 -648411 -1589347 -4059786 -4952644 -839792 6251196 10709547 10189242 7518293
34587 7518293 5955346 5588378 5095002 4267307 3197004 1000029 -2539800 -5219494 -4545212
34578 -4545212 -1280392 1132009 817066 -733922 -1604735 -2236349 -3981556 -6393744 -7809444
34569 -7809444 -7847931 -7444801 -6847580 -5687022 -5011834 -6797538 -10582048 -12852623 -11366639
34560 -11366639 -8316084 -7171057 -7676081 -6502811 -2429061 1755932 3085436 2101755
$$ packed form
34620B5319514j528780l218138l902896l875011m773511n224495k499794K155475
34612B452364M469823L488692K499033L027302K467906q08065m142281m600619
34604H854155k894721j028210P90385K353118J686276j710839m403771l388891
34596B57502r05913r40936k470439q92858M112852P090988M458351n20305k670949
34587G518293j562947l66968m93376q27695j070303k196975l539829k679694O74282
34578d545212L264820K412401l14943j550988q70813o31614j745207k412188j415700
34569g809444l8487M03130N97221J160558O75188j785704l784510k270575J485984
34560a1366639L050555J145027n05024J173270M073750M184993J329504r83681
$$ plain form
34552 2101755 1541163 2567396 3676434 3076689 1164175 104973 990431 2091085 998735
34543 998735 -1621529 -2223852 800448 4450162 5144434 3747881 3752303 5424942 5307118
34534 5307118 1760601 -2455436 -4248111 -3737179 -2174609 678683 4703174 7359304
34526 7359304 6491463 3837528 2936250 4373806 5669243 5230259 3843938 2580805 1717868
34517 1717868 1613843 2201409 1628236 -1950410 -6871398 -9002336 -7151986 -4766223 -4805834
34508 -4805834 -5492978 -3407249 1071703 4224550 4070182 2290112 1129742 826238 757160
34499 757160 1065139 1760086 1448521 -1330498 -5637850 -8261107 -6814459 -2253384 2054539
34490 2054539 3534499 2421537 862545 601081 1695064 2939196 2975887 1256823 -1368433
$$ packed form
34552B101755n60592J026233J109038n99745j912514j059202Q85458J100654j092350
34543I98735k620264o02323L024300L649714O94272j396553M422J672639j17824
34534E307118l546517m216037j792675N10932J562570K853292M024491K656130
34526G359304q67841k653935r01278J437556J295437m38984j386321j263133q62937
34517A717868j04025N87566n73173l578646m920988k130938J850350K385763l9611
34508d805834o87144K085729M478952L152847j54368j780070j160370l03504o9078
34499G57160L07979O94947l11565k779019m307352k623257J446648M561075M307923
34490B054539J479960j112962j558992k61464J093983J244132L6691j719064k625256
$$ plain form
34481 -1368433 -2990055 -2297242 -166488 1092028 506014 -277914 678558 2522598 2162015
34472 2162015 -1880576 -7309752 -10498157 -10357595 -8815640 -7825598 -7134085 -5327919 -2146043
34463 -2146043 1025154 2679760 2693724 2356853 3069705 4781514 5695664 4061700 430874
34454 430874 -2588058 -3167780 -1953600 -344405 1621627 4238759 6031256 4920773
34446 4920773 1423113 -1497374 -2225536 -2107240 -2559661 -2845547 -2179198 -1937343 -3489959
34437 -3489959 -5229844 -4403902 -1245019 1368670 2174930 2627698 3322493 2389139 -882441
34428 -882441 -3291843 -1335552 3545292 6197074 4357617 1536082 2209794 5960113
34420 5960113 8223274 6150852 1759347 -1084657 -1277507 -1040974 -2633061 -5637308
$$ packed form
34481a368433j621622O92813K130754J258516n86014p83928R56472J844040l60583
34472B162015m042591n429176l188405J40562J541955R90042O91513J806166L181876
34463b146043L171197J654606J3964l36871P12852J711809R14150j633964l630826
34454D30874l018932n79722J214180J609195J966032K617132J792497j110483
34446D920773l497660k920487p28162J18296m52421k85886O66349K41855j552616
34437c489959j739885Q25942L158883K613689Q06260M52768O94795r33354l271580
34428h82441k409402J956291M880844K651782j839457k821535O73712L750319
34420E960113K263161k072422m391505k844004j92850K36533j592087l004247
$$ plain form
34412 -5637308 -7493070 -6136939 -2237634 883929 125415 -4003845 -7544610 -7451853 -4838674
34403 -4838674 -2573532 -934265 1808348 5055560 5548147 2255909 -1479170 -2398774
34395 -2398774 -1409613 -1265328 -2519106 -4065508 -5484121 -6164015 -4240027 337695 3550370
34386 3550370 2001224 -1533784 -1642888 1488393 2453133 -619569 -3166582 -1611155
34378 -1611155 1486653 2420823 1984387 2545506 3127151 1609677 -704144 -1027357 41662
34369 41662 -321212 -2148939 -2669267 -787684 1854112 3880681 4979625 4233466 1292600
34360 1292600 -939908 1287473 6918810 10536419 9398844 6413513 4829918 3894503
34352 3894503 2095918 1111051 2988089 5754875 5698652 2914937 1029200 1742626 2907667
$$ packed form
34412e637308j855762J356131L899305L121563p58514m129260l540765R2757K613179
34403d838674K265142J639267K742613L247212M92587l292238l735079r19604
34395b398774R89161J44285j253778j546402j418613o79894J923988M577722L212675
34386C550370j549146l535008j09104L131281R64740l072702k547013J555427
34378a611155L097808R34170m36436N61119N81645j517474k313821l23213J069019
34369D1662l62874j827727n20328J881583K641796K026569J098944p46159k940866
34360A292600k232508K227381N631337L617609j137575k985331j583595r35415
34352C894503j798585r84867J877038K766786n6223k783715j885737P13426J165041
$$ plain form
34343 2907667 2323302 589911 -629249 -864608 -283477 1212891 2997259 3244933 1017510
34334 1017510 -1862024 -2329435 678681 5222851 8368334 8706412 7207456 5983326
34326 5983326 5934168 5615659 3225993 -274147 -1589757 520641 2997970 2427032 -108208
34317 -108208 -732678 1266924 2462768 823412 -1120698 -457939 1592084 2044379 939691
34308 939691 492741 693443 -626864 -3585153 -5542556 -5007169 -3128610 -722978 2886091
34299 2886091 6899784 8283388 5996499 3167283 2684536 3120281 1741787 -742386
34291 -742386 -1830693 -1952129 -3701468 -7044291 -9039848 -8427267 -7061809 -6273230 -5091531
34282 -5091531 -3207130 -2687470 -4865750 -7594462 -7603946 -4451662 -625030 1411218 1060925
$$ packed form
34343B907667n84365j733391j219160k35359N81131J496368J784368K47674k227423
34334A017510k879534m67411L008116M544170L145483L38078j498956j224130
34326E983326m9158l18509k389666l500140j315610K110398K477329n70938k535240
34317a08208o24470J999602J195844j639356j944110O62759K050023M52295j104688
34308I39691m46950K00702j320307k958289j957403N35387J878559K405632L609069
34299B886091M013693J383604k286889k829216m82747M35745j378494k484173
34291g42386j088307j21436j749339l342823j995557O12581J365458P88579J181699
34282e091531J884401N19660k178280k728712r484L152284L826632K036248l50293
$$ plain form
34273 1060925 -737570 -2473811 -2947348 -1993427 -518892 95544 -1333409 -4741941 -7723033
34264 -7723033 -6882655 -2001063 2422049 2252412 -643439 -1078151 1725909 3340281 1642386
34255 1642386 243165 2024643 3723641 1006962 -4177401 -6194355 -4107377 -2521127
34247 -2521127 -4174006 -6200908 -4874891 -592250 3456286 5129930 4373040 2290387
34239 2290387 600245 729199 2374192 3817440 4080805 3681492 3106992 2032103 452359
34230 452359 -788974 -964362 300325 3605959 8665008 12566456 11739987 6529705 1386991
34221 1386991 -666123 -1219444 -2548331 -3443087 -1829825 680551 558158 -2382683 -5078109
34212 -5078109 -6043963 -6398964 -6153450 -3693081 75785 1401334 -291011 -62583 5397027
$$ packed form
34273A060925j798495j736241m73537R53921J474535O14436j428953l408532k981092
34264g723033Q40378M881592M423112j69637k895851m34712K804060J614372j697895
34255A642386j399221J781478J698998k716679n184363k016954K086978J586250
34247b521127j652879k026902J326017M282641M048536J673644p56890k082653
34239B290387j690142J28954J644993J443248K63365l99313n74500j074889j579744
34230D52359j241333j75388J264687L305634N059049L901448q26469n210282n142714
34221A386991k053114n53321j328887q94756J613262K510376j22393k940841k695426
34212e078109r65854l55001K45514K460369L768866J325549j692345K28428N459610
$$ plain form
34203 5397027 11573757 11731910 6717515 3708869 5553935 7137243 3905906 -1323610
34195 -1323610 -3319435 -1982389 -602241 448816 3095930 6140329 6096109 3663416
34187 3663416 3971849 8694710 12722674 11539763 7870957 7092515 9036906 9160612 6349072
34178 6349072 4393365 5445810 6659649 5003816 1887750 656598 1852833 3392316
34170 3392316 3949262 3838639 3311139 2056048 325289 -870714 -833746 272550 1754057
34161 1754057 2753612 2733483 2084232 1687230 1510091 609770 -854293 -899709 1694980
34152 1694980 5018097 5859163 3571998 696983 -133557 1310719 3340591 4130534 2990934
34143 2990934 842396 -586406 -754606 -1052635 -2610192 -4181588 -3855907 -2266128 -1880895
$$ packed form
34203E397027O176730J58153n014395l008646J845066J583308l231337n229516
34195a323610j995825J337046J380148J051057K647114L044399m4220k432693
34187C663416L08433M722861M027964j182911l668806p78442J944391J23706k811540
34178F349072j955707J052445J213839j655833l116066j231152J196235J539483
34170C392316N56946j10623n27500j255091j730759j196003L6968J106296J481507
34161A754057R99555k0129o49251l97002j77139r00321j464063m5416K594689
34152A694980L323117Q41066k287165k875015q30540J444276K029872P89943j139600
34143B990934k148538j428802j68200k98029j557557j571396L25681J589779L85233
$$ plain form
34134 -1880895 -3140380 -3753492 -2412674 -703059 -113684 429701 2084347 3100984 969410
34125 969410 -3349487 -5893437 -4332413 -239542 3240102 4341224 3324148 1774351
34117 1774351 1481424 2856430 4474580 5067073 5255991 5964072 6224365 4844094 3314796
34108 3314796 3873505 4943050 2529367 -2833631 -4821680 382593 8081633 10978777
34100 10978777 8455314 5640952 4986221 3863994 458048 -2921012 -3807883 -2962299
34092 -2962299 -1899826 -227383 2471390 4788403 5743280 6524447 7708837 7090364 3053092
34083 3053092 -1884800 -4064380 -3673408 -3326207 -2989859 -508569 3247198 4440384 2389330
34074 2389330 1159963 2997075 4220579 910186 -4468805 -6307669 -3961313 -2110871
$$ packed form
34134a880895j259485o13112J340818J709615N89375N43385J654646J016637k131574
34125I69410m318897k543950J561024M092871L479644J101122j017076j549797
34117A774351k92927J375006J618150N92493J88918P08081K60293j380271j529298
34108C314796N58709J069545k413683n362998j988049N204273P699040K897144
34100A0978777k523463k814362o54731j122227l405946l379060q86871Q45584
34092b962299J062473J672443K698773K317013R54877P81167J184390o18473m037272
34083C053092m937892k179580L90972L47201L36348K481290L755767J193186k051054
34074B389330j229367J837112J223504l310393n378991j838864K346356J850442
$$ plain form
34066 -2110871 -3365607 -4880209 -3460854 -420808 879299 10619 -582148 397902 1401897
34057 1401897 326204 -2968827 -6699644 -8916706 -9012810 -7874096 -6654113 -5458443
34049 -5458443 -3574886 -927943 1356019 1973187 470653 -2601215 -5607229 -6134674
34041 -6134674 -3114653 939644 1828218 -1029101 -3172453 -898495 3341826 4204387
34033 4204387 1052288 -1256110 612244 4149821 5054060 2688057 -499563 -2749733
34025 -2749733 -3781612 -3448041 -2302331 -2573258 -5783192 -9607600 -9758980 -5399383 -323895
34016 -323895 2048019 2637823 4185427 6505357 6550851 2846590 -2149965 -4799355 -4315421
34007 -4315421 -3120185 -3496870 -4835632 -4726282 -2426467 -312041 -1254460 -4911273 -7583133
$$ packed form
34066b110871j254736j514602J419355L040046J300107q68680n92767R80050J003995
34057A401897j075693l295031l730817k217062r6104J138714J219983J195670
34049e458443J883557K646943K283962O17168j502534l071868l006014n27445
34041f134674L020021M054297Q88574k857319k143352K273958M240321Q62561
34033D204387l152099k308398J868354L537577R04239k366003l187620k250170
34025b749733j031879L33571J145710k70927l209934l824408j51380M359597N075488
34016c23895K371914N89804J547604K319930M5494l704261m996555k649390M83934
34007d315421J195236l76685j338762J09350K299815K114426r42419l656813k671860
$$ plain form
33998 -7583133 -6224694 -2036857 851775 372204 -937159 529594 4059601 4966185
33990 4966185 1032426 -3763538 -4294126 -1469789 -905964 -4683533 -8495756 -8352174 -6232504
33981 -6232504 -6174076 -7725249 -7265143 -4248005 -1905973 -2015062 -2772773 -2377058 -1446593
33972 -1446593 -1005805 -847307 -879527 -1637012 -2511648 -1865155 140159 1241250 622599
33963 622599 168942 859056 680264 -1874380 -4664230 -4694436 -2238916 201541 1540917
33954 1540917 2381904 2977322 3224872 3604155 4055335 3142136 348833 -2283564 -3049684
33945 -3049684 -3338102 -4785435 -5643700 -3585265 -453980 256293 -347190 1918972 6478118
33936 6478118 7461064 2625340 -2701394 -3488937 -1874124 -2207782 -3535194 -2253102 663379
$$ packed form
33998g583133J358439M187837K888632m79571j309363J466753L530007R06584
33990D966185l933759m795964n30588K824337N63825l777569l812223J43582K119670
33981f232504N8428j551173M60106L017138K342032j09089p57711L95715R30465
33972a446593M40788J58498l2220p57485q74636O46493K005314J101091o18651
33963F22599m53657O90114j78792k554644k789850l0206K455520K440457J339376
33954A540917Q40987N95418K47550L79283M51180r13199k793303k632397p66120
33945c049684k88418j447333q58265K058435L131285P10273o03483K266162M559146
33936F478118R82946m835724n326734p87543J614813l33658j327412J282092K916481
$$ plain form
33927 663379 1081163 -848093 -595153 3126803 6094284 5328663 3349865 3451021 4802483
33918 4802483 5177161 5200463 6337081 7047199 4855607 925628 -1213637 -918816 -820528
33909 -820528 -2064402 -2784812 -1928268 -1135576 -1504819 -1548038 -186752 834379 -327814
33900 -327814 -2611563 -3952802 -4237572 -4110291 -2946313 -798863 -315789 -3165419 -6174407
33891 -6174407 -5264297 -2218668 -2543978 -6565086 -8128026 -3634669 2938810 6713317
33883 6713317 8637198 11594660 13958759 12264671 7799341 5053796 4705407 3275578
33875 3275578 -446441 -3501264 -3849237 -2957977 -2199943 -743063 1279016 1216092 -2033454
33866 -2033454 -5275571 -5086239 -2587064 -1399891 -2271452 -2667345 -1184792 445688 304030
$$ packed form
33927F63379M17784j929256K52940L721956K967481p65621j978798J01156J351462
33918D802483L74678K3302J136618P10118k191592l929979k139265K94821R8288
33909h20528j243874p20410Q56544P92692l69243m3219J361286J021131j162193
33900c27814k283749j341239k84770J27281J163978K147450M83074k849630l008988
33891f174407R10110L045629l25310m021108j562940M493357O573479L774507
33883F713317J923881K957462K364099j694088m465330k745545l48389j429829
33875C275578l722019l054823l47973Q91260P58034J456880K022079o2924l249546
33866b033454l242117J89332K499175J187173q71561l95893J482553J630480j41658
$$ plain form
33857 304030 -855605 -945815 292269 1024308 334213 82461 2405456 5936064 6647456
33848 6647456 3145151 -1026050 -2092469 -1291305 -2749050 -7026355 -9878383 -7792896
33840 -7792896 -2284075 2106980 2334324 -1102381 -4955531 -5700998 -2814501 165733
33832 165733 -612595 -4606236 -7810680 -8158201 -7413664 -7433098 -7413598 -5920043 -3221696
33823 -3221696 -405403 1794089 2435903 1034991 -306772 1664603 6220737 7987840
33815 7987840 3893161 -1828431 -2779752 1228494 4543575 3623806 935471 377989 1913134
33806 1913134 2510914 842795 -1045503 -779657 1082898 1987268 1082633 171092 363033
33797 363033 -32035 -2391824 -4579130 -3893841 -1760880 -1553451 -2553232 -876144 3347716
$$ packed form
33857C04030j159635r0210J238084P32039o90095k51752K322995L530608P11392
33848F647456l502305m171201j066419Q01164j457745m277305k852028K085487
33840g792896N508821M391055K27344l436705l853150p45467K886497K980234
33832A65733p78328l993641l204444l47521P44537j9434J9500J493555K698347
33823c221696K816293K199492O41814j400912j341763J971375M556134J767103
33815G987840m094679n721592r51321M008246L315081r19769k688335n57482J535145
33806A913134N97780j668119j888298K65846J862555R04370r04635r11541J91941
33797C63033l95068k359789k187306O85289K132961K07429r99781J677088M223860
$$ plain form
33788 3347716 5101115 2429147 714 1856899 5306016 5759802 3602960 1942868
33780 1942868 896786 -1087488 -2728941 -1686054 706904 968394 -1346791 -3874112
33772 -3874112 -5511197 -6326903 -4872184 -43796 5206951 6402834 3486198 484932
33764 484932 -215750 453582 1593104 3321466 4672711 4177871 2375265 745632 -830926
33755 -830926 -2437445 -1947902 1357077 3241833 -151027 -5339222 -5935735 -2413362 -438312
33746 -438312 -637455 1623569 6053155 6230089 821699 -2807884 107939 4859367 6062862
33737 6062862 5604444 6420901 5702006 973856 -3248618 -2198845 912113 931812 365340
33728 365340 4530773 10621598 10697600 3948465 -2589424 -4887144 -5339452 -5397721 -3092233
$$ packed form
33788C347716J753399k671968k428433J856185L449117M53786k156842j660092
33780A942868j046082j984274j641453J042887K392958K61490k315185k527321
33772c874112j637085q15706J454719M828388N250747J195883k916636l001266
33764D84932p00682O69332J139522J728362J351245m94840j802606j629633j576558
33755h30926j606519M89543L304979J884756l392860n188195n96513L522373J975050
33746d38312j99143K261024M429586J76934n408390l629583K915823M751428J203495
33737F062862m58418Q16457p18895m728150m222474J049773L110958J9699n66472
33728C65340M165433O090825P6002o749135o537889k297720m52308n8269K305488
$$ plain form
33719 -3092233 769912 1609932 -1302096 -2832496 -387533 1662094 -647548 -4313268
33711 -4313268 -4218943 -553092 2713379 3812917 3762604 3075761 1529604 -6861 -525406
33702 -525406 -901147 -2495489 -4259152 -3498459 325966 4209263 4736571 2061685 -1646
33693 -1646 1638025 5338560 6594734 4095378 1452091 1478744 1712343 -1212810 -5136040
33684 -5136040 -4893231 -292857 3362917 3022644 1447659 1905918 3706364 4880584 5406620
33675 5406620 5384284 3323008 -1023412 -4671372 -4873607 -2584853 -320631 1349379 2966218
33666 2966218 3921431 3522600 2688671 2253231 1064218 -1966930 -5351565 -6875898 -6699926
33657 -6699926 -6326862 -5744454 -4118100 -2355887 -2293602 -3771023 -4945450 -5250948 -5738920
$$ packed form
33719c092233L862145Q40020k912028j530400K444963K049627k309642l665720
33711d313268R4325L665851L266471J099538n0313o86843j546157j536465n18545
33702e25406l75741j594342j763663P60693L824425L883297N27308k674886k063331
33693a646J639671L700535J256174k499356k643287K6653K33599k925153l923230
33684e136040K42809M600374L655774l40273j574985M58259J800446J174220N26036
33675E406620k2336k061276m346420l647960k02235K288754K264222J670010J616839
33666B966218R55213l98831q33929m35440j189013l031148l384635j524333J75972
33657f699926L73064N82408J626354J762213O2285j477421j174427l05498m87972
$$ plain form
33648 -5738920 -6571088 -6498441 -5184636 -4021992 -3947291 -3986091 -2760859 -378719 1932791
33639 1932791 3423981 4376821 5139468 4935514 2214992 -3022389 -7560052 -7339680 -2321233
33630 -2321233 2552083 2670939 -1060532 -3982430 -3680636 -2113766 -1993901 -3314079 -4267867
33621 -4267867 -4071217 -3596326 -3714924 -3993199 -3198958 -785275 2369498 4767921 5638670
33612 5638670 5223900 4036124 2448958 835557 -699102 -2580710 -4745588 -5551158
33604 -5551158 -3259441 1113975 4160186 4073194 2704090 2597563 3574774 3750299 2637078
33595 2637078 1428905 990895 1278831 2192345 3384688 3687467 2381837 759414 759885
33586 759885 2157183 2789510 1762921 750285 1477217 3263397 4014301 2862633 863270
$$ packed form
33648e738920q32168P2647J313805J162644P4701l8800J225232K382140K311510
33639A932791J491190R52840P62647k03954k720522n237381m537663K20372N018447
33630b321233M873316J18856l731471k921898L01794J566870J19865j320178r53788
33621d267867J96650M74891j18598k78275P94241K413683L154773K398423Q70749
33612E638670m14770j187776j587166j613401j534659j881608k164878q05570
33604e551158K291717M373416L046211q6992j369104j06527R77211J75525j113221
33595B637078j208173m38010K87936R13514J192343L02779j305630j622423M71
33586G59885J397298O32327j026589j012636P26932J786180P50904j151668j999363
$$ plain form
33577 863270 -647439 -1588166 -2847752 -4819570 -6600912 -6820515 -5097926 -2414729 -170225
33568 -170225 821113 667203 268736 563892 1272616 922607 -863713 -1835106 336505
33559 336505 4284518 6066361 4425987 2414826 2669441 3562623 2016957 -1705977 -4406700
33550 -4406700 -4166468 -2071026 -196530 513947 676145 1782087 4472364 6894764 6158064
33541 6158064 2278899 -1145232 -1485178 -247257 -22078 -636185 -774612 -1151304 -2875442
33532 -2875442 -4471298 -4062390 -3005107 -3432654 -3539349 -75489 4974234 5511674 -67599
33523 -67599 -6315907 -8300975 -7088765 -5609485 -3754264 -901950 547174 -1596781
33515 -1596781 -4895788 -5098528 -1994979 928308 1527772 486974 -1280427 -3394396
$$ packed form
33577H63270j510709r40727j259586j971818j781342k19603J722589K683197K244504
33568a70225R91338j53910l98467K95156P08724l50009j786320r71393K171611
33559C36505L948013J781843j640374k011161K54615Q93182j545666l722934k700723
33550d406700K40232K095442J874496P10477J62198J105942K690277K422400p36700
33541F158064l879165l424131l39946J237921K25179o14107j38427l76692j724138
33532b875442j595856M08908J057283m27547j06695L463860N049723N37440n579273
33523f7599o248308j985068J212210J479280J855221K852314J449124k143955
33515a596781l299007k02740L103549K923287N99464j040798j767401k113969
$$ plain form
33507 -3394396 -4528339 -3181309 -37115 2799599 4720068 6370863 6897741 4515236
33499 4515236 288136 -1699837 650384 4589380 6319506 5792258 5648839 6650177
33491 6650177 6764088 4826739 2821174 3338682 6011320 7923484 7162318 4572493 1912615
33482 1912615 -270319 -2220637 -3712054 -4470092 -5022211 -5682361 -5298592 -2758145 467853
33473 467853 1184738 -1742034 -5937834 -8192022 -7293879 -4188880 -966214 174029 -1170895
33464 -1170895 -2403367 -609914 3196476 4805433 2314636 -1738236 -4566688 -6255055
33456 -6255055 -7061035 -5090876 347969 5721250 7094508 5226097 3546472 2755536
33448 2755536 1133294 -1123346 -2111681 -2251569 -3861823 -6538645 -7037967 -4516491 -2059946
$$ packed form
33507c394396j133943J347030L144194K836714J920469J650795N26878k382505
33499D515236m227100j987973K350221L938996J730126n27248j43419J001338
33491F650177J13911j937349k005565N17508K672638J912164p61166k589825k659878
33482A912615k182934j950318j491417p58038n52119o60150L83769K540447L225998
33473D67853P16885k926772m195800k254188Q98143L104999L222666J140243j344924
33464a170895j232472J793453L806390J608957k490797m052872k828452j688367
33456f255055q05980J970159N438845N373281J373258j868411j679625p90936
33448B755536j622242k256640r88335j39888j610254k676822m99322K521476K456545
$$ plain form
33439 -2059946 -1772749 -1888403 -394603 1690227 2701160 3249196 4447224 5330488 4390558
33430 4390558 2214481 598866 203310 687193 1942689 3617917 4537250 4123633 3524686
33421 3524686 4106355 5660227 6969038 7126760 5709122 3077384 1113035 1834665 4528029
33412 4528029 6323684 6406141 6941302 8560689 8317220 4660941 1251227 2136479 5480820
33403 5480820 6280490 3738497 1383486 675356 -565796 -3004962 -3833450 -1468120 1690969
33394 1690969 3105284 3410714 3785070 3013790 -100307 -3605578 -4676840 -3794510 -3823174
33385 -3823174 -5345156 -5499513 -2074141 2934962 5133708 2886347 -343986 170394
33377 170394 4390359 7103307 4563961 -562232 -3237329 -3071847 -3448094 -4631347 -2897180
$$ packed form
33439b059946K87197j15654J493800K084830J010933N48036J198028Q83264r39930
33430D390558k176077j615615l95556M83883J255496J675228R19333m13617n98947
33421C524686N81669J553872J308811J57722j417638k631738j964349P21630K693364
33412D528029J795655Q2457N35161J619387k43469l656279l409714Q85252L344341
33403E480820P99670k541993k355011p08130j241152k439166q28488K365330L159089
33394A690969J414315L05430L74356p71280l114097l505271j071262Q82330k8664
33385c823174j521982j54357L425372N009103K198746k247361l230333N14380
33377A70394M219965K712948k539346n126193k675097J65482l76247j183253J734167
$$ plain form
33368 -2897180 2503805 6584853 5419252 1529869 -766507 -1675401 -3443384 -4575764
33360 -4575764 -1698851 4151262 8056060 7831970 5897498 4484935 3167611 1841543
33352 1841543 2186288 4532218 6198404 4640655 293754 -4649820 -8230776 -8819143
33344 -8819143 -5644016 -388909 3665530 5062600 5124689 5240179 5501666 6376211 8704650
33335 8704650 10917391 9366114 3407866 -2422016 -3640606 -1218110 501219 -557180
33327 -557180 -3043613 -5085145 -5659742 -4038506 -363782 3648379 6409540 8149521
33319 8149521 9272541 8281699 3723077 -2527141 -6437226 -6244757 -3802548 -1708643
33311 -1708643 -996234 -1599050 -3197145 -5151160 -6696318 -7319585 -6441846 -3624264 -44848
$$ packed form
33368b897180N400985M081048j165601l889383k296376r08894j767983j132380
33360d575764K876913N850113L904798k24090j934472j412563j317324j326068
33352A841543L44745K345930J666186j557749m346901m943574l580956n88367
33344h819143L175127N255107M054439J397070O2089J15490K61487Q74545K328439
33335H704650K212741j551277n958248n829882j218590K422496J719329j058399
33327e57180k486433k041532n74597J621236L674724M012161K761161J739981
33319H149521J123020r90842m558622o250218l910085J92469K442209K093905
33311a708643P12409o02816j598095j954015j545158o23267Q77739K817582L579416
$$ plain form
33302 -44848 1573177 103944 -2144861 -2531349 -1582329 -1146721 -678224 1408508 3738951
33293 3738951 3234922 269975 -1367722 -285601 640116 -456721 -1050559 1581549 5794465
33284 5794465 7961435 7281531 5487514 3432275 849258 -1444883 -1897905 -639680
33276 -639680 514391 507829 -43353 -289191 -156908 3152 -302406 -1577177 -3469035
33267 -3469035 -4345041 -2870886 51118 1873071 991368 -1846777 -4549417 -5496506 -4575235
33258 -4575235 -3020425 -2155062 -1990482 -1364911 337378 2215334 3016198 2644616 1910411
33249 1910411 1279306 607276 -88085 -247109 646157 2218358 3124659 2236115 130774
33240 130774 -1225116 -827655 125787 250409 244097 1580332 3641073 4152944 2272554
$$ packed form
33302d4848J618025j469233k248805l86488R49020M35608M68497K086732K330443
33293C738951n04029k964947j637697J082121R25717j096837n93838K632108M212916
33284E794465K166970o79904j794017k055239k583017k294141m53022J258225
33276f39680J154071o562n51182k45838J32283J60060l05558j274771j891858
33267c469035q76006J474155K922004J821953q81703k838145k702640r47089R21271
33258d575235J554810Q65363J64580O25571J702289J877956Q00864l71582p34205
33249A910411o31105o72030o95361j59024Q93266J572201R06301q88544k105341
33240A30774j355890L97461R53442J24622o312J336235K060741N11871j880390
$$ plain form
33231 2272554 -700451 -3499526 -5600875 -5848375 -3028360 1568904 4546147 4174368
33223 4174368 1782669 -891540 -3167192 -3949747 -2151544 409457 46565 -3353580
33215 -3353580 -5572229 -4585486 -3657062 -5134157 -5706531 -2197284 1912497 1429547 -1896088
33206 -1896088 -2089703 1229666 2649656 454825 -737030 1597940 3312452 525056
33198 525056 -4099812 -5913816 -5236272 -5513258 -7133995 -7349686 -5179716 -2781629 -2061797
33189 -2061797 -2375454 -1750288 938056 4742108 6836773 4860694 -106864 -4078334
33181 -4078334 -4580674 -3237775 -2935505 -3949770 -4371636 -3082195 -464716 3111309 7598804
33172 7598804 11970563 14010307 12224698 7834730 4317607 4125759 5620742 4518362
$$ packed form
33231B272554k973005k799075k101349k47500K820015M597264K977243l71779
33223D174368k391699k674209k275652p82555J798203K561001l62892l400145
33215c353580k218649R86743R28424j477095n72374L509247M109781m82950l325635
33206a896088j93615L319369J419990k194831j191855K334970J714512k787396
33198E25056m624868j814004O77544k76986j620737k15691K169970K398087P19832
33189b061797l13657O25166K688344L804052K094665j976079m967558l971470
33181d078334n02340J342899L02270j014265m21866J289441K617479L576025M487495
33172G598804M371759K039744j785609m389968l517123j91848J494983j102380
$$ plain form
33164 4518362 -654290 -6043632 -7177314 -4667502 -2593121 -2528053 -2761246 -2713992 -3682998
33155 -3682998 -4837067 -3223888 771030 2557135 219516 -2031265 -246201 3439948
33147 3439948 4988719 4803315 5588744 6957612 7026759 6944960 8504333 9059659 4832942
33138 4832942 -1385096 -2220421 3621144 8512235 6004984 -995588 -5112813 -3803741
33130 -3803741 -402177 1473808 971196 -1149894 -3465570 -3907168 -1154281 3583477
33122 3583477 7296414 7934014 6146973 4536996 5143645 7083788 7030767 3117597 -2125711
33113 -2125711 -4433222 -3108640 -1422864 -1559373 -1945311 -807809 237361 -1562770
33105 -1562770 -5774762 -9126778 -9652741 -8514056 -7734853 -7738757 -7590580 -6714282 -5669070
$$ packed form
33164D518362n172652n389342j133682K509812K074381O5068k33193M7254r69006
33155c682998j154069J613179L994918J786105k337619k250781J785064L686149
33147C439948J548771j85404P85429J368868O9147q1799J559373N55326m226717
33138D832942o218038q35325N841565M891091k507251p000572m117225J309072
33130c803741L401564J875985n02612k121090k315676m41598K752887M737758
33122C583477L712937O37600j787041j609977O06649J940143n3021l913170n243308
33113b125711k307511J324582J685776j36509l85938J137502J045170j800131
33105a562770m211992l352016n25963J138685P79203l904J48177Q76298J045212
$$ plain form
33096 -5669070 -5269819 -5214401 -4074366 -1099317 2370654 4128324 3557787 1992601 858054
33087 858054 571525 1079192 2025587 2287498 883430 -1272979 -2006698 -794512 393183
33078 393183 -151719 -1616919 -1984924 -473255 2095054 4300953 4820826 3186770 617471
33069 617471 -790064 -289437 820922 837166 -1017892 -4556841 -8151719 -8602092 -4140343
33060 -4140343 2064953 4479379 2285510 481055 2131667 3431803 -127454 -6017164
33052 -6017164 -7890800 -4630294 -944231 376099 1333342 3225195 3646448 1215471
33044 1215471 -1040689 -113334 2277691 2594187 758114 -770250 -1451140 -2653585 -4037200
33035 -4037200 -3480976 -823840 1250013 848098 -790636 -1467518 -769089 333264 1175775
$$ packed form
33096e669070L99251N5418J140035K975049L469971J757670n70537j565186j134547
33087H58054k86529N07667R46395K61911j404068k156409p33719J212186J187695
33078C93183n44902j465200l68005J511669K568309K205899N19873j634056k569299
33069F17471j407535N00627J110359J6244j855058l538949l594878m50373M461749
33060d140343O205296K414426k193869j804455J650612J300136l559257n889710
33052f017164j873636L260506L686063J320330R57243J891853M21253k430977
33044A215471k256160R27355K391025L16496j836073j528364o80890j202445j383615
33035d037200N56224K657136K073853m01915j638734o76882O98429J102353Q42511
$$ plain form
33026 1175775 1528795 1031567 -257912 -1200911 -525289 1548476 3218391 2745641 19692
33017 19692 -3354307 -5296683 -4743242 -2290594 342103 1410043 48109 -3199263 -6457353
33008 -6457353 -7753282 -6798280 -5209498 -4471201 -4244965 -3426382 -2058538 -776683 1087362
32999 1087362 4706689 8762720 9598665 5808578 974734 -85940 3222979 7448091
32991 7448091 9743405 9942223 8455978 5192015 1441591 107125 2090282 4192054
32983 4192054 2847280 -1012661 -3111050 -1513056 1118549 1380681 -729418 -2605627
32975 -2605627 -2568295 -1106982 771036 2765252 4507641 4777950 2579466 -1179150 -3961821
32966 -3961821 -3954016 -1749668 587867 1683036 1586164 857636 -170875 -1277297 -2309838
$$ packed form
33026A175775L53020m97228j289479r42999O75622K073765J669915m72750k725949
33017A9692l373999j942376N53441K452648K632697J067940j361934l247372l258090
33008f457353j295929R55002J588782P38297K26236Q18583J367844J281855J864045
32999A087362L619327M056031Q35945l790087m833844j060674L308919M225112
32991G448091K295314J98818j486245l263963l750424j334466J983157K101772
32983D192054j344774l859941k098389J597994K631605K62132k110099j876209
32975b605627L7332J461313J878018J994216J742389K70309k198484l758616k782671
32966c961821P805K204348K337535J095169r6872p28528j028511j106422j032541
$$ plain form
32957 -2309838 -3326561 -4063022 -3403143 -471191 3662564 6657956 7692022 8263211 9603720
32948 9603720 10723846 10080817 7942830 5779432 4280520 3332299 3088443 3631428 4298406
32939 4298406 4696273 5528873 6959904 7269074 5123965 2244658 1439747 2693857 3896582
32930 3896582 4910945 7514906 11051151 11927585 8923015 5635182 5391228 6529134
32922 6529134 5644186 3421729 3690137 7431180 11022652 10777567 6892504 2385854 -60068
32913 -60068 392749 2884877 5583861 6837744 6089079 3676352 308918 -2775376 -4041788
32904 -4041788 -3163829 -1685992 -1035628 -572465 938648 2675000 2747395 1732807 2646984
32895 2646984 6378064 9353968 7747493 2815405 -228686 1501201 5481785 7573311
$$ packed form
32957b309838j016723p36461O59879K931952M133755K995392J034066N71189J340509
32948I603720J120126o43029k137987k163398j498912r48221k43856N42985O66978
32939D298406L97867Q32600J431031L09170k145109k879307q04911J254110J202725
32930C896582J014363K603961L536245Q76434l004570l287833k43954J137906
32922F529134q84948k222457K68408L741043L591472k45085l885063m506650k445922
32913f0068M52817K492128K698984J253883p48665k412727l367434l084294j266412
32904d041788Q77959J477837O50364M63163J511113J736352P2395j014588R14177
32895B646984L731080K975904j606475m932088l044091J729887L980584K091526
$$ plain form
32887 7573311 7119959 6846249 8635252 11177473 11798955 9229643 4374729 -277697 -1688990
32878 -1688990 1529566 6856150 9289579 6555510 1758389 -653403 -166754 631636
32870 631636 719073 1335955 2604403 2976050 2442846 2960844 4775957 5537789 4319648
32861 4319648 3253216 3411677 2396842 -1387295 -4940871 -4372849 -395109 3023539
32853 3023539 3924014 3278218 2085015 691502 -19504 275595 -56006 -2218228 -4379587
32844 -4379587 -4318421 -3296856 -3989143 -5892901 -6589724 -6359058 -7139758 -7755001 -5257841
32835 -5257841 -949097 450806 -1513955 -1840518 1590957 4123400 1861271 -1979379
32827 -1979379 -2402420 -197310 591147 -350398 -333982 545917 -375006 -2975820 -3975863
$$ packed form
32887G573311m53352k73710J789003K542221O21482k569312m854914m652426j411293
32878a688990L218556N326584K433429k734069m797121k411792M86649P98390
32870F31636Q7437O16882J268448L71647n33204N17998J815113P61832j218141
32861D319648j066432J58461j014835l784137l553576N68022L977740L418648
32853C023539R00475o45796j193203j393513p11006K95099l31601k162222k161359
32844d379587O1166J021565o92287j903758o96823K30666p80700o15243K497160
32835e257841M308744J399903j964761l26563L431475K532443k262129l840650
32827a979379m23041K205110P88457r41545J6416Q79899r20923k600814j000043
$$ plain form
32818 -3975863 -2261846 -691465 -1753293 -4436430 -6305068 -6400389 -5428373 -4885770 -6238167
32809 -6238167 -9222869 -11034699 -9130208 -4791029 -1891827 -2126166 -3533675 -3817411
32801 -3817411 -2803817 -1163387 983928 3165627 4074066 3184422 1676168 871985 712499
32792 712499 300206 -1073790 -3769801 -7371561 -9973567 -9347448 -5648926 -1816306 -451196
32783 -451196 -1291438 -2453571 -2927589 -2734378 -1690674 380055 2492900 2904908 926763
32774 926763 -2290662 -4728676 -4740954 -1685750 3642446 8978137 11812192 11321367 8923515
32765 8923515 6651677 5233564 4058176 2638360 1402157 1020074 1598294 2732872
32757 2732872 3783122 3956904 3024368 2348025 3964901 7585734 9716339 7548727 2957677
$$ packed form
32818c975863J714017J570381j061828k683137j868638r5321R72016N42603j352397
32809f238167k984702j811830J904491M339179K899202k34339j407509k83736
32801c817411J013594J640430K147315K181699R08439q89644j508254q04183j59486
32792G12499m12293j373996k696011l601760k602006O26119L698522L832620J365110
32783d51196q40242j162133m74018J93211J043704K070729K112845M12008j978145
32774I26763l217425k438014j2278L055204N328196N335691K834055m90825k397852
32765H923515k271838j418113j175388j419816j236203l82083N78220J134578
32757B732872J050250J73782r32536o76343J616876L620833K130605k167612m591050
$$ plain form
32748 2957677 404202 1169569 2289477 1503410 251491 449223 1156292 758516 261048
32739 261048 1514282 3536305 3713160 2089189 1428974 2927374 4686336 5090196 5123978
32730 5123978 6103084 7136168 6516421 4377113 2242202 505553 -1990494 -5628117
32722 -5628117 -8493555 -8210608 -5094828 -2310310 -2102593 -2808869 -1280093 2124647 3469549
32713 3469549 874523 -2498859 -2944721 -1258897 -498444 -644468 754284 3512033 4581082
32704 4581082 3228702 2390646 3531297 3860480 976813 -2671296 -2964113 86723 2759084
32695 2759084 2910550 2019475 2170105 3490256 4974384 5935175 5965709 4846304 3226261
32686 3226261 2374093 2448140 1755859 -1273062 -5639927 -8354947 -7778649 -5517774 -4226922
$$ packed form
32748B957677k553475P65367J119908p86067j251919J97732P07069l97776m97468
32739B61048J253234K022023J76855j623971o60215J498400J758962M03860L3782
32730E123978R79106J033084o19747k139308k134911j736649k496047l637623
32722e628117k865438K82947L115780K784518K07717p06276J528776L404740J344902
32713C469549k595026l373382m45862J685824P60453j46024J398752K757749J069049
32704D581082j352380q38056J140651L29183k883667l648109k92817L050836K672361
32695B759084J51466q91075J50630J320151J484128R60791L0534j119405j620043
32686C226261q52168P4047o92281l028921m366865k715020N76298K260875J290852
$$ plain form
32677 -4226922 -4250394 -3832729 -2335569 -1168979 -925527 108793 2905240 5121276 4061137
32668 4061137 822487 -1474259 -2668375 -5150311 -8528080 -8781417 -4124827 1778406
32660 1778406 4579680 4325626 3258102 1205459 -3228199 -8236167 -9514048 -5767910
32652 -5767910 -622197 1914896 1743107 1157060 733303 -1074538 -4319758 -5705460 -2189631
32643 -2189631 4148186 7358838 4802084 803557 946102 4648577 6777705 5394947
32635 5394947 3460762 2845905 1707492 -624978 -1121674 1618589 3798523 2064364
32627 2064364 -817105 -394925 2295423 3148357 2396078 3732166 6959961 7610236 4341833
32618 4341833 1027491 86673 -956695 -4001691 -6230104 -4671487 -1311135 -142505
$$ packed form
32677d226922k3472M17665J497160J166590K43452J034320K796447K216036j060139
32668D061137l238650k296746j194116k481936l377769k53337M656590N903233
32660A778406K801274k54054j067524k052643m433658n007968j277881L746138
32652e767910N145713K537093j71789n86047m23757j807841l245220j385702L515829
32643b189631O337817L210652k556754l998527J42545L702475K129128j382758
32635E394947j934185o14857j138413k332470m96696K740263K179934j734159
32627B064364k881469M22180K690348Q52934p52279J336088L227795O50275l268403
32618D341833l314342r40818j043368l044996k228413J558617L360352J168630
$$ plain form
32610 -142505 -1642171 -3425565 -4423223 -5196561 -5442930 -4223543 -2048998 -357569 610404
32601 610404 1524289 2163656 1754178 737977 694444 2648781 6185672 9474320 9685540
32592 9685540 5077538 -2104219 -6536099 -5354454 -1370128 913591 752865 402903
32584 402903 639655 207801 -969526 -1178171 350220 2524803 4286098 5214737 4438960
32575 4438960 1436724 -1999179 -3110258 -1713239 29828 1335209 3219785 4919504
32567 4919504 3731960 -97058 -2130518 49126 2667788 1205203 -2560928 -3089619
32559 -3089619 853417 5077811 6484822 6291665 6109904 4941768 1918934 -1046989
32551 -1046989 -1592349 83748 2260963 3921422 4342045 2482756 -1111879 -3381902
$$ packed form
32610a42505j499666j783394r97658p73338k46369J219387K174545J691429R67973
32601F10404R13885O39367m09478j016201m3533J954337L536891L288648K11220
32592I685540m608002p181757m431880J181645L984326K283719j60726l49962
32584D02903K36752m31854j177327k08645J528391K174583J761295R28639p75777
32575D438960l002236l435903j111079J397019J743067J305381J884576J699719
32567D919504j187544l829018k033460K179644K618662j462585l766131n28691
32559c089619L943036M224394J407011j93157j81761j168136l022834k965923
32551a046989n45360J676097K177215J660459M20623j859289l594635k270023
$$ plain form
32543 -3381902 -1981461 1701313 4792675 6875506 9216427 11239774 10942580 8540542
32535 8540542 6552142 5856706 4544754 1462191 -1783173 -3424872 -3654624 -2915058 -676720
32526 -676720 2339190 3221089 586858 -2661042 -2946347 -858187 474796 546875 1561078
32517 1561078 3871355 5080023 4252224 3608057 4646334 5497734 4134053 1993568 2009588
32508 2009588 4358867 6523297 6950622 6531130 6514474 6735145 6286352 4776165 2505263
32499 2505263 183570 -1215595 -950511 686487 2227929 1957588 -763645 -4748318
32491 -4748318 -7613954 -7765023 -5961081 -4351126 -3773941 -2877160 -407599 2655029 4365523
32482 4365523 4535524 4647307 5069428 4032936 286851 -4373386 -6745378 -6167426 -5306250
$$ packed form
32543c381902J400441L682774L091362K082831K340921K023347k97194k402038
32535H540542j988400o95436j311952l082563l245364j641699k29752P39566K238338
32526f76720L015910Q81899k634231l247900k85305K088160J332983P2079J014203
32517A561078K310277J208668q27799o44167J038277Q51400j363681k140485J6020
32508B009588K349279K164430M27325m19492j6656K20671m48793j510187k270902
32499B505263k321693j399165K65084J636998J541442k70341k721233l984673
32491d748318k865636j51069J803942J609955N77185Q96781K469561L062628J710494
32482D365523J70001J11783M22121j036492l746085m660237k371992N77952Q61176
$$ plain form
32473 -5306250 -6444701 -8292294 -7831190 -4626223 -1432592 -349234 -292764 747669 2669690
32464 2669690 4107030 5005887 6168076 6872424 5379257 1916672 -1038626 -1987902 -2051265
32455 -2051265 -2822544 -4378364 -5999218 -6973410 -6051308 -2349410 2146405 3440567 598363
32446 598363 -2366130 -1886103 114459 -445575 -3221664 -4021977 -1352295 1500263 1408990
32437 1408990 -871581 -2885716 -3593808 -3187575 -2222581 -2058978 -3826497 -5788147 -4278819
32428 -4278819 1089113 5656052 5405422 2321738 1334327 3492999 5390810 4706913 3057879
32419 3057879 2947341 4509016 6219757 7058463 7038426 6736185 6797899 7011977 5938528
32410 5938528 2768912 -578520 -1013744 1749627 4574338 4874941 3422416 2257031
$$ packed form
32473e306250j138451j847593M61104L204967L193631J083358N6470J040433J922021
32464B669690J437340Q98857J162189P04348j493167l462585k955298r49276o3363
32455b051265p71279j555820j620854r74192R22102L701898M495815J294162k842204
32446E98363k964493M80027K000562n60034k776089q00313K669682K852558r1273
32437A408990k280571k014135p08092M06233R64994J63603j767519j961650J509328
32428d278819N367932M566939k50630l083684r87411K158672J897811o83897j649034
32419C057879j10538J561675J710741Q38706k0037l02241O1714K14078j073449
32410E938528l169616l347432m35224K763371K824711L00603j452525j165385
$$ plain form
32402 2257031 1655396 779748 5904 563484 2244646 3162478 1988410 -550727 -2560077
32393 -2560077 -2842309 -1966524 -1709060 -3016392 -4528522 -4176435 -2407500 -2045119 -3982446
32384 -3982446 -5031638 -2049390 3371129 6956865 7478830 7302380 7567521 6430572 2971017
32375 2971017 -514602 -1949565 -2506907 -3908807 -4913944 -3398250 -582280 26150
32367 26150 -2309321 -4389543 -3543918 -1034658 77201 -979343 -1997497 -663979 2787392
32358 2787392 5888301 6641713 5582253 4691121 4520726 3643067 1397285 -333463 548700
32349 548700 3219107 4751992 3696603 1462522 381145 1552410 4309597 6673660
32341 6673660 6606612 3831422 141436 -2668546 -4227979 -4333314 -2246268 1007005 1794892
$$ packed form
32402B257031o01635q75648p73844N57580J681162R17832j174068k539137k009350
32393b560077k82232Q75785K57464j307332j512130L52087J768935L62381j937327
32384c982446j049192K982248N420519L585736N21965j76450K65141j136949l459555
32375B971017l485619j434963n57342j401900j005137J515694K815970O08430
32367B6150k335471k080222Q45625K509260J111859j056544j018154J333518L451371
32358B787392L100909P53412j059460q91132j70395q77659k245782j730748Q82163
32349E48700K670407J532885j055389k234081j081377J171265K757187K364063
32341F673660o7048k775190l689986k809982j559433j05335K087046L253273P87887
$$ plain form
32332 1794892 -1643581 -5422131 -4513272 -262873 994750 -2947029 -7179755 -7279342 -5254891
32323 -5254891 -5045709 -5930837 -4438573 -511714 2397369 2481245 1275251 378566 -538816
32314 -538816 -2035159 -3449668 -3986054 -4070623 -4965923 -7177853 -9182521 -8287991 -4007292
32305 -4007292 51075 142771 -1922488 -716529 4265898 6562905 1945221 -4828150
32297 -4828150 -6867434 -5046879 -5238029 -8174443 -9086286 -6879834 -6342545 -9601264 -11990729
32288 -11990729 -9674668 -6061721 -6364288 -9566671 -10524283 -7869362 -5276420 -5525956
32280 -5525956 -7001757 -6479271 -3106356 876909 2305152 123932 -3157687 -3838044
32272 -3838044 -1312090 1314755 1404476 -291949 -1785988 -2691818 -3336965 -3123982 -1850938
$$ packed form
32332A794892l438473l778550R08859M250399J257623l941779m232726r9587K024451
32323e254891K09182q85128J492264L926859K909083Q3876j205994q96685r17382
32314e38816j496343j414509n36386q4569q95300k211930k004668Q94530M280699
32305d007292M058367R1696k065259J205959M982427K297007m617684o773371
32297d828150k039284J820555j91150k936414r11843K206452N37289l258719k389465
32288a1990729K316061L612947l02567l202383r57612K654921K592942k49536
32280e525956j475801N22486L372915L983265J428243k181220l281619o80357
32272c838044K525954K626845Q9721j696425j494039r05830o45147K12983J273044
$$ plain form
32263 -1850938 -969758 -1341068 -1263243 897283 3498583 3702061 1699507 37403 -534860
32254 -534860 -1478756 -2983521 -3294628 -2048474 -1354667 -2432904 -3568434 -2851232 -1065891
32245 -1065891 -212492 -463536 -331692 689084 1072508 -1026411 -5494282 -9656222 -10135921
32236 -10135921 -6125038 -840158 1369164 -296284 -2440199 -2025084 -141559 52925
32228 52925 -1896388 -2991313 -826210 3328038 6239150 6362772 4729766 2914700 1518551
32219 1518551 707793 963975 2515270 4557520 5693507 4989927 2439333 -1088009 -4097503
32210 -4097503 -5454266 -5604375 -5953138 -6460032 -5165423 -1305344 2561902 3631859 3016533
32201 3016533 4055088 6799227 7448892 4041213 -387699 -1889010 -246011 2366537
$$ packed form
32263a850938Q81180l71310P7825K160526K601300K03478k002554j662104n72263
32254e34860r43896j504765l11107J246154O93807j078237j135530P17202J785341
32245a065891Q53399k51044J31844J020776L83424k098919m467871m161940m79699
32236a0135921M010883N284880K209322j665448k143915M15115J883525J94484
32228E2925j949313j094925K165103M154248K911112J23622j633006j815066j396149
32219A518551q10758K56182J551295K042250J135987p03580k550594l527342l009494
32210d097503j356763j50109l48763n06894J294609L860079L867246J069957o15326
32201C016533J038555K744139O49665l407679m428912j501311J642999K612548
$$ plain form
32193 2366537 4884959 6864686 6371367 1751567 -4895364 -8792679 -7370125 -2393301
32185 -2393301 2611683 5378676 5627880 4661826 4391383 5359644 5792999 3867278 452927
32176 452927 -2040877 -3117411 -4388391 -6305480 -6996855 -5159461 -2245246 -514974
32168 -514974 -97897 683182 2547013 3957325 2899659 -372175 -2969828 -2485472 -313430
32159 -313430 -439520 -4312633 -8581558 -9340260 -7084366 -5332938 -5482600 -5777736 -5021200
32150 -5021200 -4339481 -4624112 -4672170 -3074970 -387364 1587652 1650283 -95280 -2320399
32141 -2320399 -3163258 -2127171 -1193250 -2461035 -4881497 -5421920 -3544983 -2039008 -2734551
32132 -2734551 -3908048 -3230681 -1182480 75570 -318300 -1543373 -2462335 -2189814 -486047
$$ packed form
32193B366537K518422J979727m93319m619800o646931l897315J422554M976824
32185b393301N004984K766993K49204r66054k70443R68261M33355j925721l414351
32176D52927k493804j076534j270980j917089o91375J837394K914215J730272
32168e14974M17077P81079J863831J410312j057666l271834k597653M84356K172042
32159c13430j26090l873113m268925p58702K255894J751428j49662k95136P56536
32150e021200O81719k84631m8058J597200K687606J975016O2631j745563k225119
32141b320399q42859J036087R33921j267785k420462n40423J876937J505975o95543
32132b734551j173497O77367K048201J258050l93870j225073r18962K72521J703767
$$ plain form
32123 -486047 1430956 1683573 99580 -1634962 -2688178 -3895973 -5084001 -4255177 -1173302
32114 -1173302 821757 -855395 -3864724 -4061023 -1462128 18847 -1802253 -4957406
32106 -4957406 -6498125 -5654559 -3675874 -2478283 -3436733 -5770688 -6446598 -3578949 560593
32097 560593 2202066 1367180 1753773 5126868 8704212 9119246 6513265 3244428 490012
32088 490012 -2122006 -4716697 -6620541 -7090967 -5714135 -2669668 832027 3121804
32080 3121804 3599130 3073221 2479873 2182060 2471816 3375673 3826039 2611842 452082
32071 452082 -590100 -104539 271528 -74729 158000 947942 -134947 -3604878 -5550812
32062 -5550812 -2790702 1610533 2121768 -1099175 -2484678 453882 3741918 3459749
$$ packed form
32123d86047J917003K52617j583993j734542j053216j207795j188028Q28824L081875
32114a173302J995059j677152l009329j96299K598895J480975j821100l155153
32106d957406j540719Q43566J978685J197591r58450k333955o75910K867649M139542
32097E60593J641473q34886L86593L373095L577344M15034k605981l268837k754416
32088D90012k612018k594691j903844m70426J376832L044467L501695K289777
32080C121804M77326n25909n93348k97813K89756R03857M50366j214197k159760
32071D52082j042182M85561L76067l46257K32729P89942j082889l469931j945934
32062e550812K760110M401235N11235l220943j385503K938560L288036k82169
$$ plain form
32054 3459749 1141446 -35726 -712730 -3205774 -6373459 -6965851 -5145068 -4559327 -6713282
32045 -6713282 -8731384 -7632192 -4168741 -1340662 -1096841 -3322585 -6190226 -6830665
32037 -6830665 -3738655 597406 1581736 -1846078 -5554566 -5515383 -2486452 355181 2053607
32028 2053607 3506906 4418740 4035165 3992824 6901013 12047358 15597520 15502697 13452346
$$ packed form
32054C459749k318303j177172o77004k493044l167685n92392J820783N85741k153955
32045f713282k018102J099192L463451K828079K43821k225744k867641o40439
32037f830665L092010M336061R84330l427814l708488L9183L028931K841633J698426
32028B053607J453299R11834l83575m2341K908189N146345L550162r4823k050351
$$ [...]
##END NTUPLES=NMR SPECTRUM
##END=
