##TITLE=31Pdec_LR-675-R2-C2
 , 24 sc
 6.6.2019
##JCAMPDX= 6.0         $$ Bruker NMR JCAMP-DX V2.0
##DATA TYPE= NMR SPECTRUM
##DATA CLASS= NTUPLES
##ORIGIN= UXNMR, Bruker Analytische Messtechnik GmbH
##OWNER= root
$$ XWIN-NMR		Version 3.5
$$ Thu Jun  6 14:35:48 2019 Russian Standard Time (UT+4h)  she@DPX200
##.OBSERVE FREQUENCY= 81.013821
##.OBSERVE NUCLEUS= ^31P
##.ACQUISITION MODE= SIMULTANEOUS
##.ACQUISITION SCHEME= undefined
##.AVERAGES= 24
##.DIGITISER RES= 17
##SPECTROMETER/DATA SYSTEM= spect
##.PULSE SEQUENCE= zgpg30
##.SOLVENT NAME= DMSO
##.SHIFT REFERENCE= (INTERNAL, DMSO, 0, 182.463)
##AUDIT TRAIL= $$ (NUMBER, WHEN, WHO, WHERE, WHAT)
$$ ##TITLE= Audit trail, XWIN-NMR		Version 3.5
$$ ##JCAMPDX= 5.01
$$ ##ORIGIN= Bruker BioSpin GmbH
$$ ##OWNER= she
$$ F:/spectra/data/she/nmr/P31/1/pdata/1/auditp.txt
$$ ##AUDIT TRAIL=  $$ (NUMBER, WHEN, WHO, WHERE, WHAT)
(   1,<2019-06-06 14:34:08.59 +0400>,<she>,<DPX200>,
      <created by zg, POWCHK disabled, PULCHK disabled
       configuration hash MD5:
       00 E9 B6 7A A2 85 ED C7 34 08 36 98 17 FE 4E 26
       data hash MD5: 32K
       FB 91 25 8E D6 E9 30 7E 35 B6 CC 9F C3 1E 85 88>)
(   2,<2019-06-06 14:34:37.51 +0400>,<she>,<DPX200>,
      <Start of raw data processing
       efp BC_mod = 2 LB = 1 FT_mod = 6 PKNL = 1 PHC0 = -2174.627 PHC1 = 59.79912 SI = 64K 
       data hash MD5: 64K
       92 DB 06 F6 46 8A FA 89 88 7B 42 8F 45 36 4D C7>)
(   3,<2019-06-06 14:34:57.65 +0400>,<she>,<DPX200>,
      <pk PHC0 = 7.450146 PHC1 = -12.4 
       data hash MD5: 64K
       57 B0 FA 5D 83 AE 26 5E 15 2C B9 D5 6D EA 26 93>)
$$ ##END=
$$ 
$$ hash MD5
$$ 1E 82 E2 D5 B2 F8 83 13 EB 26 74 0C C3 F9 24 01
##$RELAX= 
##$RELAX= 
##$RELAX= 
##$RELAX= 
##$RELAX= 
##$RELAX= 
##$RELAX= 
##$RELAX= 
$$ Bruker specific parameters
$$ --------------------------
##$DU= <F:/spectra>
##$EXPNO= 1
##$NAME= <P31>
##$PROCNO= 1
##$TYPE= <nmr>
##$USER= <she>
##$AMP= (0..31)
100 100 100 100 100 100 100 100 100 100 100 100 100 100 100 100 100 100 
100 100 100 100 100 100 100 100 100 100 100 100 100 100 
##$AQSEQ= 0
##$AQ_mod= 1
##$AUNM= <au_zg>
##$AUTOPOS= <>
##$BF1= 81.014009
##$BF2= 200.13
##$BF3= 200.13
##$BF4= 200.13
##$BF5= 200.13
##$BF6= 200.13
##$BF7= 200.13
##$BF8= 200.13
##$BYTORDA= 1
##$CFDGTYP= 0
##$CFRGTYP= 5
##$CHEMSTR= <none>
##$CNST= (0..31)
1 1 145 1 1 1 1 1 1 1 1 1 1 1 1 1 1 1 1 1 1 1 1 1 1 1 1 1 1 1 1 1 
##$CPDPRG= <waltz16>
##$CPDPRG1= <>
##$CPDPRG2= <waltz16>
##$CPDPRG3= <>
##$CPDPRG4= <mlev>
##$CPDPRG5= <mlev>
##$CPDPRG6= <mlev>
##$CPDPRG7= <mlev>
##$CPDPRG8= <mlev>
##$CPDPRGB= <>
##$CPDPRGT= <>
##$D= (0..31)
0 1 0 0 0 0 0 0 0 0 0 0.03 2e-05 3e-06 0 0 0 0 0 0 0 0 0 0 0 0 0 0 0 0 
0 0 
##$DATE= 1559817247
##$DBL= (0..7)
120 120 120 11 120 120 24 19 
##$DBP= (0..7)
150 150 150 150 150 150 150 150 
##$DBP07= 0
##$DBPNAM0= <>
##$DBPNAM1= <>
##$DBPNAM2= <>
##$DBPNAM3= <>
##$DBPNAM4= <>
##$DBPNAM5= <>
##$DBPNAM6= <>
##$DBPNAM7= <>
##$DBPOAL= (0..7)
0.5 0.5 0.5 0.5 0.5 0.5 0.5 0.5 
##$DBPOFFS= (0..7)
0 0 0 0 0 0 0 0 
$$ [...]
##$SUBNAM2= <"">
##$SUBNAM3= <"">
##$SUBNAM4= <"">
##$SUBNAM5= <"">
##$SUBNAM6= <"">
##$SUBNAM7= <"">
##$SUBNAM8= <"">
##$SUBNAM9= <"">
##$SW= 369.568048894756
##$SWIBOX= (0..15)
0 1 3 0 0 0 0 0 0 0 0 0 0 0 0 0 
##$SW_h= 29940.119760479
##$TD= 32768
##$TD0= 1
##$TE= 0
##$TE2= 300
##$TE3= 300
##$TEG= 300
##$TL= (0..7)
0 120 53 12 22 120 120 120 
##$TP= (0..7)
150 150 150 150 150 150 150 150 
##$TP07= 0
##$TPNAME0= <>
##$TPNAME1= <>
##$TPNAME2= <>
##$TPNAME3= <>
##$TPNAME4= <>
##$TPNAME5= <>
##$TPNAME6= <>
##$TPNAME7= <>
##$TPOAL= (0..7)
0.5 0.5 0.5 0.5 0.5 0.5 0.5 0.5 
##$TPOFFS= (0..7)
0 0 0 0 0 0 0 0 
##$TUNHIN= 0
##$TUNHOUT= 0
##$TUNXOUT= 0
##$USERA1= <user>
##$USERA2= <user>
##$USERA3= <user>
##$USERA4= <user>
##$USERA5= <user>
##$V9= 5
##$VALIST= <valist>
##$VCLIST= <CCCCCCCCCCCCCCC>
##$VD= 0
##$VDLIST= <DDDDDDDDDDDDDDD>
##$VPLIST= <PPPPPPPPPPPPPPP>
##$VTLIST= <TTTTTTTTTTTTTTT>
##$WBST= 1024
##$WBSW= 4
##$XGAIN= (0..3)
0 0 0 0 
##$XL= 0
##$YL= 0
##$YMAX_a= 9136
##$YMIN_a= -11585
##$ZGOPTNS= <>
##$ZL1= 120
##$ZL2= 120
##$ZL3= 120
##$ZL4= 120
##$ABSF1= 0
##$ABSF2= 0
##$ABSG= 0
##$ABSL= 0
##$ALPHA= 0
##$AQORDER= 0
##$ASSFAC= 0
##$ASSFACI= 0
##$ASSFACX= 0
##$ASSWID= 0
##$AUNMP= <proc_1d>
##$AZFE= 0.1
##$AZFW= 0.5
##$BCFW= 0
##$BC_mod= 2
##$BYTORDP= 0
##$COROFFS= 0
##$CY= -3
##$DATMOD= 1
##$DC= 0
##$DFILT= <>
##$DTYPP= 0
##$F1P= 0
##$F2P= 0
##$FCOR= 1
##$FTSIZE= 65536
##$FT_mod= 6
##$GAMMA= 0
##$GB= 0
##$INTBC= 1
##$INTSCL= 5.30512e-09
##$ISEN= 30
##$LB= 1
##$LEV0= 0
##$LPBIN= 0
##$MAXI= 10000
##$MC2= 0
##$MEAN= 0
##$ME_mod= 0
##$MI= 50
##$NCOEF= 0
##$NC_proc= -9
##$NLEV= 6
##$NOISF1= 182.463
##$NOISF2= 159.3651
##$NSP= 0
##$NTH_PI= 0
##$NZP= 0
##$OFFSET= 182.463
##$PC= 4
##$PHC0= -2167.177
##$PHC1= 47.39912
##$PH_mod= 1
##$PKNL= yes
##$PPARMOD= 0
##$PSCAL= 0
##$PSIGN= 0
##$REVERSE= no
##$SF= 81.0140089999434
##$SI= 65536
##$SIGF1= 159.3651
##$SIGF2= -187.1042
##$SINO= 113.3802
##$SIOLD= 16384
##$SREGLST= <1H.CDCl3>
##$SSB= 0
##$STSI= 65536
##$STSR= 0
##$SW_p= 29940.119760479
##$SYMM= 0
##$S_DEV= 0
##$TDeff= 32768
##$TDoff= 0
##$TI= <>
##$TILT= no
##$TM1= 0
##$TM2= 0
##$TOPLEV= 0
##$USERP1= <user>
##$USERP2= <user>
##$USERP3= <user>
##$USERP4= <user>
##$USERP5= <user>
##$WDW= 1
##$XDIM= 65536
##$YMAX_p= 518963384
##$YMIN_p= -235991439
$$ End of Bruker specific parameters
$$ ---------------------------------
##NTUPLES= NMR SPECTRUM
##VAR_NAME=  FREQUENCY,     SPECTRUM/REAL,   SPECTRUM/IMAG
##SYMBOL=    X,             R,               I
##VAR_TYPE=  INDEPENDENT,   DEPENDENT,       DEPENDENT
##VAR_FORM=  AFFN,          ASDF,            ASDF
##VAR_DIM=   65536,         65536,           65536
##UNITS=     HZ,            ARBITRARY UNITS, ARBITRARY UNITS
##FACTOR=    0.456856943014862, 1,           1
##FIRST=     14782.0589164792, 0,            0
##LAST=      -15158.0608439998, 0,           0
##MIN=       -15158.0608439998, -235991439,  0
##MAX=       14782.0589164792, 518963384,    0
$$ Real data points
##PAGE= N=1
##DATA TABLE= (X++(R..R)), XYDATA
$$ [...]
43273 -7589881 -23155454 -22458977 -7602996 6247727 9966625 4773028 -5583949 -17353490
43265 -17353490 -25154780 -26214838 -24622524 -25493754 -27034276 -23317146 -12268410 3432730
43257 3432730 19769561 31179742 31449363 20708314 8180997 2724389 3972934 7016823
43249 7016823 10359504 13442216 12386184 6221987 2542871 8169465 17710110 20060595
43241 20060595 13406937 5530659 2401422 5144598 14715587 29046606 37473914 29031312
43233 29031312 6823580 -14419645 -24579218 -24027322 -16107100 -4581886 2706712 -363767
43225 -363767 -7616962 -6388802 4953654 15500836 18335939 17248949 15618831 10783489
43217 10783489 2673343 -3215177 -5154927 -7172790 -8968530 -5202635 2077838 2800027
43209 2800027 -4876820 -10197388 -6964076 -2194885 -1499846 608156 7816076 12824854
43201 12824854 10686095 8686385 12360521 14019611 6855434 -1947811 -5265971 -10324371
43193 -10324371 -23074594 -30708943 -19753930 -2374010 -1797102 -16116352 -20309081 -4436664
43185 -4436664 13289156 16230528 11059602 11095116 15208263 14682848 8954973 3493578
43177 3493578 41924 -2213159 -1847965 1730572 5713539 9022972 14220580 20610183
43169 20610183 22136522 16315538 8988566 6286703 7759630 10422053 12767773 11623196
43161 11623196 2699741 -11420722 -21128117 -22305935 -22004532 -26694693 -32176067 -31385994
43153 -31385994 -25706775 -21281941 -19036150 -15457372 -9482063 -1943465 8623489 22928796
43145 22928796 35534375 38434002 29847997 16441815 8026290 11100443 23519181 33527249
43137 33527249 29494729 13984225 2554477 4668949 12235925 12414698 4776279 -2014245
43129 -2014245 -4601835 -6322478 -7947375 -7258533 -6255656 -9134573 -13456749 -12376372
43121 -12376372 -5915189 -1276159 -1427221 -2587965 -4216083 -11061596 -21873780 -26538544
43113 -26538544 -20523670 -13100763 -13551637 -17172784 -14471312 -7735148 -6599845 -10523196
43105 -10523196 -8597491 2790632 14265140 18594994 20568373 26082150 30543029 26012455
43097 26012455 13899020 2792754 -2389201 -2628954 -316554 872173 -4069355 -14252474
43089 -14252474 -19897902 -14929627 -8009946 -10544334 -17831321 -15824226 -5043038 -1607484
43081 -1607484 -11756833 -21448699 -17589390 -4744221 7519589 19106322 29969040
43074 29969040 30348260 15641100 101112 -1373266 3008446 -5258846 -24142236 -33392001
43066 -33392001 -26230230 -18178455 -21031654 -26603843 -23336808 -14161238 -9108078 -10524130
43058 -10524130 -13134081 -11669445 -4264309 5010983 6158628 -5289642 -17645591 -16215998
43050 -16215998 -6564247 -8435576 -24122910 -31886259 -18278201 1722371 8498683 4553987
43042 4553987 2223832 -543977 -12755896 -27985190 -29454646 -14061993 5060461 17534676
43034 17534676 22489887 18926415 5423474 -9745678 -12704399 -1650755 10159925
43027 10159925 11583367 4629815 -2912237 -6381094 -3891592 3796956 10306849 8485386
43019 8485386 1076771 -811337 6655412 12626996 4857548 -13484698 -25525790 -19131963
43011 -19131963 -1023406 9622512 2475528 -11792660 -14998230 -4527679 5751979
43004 5751979 7476369 7925131 12861913 12784046 -1951819 -21885567 -28661383 -19355444
42996 -19355444 -7174567 -1272150 748457 1651408 -1108827 -8488901 -16584200 -20727654
42988 -20727654 -16412370 48250 23203321 36251208 28736779 12005379 4485010
42981 4485010 6454294 4412461 -3745962 -6364839 -304166 3128874 -2755871 -11887153
42973 -11887153 -19368925 -26735650 -29837865 -19518651 -137566 10192994 5171838 -754323
42965 -754323 3438639 10385789 13190181 19712492 33335164 36783718 14390904 -20694447
42957 -20694447 -40130370 -34127903 -16142354 -1202816 4732388 59940 -11407915
42950 -11407915 -17889231 -12099791 -3291083 -4528332 -12367395 -12744925 -3452954 3642801
42942 3642801 1117930 -6756742 -14447739 -20004214 -19268892 -7213496 13030678 30973771
42934 30973771 38741993 33877624 16472952 -7063640 -22166536 -20023199 -10211059 -7744234
42926 -7744234 -11614071 -10054173 -3219502 -3133405 -11125422 -13467679 -3550641 7616126
42918 7616126 8989084 3820504 44362 -1416441 -2258058 -1731327 -1963064 -7785011 -16022810
42909 -16022810 -16554645 -9814580 -10049053 -22590176 -30964917 -18864863 5127236 18526953
42901 18526953 13912865 3199081 -2752226 -4762864 -6183594 -5658924 -2218211 545839
42893 545839 -919377 -5406898 -8519679 -6775979 -742728 3940313 695338 -10426970
42885 -10426970 -21657015 -25903292 -23020991 -16441974 -9142035 -5747988 -11694490 -24561550
42877 -24561550 -31792926 -23833326 -5869471 9184659 15291647 15293964 13508118 13468235
42869 13468235 18199361 24369079 20541066 1195262 -20536623 -25311853 -11914464 1949781
42861 1949781 3660889 -1262842 -2789214 -901464 -28359 1235486 5888223 10157382
42853 10157382 8560199 4180552 5493155 13729763 20331583 17638054 6939052 -5070946
42845 -5070946 -13520513 -17301036 -16740852 -11634044 -1292680 13244537 26394729 29545008
42837 29545008 19012331 2262347 -8059664 -7955329 -5965831 -9994317 -14216895 -6032814
42829 -6032814 14458933 30485514 28568891 15512844 7407411 6345775 -35157 -15531477
42821 -15531477 -25534543 -17430403 -239364 7543693 3388260 812839 6861640 14393912
42813 14393912 18667952 26149050 38884466 42878433 25155594 -4236246 -21209164
42806 -21209164 -17163796 -7265573 -7838048 -16647957 -20195532 -11962680 2943927 15898305
42798 15898305 21434414 19176922 14090124 12448706 14182191 12773208 6363364 3711515
42790 3711515 12522874 25953252 29660383 20969520 11530214 9691859 9734140 2794120
42782 2794120 -9466209 -18290674 -19295738 -13941652 -3811490 9238757 19524845 21500811
42774 21500811 17127282 13541968 13679063 15012978 17412295 24766429 36014286 41141107
42766 41141107 31697050 11917908 -6225342 -17335474 -25712540 -33590618 -33517497 -18708553
42758 -18708553 2049502 8821183 -6656190 -28941506 -36141785 -25374681 -12865641
42751 -12865641 -10581876 -13520752 -12557871 -8804680 -8143770 -9918512 -10246940 -10920381 -15427721
42742 -15427721 -20343177 -20832142 -21560640 -30622352 -43618202 -45884396 -32262690 -13584879
42734 -13584879 -654537 7311711 14008896 16993121 14667395 13354309 18196013 22701085
42726 22701085 16363424 -385168 -16287198 -22284993 -18438741 -9979662 -2407887 539947
42718 539947 -1036165 -3355903 -3805474 -3973202 -5852965 -8218643 -9468550 -10545844 -12182878
42709 -12182878 -13251449 -14684383 -19754463 -26481267 -25932879 -14326090 -1567382 -76799
42701 -76799 -8701003 -15475176 -13546284 -6283843 1244454 6807306 7288451 -539768 -13205539
42692 -13205539 -21175221 -19045138 -10624564 -2508579 2887675 6645518 10187711 14657496
42684 14657496 20162741 24226620 23573194 18441534 13313493 13048471 19129361 28277835
42676 28277835 33631911 30068635 20325018 12470368 9214462 4776368 -4009878 -9673471
42668 -9673471 -3580015 11412242 24892362 31351232 31381522 25126943 13827296 4678131
42660 4678131 4350527 9475278 12257246 12512060 14339555 14861776 9133058 3784791 10697616
42651 10697616 26590631 34190786 26395889 14481749 8759545 6785791 6162767 12157275
42643 12157275 23451309 26081234 13734581 623411 462877 4608051 -2935049 -18134771
42635 -18134771 -22525919 -11176939 2158814 6337704 4326981 3489385 7394432 17625999
42627 17625999 31887320 40081805 34044594 21943065 21181733 35016835 47457140 44387159
42619 44387159 29355831 14751348 7222409 6724262 11262287 16398982 16180091 9948807
42611 9948807 3846786 2142640 2064284 209214 -1788177 -2042454 -3439831 -8727846 -14324832
42602 -14324832 -14114966 -7475438 189444 3571760 1856673 -1131402 548262 9769180
42594 9769180 21593160 26184150 19027661 6459899 -1475652 -2189388 -1507699 -3927268
42586 -3927268 -5992857 -2449205 3359033 1633674 -9018850 -15764944 -7828478 6458564
42578 6458564 10002502 2005045 -1919521 3758953 5628520 -3238940 -7471338 5935790
42570 5935790 22685149 21466305 8261670 6320453 17583595 20253580 5060101 -11863810
42562 -11863810 -17297725 -17676470 -19052689 -13730787 528617 8886261 2660616 -3522410
42554 -3522410 4914643 17112362 13623071 -3303943 -15733030 -17342132 -15691717 -14333527
42546 -14333527 -11600108 -11955287 -19757524 -25250560 -15232668 4229824 13564654 7392559
42538 7392559 -709006 -938444 2803867 7153167 15878188 28116616 35128811 33400534
42530 33400534 28331884 22416969 13283913 5317116 7741613 17701173 20997783 14054697
42522 14054697 8839336 10588024 8402826 -3789726 -14613133 -14567795 -11473905 -13522561
42514 -13522561 -12396584 831818 15895163 16844998 5401508 -6409015 -17851462
42507 -17851462 -34750206 -49903508 -49016165 -34321200 -23399775 -23827500 -25684827 -20613997
42499 -20613997 -12295254 -5197658 2137249 8406815 7404350 -452802 -5490697 -2051490
42491 -2051490 5111924 10292782 12650622 10980581 4214135 -960929 4059979 13696305
42483 13696305 12745526 1556293 -355691 15337158 28863173 19871621 -2037512 -11891934
42475 -11891934 -5071591 628168 -5978628 -17210291 -23066174 -23232477 -19841771 -12465858
42467 -12465858 -4624245 -3600544 -9174150 -12420673 -9708505 -7949889 -11340750 -13230879
42459 -13230879 -8092064 -2474528 -4841855 -10578129 -6978599 9427804 28754152 39843389
42451 39843389 39750969 31728416 20067370 8171619 -2144548 -10494909 -15617110 -15076640
42443 -15076640 -9800549 -5851136 -7206287 -9425173 -6481554 -2141801 -6639228 -20810225
42435 -20810225 -31279418 -25785693 -8229835 6412795 9035183 3770439 550799 4576166
42427 4576166 12395749 15652328 9840243 1100058 1265869 13133074 24686225 23280360
42419 23280360 11756094 2586067 -1324218 -8608643 -20797067 -24791971 -11887964 5724596
42411 5724596 9227867 -1592133 -10098784 -7450783 -1730273 -768006 390227 8184350
42403 8184350 17383194 18832352 14042099 12358899 16685407 20617899 18838432 13606072
42395 13606072 11106150 15860109 26979082 35637881 30015234 9270473 -11026652 -15734049
42387 -15734049 -9326808 -7994183 -14870856 -16890112 -7878641 722832 -703385 -3818201
42379 -3818201 2742339 12904189 12119202 684890 -6727436 -2239578 8383438 18792763
42371 18792763 27560877 29893672 19418748 3004994 -782561 13617729 27727174
42364 27727174 23329506 8315983 5587085 21757781 39731309 40698682 22954280 -728241
42356 -728241 -15459653 -14017294 -2390528 3913795 -4360130 -18619895 -22667559 -12212212
42348 -12212212 3583023 16690946 25061897 24575701 10906419 -7268927 -11369653 3320847
42340 3320847 18887888 18568838 8141025 2514203 1449293 -6006084 -19081039 -24723198
42332 -24723198 -18969274 -12918902 -14061577 -15306970 -8559731 1656175 5499393 993078
42324 993078 -6903517 -14101734 -17809062 -14895269 -6862508 -1808620 -4101549 -5993547
42316 -5993547 2091435 15303396 18111855 5209865 -10518612 -15099749 -11205612 -11675969
42308 -11675969 -19269813 -22135919 -11173485 5821071 13601454 9335603 4798667 8156508
42300 8156508 12209282 6277999 -6389069 -11891492 -4587774 5957602 8313540 2297549
42292 2297549 -4122051 -5430505 -2631582 -651255 -4172631 -12438189 -17112921 -10737389
42284 -10737389 1190202 3993879 -6553773 -16498268 -12289405 282668 5329148 -157853
42276 -157853 -4387929 -365796 4561413 1165350 -9098696 -17779232 -18836695 -11503290
42268 -11503290 -229801 5666896 -934465 -15362061 -25323608 -26878875 -27195280 -27596676
42260 -27596676 -16214797 12131444 38907818 40455040 19557664 2138314 2421946
42253 2421946 8197428 4875152 -3468044 -7748273 -13352090 -28801737 -43689598 -38072949
42245 -38072949 -12761082 8748168 12394921 9956961 15118923 19643401 8026974 -15045802
42237 -15045802 -29564108 -28001524 -21393153 -18414181 -15145683 -9098770 -7720677 -14839593
42229 -14839593 -20443911 -13935476 194044 9100215 8112609 2348406 -2605392 -3434352
42221 -3434352 1716275 7519166 684676 -23297837 -46416709 -44981589 -20128207 2090327
42213 2090327 3638531 -5872452 -8021749 -1072872 3719722 2422860 1933803 5753236
42205 5753236 7806241 2552103 -6261060 -10456991 -7269224 -1589481 -21862 -4280161
42197 -4280161 -10078735 -12100226 -9686988 -6709415 -6094667 -6321624 -3605307 4155859
42189 4155859 15313453 23965198 22525171 9288767 -6233535 -10975574 -3357709 4648392
42181 4648392 3508910 -1733541 -596120 6880292 11342445 8718229 4350514 1749135
42173 1749135 -3777374 -15790615 -27739320 -30162848 -23490880 -16190282 -10923599 -1028756
42165 -1028756 15690617 27217826 20038691 -771205 -14044554 -7706617 6905910
42158 6905910 11425019 4132801 -1396260 2702214 9514296 9685750 3585615 -1986642
42150 -1986642 -2801563 234998 2999876 1154622 -4240065 -4595743 5730047 17453679
42142 17453679 15393727 1631595 -3212822 11113757 26697474 20659543 -2647795
42135 -2647795 -17757958 -12553553 -952390 101463 -7619599 -10833818 -4635141 2365006
42127 2365006 -84021 -11121811 -18177322 -10038831 8723899 20886347 17508304 9054899
42119 9054899 8500352 11231657 4936596 -5376306 -404951 22973057 41818254 36229075
42111 36229075 14872152 778412 2126571 9473561 14501673 17377918 18089536 13559707
42103 13559707 5250003 568114 3729748 10579981 14093333 11015361 2622221 -7098276
42095 -7098276 -13165117 -12308040 -4869780 6288560 16980403 21657508 16822304 6807043
42087 6807043 1073413 2208839 2217658 -4416098 -10517830 -6751179 3077341 7115102 2694852
42078 2694852 -2084268 -2624125 -2725855 -4861793 -6605667 -8848289 -16602730 -27693528
42070 -27693528 -31159359 -22837825 -13269410 -12770144 -16558871 -13357918 -2876460 4392270
42062 4392270 1321126 -9551241 -20759261 -24299682 -15256688 1637167 13032687 12247489
42054 12247489 8831311 13841817 21482326 18593851 8315048 7014963 17146941 22351368
42046 22351368 15681964 13380891 27954449 44011883 39121542 17775615 3595033
42039 3595033 3002275 -933191 -17322874 -31753633 -29437950 -16904182 -9545840 -9918375
42031 -9918375 -10210680 -7322644 -3651568 759156 5557010 4560360 -5533215 -14290085
42023 -14290085 -7691669 11314918 23944500 19236619 6651108 1498164 6355154 12312566
42015 12312566 12501350 8049405 3758954 3599998 9643866 20783967 31162884 32595190
42007 32595190 21671782 5104935 -4733585 -2935014 641176 -7715953 -27227324 -41896438
41999 -41896438 -40172325 -27302585 -13619607 -240886 14200932 21137133 11063624
41992 11063624 -7906205 -15602807 -5581835 7588010 9760175 3445538 -2175920 -5556920
41984 -5556920 -9514782 -12473255 -10675671 -3241371 9729618 26904889 39890501 37922014
41976 37922014 24627252 19018314 30457777 42945438 36291149 14328563 -1968290
41969 -1968290 -3168192 2173083 5850688 8172280 7929405 254716 -12016729 -17969902
41961 -17969902 -13768992 -6913042 -1841776 6579217 19947049 28805974 26412729 20352424
41953 20352424 21036680 25772687 23928955 13081608 825844 -6443435 -8352315 -6256478
41945 -6256478 -1803978 1027680 -971979 -5060015 -5433777 -987693 4233707 7683462
41937 7683462 10712439 14024434 14682124 9019345 -2864621 -15387956 -20144863 -13184694
41929 -13184694 -1079429 4240395 -567792 -6022949 -3405380 3074646 4329132 1262370
41921 1262370 1518035 4248144 890357 -7382033 -6517249 9229957 24049869 19301187
41913 19301187 -1348150 -17478833 -18998913 -14593726 -13078618 -10356023 -1032830 7927699
41905 7927699 5476093 -6697814 -15476690 -13079339 -4417085 2409286 5553782 7306165
41897 7306165 8313003 7302740 3574126 -2367354 -8517463 -11113042 -7678522 -982684
41889 -982684 3201935 2582004 -1015812 -6857828 -15139202 -20887005 -15970822 -1176775
41881 -1176775 11075515 12200330 9139812 12535618 18899497 16085223 4785461 1545455
41873 1545455 16034144 34982967 36337927 15184056 -10623076 -19289723 -5792951
41866 -5792951 15191829 24356688 16066301 2700395 393671 11444212 23342063 24224254
41858 24224254 14803749 4235712 -908690 -655952 1829802 3876051 4630441 5195511
41850 5195511 6934327 8855440 8218874 4466199 467998 -1139015 -569538 1380060
41842 1380060 5443371 11213714 14290342 9625999 -1823100 -12017690 -13033428 -5218465
41834 -5218465 2835521 3088208 -3991197 -11410763 -14114722 -12157499 -6250270 3791952
41826 3791952 13622226 13854671 1373629 -12691248 -13922894 -2276168 8331527 7889530
41818 7889530 653719 -3513960 -1459488 2494073 3470490 938878 -695188 4332356
41810 4332356 16111423 26368613 27132041 21231800 18645400 22757626 26840086 25131881
41802 25131881 20639802 19326335 21974702 24836843 24559600 20254182 13343900 6216944
41794 6216944 -512230 -7240377 -9743732 -385316 18840240 31631514 26281429 13083513
41786 13083513 9344813 12814347 8145472 -3598705 -5128110 4883338 5183858 -12729839
41778 -12729839 -26592003 -16346090 5032955 12854641 6617191 3320194 7034834 7496574
41770 7496574 1876921 -2309509 -1605053 2535776 11275727 21309870 18714788 -2659038
41762 -2659038 -25423939 -30088283 -22652198 -20110315 -20199524 -12104035 -6545573 -21628872
41754 -21628872 -43818633 -40782888 -15024048 -5153783 -24559209 -38700596 -20929400
41747 -20929400 6522476 12359751 4633545 8232680 19168829 16152770 1486017 -3846547
41739 -3846547 3102340 6115851 213012 -4148422 -4045797 -6619608 -10895997 -9529824
41731 -9529824 -6275654 -10303230 -16178639 -11490438 -1348083 -1697460 -9753939 -5946031
41723 -5946031 13488110 30421823 34302058 33228588 31140200 19556795 431631 -7291673
41715 -7291673 4123530 17722322 18891510 15528400 17723689 17764082 7612434 -1386603
41707 -1386603 3970658 15088540 15188722 5808886 297022 -127809 -3838740 -8877864
41699 -8877864 -5748486 3058683 4752774 -3733935 -13149414 -17376736 -16242050 -6225841
41691 -6225841 13724733 28798094 21142708 -1171061 -7983118 13416145 40377458
41684 40377458 45782244 31073875 16766933 13310617 15792352 18789841 21527165 22253416
41676 22253416 19904722 19199192 23766222 26339298 16247081 -3867245 -18564995 -17742474
41668 -17742474 -5937101 7254606 17161642 22076020 20325383 14636562 12777569 17462589
41660 17462589 20247483 12343497 -1628962 -8482636 -4209449 1217965 -1348109 -8131924
41652 -8131924 -9732385 -4736693 534342 2386947 2185682 -263815 -7132288 -14811252
41644 -14811252 -14430067 -4901526 1898158 -3644640 -13724469 -12631965 688768 9830129
41636 9830129 2185216 -15933514 -29170501 -30808141 -25621516 -20946309 -20758960 -24497327
41628 -24497327 -26083264 -17555706 772973 17390157 23099218 23512128 29598374 38971101
41620 38971101 38281194 24664229 11663553 8542336 5789341 -9062826 -30094838 -40059088
41612 -40059088 -34381704 -25356147 -23345211 -25833231 -26698151 -25193357 -22045995 -16396808
41604 -16396808 -11403075 -13884732 -22385595 -24075793 -11605779 3607176 4117329 -11928765
41596 -11928765 -30721845 -40567960 -40141485 -31687957 -17212484 -2302127 5928109 7415435
41588 7415435 8705539 12509734 14803007 13412541 11423257 10037653 6544673 2451584
41580 2451584 4688138 13827936 19502146 14002929 3383162 -1900090 -846535 1195302
41572 1195302 3183357 6717314 8570567 4978431 294255 1367021 5510637 4294843
41564 4294843 -2417157 -7460329 -10560675 -18574606 -29971099 -33204767 -25741782 -20817678
41556 -20817678 -26218441 -28755712 -13067397 12686263 25402967 17421455 2761387
41549 2761387 -6626076 -14735551 -26901980 -35710616 -31656862 -19229889 -11213178 -10837106
41541 -10837106 -9612647 -1918719 7247879 10935829 9842949 9429037 11127748 10879112
41533 10879112 6493779 3717036 11620106 29921324 43614823 36687825 12628352 -6048688
41525 -6048688 -3730487 9768193 14711984 9037002 7528816 16124926 23494722 22069070
41517 22069070 21289942 30148312 39681683 36484813 24445709 17664418 17741416 14787208
41509 14787208 7987856 6968211 11628785 8974791 -4754111 -15904038 -15697370 -14812461
41501 -14812461 -23850877 -33012175 -26837177 -9854897 -566449 -4782000 -11269114 -11967130
41493 -11967130 -10723422 -10855094 -8482106 -2095616 2893729 3856426 5968741 13198487
41485 13198487 21872383 26551313 25221797 16654526 1171500 -13252961 -15243837 -5037148
41477 -5037148 3524051 1247183 -5031324 -5767179 -4042439 -7824504 -13901278 -11609586
41469 -11609586 -101109 9150121 7804515 222435 -4182888 -1894941 3404460 5882992
41461 5882992 1846453 -8161724 -19795563 -28017692 -29551321 -22941862 -9754584 3437360
41453 3437360 9348743 8868183 10119004 15173625 14983245 4108602 -6914712 -4496932
41445 -4496932 7349401 11767279 2891028 -8435212 -14045034 -19112741 -27454151 -29396823
41437 -29396823 -15500991 5784062 16830995 13788164 8944510 10521538 11836027 4640644
41429 4640644 -6160133 -9203158 -3924540 -2480620 -13469682 -30081309 -38355191 -33884203
41421 -33884203 -25264611 -21651704 -22373339 -21156631 -16254753 -11815165 -11099275 -13077004
41413 -13077004 -15562338 -17521571 -17528941 -13778525 -7518017 -3781395 -6293436 -12578782
41405 -12578782 -15565311 -9948957 2801548 14773766 17438875 8952975 -3914543 -11756682
41397 -11756682 -10103853 -1335902 8266290 12244457 8534937 3210798 5507620 14635151
41389 14635151 16444527 1039592 -19823167 -23918330 -7372400 9407897 8419169 -4660313
41381 -4660313 -13165505 -13414191 -14653374 -20876185 -25787248 -25453318 -24555749 -26976455 -28640285
41372 -28640285 -24339220 -16055474 -9674451 -6807693 -4308179 -224982 3558334 4468282
41364 4468282 2526110 1073 -869477 790815 4696031 9813101 14163792 15225861
41356 15225861 12169675 7735861 6072651 7747075 8144815 2169339 -9520786 -19330121
41348 -19330121 -18282039 -4359469 13903677 24510398 24655365 23290232 27746816 32190016
41340 32190016 26575491 14274818 10249053 20199992 31874983 31512714 19861612 6197860
41332 6197860 -4660011 -11588632 -11299899 -3062055 5942158 9194297 9993472 12921172
41324 12921172 12232579 1191849 -11179697 -7768901 12056100 29824223 32562356 26629329
41316 26629329 22520008 19166348 11523909 3378064 2203234 6932962 9674245 6352119
41308 6352119 -925327 -9144853 -16249161 -19857861 -18692139 -13964430 -7285629 52664
41300 52664 4706943 2953341 -3582562 -9043186 -11400546 -12717052 -10249896 2854229
41292 2854229 23650695 36590783 32242284 19934865 12827653 9068372 -589756 -13669787
41284 -13669787 -19181760 -16661996 -16641510 -21539569 -20883381 -9907769 -52897 -3201698
41276 -3201698 -14404495 -19112629 -12529205 -3500569 -1085331 -4090263 -4835172 562092
41268 562092 7657753 9115533 4037787 -1611 3638585 10765983 9937396 -3487396
41260 -3487396 -20567299 -28056861 -22314267 -11733003 -5950023 -4851567 -362705 10823024
41252 10823024 20371483 18813321 10306883 8442937 16105191 19446372 7523556 -11057748
41244 -11057748 -19926028 -16447256 -10898301 -9218696 -8607277 -7642480 -8424064 -9403366 -8024157
41235 -8024157 -10040798 -22975401 -39449726 -42031033 -28491411 -16698457 -17400808 -18028267
41227 -18028267 -5194899 10734264 10076297 -5954285 -17467985 -14667992 -7005826 -3599148
41219 -3599148 -1535156 1664631 -1342284 -15697172 -32443020 -38156448 -31350457 -21787332
41211 -21787332 -17478481 -19355652 -25491157 -32790385 -35808001 -31567499 -26078748 -28750451
41203 -28750451 -38058320 -39807208 -24460276 -862452 13757691 14156597 10169819 11148984
41195 11148984 15723115 17986185 15669591 9248526 325050 -5431488 -1427571 8820130
41187 8820130 11936852 2854986 -5524811 -15149 13565476 20845842 21484890 25502100
41179 25502100 31240424 25865704 8884341 -3503272 -2437492 2578183 3742126 8552479
41171 8552479 22259474 32235577 24690696 6263143 -5428532 -4391384 3758193 15720656
41163 15720656 29819840 38693691 37955633 36234726 41632469 45065479 34615904 19771622
41155 19771622 19178414 27231043 18873680 -8577691 -25286780 -12186776 9356552 9223534
41147 9223534 -8589028 -17443387 -10639519 -6755992 -15220916 -21577281 -13565058 -2350829
41139 -2350829 -5349731 -19841962 -27955462 -22751948 -15371382 -15537272 -17596474 -12644336
41131 -12644336 -5725640 -9627903 -24109753 -33601310 -28409578 -16902319 -10007878 -4299978
41123 -4299978 8084103 20624893 19204437 5369946 -3369237 1372722 8689626 8332050
41115 8332050 5977585 9692596 14108084 10546428 3630802 3705107 8397803 6491873
41107 6491873 -2081233 -5053648 1712900 6557227 790124 -5884033 1847342 22649334
41099 22649334 39127581 39536281 30378507 25226873 27795633 31408300 31300167 29533840
41091 29533840 27125482 19645595 6247516 -2808920 3466800 20566102 31456955 26664352
41083 26664352 13354641 2614226 -3614050 -8809758 -13320254 -15956125 -17974966 -18544506
41075 -18544506 -11299193 6927428 27695791 39325290 41163896 41268800 41489806 34568058
41067 34568058 17817517 871508 -5361608 -2245221 -119222 -3661820 -6379545 -1169101
41059 -1169101 7664174 7726668 -5719284 -21946249 -26237825 -15835829 536349 15380467
41051 15380467 25977609 26993891 12227871 -11958768 -26560493 -21455279 -8143759
41044 -8143759 -2056829 -1168648 5344446 14250595 10743443 -6922094 -20984381 -16683733
41036 -16683733 477657 15322590 21398165 22348132 21684865 18328689 9926678 -3341950
41028 -3341950 -17209170 -25260087 -24983075 -20627246 -16360943 -9890527 495539 6503558
41020 6503558 -1535246 -17528076 -23733224 -14325887 -2570339 -509050 -4248148 -5636002
41012 -5636002 -5477237 -5856205 -1580961 8442711 11773039 -806300 -17063802 -18677552
41004 -18677552 -9576653 -9931993 -22930721 -27985815 -12163121 10015532 18047266 12290746
40996 12290746 6893611 6389138 3615233 -4482484 -12571462 -17152451 -20141492 -21785781
40988 -21785781 -18609165 -9561341 2143316 13369874 21375892 21201455 10620566 -2498229
40980 -2498229 -6646965 -2223675 -1881989 -12247695 -24248174 -26797151 -21362753 -15230159
40972 -15230159 -8008086 4310919 16459603 17670929 8130125 281589 1588190 6305041
40964 6305041 8072023 10331083 17302342 22894918 18069692 4834289 -6206800 -10182220
40956 -10182220 -11514806 -13974888 -15455373 -13932117 -11463839 -9523995 -5951822 125213
40948 125213 4695517 3975773 183808 -1549285 -371589 -370778 -4422634 -9901549 -11017028
40939 -11017028 -4441910 7331912 17586477 20458768 14968076 4597769 -5796753
40932 -5796753 -11764967 -9811535 397414 13574751 21228916 18728334 9142942 -1319520
40924 -1319520 -10593470 -21049445 -32443181 -38060180 -31571686 -16918458 -6424954 -6681656
40916 -6681656 -10499209 -7304268 2046350 7686579 6112924 4140204 6235459 7409350
40908 7409350 3014579 -3244048 -7483257 -13337296 -22499483 -25017811 -11174233 11295894
40900 11295894 25261914 27837342 31573756 40686131 41801780 25615009 5041957 630714
40892 630714 14838835 31085798 34422693 24256381 9173979 -2111760 -4626042 1302033
40884 1302033 10530655 17912644 22163222 23208662 18893334 8378119 -3674750 -11176632
40876 -11176632 -13641041 -14790948 -15185081 -10970697 -407995 11937362 18492080 14384548
40868 14384548 347047 -17580014 -30940057 -33287468 -23093648 -3803225 16847578
40861 16847578 28506920 24092978 6759812 -11591268 -20942453 -20374324 -14308692 -6198524
40853 -6198524 1625382 6586377 8457344 9903604 10751395 5808743 -6616454 -17794585
40845 -17794585 -16925703 -5052756 5522154 5772510 -929251 -4517092 694764 10723127
40837 10723127 15130710 6963855 -7702294 -13109575 -1406655 15902040 20450811 9235596
40829 9235596 -3147598 -4228113 2974646 8848039 11188457 14311741 19288259 22385287
40821 22385287 22082766 21614365 23142566 23343559 17731523 8212504 3247148 8797678
40813 8797678 20426726 27148297 23452317 14732269 9696946 10629677 13520995 14627184
40805 14627184 12921173 8105835 1111686 -3523888 -96284 11939258 26171637 34450584
40797 34450584 32711562 22378959 8398179 -3689999 -10164847 -9693607 -2902284 6732124
40789 6732124 12924257 12039675 8969436 12132102 20912652 24612884 17596639 8499355
40781 8499355 8213868 14840086 18488234 16108567 12247077 8447543 2305668 -3843816
40773 -3843816 -3052426 6619651 20146310 32746732 41484407 41616236 31359404 19456344
40765 19456344 16601790 18742628 11348496 -7418721 -21401244 -19442947 -10362592 -7094647
40757 -7094647 -8237799 -6007843 -2180649 -3099169 -5769827 -2402896 5200471 8633879
40749 8633879 8051170 11611956 19605359 21255117 10494589 -4667611 -12880443 -12433934
40741 -12433934 -9075750 -6296997 -2743132 3509291 12062982 20746265 27090278 29712321
40733 29712321 28900594 25644205 20805501 15861932 12853992 12156187 11681289 9464681
40725 9464681 5462819 451113 -3858426 -3251350 5418331 16911445 19374285 7618330
40717 7618330 -9676644 -20312264 -21910784 -20378884 -19679856 -19074791 -17235960 -13554084
40709 -13554084 -8164793 -4731834 -8232349 -15188030 -13528302 -270765 8489012 -2575645
40701 -2575645 -23739916 -30634300 -16751636 234594 5384705 3147633 2615677 2246457
40693 2246457 -1870052 -5438777 -4394883 -4163678 -9603081 -13641639 -7316556 5094301
40685 5094301 12843225 16038098 23295790 33594955 33497870 15689032 -8787220 -21479229
40677 -21479229 -15227067 561204 10283213 6776128 -2480108 -4508379 2929328 8681725
40669 8681725 4909928 -485663 3975682 14448411 16825942 8885290 4155587 11145500
40661 11145500 21067132 22321620 16932608 13858371 13219958 7445345 -5192054 -17618339
40653 -17618339 -23972007 -25043123 -23425655 -20033347 -16933882 -17633305 -21435518 -21757543
40645 -21757543 -14037379 -3308237 -126553 -9004390 -23504664 -33513080 -35076392 -31000054
40637 -31000054 -23570761 -11643493 3040478 11495850 5597165 -10524429 -23236861
40630 -23236861 -24117096 -16187459 -5072050 7745618 19288642 21944047 14207207 8092078
40622 8092078 15374258 29964609 35119092 26792679 17951028 18841044 25502319 31322145
40614 31322145 36984546 41792916 37147225 19828252 3215497 2403299 13277106 19455879
40606 19455879 17014845 18062238 29150097 40223040 40093358 32141173 27826587 31834042
40598 31834042 39860131 45623007 44407821 34214154 19041145 8009626 6450973 9848576
40590 9848576 9881675 4260646 -2044809 -3113449 2139477 7914240 4766339 -10856767
40582 -10856767 -29564330 -36927260 -29908662 -19521826 -15655558 -16694014 -16699542 -13847766
40574 -13847766 -6995198 6372065 21166760 22859680 5095683 -17585037 -25958919
40567 -25958919 -20025512 -15145481 -18756430 -24195474 -25401253 -23627903 -19032549 -9040199
40559 -9040199 2445899 6391432 2547522 901785 5774788 9627594 6851246 2318872
40551 2318872 832589 -560637 -2838382 1264026 14726568 26869333 26715911 18297569
40543 18297569 12458706 10172212 5303552 -1252751 -2713372 456634 170347 -6099345
40535 -6099345 -11061679 -7920165 1703218 10682806 12209090 4078465 -7515048 -10853399
40527 -10853399 -1401785 11000081 13918788 7616354 923808 -3739530 -10491933 -17484967
40519 -17484967 -16683131 -7372379 1090229 2755439 1983576 4113891 7800518 9266360
40511 9266360 6204560 -3977791 -20375862 -31646389 -24705065 -4184772 9252606
40504 9252606 5858255 -1288373 99948 696128 -12584607 -29235906 -26325070 -3818170
40496 -3818170 11677091 2261901 -18761792 -27018385 -16657673 -250732 11359822
40489 11359822 17233637 18490281 13845124 4730267 -2050354 -187235 9981863 22441252
40481 22441252 30711000 31288668 24273908 13537197 6470178 10203113 24344014 38210764
40473 38210764 39918603 29667879 19570667 17958089 19420992 15267797 8060899 6937516
40465 6937516 11350218 10394436 -289171 -11197879 -12981642 -9161415 -8314229 -10283992
40457 -10283992 -8546090 -2494951 1446789 227747 -1848780 -464251 3405261 7122981
40449 7122981 10301197 12772850 12502857 8226494 1976713 -2656530 -2901728 2904186
40441 2904186 13846102 23892500 25206108 17415094 10035332 11018829 15772845 13884581
40433 13884581 5161289 353289 4171020 7220189 1297811 -5462601 412217 15979793
40425 15979793 24634232 21134952 19722901 31625310 47327059 51358362 44820778 40101335
40417 40101335 39639804 35047868 24957272 18138259 17214058 13810026 4577234 -741710
40409 -741710 6035508 19296880 29139146 33825900 35588030 33205532 27105170 23380822
40401 23380822 23787779 20143058 8867675 2480243 13435645 32846507 40044170 30006024
40393 30006024 16905043 12288990 14469942 19447361 27150213 33954658 32440725 22958719
40385 22958719 14730190 12598412 13271693 15984364 23713940 31202054 26731399 11337964
40377 11337964 1663659 6349461 13797645 12171991 6973766 7266557 8481754 3848142
40369 3848142 1439282 12434913 29730205 35474768 25910362 13403655 6987300 5477609
40361 5477609 7096453 10945357 10374756 -359116 -12949812 -12456001 1561070 14265796
40353 14265796 16237533 11832104 6498144 -109001 -6179629 -6368205 -1584040 1528949
40345 1528949 2736688 7688568 14600566 15890845 14382651 21077598 33538147 35353422
40337 35353422 23717886 17640416 27704980 36791891 26466017 6368810 -1454347
40330 -1454347 4611862 8763125 5493294 3931755 8494765 13794745 17033952 18760245
40322 18760245 12867514 -6907763 -30098830 -36196079 -21356813 -3366636 3874333
40315 3874333 5970268 12301053 18900835 16816483 7965613 2311409 4038742 8302800
40307 8302800 8987276 4436090 -2574744 -7390915 -7509143 -4708852 -1072459 4815171
40299 4815171 12469479 13403658 -162667 -20561245 -29087512 -17993417 1221910 14752125
40291 14752125 21505048 25834186 25885179 18650033 9355964 4974619 2143505 -8068335
40283 -8068335 -24650523 -35575445 -33409566 -24025839 -16862469 -12650081 -5413015 6383599
40275 6383599 15566311 13888576 1876526 -10602122 -13770061 -6791524 3579348 11340601
40267 11340601 15385356 16202249 12902464 5437426 -3149548 -9148950 -11521153 -11553185
40259 -11553185 -10826433 -10545643 -10982408 -10454509 -6706897 -249251 5814916 10181670 14637511
40250 14637511 18970738 17614153 5536042 -12810525 -24220100 -18773879 -157994
40243 -157994 18238561 27772443 32273345 38824299 43829412 35263768 10437039 -15702841
40235 -15702841 -25737136 -18794309 -8101107 -3318264 -3405900 -5066412 -8485139 -12696159
40227 -12696159 -13069330 -7133364 1814585 8986679 11788277 8917881 1590306 -3885474
40219 -3885474 -1808343 3477133 2009088 -5761143 -7121838 3893797 15722943 15578224
40211 15578224 7764418 4750941 6432002 2090417 -8945814 -13112011 -2435019 13262013
40203 13262013 20429532 19370068 19358417 21538571 16742276 497843 -17753494 -24366681
40195 -24366681 -16901229 -6005670 -2784973 -7210105 -9935068 -4191998 5709824 8467262
40187 8467262 -1633351 -17200040 -24483414 -17715013 -4216312 5830035 10688988 14283434
40179 14283434 16231368 12508335 4904922 330672 -1118340 -7251036 -18554085 -22731739
40171 -22731739 -12568663 492888 1576293 -6818057 -11945628 -11769793 -13307224 -14835744
40163 -14835744 -7970363 3204657 3835703 -7760295 -15395952 -9519714 27072 2146672
40155 2146672 -1060466 -5953867 -16584567 -31306673 -35934378 -23884179 -9849753 -9237897
40147 -9237897 -16288846 -17543717 -14700181 -16803124 -20956103 -20511960 -22999937 -37535589
40139 -37535589 -50843695 -40616049 -11358995 7513620 2110990 -10178080 -10572893
40132 -10572893 -2332395 4699264 12500213 24215677 30577007 22566886 8351298 3752334
40124 3752334 11088144 18279514 15650339 5423281 -3608332 -5999864 -5745042 -12711620
40116 -12711620 -28453986 -38102580 -26413009 -973718 14147320 9969067 2389116
40109 2389116 5306305 11232409 9266751 6305723 14297349 27592110 31089286 24727599
40101 24727599 22101128 27070761 28479317 19316648 6764415 -310308 -2283774 -2765875
40093 -2765875 -941162 4732324 11362668 14921437 15083718 13918408 12579258 10971205
40085 10971205 8414634 3995107 -1870511 -6875352 -10041399 -13888122 -20132577 -24551504
40077 -24551504 -19930770 -4086248 17296822 35044641 42294250 38319051 29157870 22736793
40069 22736793 21573770 22242663 22187685 22310912 21596690 15939371 6225249 1182610 6580696
40060 6580696 16718704 22286679 21640265 18413049 13625643 7552730 4369301 6623459
40052 6623459 9182623 6905596 3909777 5974644 8319187 2333130 -8539541 -12340552
40044 -12340552 -7289020 -4368802 -10453067 -21088842 -31507402 -41431956 -45333404 -32142391
40036 -32142391 -2694378 23676264 29608996 19187581 8654149 5073082 3693911
40029 3693911 812480 -1226472 507838 7347392 20377416 36787395 47009329 42971794
40021 42971794 28158997 12964487 1552912 -9577338 -21266922 -28655706 -29822048
40014 -29822048 -29438038 -30398829 -28337591 -19233082 -7645866 -1556705 -1535106 -970640 3362867
40005 3362867 6645287 3695076 -3247010 -8121114 -9644199 -11308803 -13537810 -11851452
39997 -11851452 -5089302 88932 -2182637 -7840805 -9036136 -7078915 -10590008 -19884537
39989 -19884537 -22489880 -9224646 12163904 26083027 26987274 20878528 12804276 2499696
39981 2499696 -7814922 -11224741 -5605767 1720129 3901638 4009735 8699556 15953070
39973 15953070 16179817 5038509 -10736419 -21231402 -22558868 -17412899 -11279405 -9726035
39965 -9726035 -14398958 -18684464 -12245567 5379839 19825397 17219481 2425334 -5634004
39957 -5634004 2724948 16772138 20083645 9913578 -2595301 -6813592 -1837958 6174771
39949 6174771 10896530 10723383 9924565 14095375 22457374 26571034 19163817 2562963
39941 2562963 -13622058 -21033076 -17223478 -5577066 6139747 10235123 5724586 -1689012
39933 -1689012 -8154539 -15563761 -23984490 -27017469 -21026225 -12711025 -8682059 -2861409
39925 -2861409 14058700 35508447 43224880 31793882 15728391 8033458 4601715 -2724565
39917 -2724565 -9198049 -4888482 7326691 13846887 8671307 -350260 -3888160 -1511786
39909 -1511786 2101123 4646791 6401079 7070086 6590123 7811755 14633426 25844218
39901 25844218 32820278 27063247 10913953 -3122796 -6450271 -3606998 -2880647 -2699416
39893 -2699416 4055521 15031742 19099522 13167542 7129989 8563314 13217687 15745360
39885 15745360 18920894 24939476 28082796 25346189 24321228 28949139 27156751 8240036
39877 8240036 -14269290 -15993359 3525961 18586673 13180808 1186205 3055338 17593746
39869 17593746 28277377 26901863 18556586 9695145 3006379 759417 3329323 5929215
39861 5929215 4220338 1164670 1780136 4134215 3129257 521360 2162135 6067646
39853 6067646 2527698 -12188705 -29762071 -39659022 -38758258 -29575867 -16046289 -4136710
39845 -4136710 116288 -2189755 -2659319 3054937 8649720 6555228 -1113854 -6723615
39837 -6723615 -7488325 -4570389 3921871 19472648 34181486 35605191 22545083 7504636
39829 7504636 669534 -511873 -2148577 -2683658 2970963 14314917 26884101 38111831
39821 38111831 45290165 42896744 29867811 15662080 10364562 11075668 6926880 -3741773
39813 -3741773 -10559907 -5941643 5851257 16004951 20109989 18293031 13238209 9362128
39805 9362128 7535732 549021 -18403223 -42739092 -57312380 -56818393 -48829955 -37910381
39797 -37910381 -20979351 -2506026 2374570 -10003595 -21224688 -15910961 -5021504
39790 -5021504 -7621616 -19841379 -22363315 -12700374 -6989919 -9998323 -7068804 7814864
39782 7814864 17671118 8436366 -7779373 -11274061 -5168196 -9424088 -29431516 -47620682
39774 -47620682 -47583460 -33261655 -19563381 -13119334 -8863561 -1117929 8466559 14043734
39766 14043734 12892811 7667459 2365758 -1756482 -5592666 -9617499 -13789219 -18349697
39758 -18349697 -22499429 -24188624 -23888469 -25758808 -30873568 -32404032 -23921069 -10413219
39750 -10413219 -3154275 -4260921 -5291260 -2019664 -354400 -3991585 -6552103 -2882668
39742 -2882668 371832 -5314197 -15409821 -17131686 -6759591 6426295 12549286 9916312
39734 9916312 1587391 -9336944 -18848168 -21785387 -15970921 -5214142 2951612 2422950
39726 2422950 -6881243 -17875433 -21358453 -14130369 -1086537 10775146 17228477 15971010
39718 15971010 7388979 -1254012 235415 11236539 17038650 6942161 -9758400 -15275555
39710 -15275555 -6877098 2248480 4090072 5022176 11305907 17224792 14446970 5324569
39702 5324569 -878448 -825937 267721 -3430398 -12596396 -23178606 -28906164 -24964415
39694 -24964415 -12361393 2244091 12593832 17034139 16421760 12064462 7636439 8099059
39686 8099059 12682562 13275557 5308381 -2981972 915299 16899880 30759705 30575190
39678 30575190 18606979 4780140 -5663090 -13592875 -19343673 -20816230 -17597111 -12388772
39670 -12388772 -7702379 -3995678 -1078542 1547520 5424584 10512758 12021946 5160839
39662 5160839 -5624587 -8867218 -1894736 2346371 -7465224 -21743230 -20019560 -341917
39654 -341917 14531168 6124821 -15575219 -26762500 -21050966 -13384421 -15304293 -19763042
39646 -19763042 -14417102 -625020 7729955 957057 -15641407 -26929568 -22242251 -5442650
39638 -5442650 9091113 11319321 4558698 -2158608 -6585360 -12508647 -19730869 -23559500
39630 -23559500 -24402378 -28660321 -37047391 -40313648 -31725145 -17378418 -8402860 -8034695
39622 -8034695 -11968589 -16254599 -17935374 -12362840 1352406 14068218 14440808 3524421
39614 3524421 -5632504 -4239679 2693158 4843423 -1163928 -10559702 -16718748 -15760521
39606 -15760521 -8695997 -1706214 -932053 -4526914 -3529155 6208039 16521602 15970595
39598 15970595 4448815 -6234519 -6467732 736442 5078406 1825415 -3592184 -3413803
39590 -3413803 2606243 7098702 4158027 -4202240 -11856556 -15939635 -17228455 -15349681
39582 -15349681 -8726932 732564 7994679 10898513 10874207 7055195 -3168666 -15002132
39574 -15002132 -16359071 -3769793 9380052 9671078 2216160 673965 4334050 1539400
39566 1539400 -5538400 288808 21692596 35769216 25460786 6033861 2667533 13558766
39558 13558766 16661876 6205304 -1901213 -871839 -4247014 -19163088 -30792160 -26449883
39550 -26449883 -17396473 -20018768 -28142021 -22677331 -1547367 18002429 23855262 19926732
39542 19926732 14024330 9736626 10710725 18810645 26057676 21658631 10092059 9099553
39534 9099553 24672299 40349049 38637806 22657218 7975764 1829449 731106 2529521
39526 2529521 9190595 19002560 25269356 24011911 17708163 11130601 7242622 6528812
39518 6528812 7019764 5807493 2896928 1652901 3242921 3789495 236360 -4159420
39510 -4159420 -3973201 1656398 9970240 18425359 23128731 18227170 4127135 -6895111
39502 -6895111 -2394305 13248792 22403593 16419097 5722265 3987546 10255826 13498758
39494 13498758 9372408 3697471 1145897 -589492 -3391143 -2941959 4409852 13110826
39486 13110826 13148081 2799523 -8713511 -12481073 -9405231 -6432991 -7412872 -11010874
39478 -11010874 -14462052 -15266572 -11541451 -5213732 -3061462 -9628276 -20193052 -25564774
39470 -25564774 -22616316 -15094630 -6325246 1824032 4907203 621793 -2698751 6034143
39462 6034143 21947034 26279770 12805138 -1193236 100073 7728602 3582114 -10682341
39454 -10682341 -18094952 -14261430 -10921848 -11689590 -4481705 15487246 32388986 30511161
39446 30511161 16491059 8775519 12575186 17492222 16085947 13028776 15285894 21642325
39438 21642325 24840134 20297432 11042200 5235623 8329648 17026421 22808044 21663737
39430 21663737 16870436 11642714 4612739 -4368275 -9466945 -5669794 2438529 4600867
39422 4600867 -2660395 -11716570 -12652247 -4024578 5840868 7341683 -911122 -11465415
39414 -11465415 -17071453 -17796273 -16415836 -10242552 5464334 26313369 39095476 36458847
39406 36458847 25520026 18759380 21471696 30797509 41074781 46363863 43381499 36239979
39398 36239979 33242484 35470337 34740858 26762291 18497350 16594263 16886099 13818429
39390 13818429 12500203 20161951 31072590 32477325 22999861 13387735 10385257 11166559
39382 11166559 12518552 13383600 8767840 -5206616 -18571124 -14483228 6294838 22112825
39374 22112825 19514377 12558623 21567317 42481358 51968967 39171756 18961044 12800640
39366 12800640 26016558 46227894 57599719 53863402 40987046 29330305 22770528
39359 22770528 16627446 6698761 -3481120 -7283126 -3859424 932881 502104 -7404588
39351 -7404588 -18399517 -22722424 -13701578 2557278 11676221 8463979 2811760 3304392
39343 3304392 3739545 -4988887 -17052780 -18321616 -7129265 4533797 9045956 9012801
39335 9012801 5207536 -5945377 -18955976 -19119307 -4647951 4716649 -5773987 -21051369
39327 -21051369 -14688322 12564557 31214895 22298579 1387262 -5050574 5673972
39320 5673972 14728172 11723240 6113891 7262552 8156684 -1430573 -14450892 -12910290
39312 -12910290 6493231 26061391 30744261 27082496 30016100 39363076 42343966 35848212
39304 35848212 30993073 33077345 31543216 17955988 2514156 568752 9520563 12874429
39296 12874429 4981348 -2307676 226940 5506832 3180313 -3816703 -5347666 -651269
39288 -651269 2037702 498296 2485580 12703008 24657516 30108012 29955294 29422131
39280 29422131 27274140 18575800 7122360 5654028 19714025 37701694 42959583 32559151
39272 32559151 18414456 11708426 12435984 14233645 13327652 10597408 9116768 11684003
39264 11684003 17391794 19893349 14071621 5884593 8826231 26343426 44194028 46962396
39256 46962396 36954811 28061669 24782740 18944826 7228258 -853355 1981423 7702143
39248 7702143 3849640 -8030821 -14247468 -7645093 3606087 7043622 360644 -7021896
39240 -7021896 -3827661 12614515 33513784 45373194 40901630 24057189 5408133
39233 5408133 -5360987 -3457981 8770998 21108873 22271033 11728444 444373
39226 444373 -4247544 -8274344 -18431867 -27240214 -22168231 -6795164 1689899 -2375311
39218 -2375311 -4976792 5125379 19472568 24944095 24232985 27971879 33630801 27730482
39210 27730482 7932656 -10500691 -12941397 -759891 13821505 20336445 15547545
39203 15547545 4090145 -3248060 1819591 15078007 23421451 20164610 11147218 4282324
39195 4282324 389076 -2188370 -1052930 6286270 16304568 22647424 22770166 17875555
39187 17875555 9579961 430987 -4999395 -2997104 6737033 21749343 36130016 39920314
39179 39920314 27465435 8642160 2067191 11640656 19560288 10843000 -4878274 -7870303
39171 -7870303 3262390 12836376 13563338 13871585 19748080 25982338 28966739 32373029
39163 32373029 34128473 23437839 434236 -15375296 -9660569 4703305 5821451
39156 5821451 -4867387 -6708432 6742498 18158217 14023436 4253530 4952018 14314986
39148 14314986 17964915 10991151 2071396 -1559966 -1488405 349305 7029466 18816035
39140 18816035 27160651 23450045 10729927 199085 -3228302 -5229421 -10241628 -12322053
39132 -12322053 -4185951 8454733 11033193 426723 -7445091 3204498 26239910
39125 26239910 39472386 31447960 14354540 8026180 17555581 30968383 34778826 26850523
39117 26850523 15934410 12934339 21814745 35618273 42028224 35751064 24302773 18471330
39109 18471330 19240373 19490119 17091251 17906012 23681355 26219317 20400458 15788806
39101 15788806 24969764 43907066 55670545 53524037 47742470 46203241 41616789 26958172
39093 26958172 12774446 15563858 33809977 49040693 49740860 42210402 36953889 36008151
39085 36008151 36848224 38420639 38499064 33330250 24359949 17736185 13600593 5018457
39077 5018457 -7784150 -12840315 -3816894 8373985 11882810 12535613 22542138 37833911
39069 37833911 43566900 39268620 40168884 51584422 60014391 56400255 51984464 59774991
39061 59774991 72683659 74459786 65145754 60624136 68792595 79359853 79094803 67322098
39053 67322098 53283681 45544472 47230905 55748853 63330190 61942353 51457177 40889291
39045 40889291 39303251 47314638 58746530 67946797 73621365 77955999 84362170 94301280
39037 94301280 103915464 105298311 94218783 76647845 65254269 68331025 82683349
39030 82683349 97227545 102630110 97672538 87745533 78450580 71473266 67066126 68736729
39022 68736729 81100909 101015286 115441352 114418553 104736473 103046968 114065654
39015 114065654 124204009 121455358 112680537 111976554 118797594 120992344 116946138 118914090
39007 118914090 131267560 140782269 136702297 127531575 126416129 130445649 129489201 128726100
38999 128726100 144099475 175250453 199925382 201221499 188309028 182717010 192642542
38992 192642542 208655956 219095875 221470298 220165539 218814576 216712398 212172073 208572558
38984 208572558 213249927 227136175 240478337 246215573 253437950 276276279 310455152
38977 310455152 334202459 335537147 325872699 320863395 320351368 316683541 312708448 319178084
38969 319178084 339100354 364658794 386621030 399661826 403001614 403269651 411776287
38962 411776287 431032737 449095563 455475216 456429417 464178258 477108919 484059340 484482179
38954 484482179 488982733 499788537 506040336 502397314 498906694 505538951 516751401 518963384
38946 518963384 507234249 488848919 475020028 472650882 479399354 484260332 478331036
38939 478331036 466585495 462085819 466698666 466569566 451247444 428391702 412171039
38932 412171039 403906782 393138554 374167703 352991113 338719081 334340601 335714183
38925 335714183 335391670 328285758 316873328 308904098 306592850 301054899 282561381 254469040
38917 254469040 231179843 222311930 223873483 225682358 222516105 215936789 209697467 207523993
38909 207523993 212766058 224447519 233379361 228644040 211922566 199687251 203419649
38902 203419649 211446344 202264813 176130367 158111286 162753601 171454928 159846635
38895 159846635 135456894 126610843 138993463 147837661 136435568 118601720 112324566
38888 112324566 111238691 98708708 76999547 64532799 70505359 86887319 101673208
38881 101673208 108097669 104412671 95611713 92486862 99466999 106724235 102841814 90488206
38873 90488206 80397218 75617830 72366800 70529063 70968620 67931254 58147286 52712993
38865 52712993 63749361 82188424 86869886 75699583 68886158 77930207 90064190
38858 90064190 90151930 80848932 71724567 63447772 53979803 48063537 48580817 48128605 40291024
38849 40291024 30785566 27109456 25805294 20950276 16915275 20653067 28513594 33033583
38841 33033583 36093460 42278461 45748033 38912579 29411381 31504533 42306319 44054650
38833 44054650 31546418 20362918 23087077 32614323 36287481 33639295 31235066 30148950
38825 30148950 28072611 26403287 26473061 24553443 18388354 13495126 15589244 21441153
38817 21441153 24443503 24889886 27322760 31415548 33122871 32204889 31520996 31212939 30288890
38808 30288890 31273697 35895304 38541625 32339906 20585457 13697575 15087086 18520411
38800 18520411 19790487 21760262 26107209 29690428 32655708 40457286 51846783 53777093
38792 53777093 37380137 13415046 1912917 8875543 22212477 29710271 31673343
38785 31673343 34017064 37160784 36708514 30833138 22400140 15238164 10891004 8312586
38777 8312586 5635377 2777380 1761963 2822975 1629591 -5761457 -15240869 -16781184
38769 -16781184 -6694134 5743593 7675933 -2487909 -12805013 -10884506 2461313
38762 2461313 13951824 12476943 1895532 -3315793 4075001 14529100 14211307 4085606
38754 4085606 -466177 10516988 29449341 42111050 44226460 41648889 38876658 35070596
38746 35070596 30071880 26912634 26816008 27107062 26337383 27092229 30648421 32390919 27064376
38737 27064376 17289899 12095060 15850979 22482105 23479011 18986539 16465887 19188278
38729 19188278 21844497 19564704 15481960 14373695 13319969 6271446 -3885216 -6684892
38721 -6684892 664372 7018765 498651 -17036570 -32690585 -36045609 -26937543 -13533440
38713 -13533440 -5743157 -7164350 -11137118 -8248261 1317538 8675676 10567433 13716510
38705 13716510 20457153 20322751 5189235 -14924639 -22451007 -13818690 423520 12253975
38697 12253975 20239717 20369386 8051141 -9899969 -19321277 -17534739 -15431864 -18069620
38689 -18069620 -17364632 -9067637 -1907379 -1191469 2341745 14895016 23213966 12388995
38681 12388995 -7411672 -10370802 10213020 33152126 37876362 27653240 19191592
38674 19191592 20551596 26891689 30589159 27811679 19148168 10009788 7912849 14233835
38666 14233835 20232474 15687060 918860 -13141239 -16596816 -9493409 703861 7227141
38658 7227141 8097096 4612686 -797272 -4883159 -4738047 -1001856 1580233 -317262
38650 -317262 -3073102 524373 11761305 23029293 26018341 20602921 13940792 12599939
38642 12599939 17098213 22652002 23958234 20395477 17049441 19041476 24761310 26951568
38634 26951568 20674023 7898945 -5271390 -12652389 -10229973 329671 9860353 9125418
38626 9125418 1043 -5862167 -1394727 8424529 15483266 18145412 18139410 14441153 5948523
38617 5948523 -4201573 -11823657 -15265373 -12584491 -1204719 15113511 25551158 24193783
38609 24193783 16529392 8767100 -961996 -13378572 -19861132 -14992489 -9110058 -14096982
38601 -14096982 -22595542 -17749364 -693127 9380885 3450846 -6255530 -7523964 -4823986
38593 -4823986 -7798917 -15625906 -20483462 -17398631 -5214740 13284913 28331180 30371149
38585 30371149 23820060 22250020 26920685 24906815 13817073 10232682 22380310 31764169
38577 31764169 18610712 -7839768 -23248714 -21897481 -16020621 -9615922 3246304
38570 3246304 16678732 14292644 -3935675 -17576904 -15097254 -8052465 -7611563 -5770011
38562 -5770011 7313121 23005981 27258415 22863621 21599709 21512944 10671519 -8274305
38554 -8274305 -15486770 -528125 21896574 30193603 21146079 9072621 5260993 6967190
38546 6967190 5990737 994632 -1755666 3020646 13388623 22178373 23264478 15770449
38538 15770449 4220955 -4020979 -3125920 6800533 19670846 29070767 33155456 32787561
38530 32787561 27649165 18276557 10198770 9973272 16042378 18964794 13269833 4669560
38522 4669560 2285632 7242254 12746171 13346875 10591900 10017846 14131407 17957817
38514 17957817 12581944 -3833407 -20022007 -22694490 -13781679 -8481493 -13726649 -18563179
38506 -18563179 -12173974 -1276868 1298825 -2524298 -1074734 5366320 4569759 -5280360
38498 -5280360 -10271928 -3374119 3019600 -3522456 -16355889 -21816931 -19948863 -19114163
38490 -19114163 -17694057 -7719537 6799477 12568587 8831144 9850415 21437144 31025134
38482 31025134 29005571 24957769 30074700 35327152 24163697 989915 -11678677 -4989958
38474 -4989958 4799440 2423497 -4172620 1112969 15901412 22668774 15019745 5889260
38466 5889260 7231103 13737191 13514376 6946133 5884819 16759871 32059202 38842796
38458 38842796 30755236 11418218 -9534612 -22869533 -25973323 -24125828 -23602960 -24309919
38450 -24309919 -22715460 -20363202 -22582331 -27646111 -25053048 -9202586 11234952 23357415
38442 23357415 24619989 21027499 15403274 6328208 -2917133 -3655076 7856485 25213015
38434 25213015 38649870 43223376 40627661 37195951 38966141 44324203 44349790 36197835
38426 36197835 31282845 40405656 54888855 56276608 43717676 35516575 40716220 46525561
38418 46525561 41090452 31599265 28276465 25863533 16402815 8046707 13011329 24977731
38410 24977731 27023321 17189611 8435098 6459283 5282212 2973967 3704433 4396946
38402 4396946 -2347133 -10803786 -6609239 7926645 12418414 -1313590 -16179991 -15858808
38394 -15858808 -6441982 -1199741 -148719 1703714 -4031 -9621693 -18879358 -19131465
38386 -19131465 -16773952 -20827026 -24120701 -14853836 -565391 -630517 -16478265 -28382080
38378 -28382080 -24025305 -12931815 -7467386 -5178882 949734 6058769 -1081876 -20307899
38370 -20307899 -36905961 -36869064 -21348239 -4707640 985675 -1902291 -2036975 4596288
38362 4596288 9877700 6533299 -1792089 -7843469 -10069773 -8204325 1544685 17133403
38354 17133403 24627060 14255915 -3416130 -11498407 -12060215 -20534710 -36979401 -42615936
38346 -42615936 -28937612 -12072259 -9787678 -18806543 -24979412 -23944602 -20136461 -14229795
38338 -14229795 -3990371 7134466 12779068 12630898 10986646 8799871 3756555 -3812089
38330 -3812089 -10669752 -14778312 -16012665 -15286231 -15591361 -19938362 -25538136 -25020988 -16475129
38321 -16475129 -6318062 1261012 9977407 20931197 24955765 14980545 -6130 -4671462
38313 -4671462 1896326 6490335 2160260 -3453495 -2898134 -1516826 -8879203 -24115773
38305 -24115773 -37034811 -41018008 -38403355 -33496327 -25979578 -13794792 712691 11558431
38297 11558431 15808792 16207146 16194519 15626565 13559706 11780296 11669951 10249818 4132183
38288 4132183 -4650357 -11931063 -18065330 -24569982 -26432007 -17102762 -1277776 7288855
38280 7288855 3040313 -5529787 -9787665 -10558793 -10200190 -6550427 -1036588 -1653191 -9736523
38271 -9736523 -14568407 -10721732 -9347172 -19575061 -29901021 -25084300 -12980960 -13730399
38263 -13730399 -26209887 -28268797 -12091374 3806956 5360775 4269368 15391562
38256 15391562 30259491 30704449 17696176 7906674 7094808 4831442 -5216477 -15952561
38248 -15952561 -20848919 -24113368 -30968995 -36870470 -33336159 -19996354 -5991787 -1853355
38240 -1853355 -11903604 -30839560 -45605730 -44814843 -29838018 -14128170 -8870375 -11566061
38232 -11566061 -11281029 -2662041 8760278 14028840 10192279 2208497 -2497455 -1196144
38224 -1196144 1467153 -1193639 -8831956 -12312055 -3872313 12016147 21730356 17124847
38216 17124847 3984493 -5402478 -5248039 182838 3498218 1325114 -4862409 -12066292
38208 -12066292 -18645538 -24421485 -28406427 -27559241 -19964254 -9316566 -2898221 -3210803
38200 -3210803 -4826208 -2672822 -283004 -4510289 -13295812 -15150970 -3015286 15755426
38192 15755426 26619181 23106870 12157003 5142992 6234079 10654600 12911116 13277527
38184 13277527 13746772 10690024 -1687587 -19787163 -30364087 -26298406 -15655828 -8795132
38176 -8795132 -4041146 3926451 8377679 -1527752 -18875527 -22286580 -5684929 10358636
38168 10358636 5711608 -12901639 -23605529 -18839527 -10540800 -10162791 -15599327 -18387458
38160 -18387458 -15638698 -12548858 -16235796 -27130308 -36029829 -33342794 -21852123 -13928742
38152 -13928742 -14434819 -15225098 -10577988 -7627651 -13749636 -22946686 -24806530 -19525490
38144 -19525490 -13544091 -7459041 -387405 78159 -13073168 -30402505 -33830537 -20026748
38136 -20026748 -3364975 4336256 4701675 3279466 1885404 2065973 4355204 2292416
38128 2292416 -10928587 -27623743 -30006465 -13613703 5026813 9170594 241796 -9411409
38120 -9411409 -12472464 -10036222 -7469317 -11382444 -22662506 -29720980 -19010529 4056374
38112 4056374 16711852 7299772 -10029227 -16921116 -14545701 -14548198 -17538043 -15781352
38104 -15781352 -10916156 -12949305 -22709645 -28761970 -23508117 -12074220 -2832911 2314021
38096 2314021 4737525 2975363 -4731924 -14154356 -15979216 -5101771 11609892 19911238
38088 19911238 13105596 -333323 -8333894 -10898826 -16411131 -24674532 -25088895 -13463053
38080 -13463053 775902 8274647 9944170 8667516 2604817 -5959200 -6763188 3440727
38072 3440727 12090949 8237359 -390972 -594909 4096802 -173920 -13830702 -22686901
38064 -22686901 -19532770 -12226683 -8948911 -8149946 -5750488 -1508879 4782849 14178412
38056 14178412 22586960 21836176 9846373 -6235433 -18625322 -24994349 -25758674 -21964845
38048 -21964845 -17018267 -14937090 -15910586 -17225263 -16760081 -11422486 3038496 23087162
38040 23087162 33262533 21981039 -1016417 -14858404 -14281818 -13338818 -21019234 -26838801
38032 -26838801 -16825824 5872886 23649128 22900307 5999387 -11356657 -13674089
38025 -13674089 -712680 12064203 12581570 6645041 4851666 2311413 -12649804 -32933643
38017 -32933643 -36257478 -17808894 337631 316232 -8995438 -11225113 -7290382 -6276888
38009 -6276888 -5431308 3054235 13953179 14853039 5217669 -4887705 -10518664 -12390562
38001 -12390562 -6615950 10140706 27146084 26971274 7902764 -13274767 -21643489 -16182511
37993 -16182511 -2520042 12820247 20246693 13558438 1808018 1396930 12520964 17558514
37985 17558514 8597068 1270754 10875667 28049166 32553927 22148008 11656747 8282445
37977 8282445 4943908 -1672317 -2589460 8627944 24559161 34588619 38341639 41282837
37969 41282837 43887528 43430937 41568941 40883182 36245908 19295518 -7431352 -28817841
37961 -28817841 -32739437 -22225638 -9888039 -5028575 -8141382 -12594397 -8795885 7609498
37953 7609498 27618978 34620794 23681537 9703357 9463127 20516531 26853932 21642054
37945 21642054 12985978 8042708 3919550 -2687266 -8021193 -8839504 -8393150 -8897827
37937 -8897827 -6277873 853979 4977201 965017 -3231196 2361283 12638123 13248106
37929 13248106 2218523 -6001968 -312242 13021530 20527327 18518556 14378478 15052466
37921 15052466 19623732 22171413 18640384 10609838 3150541 -864185 -3063321 -5189014
37913 -5189014 -5280502 -1972245 -185360 -6143194 -16321978 -18120873 -4802520 15379243
37905 15379243 29286036 33777150 34497714 32962859 24095773 8677579 -757681 5678691
37897 5678691 19412030 22215935 11204474 4328345 15709291 34982845 41172616 31133598
37889 31133598 21170264 21729919 24720282 19969806 11549177 9349105 13364694 16262012
37881 16262012 16099415 16686873 18272527 17145758 13810898 13733070 19028637 24885133 25376664
37872 25376664 19842128 13753196 14594447 23964895 32369927 27563465 11204393 -430469
37864 -430469 1935172 7177800 1520663 -9011720 -8238975 3318106 8545481 496310
37856 496310 -8461499 -8456989 -6661258 -11629411 -16757502 -11264904 797350 4538104 -6382651
37847 -6382651 -23014959 -31411392 -23988888 -4305169 14152045 18004508 8109854 -294144
37839 -294144 3967022 14788741 19400133 15860071 12014059 11705992 11297711 8110016
37831 8110016 4344791 2963027 5223689 10759068 15200285 11100408 -2428702 -14607577
37823 -14607577 -15292330 -9209323 -8624216 -13955843 -12944862 -148889 13866264 17182209
37815 17182209 11900463 9360788 15567557 25966386 30745829 22600191 3874716 -11742335
37807 -11742335 -10527928 4734030 15229052 7657201 -10059567 -20280008 -17918779
37800 -17918779 -13188516 -14201663 -16133167 -10711397 -43060 5387661 1461318 -2838980
37792 -2838980 2713477 13979890 15914808 3574619 -8321374 -4355133 8742441 10151115
37784 10151115 -5065880 -17891712 -12062046 3689399 9325425 -77274 -13495348
37777 -13495348 -23291288 -31373796 -37365953 -34101522 -18646121 1024477 14165642 16264085
37769 16264085 8525856 -4654856 -15679624 -18283629 -15310195 -16186212 -23973053 -30743988
37761 -30743988 -28332156 -17315128 -2689515 11683860 20095855 15104367 -1697015
37754 -1697015 -15444427 -13523948 -1314460 6078233 4011633 180722 -1420680 -6108301
37746 -6108301 -15506319 -19773848 -9773496 8602354 19005415 12008948 -5763425 -18938917
37738 -18938917 -17971076 -7548470 -1227033 -6440181 -15666863 -15507666 -3805492 7069511
37730 7069511 5310573 -6358767 -14699421 -11392440 -1539420 2673842 -4666575 -16704119
37722 -16704119 -21535724 -15964182 -7649576 -2002278 6256056 21632923 33913329 27742292
37714 27742292 5335297 -13290104 -15944106 -11802737 -13349900 -16990930 -11988337 642827
37706 642827 11250531 18052255 26634303 35005228 33291887 20409436 8814390 7995823
37698 7995823 12913812 14422145 12892920 14388671 19436565 23772307 26973475 32454232
37690 32454232 39649453 42897591 38910151 30162129 19690567 7544327 -5043750 -12397186
37682 -12397186 -10045363 -1817595 3586429 3187549 2386198 5927979 11170009 13577317
37674 13577317 14471337 17873459 22382801 22786625 18872856 15818784 15466680 14334823
37666 14334823 11707864 11893142 15244042 14862737 7466800 387939 1026441 5601219
37658 5601219 6479189 5485023 10325003 20988616 29628568 32180181 30061119 21554169
37650 21554169 3508455 -16487940 -22004452 -8017598 10046551 15035338 8646896
37643 8646896 4745685 7681498 8267612 478582 -8406676 -8159095 974835 10816949
37635 10816949 17120598 22214320 26974310 27514616 22407390 16970969 15207567 12277652
37627 12277652 2314278 -9627560 -13201388 -9455267 -10054662 -17083840 -16476879 709579
37619 709579 21357107 25664427 12215427 -3519588 -10009909 -7405922 589883 9540012
37611 9540012 11629576 3056677 -7197662 -7944341 -3195662 -5572909 -13725657 -12210297
37603 -12210297 4288307 22325793 29299447 26914577 20378784 9745409 -789753
37596 -789753 -275326 12127560 20646987 14436272 4155347 4965423 13207037 13926322
37588 13926322 4580237 -2592457 1743220 14845228 27295369 29253869 16035019 -4546925
37580 -4546925 -15956513 -11797770 -4133263 -5254478 -10502839 -9737502 -5663748 -6216992
37572 -6216992 -6910456 2119023 16351851 21623676 16263581 11558364 11027082 6443589
37564 6443589 -4098187 -10746230 -8277179 -3776747 -4105586 -8304694 -15222180 -25450066
37556 -25450066 -32610089 -26548156 -9397586 4779854 10042010 13638598 17009842 9671178
37548 9671178 -9049267 -19914309 -9561107 7481464 8877814 -3738424 -10713313
37541 -10713313 -5304489 210322 -2215983 -4629088 1942846 13969751 22424736 24567054
37533 24567054 23487715 21408566 17779355 11582352 3781470 -1351812 980587 8954669
37525 8954669 12178145 1902123 -17578727 -32072466 -31752592 -19159607 -4337775 4374365
37517 4374365 5795542 5484105 9046913 14175821 12546236 2304563 -6224352 -2672992
37509 -2672992 9613934 18957210 21598603 24075284 29842622 32450536 25014545 10251928
37501 10251928 -2527662 -6501392 -996518 9787217 18465660 17950856 7313780 -6144829
37493 -6144829 -12695286 -8218289 3592371 15618227 22940452 24959365 23317554 18938818
37485 18938818 12196309 5374649 2245820 4060142 8383515 13334919 19806746 26912332
37477 26912332 28978313 22027404 11052076 4844521 4124817 1280102 -6885551 -13029939
37469 -13029939 -10007787 -2399533 -804101 -6576001 -8945379 1291946 19926128 33754634
37461 33754634 33949923 22425304 7296004 -4287232 -9541831 -10222694 -10620809 -13172061
37453 -13172061 -15321553 -12982353 -7548383 -6025683 -12132112 -20247150 -21252795 -12382691
37445 -12382691 1627786 14929904 24234420 27841924 25920491 21832403 19105626 16610414
37437 16610414 10415644 980985 -5514638 -4854931 -924679 -1721733 -9953953 -18690325
37429 -18690325 -16823854 -333534 21145341 31466607 23820691 7267740 -4469938
37422 -4469938 -7224256 -6396188 -7404888 -11535068 -17681776 -22008618 -18861741 -8421432
37414 -8421432 -128300 -1449770 -7345197 -9434237 -10460902 -17629819 -25767417 -22804154
37406 -22804154 -11143096 -6210365 -11259626 -11812665 -1018470 8186398 6351429 5261088
37398 5261088 17832270 34447438 36477365 23650957 10999359 5572021 2723361 633181
37390 633181 2457181 6580400 8520632 9915670 13221282 11840586 -491944 -14575507
37382 -14575507 -15400107 -4303113 4056645 4700400 5825684 10517424 12691671 12196612
37374 12196612 16170207 22832492 21600596 13012281 10442585 16767693 18085222 8462376
37366 8462376 2262977 10746997 23169532 24456421 17393076 12961583 10864349 4635733
37358 4635733 -3935331 -10167322 -17393844 -28167478 -33184139 -24222707 -10406391 -5393730
37350 -5393730 -5175153 3618623 18334206 22842689 14023998 6102022 6412608 5358599
37342 5358599 -3890271 -11755840 -6760415 7753425 19305498 20579109 12705103 2175768
37334 2175768 -1088993 9445196 27642396 39190890 38117671 31010097 23478900 13681468
37326 13681468 3014083 283332 7224193 10866621 637688 -15001574 -19331917 -8530975
37318 -8530975 7410663 18586434 19909233 8395971 -11937968 -26554667 -24445143
37311 -24445143 -13468364 -9541054 -12889085 -9338572 4841366 15405611 11763436 1629190
37303 1629190 -2993437 -1774421 727174 6208821 15719758 20815327 14654984 5833240
37295 5833240 7685805 17375659 19089648 6684470 -9996876 -21526018 -28004668 -29278726
37287 -29278726 -19823873 138088 19228681 28227055 30432759 31715803 28877962 17042267
37279 17042267 1676660 -7260513 -8691728 -7701667 -3268787 9250969 24310492 27788020
37271 27788020 16249948 4324852 6419558 18081827 23095473 15069531 3491389
37264 3491389 -1653219 -3113624 -9167175 -17957584 -18267327 -7732628 -700166 -9394798
37256 -9394798 -23820822 -23872919 -9439393 -1387094 -8454130 -11994334 4277896 26015532
37248 26015532 28469804 13453016 3425078 4625522 1168950 -13610408 -25062595
37241 -25062595 -23216036 -18582820 -21556020 -25306057 -21585978 -16327983 -15674258 -12615597
37233 -12615597 -3182891 -308443 -12713908 -24155145 -16354606 -1174795 -3152247 -16950017
37225 -16950017 -13269766 11858483 25814912 7737448 -20193446 -26924730 -14937656
37218 -14937656 -6566444 -5393586 1963552 14277958 13893211 -2698674 -16530885 -14915601
37210 -14915601 -8601403 -10097676 -11930095 -1705415 12539681 10544413 -10172073 -29729872
37202 -29729872 -33169068 -27349507 -25049653 -25506033 -20979795 -13466283 -11839085 -16043788
37194 -16043788 -16279487 -7558642 5041013 15762332 22816059 23176859 14119695 2661429
37186 2661429 1810454 12353369 19438703 13810752 5239019 5972355 11589935 10034839
37178 10034839 913670 -7643693 -14563623 -23550877 -29871855 -24953875 -12150646 -3031748
37170 -3031748 977451 8263190 19081318 24668376 25530850 32402151 44364701 44543470
37162 44543470 26188293 6212655 1412586 5970926 5860545 2330678 4784325 10038915
37154 10038915 6819899 -3639648 -8132691 -1570221 7122346 9299028 5368471 -1124171
37146 -1124171 -8499407 -15431708 -21555049 -28148502 -32363312 -26096780 -9075595 4008992
37138 4008992 1615128 -6093439 -2341711 8272787 6870140 -6584918 -10766409 2065296
37130 2065296 12673939 7214131 519112 9726984 22747984 15650071 -9267451 -26534142
37122 -26534142 -24480299 -16813540 -16591694 -19153860 -16306074 -10599963 -7295209 -4465316
37114 -4465316 648146 4802673 5719464 7989475 14889190 20860961 18829850 9519417
37106 9519417 -2087678 -13511426 -22254685 -23457122 -17761628 -15565062 -24327507 -35892691
37098 -35892691 -35892686 -22643820 -6888439 4554688 13144900 17253633 10222693 -5639221
37090 -5639221 -14799304 -6285776 11716911 22695818 21516934 15985812 13907358 16886442
37082 16886442 23374413 29304180 28077802 18503304 10742430 14531054 22384864 16628372
37074 16628372 -4175458 -18599886 -9707295 11445871 20811851 13074942 5126562 10191129
37066 10191129 22147298 28015336 24320193 15616561 5924471 -1433739 -2522524 848240
37058 848240 -1228451 -14170445 -27676619 -26486949 -10637892 4685519 9285999 7485253
37050 7485253 5730585 2445770 -3439975 -4064383 6751952 20158662 20896985 7622701
37042 7622701 -5307691 -6447874 1422406 9706669 14445039 15051487 11119061 6180708
37034 6180708 8420862 21036539 35799338 42284169 40459524 37945363 37135236 32270219
37026 32270219 19479841 3564510 -7019580 -8021711 -1350785 6988215 10187567 6216475
37018 6216475 1584917 4994002 14667545 16756680 1318818 -22975042 -36249636 -29293687
37010 -29293687 -12415704 -1482298 -1116840 -4965230 -6750769 -4555335 2374767 12577650
37002 12577650 18374408 11735853 -3081755 -10568030 -2044180 14276245 26351023 33214300
36994 33214300 38824082 39638726 31538734 24041991 31095728 47381393 50437990 31161062
36986 31161062 6942174 -3149668 -1786631 -1124010 -409114 8565083 21938661 26826970
36978 26826970 21055382 14987353 14389744 14859879 13600035 13720185 14840303 11421226
36970 11421226 3744925 -109314 2865639 5305208 1140007 -6141322 -10907392 -12583142
36962 -12583142 -11197569 -4234444 6950072 15302366 18017790 21095349 28672415 35263932
36954 35263932 34683026 29445064 24388674 17713842 6167851 -6611620 -14794061 -17951654
36946 -17951654 -16126008 -3958539 19427179 39661373 39496902 20993503 3188664
36939 3188664 -2848835 -4154901 -8552162 -10783091 -3857063 5875019 6072251 -3802043
36931 -3802043 -12220493 -11575640 -5302010 1460362 9309242 18641662 23119864 16087018
36923 16087018 1020953 -10960192 -13868611 -11235229 -6915382 1327316 14488435 24304396
36915 24304396 20444623 4375711 -10754263 -14347550 -6961127 4878136 15257919
36908 15257919 18886970 12461955 678502 -4787320 2162664 14012551 18979897 15451232
36900 15451232 12115361 15646103 23181502 26647590 20976283 8075375 -4789880 -10204669
36892 -10204669 -5297910 8177610 26389774 43367198 50800907 44178319 29521706
36885 29521706 17600656 10221984 -244149 -15143096 -22427873 -11757664 10046184
36878 10046184 26425896 29794893 26007833 23803323 26455427 31152911 31073373 21181970
36870 21181970 6655520 605316 7676042 15990639 13184346 4262170 3196784 11488368
36862 11488368 17356518 14424618 8888535 7224500 7454064 4952059 -1083761 -8347098
36854 -8347098 -12453509 -8932891 -1257864 -2231300 -16447885 -26720678 -14223899 10460463
36846 10460463 17112744 -403762 -12914095 1555203 25509842 29178625 12925953
36839 12925953 486120 497754 -282841 -7995666 -10305585 414151 11792401 9556766
36831 9556766 -1770512 -7069988 -1707744 5577422 6720965 2792027 -259227 1745630
36823 1745630 8668759 16212064 18644492 14075598 6940439 3344406 4206128 4793327
36815 4793327 1200282 -4355922 -5930341 -988457 6869203 13559766 20772272 32841806
36807 32841806 47729484 56321206 53389325 45060595 41176589 43275995 45331770 44283725
36799 44283725 42928142 41624337 34208833 16819060 -3010012 -12040866 -6421768 3056059
36791 3056059 2882327 -8193600 -18746571 -18246831 -7746879 3340600 7091278 1323562
36783 1323562 -11592741 -24529657 -26534569 -11821576 10586403 22874949 17429674
36776 17429674 4528430 -2276906 -2208388 -2868012 -5462868 -3805874 3270416 7830154
36768 7830154 3611293 -5831928 -13177970 -16301421 -16894269 -14088777 -5439372 6224107
36760 6224107 12136976 6492401 -5814370 -12972443 -8146470 3969318 13425019 16291803
36752 16291803 17219622 21296882 27166657 29962924 27652571 21146425 10876670 -1739344
36744 -1739344 -10660431 -9477734 -1028560 3243204 -2147912 -7419911 526067 18845943
36736 18845943 29798274 23175576 10007769 7902481 17800578 23878087 15436275 27156
36728 27156 -7682716 -2851665 7894433 15611377 14260628 2029097 -14940891 -22939636
36720 -22939636 -13134030 6401428 18170671 15532439 8763713 9435828 16130620 19861056
36712 19861056 17871472 15593049 16782831 17456230 11345252 -667302 -8906666 -4509181
36704 -4509181 9474762 20091786 19748241 15071830 15853339 20004698 18078147 9983281
36696 9983281 5701593 8066312 6749548 -5306740 -19639194 -24205622 -19941163 -16726743
36688 -16726743 -18405247 -20922099 -21924916 -23302011 -25315902 -25172228 -20766035 -10979001
36680 -10979001 5240913 24551691 37075930 35485725 24403034 14645263 10580526
36673 10580526 9460842 9260395 8112856 -669811 -20841139 -40633683 -41329880 -22450416
36665 -22450416 -6158151 -9400533 -22040796 -22448227 -6837185 9262292 14765316 14687959
36657 14687959 16862818 19209894 16375302 11118678 10864334 16124967 19965129 18968770
36649 18968770 18448097 24331774 33997453 38695237 33423153 21735614 11816914 9951160
36641 9951160 16381377 24422986 24426686 12735726 -2232437 -6461110 4581170 19435508
36633 19435508 22016146 8665116 -8643521 -16215359 -13182630 -10007860 -13524974 -17858764
36625 -17858764 -13669702 -3284936 903518 -5615212 -11472389 -4924360 9447564 17735590
36617 17735590 15482149 9584326 4688820 -633210 -4687297 -1861389 6769685 12948940
36609 12948940 13860246 14180211 13204735 3789005 -10409775 -11834391 6360045 25445301
36601 25445301 24139368 6562044 -7031709 -9041046 -7867195 -8411035 -7402152 -6693898
36593 -6693898 -13250997 -22964183 -20292914 -621956 18606558 16910451 -5675023 -29492647
36585 -29492647 -35230197 -20090992 1548287 11353318 3734248 -10670349 -19855482 -23676342
36577 -23676342 -26666053 -24883613 -11737766 6701319 16232170 14600002 13433112 17851830
36569 17851830 18266264 8410911 -1017934 3832059 20535724 33994814 34811063 26364509
36561 26364509 16449436 8724184 2449841 -3188982 -6114264 -3476761 2975473 7137549
36553 7137549 7078437 8651058 15312734 19943335 15160989 6691403 5532640 10668928
36545 10668928 12397385 10189513 12268913 17856677 16172496 5390566 -3725220 -6825687
36537 -6825687 -11425851 -17653096 -12258267 8024243 24665184 22639173 12573634 11814368
36529 11814368 16546660 11775719 -402411 -3915773 3746903 8020688 2587392 -582267
36521 -582267 7463588 16046465 9202047 -11471351 -27563022 -25072723 -8892931 4439328
36513 4439328 5534584 1021498 2705351 11356824 17020863 14309777 9067739 7752337
36505 7752337 8657317 7759981 5335702 1833370 -4910936 -12705576 -13454592 -5322793 1692527
36496 1692527 158696 -2951925 1760855 9629121 8610678 -2280831 -12107023 -12796338
36488 -12796338 -5774209 3301094 8088949 2880256 -11485188 -25294416 -29947105 -27095474
36480 -27095474 -23082188 -20425905 -20566782 -26666906 -35403840 -34753125 -20320886 -5537603
36472 -5537603 -3898335 -9480420 -8771905 -3669122 -5983705 -14772396 -17486052 -11320219
36464 -11320219 -5537240 -2835290 4170572 16198396 23489144 22327875 21044162 25373965
36456 25373965 30130782 29110202 22497271 12111252 -399137 -9805521 -12371683 -13830983
36448 -13830983 -20321626 -23884936 -12733999 5256189 8236500 -8026628 -23465428
36441 -23465428 -23599840 -16710844 -13278500 -7460086 8649614 27604082 37037915 36515407
36433 36515407 32585711 27062075 20358439 16554416 15574208 10346083 663690 -1444802
36425 -1444802 9925854 22813776 25419621 23614889 26623979 26906492 11828508 -12191413
36417 -12191413 -25364520 -20929083 -9898567 -1736465 4059121 7193083 2360592 -10644412
36409 -10644412 -22991979 -26348181 -19948855 -8252087 1898135 3476450 -3740399 -9995428
36401 -9995428 -6772892 1172594 3095396 -1361434 -3056885 780131 2383602 -3607183
36393 -3607183 -12221785 -15471631 -10649961 -119078 10694120 14770301 10061572 4887580
36385 4887580 8956118 18283469 18288676 4797028 -7812542 -6028558 3034371 1377105
36377 1377105 -13615612 -24198019 -16442803 300199 6359872 -1183860 -6068884 2072040
36369 2072040 12996813 12841361 4465708 -903200 -3555515 -10403558 -14956172 -2902715
36361 -2902715 19842024 25841806 2690693 -26466786 -32338526 -15629362 1488242
36354 1488242 8424720 11781680 14370047 9296925 -3715422 -12784820 -10077440 -2683472
36346 -2683472 -1933136 -8913515 -15064155 -13175214 -5043043 413865 -3027178 -10651147
36338 -10651147 -12380268 -7785884 -8131599 -18900857 -28468204 -22290045 -2441270 15635859
36330 15635859 21410158 16523784 8698468 6521456 15408764 30191386 36109308 25182946
36322 25182946 6685327 -6002986 -11687473 -15424519 -15058059 -6390439 5000142 10651969
36314 10651969 12213184 14245216 11150424 -2615001 -15794585 -13052771 -619514 1339045
36306 1339045 -9761599 -17346866 -16898249 -24639815 -48014034 -69436323 -70733090 -56362791
36298 -56362791 -40773440 -27790494 -14711476 -4194017 76327 -85293 -4222187 -15984126
36290 -15984126 -30978492 -34814465 -23521683 -13017336 -16145502 -22893550 -17929511 -6249258
36282 -6249258 -3651460 -9839038 -10530470 -2785682 1048662 -4564206 -9812700 -7513069
36274 -7513069 -4972032 -10539371 -18992704 -19216435 -10409890 -2438457 -2626451 -9000976
36266 -9000976 -16357923 -22913827 -28004535 -27384544 -17121035 -2237288 5629274 3249634
36258 3249634 2202409 13266926 29430657 34043338 23158937 8950729 1578801 -1101059
36250 -1101059 -4786126 -10689731 -17924864 -23251905 -17676137 3734730 26848851 28923024
36242 28923024 9311210 -6123875 764759 17494245 22810771 15934696 9658080 7418932
36234 7418932 4401425 2246314 5176675 7620917 2347051 -3618871 2281970 15945952
36226 15945952 18794024 2037795 -23801063 -42460062 -43662498 -25008770 3497472
36219 3497472 18960136 5523291 -23903692 -39550563 -29737301 -10837433 -1819923
36212 -1819923 -4380226 -11932412 -22208951 -32334095 -33518654 -21289752 -4427785 4343156
36204 4343156 2189016 -4444274 -9191057 -9423605 -4922580 1741615 5353548 1963120
36196 1963120 -7446150 -16865987 -17950607 -6251372 11645135 21545380 17771107 10962296
36188 10962296 12543710 17592264 14079714 3672496 -1464371 38998 -1975225 -7346102
36180 -7346102 -1798703 18192281 33747325 28007898 9238618 -3114700 -5173863 -6956597
36172 -6956597 -10561653 -6208365 9746986 25666102 28061236 17396337 6211656 4405438
36164 4405438 9588028 12186712 8371269 4472534 6666610 10970830 9692816 4300119
36156 4300119 2404780 3001130 -3597781 -18314658 -27306323 -19701572 -2410771 9961141
36148 9961141 12902052 12484353 14209998 19152332 26968248 35520911 40022901 37788962
36140 37788962 31328803 23366239 13150221 1582629 -4910570 -464635 13665886 31306309
36132 31306309 45347405 48117769 35950657 17344734 8208395 13656348 22460495 24432281
36124 24432281 23124204 24275962 23359472 15765897 9258442 12436173 18420663 15093793
36116 15093793 5956587 4461288 10607742 10259647 -1801452 -13986282 -15759522 -9630229
36108 -9630229 -2046153 4859048 8441962 4508865 -3974802 -7598261 -4455684 -3341191
36100 -3341191 -8769427 -13406643 -10698683 -4620340 -398621 4902293 15311887 27829482
36092 27829482 38449294 48457192 57703875 59516119 50111906 35979763 24217105
36085 24217105 12700582 -2141617 -15428770 -21105621 -22134484 -23288499 -20535838 -9091594
36077 -9091594 3984549 8091726 5053099 2929472 -1479528 -16896571 -35866847 -38105958
36069 -38105958 -19444056 459373 6622119 8489527 20572345 37800655 44661832
36062 44661832 39110937 31791098 26881600 18801709 6229773 -3763591 -6034839 -1388943
36054 -1388943 9423802 24894105 35393828 28648639 6915557 -10656564 -8505272
36047 -8505272 8721819 24246775 27871446 22254617 16049545 15982079 22242296 27781322
36039 27781322 24949533 14836413 5910949 2163899 -830686 -5531850 -6750066 -2172158
36031 -2172158 -86675 -7276347 -15344353 -10409184 6686292 21356233 25445272 24927094
36023 24927094 26667607 29210039 29967404 30584295 29762194 20449907 1295875 -16785147
36015 -16785147 -23016540 -19542270 -14899151 -11635519 -8948168 -10622388 -18547902 -22803684
36007 -22803684 -12027906 7185174 15427636 7475969 306696 8330929 23505978 29614213
35999 29614213 25789725 23122652 24769988 24279827 21445404 24593185 34374799 38697668
35991 38697668 30311282 19084888 18085002 24584559 24662749 12706633 -3307389 -14442979
35983 -14442979 -19539990 -20668575 -18082734 -12497802 -6487734 -855586 5620201 10864985
35975 10864985 9705077 2730638 -860168 5057174 12899388 9321304 -7094450 -22042172
35967 -22042172 -20563178 -2272986 19340737 29931263 25698672 14258949 5947396
35960 5947396 4270433 5126212 4811192 5709015 11910085 21742215 28520241 28400683 24562306
35951 24562306 23064174 25913261 28165201 21759779 4200099 -16043183 -26306650 -23834969
35943 -23834969 -19003138 -21371239 -27533609 -28316308 -23372694 -20371730 -22005137 -23132254
35935 -23132254 -20947825 -18549294 -16071615 -7449276 8780248 22302931 21408626 7435975
35927 7435975 -6103766 -7066856 5537918 22823712 34159213 35470497 30889941 25482952
35919 25482952 18820255 10019052 5344219 11129107 19843432 15698816 -2391694 -16560457
35911 -16560457 -15719274 -12037137 -19897577 -30561406 -25152352 -5628167 7417409 6374112
35903 6374112 5338355 13262981 18279525 8796278 -5918063 -10157570 -5492955 -4496030
35895 -4496030 -7758460 -4039602 8185340 15258644 8151810 -4323811 -8153705 -1627049
35887 -1627049 6167636 8279918 4418390 -3621096 -13470729 -19602563 -15729483 -2565264
35879 -2565264 9808187 10487481 -1156384 -14109787 -16248876 -6253094 5779399 9867732
35871 9867732 6463809 3368690 4513123 6569976 6910574 8738260 14397600 18556779
35863 18556779 14881020 7425399 7327771 16731316 23350708 15383870 -3244012 -17906135
35855 -17906135 -20382091 -15228447 -10657230 -9237873 -8705462 -7300978 -5525675 -4176762
35847 -4176762 -2327541 2255298 9403051 13220804 6522810 -8256185 -16764698 -7612145
35839 -7612145 12470661 25573267 24182679 17540298 15116939 13511223 5481512 -5978297
35831 -5978297 -11570544 -9790507 -8095238 -10991020 -14936760 -15832966 -14563564 -13112204
35823 -13112204 -11195333 -9489142 -10640546 -13175512 -9455342 4558219 20990488 28761208
35815 28761208 29295641 34931376 49661468 60545033 54862547 38911546 29639651 30763076
35807 30763076 29085276 15509877 -2427006 -13850953 -19294946 -24143263 -26704627 -23546844
35799 -23546844 -19933197 -22623100 -26275332 -19694904 -3839198 8585311 10572589 5720805
35791 5720805 -3146071 -15841759 -24529359 -17936532 -477827 8529631 1755926 -5079374
35783 -5079374 2212610 15957707 22776011 25518025 33230056 40818050 37289808 26867328
35775 26867328 22706552 23528402 15776834 -1388213 -11848539 -6600646 3768025 6050231
35767 6050231 1119637 -2383617 -1381867 18893 -4468838 -18773670 -37802713 -45707938
35759 -45707938 -30843145 -3042870 15028433 15007572 9432536 9792327 12617712 12260740
35751 12260740 12125528 13914964 9007313 -7195017 -22350518 -21955514 -9860746 -482953
35743 -482953 3924658 12791318 25791227 28391095 13517927 -5172167 -10228227 -2809963
35735 -2809963 1624917 -3300058 -6381246 3705411 20781378 28643441 22797891 15021295
35727 15021295 14492058 14304944 3908935 -12307566 -19394978 -11571516 3187230 16969980
35719 16969980 28512350 34747762 28745751 12166631 -349568 2253167 12558957
35712 12558957 14121859 1928335 -13352064 -19319768 -14551417 -8068880 -9028588 -16274270
35704 -16274270 -18381458 -7357299 9038325 15235881 8109378 654793 3260797 10870527
35696 10870527 13563981 10617446 6694128 1616606 -7203807 -17062198 -22964896 -24873757
35688 -24873757 -24897717 -20954671 -10632464 1736028 9472544 12836860 16506193 19421417
35680 19421417 15166803 3084796 -7783833 -8395358 384065 9556445 11889782 8709726
35672 8709726 6604562 7542875 5262357 -4732273 -14753683 -12771439 -747504 4800801
35664 4800801 -5638994 -21446801 -26001168 -16158310 -1210663 10148578 14104395 9609479
35656 9609479 1272827 147756 12749105 31415398 42184966 39556566 28142125 14496827
35648 14496827 4223177 2364478 8107211 11944204 5920522 -5504105 -11656380 -10024232
35640 -10024232 -7348764 -8499736 -11113674 -10323847 -4084672 4401999 6812121 -2948432
35632 -2948432 -18223347 -23593946 -14512405 -4733927 -7245200 -16754461 -20407845 -17040893
35624 -17040893 -13798036 -10637016 -1724916 11704852 22044074 25974242 24566526 17419257
35616 17419257 6805866 1687807 6401220 11822117 9459731 6125950 10770612 16182810
35608 16182810 11193768 2276569 2511847 6666990 819953 -9157570 -5960837 5089554
35600 5089554 1061982 -16871834 -19147632 5268088 28515112 25582337 8987770 2803698
35592 2803698 6026103 4256987 -1456897 -2202097 -4179670 -19678314 -42485062 -52943633
35584 -52943633 -43113526 -21257199 2653892 21288122 26677116 17706691 6059443
35577 6059443 2661918 4496398 5086177 7847754 15986305 19982679 11121559 -1344651
35569 -1344651 -2721191 5320694 11134336 12828573 15173196 15736900 12124171 14155194
35561 14155194 28817210 41247380 32898974 12055139 2484724 6990466 8214623 2380540
35553 2380540 3048237 9862509 3878185 -18618316 -35595552 -33469184 -26723672 -30745069
35545 -30745069 -38443865 -38600312 -35818697 -35493743 -28690681 -10879973 1544360 -5838564
35537 -5838564 -20057810 -19360497 -5746758 2615417 1883780 2435171 4584906 -1686590
35529 -1686590 -14468787 -19825079 -15491488 -14261747 -20216540 -21019829 -10341969 -298481
35521 -298481 -1747791 -6087494 1677282 20873445 37116319 40813630 34816826 27251271
35513 27251271 23908058 25463481 27065084 22581426 12311372 3234398 -822706 -4116391
35505 -4116391 -10159194 -13744089 -8472454 1629090 6268464 3872113 4399916 15038007
35497 15038007 29505857 36060161 32336055 26624099 25075775 23298221 13946955 -100244
35489 -100244 -5504566 6586135 28267059 41145910 34637789 15364722 -1535243 -6815765
35481 -6815765 -1356149 9767019 22165911 31506413 33249700 26204661 14416998 2921742
35473 2921742 -7343218 -17958305 -27186373 -29302053 -21397986 -8678220 -78192 1562974
35465 1562974 2624179 10005967 20250086 21176561 7137351 -10112456 -11701649 6431854
35457 6431854 28209407 37421962 36476529 38052952 43300701 39920485 22355223 2514129
35449 2514129 -4733810 1200202 9728459 13041989 10333041 3030723 -6468054 -13377476
35441 -13377476 -14298056 -12064291 -12816594 -19019423 -27677288 -33209010 -30594407 -20138823
35433 -20138823 -11147283 -14194868 -25733557 -28292915 -12764603 7196937 12056865 750409
35425 750409 -12808328 -21283296 -27938965 -32491317 -28811859 -18026520 -10054120 -9131797
35417 -9131797 -9639897 -8503089 -8994947 -9295693 -1615230 11419325 13633840 -2298301
35409 -2298301 -20971219 -23095610 -8789453 8133432 19816784 26159652 24660045 12914924
35401 12914924 -2040289 -10023538 -12233188 -17700828 -25310257 -21589703 -265178 25280962
35393 25280962 35425385 26190358 12983488 13230911 27534822 39388175 34438592 17768382
35385 17768382 7207469 10406642 16551625 12885754 139105 -13458904 -23847170
35378 -23847170 -28928043 -23984816 -10378444 -1657747 -8121924 -20159859 -20564026 -9975380
35370 -9975380 -4972311 -11879018 -18646587 -15286336 -7110792 -2678065 -2465904 -5920757
35362 -5920757 -16277070 -29460760 -30251965 -11259969 12510471 19723258 7823589 -8080925
35354 -8080925 -15932644 -15122499 -8222150 3298343 15392466 23284272 27231252 28861223
35346 28861223 24028148 9288999 -6237660 -8237784 2040824 7701056 1365731 -3514431
35338 -3514431 4351730 12683202 2468047 -21004331 -32259148 -20958759 -5793658
35331 -5793658 -6852885 -18592601 -21673165 -12134308 -4256169 -7372138 -13930972 -13272978
35323 -13272978 -6232171 -211184 2779331 5948359 9534855 9734174 4936233 -1842832
35315 -1842832 -6669896 -7488604 -3856317 2474161 6647161 3915397 -4806428 -12432947
35307 -12432947 -11909683 -2305494 11149296 21982970 27486947 29830998 32443606 35422092
35299 35422092 35644270 31522412 25299841 19126235 11141041 -1619793 -17072079 -27235580
35291 -27235580 -24028421 -5957535 19050661 36891473 37007523 22145645 6352859
35284 6352859 373267 1450133 641483 -3806907 -6369153 -4615439 -1677479 1179774
35276 1179774 6130796 11759754 13048514 11088022 13652650 21240834 22198871 10081593
35268 10081593 -2713274 -688761 10903797 12587106 -221009 -10268228 -4285772
35261 -4285772 8845179 13528328 9007189 5140339 6058460 9972652 18030210 29896218
35253 29896218 35545726 26468096 12745168 12997895 27043870 35640784 30638511 26562562
35245 26562562 33887520 39682444 29737518 14517075 13113027 21189093 17484111 -1430978
35237 -1430978 -15836485 -14375694 -9371976 -13487130 -19742464 -16228292 -6702130 -3229295
35229 -3229295 -7262262 -10337107 -7838673 -1821757 5067259 9379215 5305205 -7338149
35221 -7338149 -17234613 -12930836 2076395 13580311 13983256 7951168 2740658 495602
35213 495602 -474272 -2691561 -6784583 -7625243 2756216 22428480 35127561 27941476
35205 27941476 9797566 1340422 8094219 15834241 13266196 5989201 3118890 2188947
35197 2188947 -3477907 -10317997 -8548188 1833766 8739038 3424407 -7901455 -11452433
35189 -11452433 -2540182 8333191 6769669 -9473030 -27494418 -32303459 -20527011
35182 -20527011 -224792 19321912 33736747 41426858 40898738 32154201 18264382 3718726
35174 3718726 -8142972 -15539395 -16946196 -10928901 1006516 11749198 13159998 6654868
35166 6654868 4645645 14811258 27018856 26177455 15626936 13282073 22969252 26978816
35158 26978816 14568370 184091 -155396 5096736 -775630 -12543460 -11780010 775296
35150 775296 6048941 -1157645 -4764990 4171551 14037305 14824474 13468735 17087244
35142 17087244 18571320 10847656 1013441 -1959840 -1364624 -2987377 -2904523 2663671
35134 2663671 5948429 -793748 -11141742 -14595086 -12377850 -10269497 -4274394 11404334
35126 11404334 28571440 33492310 27606986 24297319 27151902 27308075 22545207 22944716
35118 22944716 33477966 44352994 45096390 38614015 34619473 35660486 35934801 30630301
35110 30630301 21970035 16783436 19339810 26405899 30983037 31190404 30757939 29320079
35102 29320079 20546474 5320223 -2805301 4328219 13625903 6717378 -12497157 -21545815
35094 -21545815 -9972186 8720100 17695340 15213568 8373790 1774308 -988154 4501803
35086 4501803 15908919 22554864 17891019 6879245 -3645038 -13411382 -21684580 -21234831
35078 -21234831 -8460429 7101471 13031733 9675314 7117889 10273832 15593163 19773890
35070 19773890 22663660 22534362 17062023 9611216 7287165 11397420 15725217 15343769
35062 15343769 11571623 7085447 1969797 -3276343 -6125393 -6097115 -5615737 -3927279
35054 -3927279 4247233 18943412 28773549 22385782 4407014 -8307136 -7125939 -226466
35046 -226466 1826893 -9422 -219114 -1407681 -9029816 -17615478 -15444958 -3693281
35038 -3693281 1763215 -7981185 -22332783 -26562598 -19877449 -10478608 -2087611 4408998
35030 4408998 4133493 -4126670 -9180661 -681268 12261297 11469211 -1943505 -7023655
35022 -7023655 5448569 18473370 15161555 4318299 5416510 18056161 23539712 13832520
35014 13832520 2682337 4560783 14566901 16269568 3209140 -14500407 -23088608
35007 -23088608 -19054268 -9122214 -180821 6459227 10822304 9891845 2681947 -3148630
34999 -3148630 2405417 17594833 28390059 25502430 15659532 11140108 13822278 16444959
34991 16444959 15798457 16297761 20979615 26336301 27908027 25774203 22113803 17216188
34983 17216188 11042531 6649137 8438513 16106361 22206384 18549723 6066511 -4568898
34975 -4568898 -5596037 -2969358 -7996304 -18520556 -17914310 2152573 26225112 31501201
34967 31501201 15112096 -5409001 -16786777 -23001266 -31463682 -38209829 -34551309 -21182905
34959 -21182905 -7014374 2303266 7045015 7466768 3699941 943363 6031473 16666525
34951 16666525 21518598 14963160 5671697 5264864 12780569 16609034 9723019 -2754471
34943 -2754471 -10490284 -8027290 1208318 7151521 1270503 -12684458 -18458458 -4474023
34935 -4474023 20216584 34923845 31426029 19652400 9266842 -1526940 -14068868
34928 -14068868 -19523044 -11401192 1738337 7814174 8025205 9491718 7900240 -6302599
34920 -6302599 -27133000 -36000558 -27413575 -15580815 -10574462 -3525886 15683068 38933368
34912 38933368 49724881 44112544 30753696 16350695 2075371 -9686650 -15743929
34905 -15743929 -17343768 -16388377 -9061430 7308886 23071202 23210005 6841190 -10372477
34897 -10372477 -16411082 -16036325 -18521253 -21055750 -13623093 3791469 18657825 20675732
34889 20675732 11514472 -1449226 -13716347 -22538966 -23935294 -17149943 -8194856 -2351939
34881 -2351939 4066539 17318669 34212730 45811283 51870932 59612169 66613625 59684472
34873 59684472 37685918 20688882 23795482 34026206 29957493 15153477 11015929
34866 11015929 20347226 22174036 6878017 -6344400 1537992 20360399 25760951 12359314
34858 12359314 -3068864 -5894495 2042166 10550702 13565716 13028344 15789517 26517279
34850 26517279 41596363 52390148 54906332 51557025 44179204 33446983 25185262 26073989
34842 26073989 30455931 23638122 3190904 -15519299 -21464935 -22294639 -27454389 -30203494
34834 -30203494 -19256940 1612056 18979708 27503224 30573586 30736769 30854848 36607253
34826 36607253 45571268 42478167 19364986 -7495111 -15904933 -5704177 7456347
34819 7456347 18506461 33688878 49664656 53196771 42277920 29683953 24270674
34812 24270674 24294989 28535916 36957025 40677155 29742681 12159221 6696587 14785690
34804 14785690 18939445 12397355 9690914 21388983 38106731 47969631 51598899 50748344
34796 50748344 40473140 23558040 15315382 21413250 26654549 18827161 8420873 10230366
34788 10230366 19807076 24478457 25317038 30759243 38498807 41348792 43003776 50492005
34780 50492005 57389073 51909997 37182166 27018772 25037436 23891599 22296130 26002130
34772 26002130 32144561 28894537 13985223 932874 2334472 15436667 27623350
34765 27623350 30869215 29355923 35047094 53049585 70461834 68281310 47843855 32791098
34757 32791098 37025736 45617229 40327741 28328420 26582253 31688135 30059839 28343827
34749 28343827 44431619 71464055 81411300 67670431 54892413 59082248 66267191
34742 66267191 62627772 58908578 67864061 80277124 83250509 83500253 91137496 96151622
34734 96151622 84606382 66899301 65620904 81660687 94892986 94938721 90308452 89071246
34726 89071246 90799176 97281023 111144928 122395692 116301884 98448291 92404001 106245382
34718 106245382 120490585 118582541 110960573 115063232 126741117 129366568 121639778 117211808
34710 117211808 120521221 121063975 112808523 104107600 104010716 110502508 117902902 126533960
34702 126533960 138072737 147826179 149278413 143506409 138378465 139884675 148183932 160339371
34694 160339371 172784520 182043080 186747531 188928872 191005071 192230006 190329210 185539683
34686 185539683 180625609 178152590 180220174 188820445 202440395 213601714 214649136 206077458
34678 206077458 194969074 185824386 178581320 175575365 182290921 197495634 209710570
34671 209710570 209759464 202479001 199893813 206186002 215566673 221892080 223181770 218418762
34663 218418762 207493086 194329122 183872299 176526860 171643182 174028520 187056801
34656 187056801 199636098 193084607 166315216 142642745 142321882 156856309 161910272
34649 161910272 150080088 137595141 139733634 152526547 161776756 159877941 148986441
34642 148986441 135744072 128501446 133208393 145709640 153021752 148512469 141318690 143504976
34634 143504976 151921566 152400627 140595295 127712754 123040748 121177117 112850575 100085562
$$ [...]
##END NTUPLES=NMR SPECTRUM
##END=
