##TITLE=31Pdec_LR-675-R2-C1
 , 24 sc
 6.6.2019
##JCAMPDX= 6.0         $$ Bruker NMR JCAMP-DX V2.0
##DATA TYPE= NMR SPECTRUM
##DATA CLASS= NTUPLES
##ORIGIN= UXNMR, Bruker Analytische Messtechnik GmbH
##OWNER= root
$$ XWIN-NMR		Version 3.5
$$ Thu Jun  6 15:34:39 2019 Russian Standard Time (UT+4h)  she@DPX200
##.OBSERVE FREQUENCY= 81.013821
##.OBSERVE NUCLEUS= ^31P
##.ACQUISITION MODE= SIMULTANEOUS
##.ACQUISITION SCHEME= undefined
##.AVERAGES= 24
##.DIGITISER RES= 17
##SPECTROMETER/DATA SYSTEM= spect
##.PULSE SEQUENCE= zgpg30
##.SOLVENT NAME= DMSO
##.SHIFT REFERENCE= (INTERNAL, DMSO, 0, 182.463)
##AUDIT TRAIL= $$ (NUMBER, WHEN, WHO, WHERE, WHAT)
$$ ##TITLE= Audit trail, XWIN-NMR		Version 3.5
$$ ##JCAMPDX= 5.01
$$ ##ORIGIN= Bruker BioSpin GmbH
$$ ##OWNER= she
$$ F:/spectra/data/she/nmr/P31/1/pdata/1/auditp.txt
$$ ##AUDIT TRAIL=  $$ (NUMBER, WHEN, WHO, WHERE, WHAT)
(   1,<2019-06-06 15:33:27.54 +0400>,<she>,<DPX200>,
      <created by zg, POWCHK disabled, PULCHK disabled
       configuration hash MD5:
       00 E9 B6 7A A2 85 ED C7 34 08 36 98 17 FE 4E 26
       data hash MD5: 32K
       27 4C A8 95 36 55 B7 B7 E2 44 25 EE 45 97 C3 8F>)
(   2,<2019-06-06 15:33:34.42 +0400>,<she>,<DPX200>,
      <Start of raw data processing
       efp BC_mod = 2 LB = 1 FT_mod = 6 PKNL = 1 PHC0 = -2364.604 PHC1 = 53.59912 SI = 64K 
       data hash MD5: 64K
       00 0C 7B EB 2E 2C 5D A7 7B 71 4A F6 B5 D5 DC 55>)
(   3,<2019-06-06 15:33:50.23 +0400>,<she>,<DPX200>,
      <pk PHC0 = -167.0845 PHC1 = -8.600001 
       data hash MD5: 64K
       61 AF AB 6C 3C 4F D3 DC A8 A0 07 E9 5B 56 A3 04>)
(   4,<2019-06-06 15:33:53.85 +0400>,<she>,<DPX200>,
      <abs ABSG = 5 
       data hash MD5: 64K
       72 6D 10 A6 76 D9 FB 48 F1 DC 7D 94 73 4E 36 E4>)
$$ ##END=
$$ 
$$ hash MD5
$$ 2A A4 BA 79 AA 1F F7 C6 0A 28 58 94 D3 B9 3D 77
##$RELAX= 
##$RELAX= 
##$RELAX= 
##$RELAX= 
##$RELAX= 
##$RELAX= 
##$RELAX= 
##$RELAX= 
$$ Bruker specific parameters
$$ --------------------------
##$DU= <F:/spectra>
##$EXPNO= 1
##$NAME= <P31>
##$PROCNO= 1
##$TYPE= <nmr>
##$USER= <she>
##$AMP= (0..31)
100 100 100 100 100 100 100 100 100 100 100 100 100 100 100 100 100 100 
100 100 100 100 100 100 100 100 100 100 100 100 100 100 
##$AQSEQ= 0
##$AQ_mod= 1
##$AUNM= <au_zg>
##$AUTOPOS= <>
##$BF1= 81.014009
##$BF2= 200.13
##$BF3= 200.13
##$BF4= 200.13
##$BF5= 200.13
##$BF6= 200.13
##$BF7= 200.13
##$BF8= 200.13
##$BYTORDA= 1
##$CFDGTYP= 0
##$CFRGTYP= 5
##$CHEMSTR= <none>
##$CNST= (0..31)
1 1 145 1 1 1 1 1 1 1 1 1 1 1 1 1 1 1 1 1 1 1 1 1 1 1 1 1 1 1 1 1 
##$CPDPRG= <waltz16>
##$CPDPRG1= <>
##$CPDPRG2= <waltz16>
##$CPDPRG3= <>
##$CPDPRG4= <mlev>
##$CPDPRG5= <mlev>
##$CPDPRG6= <mlev>
##$CPDPRG7= <mlev>
##$CPDPRG8= <mlev>
##$CPDPRGB= <>
##$CPDPRGT= <>
##$D= (0..31)
0 1 0 0 0 0 0 0 0 0 0 0.03 2e-05 3e-06 0 0 0 0 0 0 0 0 0 0 0 0 0 0 0 0 
0 0 
##$DATE= 1559820806
##$DBL= (0..7)
120 120 120 11 120 120 24 19 
##$DBP= (0..7)
150 150 150 150 150 150 150 150 
##$DBP07= 0
##$DBPNAM0= <>
##$DBPNAM1= <>
##$DBPNAM2= <>
$$ [...]
##$SUBNAM3= <"">
##$SUBNAM4= <"">
##$SUBNAM5= <"">
##$SUBNAM6= <"">
##$SUBNAM7= <"">
##$SUBNAM8= <"">
##$SUBNAM9= <"">
##$SW= 369.568048894756
##$SWIBOX= (0..15)
0 1 3 0 0 0 0 0 0 0 0 0 0 0 0 0 
##$SW_h= 29940.119760479
##$TD= 32768
##$TD0= 1
##$TE= 0
##$TE2= 300
##$TE3= 300
##$TEG= 300
##$TL= (0..7)
0 120 53 12 22 120 120 120 
##$TP= (0..7)
150 150 150 150 150 150 150 150 
##$TP07= 0
##$TPNAME0= <>
##$TPNAME1= <>
##$TPNAME2= <>
##$TPNAME3= <>
##$TPNAME4= <>
##$TPNAME5= <>
##$TPNAME6= <>
##$TPNAME7= <>
##$TPOAL= (0..7)
0.5 0.5 0.5 0.5 0.5 0.5 0.5 0.5 
##$TPOFFS= (0..7)
0 0 0 0 0 0 0 0 
##$TUNHIN= 0
##$TUNHOUT= 0
##$TUNXOUT= 0
##$USERA1= <user>
##$USERA2= <user>
##$USERA3= <user>
##$USERA4= <user>
##$USERA5= <user>
##$V9= 5
##$VALIST= <valist>
##$VCLIST= <CCCCCCCCCCCCCCC>
##$VD= 0
##$VDLIST= <DDDDDDDDDDDDDDD>
##$VPLIST= <PPPPPPPPPPPPPPP>
##$VTLIST= <TTTTTTTTTTTTTTT>
##$WBST= 1024
##$WBSW= 4
##$XGAIN= (0..3)
0 0 0 0 
##$XL= 0
##$YL= 0
##$YMAX_a= 40289
##$YMIN_a= -50684
##$ZGOPTNS= <>
##$ZL1= 120
##$ZL2= 120
##$ZL3= 120
##$ZL4= 120
##$ABSF1= 182.463
##$ABSF2= -187.1042
##$ABSG= 5
##$ABSL= 3
##$ALPHA= 0
##$AQORDER= 0
##$ASSFAC= 0
##$ASSFACI= 0
##$ASSFACX= 0
##$ASSWID= 0
##$AUNMP= <proc_1d>
##$AZFE= 0.1
##$AZFW= 0.5
##$BCFW= 0
##$BC_mod= 2
##$BYTORDP= 0
##$COROFFS= 0
##$CY= -3
##$DATMOD= 1
##$DC= 0
##$DFILT= <>
##$DTYPP= 0
##$F1P= 0
##$F2P= 0
##$FCOR= 1
##$FTSIZE= 65536
##$FT_mod= 6
##$GAMMA= 0
##$GB= 0
##$INTBC= 1
##$INTSCL= 5.30512e-09
##$ISEN= 30
##$LB= 1
##$LEV0= 0
##$LPBIN= 0
##$MAXI= 10000
##$MC2= 0
##$MEAN= 0
##$ME_mod= 0
##$MI= 50
##$NCOEF= 0
##$NC_proc= -7
##$NLEV= 6
##$NOISF1= 182.463
##$NOISF2= 159.3651
##$NSP= 0
##$NTH_PI= 0
##$NZP= 0
##$OFFSET= 182.463
##$PC= 4
##$PHC0= -2531.688
##$PHC1= 44.99912
##$PH_mod= 1
##$PKNL= yes
##$PPARMOD= 0
##$PSCAL= 0
##$PSIGN= 0
##$REVERSE= no
##$SF= 81.0140089999434
##$SI= 65536
##$SIGF1= 159.3651
##$SIGF2= -187.1042
##$SINO= 113.3802
##$SIOLD= 16384
##$SREGLST= <1H.CDCl3>
##$SSB= 0
##$STSI= 65536
##$STSR= 0
##$SW_p= 29940.119760479
##$SYMM= 0
##$S_DEV= 0
##$TDeff= 32768
##$TDoff= 0
##$TI= <>
##$TILT= no
##$TM1= 0
##$TM2= 0
##$TOPLEV= 0
##$USERP1= <user>
##$USERP2= <user>
##$USERP3= <user>
##$USERP4= <user>
##$USERP5= <user>
##$WDW= 1
##$XDIM= 65536
##$YMAX_p= 420702254
##$YMIN_p= -91315416
$$ End of Bruker specific parameters
$$ ---------------------------------
##NTUPLES= NMR SPECTRUM
##VAR_NAME=  FREQUENCY,     SPECTRUM/REAL,   SPECTRUM/IMAG
##SYMBOL=    X,             R,               I
##VAR_TYPE=  INDEPENDENT,   DEPENDENT,       DEPENDENT
##VAR_FORM=  AFFN,          ASDF,            ASDF
##VAR_DIM=   65536,         65536,           65536
##UNITS=     HZ,            ARBITRARY UNITS, ARBITRARY UNITS
##FACTOR=    0.456856943014862, 1,           1
##FIRST=     14782.0589164792, 0,            0
##LAST=      -15158.0608439998, 0,           0
##MIN=       -15158.0608439998, -91315416,   0
##MAX=       14782.0589164792, 420702254,    0
$$ Real data points
##PAGE= N=1
##DATA TABLE= (X++(R..R)), XYDATA
$$ [...]
41584a707380M83839K080772J705347k60253j915652k020309q54191O92066J933621
$$ -1707380 -1223541 857231 2562578 2302325 386673 -1633636 -2487827 -1795761 137860
41575A37860K327994J669769P42363P70217J526545J022251j682653m198324l314886
$$ 137860 2465854 4135623 4877986 5648203 7174748 8196999 6514346 2316022 -998864
41566i98864K34563J881069p56407m076924l062276J629800M346041K306244p16047
$$ -998864 -764301 1116768 360361 -3716563 -6778839 -5149039 -802998 1503246 787199
41557G87199l03975K041473J511564k458519n177957l293870J119198M039092
$$ 787199 483224 2524697 4036261 1577742 -3600215 -6894085 -5774887 -1735795
41549a735795M047339J957388j244646l880532l363395O18408M120616L050663
$$ -1735795 2311544 4268932 3024286 -856246 -4219641 -3601233 519383 3570046
41541C570046j475403m499573l399378o8898K709561M126058M201904K529319
$$ 3570046 2094643 -2404930 -5804308 -5873206 -3163645 962413 5164317 7693636
41533G693636o81907l958966n765327n284490k247042K261338N166856M020785
$$ 7693636 7011729 3052763 -2712564 -7997054 -10244096 -7982758 -2815902 1204883
41525A204883M09901j641509q11500O53141J238602J764724J968815k55513m157006
$$ 1204883 1614784 -26725 -838225 -185084 1053518 2818242 4787057 4531544 374538
41516C74538m838720m6531N162580M767677L43445j465669J407386M372583L546261
$$ 374538 -4464182 -4510713 651867 5419544 5762989 4297320 5704706 10077289 13623550
41507A3623550L54099k153781l397928l962533l472394j841411l87349L2276K13595
$$ 13623550 13977649 11823868 8425940 4463407 991013 -850398 -1237747 -1205471 -991876
41498i91876O54471L41309j090878j869486n43207J479307J706635r627j482022
$$ -991876 -337405 3904 -1086974 -2956460 -3499667 -2020360 -313725 -323352 -1805374
41489a805374j076333P82336K610098L154643J852245r20956l742227m748010
$$ -1805374 -2881707 -2099371 510727 3665370 5517615 4596659 854432 -3893578
41481c893578k850538J133285M466343M584288K056031M34214J761641L384794
$$ -3893578 -6744116 -5610831 -1144488 3439800 5495831 5930045 7691686 11076480
41473A1076480J511081k941421n240429l539735r91568k33737K59884K140294
$$ 11076480 12587561 9646140 4405711 865976 -125592 -359329 -99445 2040849
41465B040849L255269J263936j617536j697035J24512j08141k635018l523663
$$ 2040849 5296118 6560054 4942518 3245483 3369995 3261854 626836 -2896827
41457b896827j242310R76240O55299k92895L74174J242469K62331j162997n98467
$$ -2896827 -4139137 -3162897 -2507598 -2800493 -2426319 -1183850 -921519 -2084516 -2682983
41448b682983R19153N48941j278441j279129J297132L229832J996965j013480
$$ -2682983 -1763830 -1214889 -2493330 -3772459 -2475327 754505 2751470 1737990
41440A737990l010292l096666j887487l2444J448734J260836j54765l79997J544075
$$ 1737990 -1272302 -4368968 -6256455 -6288899 -4840165 -3579329 -3734094 -4114091 -2570016
41431b570016L133267J971712l57685n30632J341268J895818k98428k851320l367602
$$ -2570016 563251 2534963 2177278 1646646 2987914 4883732 4585304 1733984 -1633618
41422a633618k279563q98177N98387J754460J041472j428415k622646n92895K043646
$$ -1633618 -3913181 -4811358 -4212971 -2458511 -1417039 -2845454 -5468100 -6060995 -4017349
41413d017349J648310p49684r32938J794618L423428J606271o72533M046K009693
$$ -4017349 -2369039 -3118723 -4051661 -2257043 1166385 2772656 2100123 2104169 4113862
41404D113862J398107j638552k855868m15646K251567J373990j949075l649630
$$ 4113862 5511969 3873417 1017549 601903 2853470 4227460 2278385 -1371245
41396a371245k344719n01273k53099o48499P6433J570548K339058K251727K126192
$$ -1371245 -3715964 -4217237 -4470336 -5118835 -5042402 -3471854 -1132796 1118931 3245123
41387C245123J694295K30534j206924p15513J100858J445420k38469j037218O70652
$$ 3245123 4939418 5169952 3963028 3247515 4348373 5793793 5555324 4518106 5188758
41378E188758K086187K14511l032071l310805k41583K138775J114318j556151
$$ 5188758 7274945 7489456 4457385 1146580 904997 3043772 4158090 2601939
41370B601939k631209j200529J006248J543838n08738l015346k452419J258043
$$ 2601939 -29270 -1229799 -223551 1320287 811549 -2203797 -4656216 -3398173
41362c398173L377143N58494l577670l195958R73454K981061J203987O7167J246460
$$ -3398173 -21030 537464 -3040206 -6236164 -5262710 -2281649 -1077662 -1010495 235965
41353B35965L32548m484129p134497k453871M861698O483051K215886j124166
$$ 235965 568513 -3915616 -11050113 -13503984 -8642286 -2159235 56651 -1067515
41345a067515m76847P27179j3524p59991J0183N53559m33697j479351j278051
$$ -1067515 -1544362 -817183 -830707 -1590698 -1580515 -1026956 -1460653 -2940004 -4218055
41336d218055n57754R3918J053036J573661K90735j475321n88875K733598M403852
$$ -4218055 -4775809 -4681891 -3628855 -2055194 -1764459 -3239780 -3828655 -1095057 3308795
41327C308795K479838j5231k6413J313356J419811q271k021184m063372m634478
$$ 3308795 5788633 5773402 5746989 7060345 8480156 8471885 6450701 2387329 -2247149
41318b247149j713309L196751N023223J909371j533242r96614J243285R54451
$$ -2247149 -3960458 -763707 4259516 6168887 4635645 3639031 4882316 5836767
41310E836767p37442l7648K135637J601988j531799k970651j602458o77483j165268
$$ 5836767 5099325 5061677 7197314 8799302 7267503 4296852 2694394 2016911 851643
41301H51643j71900K507891K459096j903943n484251l906953j34143P15555p87976
$$ 851643 679743 3187634 5646730 3742787 -1741464 -5648417 -5782560 -5067005 -5854981
41292e854981p77643Q04656J247968J220063L596180O686842N064636j649232
$$ -5854981 -6632624 -5827968 -4580000 -3359937 236243 6923085 11987721 10338489
41284A0338489o607218m870361K7870J945237O23401J09537J399119J612875k48997
$$ 10338489 3731271 -1139090 -1111220 834017 1457418 1566955 2966074 4578949 4329952
41275D329952j314910N16426L224518L455590O93283k608364l777920j976500
$$ 4329952 3015042 3531468 6755986 10211576 10904859 8296495 4518575 2542075
41267B542075J386452L568102K727526j86865k456700k630252j631842q94833
$$ 2542075 3928527 7496629 10224155 10037290 7580590 4950338 3318496 2423663
41259B423663p57809r66371j265651r49066O73573K578268K339359o90158l827484
$$ 2423663 1665854 699483 -566168 -1515234 -841661 1736607 4075966 3385808 -441676
41250d41676m108721j888029Q2073L41613j36003q451Q75185J928745K538668
$$ -441676 -4550397 -6438426 -6356353 -6014740 -6150743 -6159194 -5284009 -3355264 -816596
41241h16596K266194J330617P99578J376167K185592J745892J6301j475716j544598
$$ -816596 1449598 2780215 3579793 4955960 7141552 8887444 8903745 7428029 5883431
41232E883431o20170o8296o43019j488957p68096J903224L866736K125539k002982
$$ 5883431 5263261 5194965 4551946 3062989 2294893 4198117 8064853 10190392 8187410
41223H187410l587326q59818J707415j45523l760466l507524M34202K491315M91978
$$ 8187410 4600084 3740266 5447681 5302158 1541692 -1965832 -1531630 959685 1451663
41214A451663j543185n26536J122858N12143p16164Q9755J530418O01306k046416
$$ 1451663 -91522 -618058 504800 1016943 300779 390534 1920952 2522258 475842
41205D75842l128084j697998K16478J092519J201066J076936J018633J379229
$$ 475842 -2652242 -4350240 -4133762 -3041243 -1840177 -763241 255392 1634621
41197A634621J527292j16486l026437l561302J24916M072517L179061j349634
$$ 1634621 3161913 3045427 18990 -3542312 -3417396 655121 3834182 2484548
41189B484548l473009r08355K187637J848924n35895j417463j66932J252414J493684
$$ 2484548 -988461 -1896816 290821 2139745 1603850 186387 19455 1271869 2765553
41180B765553O87532m21748o85064Q06142L042925L324385L89001l638840n431748
$$ 2765553 3453085 3031337 2346273 3152415 6195340 9519725 9908726 6269886 838138
41171H38138l862212o59111J494247J164624n82331r65292J407540M287345M116596
$$ 838138 -3024074 -3683185 -2188938 -1024314 -1606645 -2571937 -1164397 3122948 7239544
41162G239544O23214k730093l203197j737916p74581r92987j341446r02930L81136
$$ 7239544 7862758 5132665 1929468 191552 -583029 -1576016 -2917462 -3820392 -3439256
41153c439256J888024K500623J537219j17589q52873m32293L6801J89213P42792
$$ -3439256 -1551232 949391 2486610 2369021 1516148 1083855 1120656 1309869 2052661
41144B052661J683987K109456K115030K612546K851449P08032l580390o457368
$$ 2052661 3736648 5846104 7961134 10573680 13425129 14133161 10552771 4095403
41136D095403n230060j220625K406585L904030L033885L80348k054801k002021
$$ 4095403 -1134657 -2355282 51303 3955333 6989218 7369566 5314765 3312744
41128C312744j42640K90259j532548k550982j055751K07934j086484k497757j051193
$$ 3312744 3170104 3460363 1927815 -623167 -1678918 -1470984 -2557468 -5055225 -6106418
41119f106418J405412J550869O22259J981626M567443M312019J084110j311892
$$ -6106418 -4701006 -3150137 -2527878 -546252 4021191 8333210 9417320 8105428
41111H105428j613192j983581k471113n64943K884794L372837J53884j822904
$$ 8105428 6492236 4508655 2037542 1472599 4357393 7730230 7884114 6061210
41103F061210J60201K346541J355625k55083M81152R49244k009028n083847l006873
$$ 6061210 6221411 8567952 9923577 9668494 10149646 11098890 9089862 4006015 999142
41094I99142K312342L897581K04993k924190j492082J270364P88887k123270l311230
$$ 999142 3311484 7209065 7414058 4489868 2997786 4268150 5057037 2933767 -377463
41085c77463j237354J821508L072301J791213n57508j674626m99695J666072K736891
$$ -377463 -1614817 206691 3278992 5070205 4512697 2838071 2338376 4004448 6741339
41076F741339K259650J250886L53251k28469K24047J744084K206625k14451l504898
$$ 6741339 9000989 10251875 10605126 10376657 10600704 12344788 14551413 14336962 10832064
41067A0832064l943417j805051j176888l302164m289328j445426K108002K297648
$$ 10832064 6888647 5083596 3906708 604544 -3684784 -5130210 -3022208 -724560
41059g24560K59490l36535L78479m77759k503251k154221R68061K837076J300018
$$ -724560 -465070 -801605 -423126 -900885 -3404136 -5558357 -4590296 -1753220 -453202
41050d53202o31162M8610J554922P32587j488893j701318M19180J816561R19858
$$ -453202 -1084364 -1035754 519168 1251755 -237138 -1938456 -1519276 297285 1217143
41041A217143m61768m36102N23793J147048J096753K74009j550796l378660l179612
$$ 1217143 755375 319273 843066 1990114 3086867 3360876 1810080 -1568580 -4748192
41032d748192p50593J319942R90072n24298r89048m30378m7813O02291K476168
$$ -4748192 -5498785 -4178843 -3188771 -3713069 -4702117 -5132495 -5180308 -4578017 -2101849
41023b101849M020037K605955j054062l229691k438826j077498p62634L30132
$$ -2101849 1918188 4524143 3470081 240390 -2198436 -3275934 -4038568 -3708436
41015c708436L340891N284248L057598j341921l261876j744321J53911N50925
$$ -3708436 -367545 4916703 7974301 6632380 3370504 1626183 1780094 2331019
41007B331019M67045N24731k33459j563554j547805n0529N10679p28527j282521
$$ 2331019 2798064 3322795 3089336 1525782 -22023 -72552 438127 -290400 -1572921
40998a572921M46281K058415R65947j044883m11793K372148L124060J14453l312831
$$ -1572921 -1126640 931775 1897722 852839 441046 2813194 5937254 6051707 2738876
40989B738876l256528k04535K036504J287980o79316r13749O35032J013485j458346
$$ 2738876 -517652 -722187 1314317 2602297 1922981 1009232 1644264 2657749 1199403
40980A199403m256909l733595l26105J919479J165448M2932Q90232J883885L97286
$$ 1199403 -3057506 -6791101 -7117206 -5197727 -4032279 -3989347 -3099115 -1215230 -817944
40971h17944k211183k372572M77189L496787M431936L265601O96498k141212l078847
$$ -817944 -3029127 -5401699 -4924510 -1427723 3004213 6269814 6966312 4825100 1746253
40962A746253j111479J144055L37166k423336k682455P61382L964433L534497
$$ 1746253 634774 1778829 2115995 -307341 -2989796 -2228414 1736019 5270516
40954E270516Q65905q19053p16494O2438P57244Q56394k24464j707061j584212
$$ 5270516 6136421 5317368 4600874 4663312 5420556 6276950 6052486 4345425 2761213
40945B761213L96838J897904J446754L81016j76229j518079m243583n567915k896748
$$ 2761213 3158051 5055955 6502709 6883725 6707496 5189417 945834 -4622081 -7518829
40936g518829J617139L366008J293705j247037j235256Q24998K354234J635043
$$ -7518829 -5901690 -2535682 -1241977 -2489014 -3724270 -2899272 -545038 1090005
40928A090005n42367j342605J008438M075741L390955j174641m328068k723046
$$ 1090005 547638 -794967 213471 4289212 7680167 6505526 2177458 -545588
40920e45588J51397k01752k131272j331449J326048J448910r22387j507042L90042
$$ -545588 -394191 -595943 -2727215 -4058664 -2732616 -1283706 -2206093 -3713135 -3323093
40911c323093Q85059q96856r43558K009991L471810R17029j459721J49040K536201
$$ -3323093 -2438034 -3334890 -4278448 -2268457 1203353 2120382 660661 809701 3345902
40902C345902J001287k657694l266115n10899J467215Q15438q24122k360674l549808
$$ 3345902 4347189 1689495 -1576620 -2087519 -620304 195134 -628988 -2989662 -6539470
40893f539470k542778J663130N209144L382785j509596k167807K872017O377961
$$ -6539470 -9082248 -7419118 -2209974 1172811 -336785 -2504592 367425 6745386
40885F745386K781721l890151o124901k958324M94038J004742R8011j57540n6110
$$ 6745386 9527107 5636956 -487945 -3446269 -2952231 -1947489 -1849478 -2007018 -2063128
40876b063128m07911p03455k48994M92162O40003J56743k08073J29732Q85760
$$ -2063128 -2471039 -3174494 -3423488 -2931326 -2291323 -2134580 -2342653 -2212921 -1327161
40867a327161J081538J53620j121120j456209r01347q13419j531027j374567Q68748
$$ -1327161 -245623 -92003 -1213123 -2669332 -3570679 -4384098 -5915125 -7289692 -6420944
40858f420944L418068L158274k72538l587783l574836o48269K151104L030826
$$ -6420944 -3002876 155398 -117140 -3704923 -7279759 -7928028 -5776924 -2746098
40850b746098L037645L586034L749165J509834k537289m676162k435104J791910
$$ -2746098 291547 3877581 7626746 9136580 6599291 1923129 -511975 1279935
40842A279935L300548Q02511k344440k781583j013152K65172j3042o89877o57730
$$ 1279935 4580483 5382994 3038554 256971 -756181 -491009 -504051 -1193928 -1851658
40833a851658p8053M23290M87576l8969r06922j234267m27498O58112N10119q78432
$$ -1851658 -1929711 -1506421 -1018845 -1057814 -1964736 -3199003 -3626501 -2968389 -2458270 -3336702
40823c336702j691710o39749J316075K320563J868285O91660q14260k518726l262321
$$ -3336702 -5028412 -5668161 -4352086 -2031523 -163238 528422 -285838 -2804564 -6066885
40814f066885j671480J239349K338192N15309j334013m33659J472350Q05444j787456
$$ -6066885 -7738365 -6499016 -4160824 -3645515 -4979528 -5413187 -3940837 -3135393 -4922849
40805d922849j998724J152035L149718P79618k690226k409453Q09135K302949
$$ -4922849 -6921573 -5769538 -2619820 -1840202 -4530428 -6939881 -6130746 -3827797
40797c827797R21628q9474Q46451J446471L46835k79186J114697K268577Q55125
$$ -3827797 -2906169 -2995643 -2149192 -702721 -355886 -635072 479625 2748202 3603327
40788C603327j323157j110826P73995P78716j813387l558785j799144J532651
$$ 3603327 2280170 1169344 1943339 2722055 908668 -2650117 -4449261 -2916610
40780b916610K395307k65560l202271k617337J303957M191500K395909k320104
$$ -2916610 -521303 -786863 -3989134 -6606471 -5302514 -1111014 1284895 -1035209
40772a035209m517083j848110J908726K020310q55213k070357J82294K640730
$$ -1035209 -5552292 -7400402 -5491676 -3471366 -4326579 -6396936 -6214642 -3573912
40764c573912K064931l32648j176011L16767J969434K061376J037359L2670n20524
$$ -3573912 -1508981 -1841629 -3017640 -2700873 -731439 1329937 2367296 2399966 1879442
40755A879442n40948L0689O97923O55979J21589L29998J458756J711366k36511
$$ 1879442 1338494 1369183 2067106 2723085 2844674 3174672 4633428 6344794 6108283
40746F108283k734377k881136n22811J394955Q56662o83208p23693Q77532K228080
$$ 6108283 3373906 492770 -30041 1364914 2221576 1538368 814675 1692207 3920287
40737C920287J988179L10195j821625k870723j467071J527446K766202L25702
$$ 3920287 5908466 6218661 4397036 1526313 59242 1586688 4352890 4678592
40729D678592k982506k776692P64707K847261N51761l473051m916677k889395
$$ 4678592 1696086 -1080606 -315899 2531362 3083123 -389928 -5306605 -8196000
40721h196000M56420L192973M436677L453092L03649l119039m429911k997378
$$ -8196000 -7739580 -4546607 -109930 3343162 3646811 527772 -3902139 -6899517
40713f899517m670K985221M587321L783700J008430j588873k304152j829684j891462
$$ -6899517 -6904187 -3918966 668355 4452055 5460485 3871612 1567460 -262224 -2153686
40704b153686k570724k417519r08640P03364J182245Q57047R44991J847998K537361
$$ -2153686 -4724410 -7141929 -8050569 -7347205 -6164960 -5307913 -4362922 -2514924 22437
40695B2437J780155j048p20587P26242K462199J797079r34723k720643k107324
$$ 22437 1802592 1801544 1080957 1807199 4269398 6066477 5131754 2411111 303787
40686C03787p28455j82425j31652m24695j990623l993037l409302R0876K163179
$$ 303787 -424668 -607093 -738745 -1163440 -3154063 -7147100 -10556402 -10465526 -8302347
40677h302347N8188k259901K36102N312924O335564K271653j160333n77281Q02963
$$ -8302347 -8244159 -10504060 -10267958 -4955034 1380530 3652183 2491850 1914569 2717532
40668B717532l61728k173042j484211Q64166K054801J608915P59264j58406j125511
$$ 2717532 2355804 182762 -1301449 -437283 1617518 3226433 3985697 3827291 2701780
40659B701780j308919p11275q85919k071118k040961Q0809J627216O52613m41377
$$ 2701780 1392861 681586 -204333 -2275451 -4316412 -4235603 -2608387 -1955774 -2397151
40650b397151J072395L120865J873928j790615l352315j442723P48547Q32032
$$ -2397151 -1324756 1796109 3670037 1879422 -1472893 -2915616 -2167069 -1335037
40642a335037l1305k50272q3765Q8830P49477J574077J365844L24693p5699J65226
$$ -1335037 -1366342 -1616614 -1700379 -1611549 -862072 712005 2077849 2402542 2326843 2492069
40632B492069l28756j193058m75875J536955K165686R58571O25013J848920J451889
$$ 2492069 2163313 970255 494380 2031335 4197021 5155592 5780605 7629525 9081414
40623I081414j689713l241600L4512L909929K148505l810827o451003k894193
$$ 9081414 7391701 4150101 4184613 8094542 10243047 6432220 -18783 -2912976
40615b912976J711982K379417N62146M7403Q72892N98156j037680j994253j174494
$$ -2912976 -1200994 1178423 1740569 1787972 2660864 3259020 2221340 227087 -947407
40606i47407O33793K225903K685933J540009l99401j345000q26915l67755p93107
$$ -947407 -313614 1912289 4598222 6138231 5738830 4393830 3566915 3199160 2406053
40597B406053p35933N67342J132559o06626k320585q25471K399553K554144j488718
$$ 2406053 1670120 2237462 3370021 2763395 442810 -382661 2016892 4571036 3082318
40588C082318n166998m284461p0887L279441L585438J485093j486539l472730
$$ 3082318 -2084680 -6369141 -6440028 -3160587 424851 1909944 423405 -3049325
40580c049325k569806J136163M607920M839845K295536j10603p79564n66106o74397
$$ -3049325 -5619131 -4482968 124952 4964797 7260333 7149730 6370166 5804060 5129663
40571E129663j168649j611771j865930k027198k250339k481901j945641L23106
$$ 5129663 3961014 2349243 483313 -1543885 -3794224 -6276125 -8221766 -7898660
40563g898660L668092N553939M308257J240068j237599k524836l264389l101211
$$ -7898660 -4230568 1323371 5631628 6871696 5634097 3109261 -155128 -3256339
40555c256339j423117L99684L68949o32021L05467L231384M472559K041199j024557
$$ -3256339 -4679456 -4279772 -3910823 -4542844 -4237377 -1005993 3466566 5507765 4483208
40546D483208r88220J193194J664112n05196k376582j710202L09418J398651J081669
$$ 4483208 3494988 4688182 6352294 5847098 3470516 1760314 2069732 3468383 4550052
40537D550052L90577R7567J66105J99935p7393l17847L69333J999907K717594
$$ 4550052 4940629 5038196 5204301 5404236 5326843 5008996 5378329 7378236 10095830
40528A0095830O82766k970312m798055l281700o94149L02702J86190R13139K079799
$$ 10095830 10778596 7808284 3010229 -271471 -965620 -662918 -476728 436411 2516210
40519B516210J319836j667470l991836l209052k40210K274817L024276K376094
$$ 2516210 3836046 2168576 -1823260 -5032312 -5272522 -2997705 26571 2402665
40511B402665J063714j25744l14447N09045J231936J354425J890273L179208L148414
$$ 2402665 3466379 3340635 3026188 3535233 4767169 6121594 8011867 11191075 14339489
40502A4339489l1820m339810n559964k573107J342987K757732J402723j050974
$$ 14339489 14307669 9967859 4407895 1834788 3177775 5935507 7338230 6287256
40494F287256l015303l039341m10917K983296L633424P50236k351755k682560
$$ 6287256 3271953 232612 -178305 2804991 6438415 7188651 4836896 2154336
40486B154336j245751n22347n85617j89959J79059o57006j645270o55100J900318
$$ 2154336 908585 386238 -199379 -389338 -210279 -867285 -2512555 -3167655 -1267337
40477a267337L256591K021068m23458k061477j963829k72843J754479K224565
$$ -1267337 1989254 4010322 3586864 1525387 -438442 -711285 1043194 3267759
40469C267759Q01386l87751L07960J527787J336772N13229O83619R15313l31174
$$ 3267759 4069145 3681394 3989354 5517141 6853913 7367142 8050761 8966074 8634900
40460H634900j332129N52440L518263L075134q58198l515891k622132j224206
$$ 8634900 7302771 7855211 11373474 14448608 13590410 10074519 7452387 6228181
40452F228181j770908k236551n32703J441391J099719p43991j837985j819028
$$ 6228181 4457273 2220722 1688019 3129410 4229129 3485138 1647153 -171875
40444a71875j283734k31940N61844m44332k275833j530707K087608M085794J773944
$$ -171875 -1455609 -1687549 -1125705 -1570037 -3845870 -5376577 -3288969 796825 2570769
40435B570769j309817r34710J605769K734025K463890K499716J724763j238763
$$ 2570769 1260952 326242 1932011 4666036 7129926 9629642 11354405 10115642
40427A0115642l630367k235179O76761Q31962n49733Q23507L706852K485789k862581
$$ 10115642 6485275 4250096 4926857 5758819 5209086 6032593 9739445 12225234 9362653
40418I362653n487183k154476J890422J542941q38175p27703J127566J411748
$$ 9362653 3875470 1720994 3611416 5154357 4316182 3588479 4716045 6127793
40410F127793N04228P99749J324319o04584l508183k716365K410529O488968M846206
$$ 6127793 6632021 7431770 8756089 8151505 4643322 1926957 4337486 10826454 15672660
40401A5672660o38470m281917l437963o24775N14677n14363j409476n99716Q74904
$$ 15672660 15034190 10752273 7314310 6689535 7204212 6689849 5280373 4680657 5555561
40392E555561J048805m76782k244387k426913k40409L196947N034911L077357
$$ 5555561 6604366 6127584 3883197 1456284 1215875 4412822 9447733 12525090
40384A2525090j238088l755368k509374J9074Q38002M25296O99307J235666M52474
$$ 12525090 11287002 7531634 5022260 5041334 5879336 6304632 7003939 8239605 8692079
40375H692079j097634j808021j992393k460228j635682J912551N286710M270155
$$ 8692079 7594445 5786424 3794031 1333803 -301879 1610672 6897382 11167537
40367A1167537k309k280264j043177J36759m60281k27479J700271J828740j323009
$$ 11167537 11165228 8884964 7841787 7978546 7518265 7290786 8991057 10819797 9496788
40358I496788l548830j454539J894638K077606J18161n42413m56393k113617l898722
$$ 9496788 5947958 4493419 6388057 8465663 8583824 8041411 7585018 5471401 1572679
40349A572679k058579K259928L692982O73754k350390j860068P3373M7718j411578
$$ 1572679 -485900 1774028 5467010 6140764 3790374 1930306 2003679 2051397 639819
40340F39819j593225j74874R61788J314067K171750L381817K433245j683482n467741
$$ 639819 -953406 -1128280 -166492 1147575 3319325 6701142 9134387 7450905 1983164
40331A983164m457257M35671L263210J042259j743059L28624N123077N698540
$$ 1983164 -2474093 -2038422 1224788 2267047 523988 852612 5975689 11674229
40323A1674229O30481l856597l024040L05165J171035n01761j682450j588279
$$ 11674229 12304710 8448113 5424073 5729238 6900273 6398512 4716062 3127783
40315C127783j403046r61096N37728J936746J481839k58618j480344k026332k730726
$$ 3127783 1724737 763641 1301369 3238115 4719954 4461336 2980992 954660 -1776066
40306a776066l059152j863060M14793K306685L077808K406795L5510k549336k294783
$$ -1776066 -4835218 -6698278 -6283485 -3976800 -898992 1507803 1543313 -1006023 -3300806
40297c300806J295434M389813L691730Q80881n04758k36507k27990m85338L2372
$$ -3300806 -2005372 2384441 6076171 6957052 6452294 6215787 5987797 5502459 5534831
40288E534831L17717j061663k704170k460710j279112j154863r36439J464049
$$ 5534831 5852548 4790885 2086715 -373995 -1653107 -2807970 -3744409 -2280360
40280b280360M147066L406485l5046j950715j296715r06276j634958j119615J076441
$$ -2280360 1866706 5273191 5238145 3287430 1990715 1084439 -550519 -1670134 -593693
40271e93693K211003J264525L38664J53553j001057k637879j578247K080685L675828
$$ -593693 1617310 2881835 3220499 3374052 2372995 -264884 -1843131 237554 3913382
40262C913382J180863j263872k13378J417430k84010l143912k270178J847540
$$ 3913382 5094245 3830373 3616995 5034425 4750415 1606503 -663675 1183865
40254A183865L732258P57055l563091m454401j248676K682033L703992J280191
$$ 1183865 4916123 5673178 2110087 -2344314 -3592990 -910957 2793035 4073226
40246D073226j798335k684623j704865j090731j134926k65473J106656M68636
$$ 4073226 2274891 -409732 -2114597 -3205328 -4340254 -4605727 -3499071 -3030435
40238c030435j975517k259353J328449M712800L593927l49329k351693j385877
$$ -3030435 -5005952 -7265305 -5936856 -1224056 2369871 2020542 -331151 -1717028
40230a717028k02779r3788K26591J008925O69743r08275j443279L49679K664947
$$ -1717028 -1919807 -2013595 -1787004 -778079 -108336 -1016611 -2459890 -2110211 554736
40221E54736K981916J057963j292564k393193k019639j098776n17687j59636O88654
$$ 554736 3536652 4594615 3302051 908858 -1110781 -2209557 -2727244 -2886880 -2198226
40212b198226J961900K554005J718484k9418j695505k606784k227115m09180J705866
$$ -2198226 -236326 2317679 4036163 4006745 2311240 -295544 -2522659 -2931839 -1225973
40203a225973K345731J347879N36757J139143K050363J607542P8089o96122L09033
$$ -1225973 1119758 2467637 3004394 4143537 6193900 7801442 7879531 7183409 7492442
40194G492442J950905J946343n87811l514888l667936j121786L43852j355758
$$ 7492442 9443347 11389690 10801879 7286991 3619055 2497269 2841121 1485363
40186A485363l080838j259053K102330K564551P24453Q66851K724745J299520
$$ 1485363 -1595475 -2854528 -752198 1812353 2536806 3403657 6128402 7427922
40178G427922l913303o477834k786663K071823K427763L59719O51228K244963
$$ 7427922 3514619 -2963215 -5749878 -3678055 -1250292 -890573 -239345 2005618
40170B005618J112384j646129j372491K041870L889613K138389j32118l6797J668933
$$ 2005618 3118002 1471873 99382 2141252 6030865 8169254 8037136 8000339 9669272
40161I669272K772451J868673j360114n158843n887066k380443J180124M39875
$$ 9669272 12441723 14310396 12950282 7791439 1904373 -476070 704054 1143929
40153A143929k538991k294136J482959L551948J318809j648599j413496J300015
$$ 1143929 -1395062 -3689198 -2206239 1345709 2664518 1015919 -397577 902438
40145I02438L429577L515933J780587r97249l302274l659103k489641j576185
$$ 902438 4332015 7847948 9628535 8631286 5329012 1669909 -819732 -2395917
40137b395917j522055j419316o83616N89629K338446L738950L077715N99817n59915
$$ -2395917 -3917972 -5337288 -6020904 -5431275 -3092829 646121 3723836 4323653 3763738
40128C763738R07490J561252j059693k895075P15942N990577M881211k459883
$$ 3763738 4671228 6232480 5172787 2277712 2993654 8984231 13865442 11405559
40120A1405559p222260m793682l48228N83270k96892N87258K255059K486723K282093
$$ 11405559 4183299 -610383 -958611 -375341 -672233 -84975 2170084 4656807 6938900
40111F938900K602257J272943k520675m938726l113787n9330N21859K47337J831902
$$ 6938900 9541157 10814100 8293425 3354699 240912 181582 703441 950778 2782680
40102B782680K823002l16592m749783m531923J28319L219640K025813j04780l71747
$$ 2782680 5605682 5289090 539307 -3992616 -3864297 -644657 1381156 1276376 904629
40093I04629k83131j509425k647916j974980r638K159740M195816M986206K724321
$$ 904629 621498 -887927 -3535843 -5510823 -5520461 -3360721 835095 5821301 8545622
40084H545622j928068n109602l875385M45248M078702M625245K334697q51780
$$ 8545622 6617554 1507952 -2367433 -1922185 2156517 6781762 9116459 8264679
40076H264679k543719j439792J272922K731559J375925j297679k444686j064090
$$ 8264679 5720960 4281168 5554090 8285649 9661574 8363895 5919209 4855119
40068D855119R18258R00392j173297k531231j158978J285400J819806O71786O75653
$$ 4855119 5773377 6673769 5500472 2969241 1810263 3095663 4915469 5587255 6262908
40059F262908K020529J224984l002221o382161m598226L26622K858316J556108
$$ 6262908 8283437 9508421 6506200 124039 -4474187 -4147565 -1289249 266859
40051B66859j53968j74174m56264k610882m244145j895661L827859P982472O321384
$$ 266859 112891 -61283 -517547 -3128429 -7372574 -9268235 -5440376 2542096 8863480
40042H863480J14871m591757l323831J464353L104510q67920n520607n233080
$$ 8863480 8978351 4386594 1062763 2527116 5631626 4763706 -756901 -5989981
40034e989981j004665J665233L95682j914168j893310L99380K580331K770170
$$ -5989981 -6994646 -5329413 -4933731 -6847899 -8741209 -8341829 -5761498 -2991328
40026b991328J062012n04636K10101K629658L678751K030825K03275N16173J321949
$$ -2991328 -1929316 -2433952 -2223851 405807 4084558 6115383 6318658 6834831 8156780
40017H156780J36481j775502j774320r36753k110901l975247k357264K413142
$$ 8156780 8293261 6517759 4743439 3806686 1695785 -2279462 -4636726 -2223584
40009b223584M863017K391032r68163q87696J395165K175637O94980j380515l019157
$$ -2223584 2639433 5030465 4062302 3174606 4569771 6745408 7440388 6059873 3040716
40000C040716l566588j910106J283925K638213K55492k895429k642186P38717
$$ 3040716 -525872 -2435978 -1152053 1486160 1741652 -1153777 -3795963 -3057246
39992c057246L358489L108450J334433k20126j240619j571581o30628J256202
$$ -3057246 301243 3409693 4744126 4524000 3283381 1711800 1081172 2337374
39984B337374K546923K090521J47833k167215l556012k975798o26157J613821
$$ 2337374 4884297 6974818 7122651 4955436 1399424 -1576374 -2202531 -588710
39976e88710J899971O45999M9733J268355K934890K794867K90815k743288l769900
$$ -588710 1311261 1957260 2006993 3275348 6210238 9005105 9295920 6552632 2782732
39967B782732j977970P89103J753903J08925k081217k241503k87511J330343P28105
$$ 2782732 804762 1593865 3347768 3456693 1375476 -866027 -1153538 176805 904910
39958I04910q25502k80847K983936N414905L242096k129877m905289j960846L034097
$$ 904910 79408 -201439 2782497 8197402 11439498 9309621 4404332 2443486 5477583
39949E477583M453185J909231j76575O89600K099801R66227k149347m289477l862385
$$ 5477583 9930768 11839999 11663424 12353024 14452825 15419052 13269705 8980228 5117843
39940E117843j817219j53785j55256j310127j609001K09774K690125L114765R03994
$$ 5117843 3300624 3146839 2991583 1681456 72455 282229 2972354 6087119 6991113
39931F991113j790848k835802k010484l50824P40586L8921j883756k052817J342025
$$ 6991113 5200265 2364463 353979 3155 743741 782662 -1101094 -3153911 -1811886
39922a811886N168089M514838j33945k889530q63463J655397k5415l908930m804045
$$ -1811886 3356203 7871041 7737096 4847566 3984103 5639500 5614085 1705155 -3098890
39913c098890k172269J0032j09112k52339J358662L243031L445575K208913P20406
$$ -3098890 -5271159 -5261127 -5370239 -5622578 -4263916 -1020885 2424690 4633603 5354009
39904E354009o62075j756407j762702m02391J102144J265086J37928q31755o02613
$$ 5354009 4691934 2935527 1172825 770434 1872578 3137664 3275592 2443837 1841224
39895A841224K38627K30533j050444k235710j777885K6890J419450J320918R8070
$$ 1841224 2079851 2310384 1259940 -975770 -2753655 -2726765 -1307315 13603 111673
39886A11673j489882k706749k411138l4969K835166L732824K481700J144624O15225
$$ 111673 -1378209 -4084958 -6496096 -6531065 -3695899 36925 2518625 3663249 4278474
39877D278474k25224j415407j020679J310736K831959J639338n08681j345810
$$ 4278474 4053250 2637843 1617164 2927900 5759859 7399197 6890516 5544706
39869E544706j340536j410083l14460K492150M008699J552656k398238l280024
$$ 5544706 4204170 2794087 2479627 4971777 8980476 10533132 8134894 4854870
39861D854870j014436O25293K43110n153Q11222Q72640n79031j766305j591722
$$ 4854870 3840434 4465727 4708837 4703684 5514906 6387546 5808515 4042210 2450488
39852B450488j023874n19035P35481K203434J822670n04545k175821j688254l66371
$$ 2450488 1426614 907579 1643060 3846494 5669164 5164619 2988798 1300544 934173
39843I34173O33687J978013L561139L414920J062028p82860m1137J381851L23975
$$ 934173 1567860 3545873 7107012 10521932 11583960 10801100 10759963 12141814 12465789
39834A2465789l101301n669160m744772n89703L966681N501057L098072j32429
$$ 12465789 9364488 3695328 -1049444 -1639147 2327534 7828591 10926663 10794234
39826A0794234m71426J450829J799329k61839j361148k9733M41661k146387m398016
$$ 10794234 10322808 11773637 13572966 13311127 11949979 11920246 12361907 10215520 5817504
39817E817504k553105J142926J972685K32890M328J827191K113374k61248k124582
$$ 5817504 3264399 4407325 6380010 6612900 6617228 8444419 10557793 10296545 8171963
39808H171963j718770j332945k411847k489055K21802K827974J907056q74392
$$ 8171963 6453193 5120248 2708401 219346 441148 3269122 5176178 4301786
39800D301786j238722R69871J643512j011365l575452k449839J082974L030837
$$ 4301786 3063064 4032935 5676447 4665082 1089630 -1360209 -277235 2753602
39792B753602K210380J023248J264693J737853P16712j193596k087172j544334
$$ 2753602 4963982 5987230 7251923 8989776 9706488 8512892 6425720 4881386
39784D881386q41305q77708j337637j722230j825203j149980P44429K966125L580988
$$ 4881386 4040081 3162373 1824736 102506 -1722697 -2872677 -2128248 837877 4418865
39775D418865J761832j143626l013236k728926o27667J780111K606001J360223
$$ 4418865 6180697 5037071 2023835 -705091 -1332758 447353 3053354 4413577
39767D413577q7804K90879J730968J808544L96598j14594R81889J321496l79251
$$ 4413577 4325773 4616652 6347620 8156164 8552762 8438168 9420057 10741553 10362302
39758A0362302j810109q69399P29895M31871q75680p92772K31540J53036m18886
$$ 10362302 8552193 7682794 8412689 8844560 7968880 7176108 7407648 7560684 7141798
39749G141798O08122K043586M23914l735773n259684j586891L157335L884153
$$ 7141798 7749920 9793506 10217420 6481647 1221963 -364928 2792407 6676560
39741F676560J294616j47089J075468K242829J058823j431725k876792k427419
$$ 6676560 7971176 7824087 8899555 11142384 12201207 10769482 7892690 5465271
39733E465271q32668Q65590J874711J650189L17885q97300m47242J620011K859880
$$ 5465271 4632603 5498193 7372904 9023093 9340978 8443678 7996436 9616447 12476327
39724A2476327Q39306l318114n395124l212610L34169J251598q7276k71524J390540
$$ 12476327 13315633 9997519 4602395 1389785 1723954 2975552 2888276 2616752 4007292
39715D007292K147626Q77460j37656L33087J62019j806804k697101o3324L371454
$$ 4007292 6154918 7032378 6894722 7227809 7389828 5583024 2885923 2822599 6194053
39706F194053L286341K28948j628346j174208j305856l045338l233412J87201
$$ 6194053 9480394 9709342 8080996 6906788 5600932 2555594 -677818 -490617
39698d90617M130786M275944R04604j851806j505680N46033J944346K175509J810067
$$ -490617 3640169 7916113 8820717 6968911 5463231 6009264 7953610 10129119 11939186
39689A1939186P19697j388114l250504k681788L47870K593389J131280k440346
$$ 11939186 12658883 11270769 8020265 5338477 5686347 8279736 9411016 6970670
39681F970670l495333m09185L156400L169257K64370k093427k598579k470821
$$ 6970670 3475337 3066152 6222552 9391809 9656179 7562752 4964173 2493352
39673B493352k046614m00863J762045K165425N88028m74452K52829J030887N66840
$$ 2493352 446738 45875 1807920 3973345 4561373 4086921 4339750 5370637 5937477
39664E937477L88965J712531K504961N11500k552261k991395m34089J910400K017076
$$ 5937477 6326442 8038973 10543934 11055434 8503173 5511778 5077689 6988089 9005165
39655I005165J117787P01317K47448r77478k077204j981897j295103j187611j383055
$$ 9005165 10122952 10824269 11071717 10094239 8017035 6035138 4740035 3552424 2169369
39646B169369p06017Q16557J765343J332774N08928P64460K039603K743013J839730
$$ 2169369 1463352 2279909 4045252 5378026 5886954 6651414 8691017 11434030 13273760
39637A3273760K35657o14815r67603k274445m302750m593811j921198J279006
$$ 13273760 13509417 12894602 11926999 9652554 5349804 755993 -1165205 113801
39629A13801J781919j30327j393427o00244P20229J216989J500777K147291K278711
$$ 113801 1895720 1765393 371966 -228278 491951 1708940 3209717 5357008 7635719
39620G635719J263875j02287j227301k591799l787203k892044L88546L061553
$$ 7635719 8899594 8797307 7570006 4978207 1191004 -1701040 -1312494 1749059
39612A749059K690756J061389J111112J813021m1459l624344m179057l30009K953464
$$ 1749059 4439815 5501204 6612316 8425337 8383878 4759534 580477 250468 3203932
39603C203932J162248l177095m051575j82292L895456M307846J969425j73960
$$ 3203932 4366180 1189085 -2862490 -3044782 850674 5158520 7127945 6953985
39595F953985j040136j144496n23793J058727K620030K445853K57667k094209
$$ 6953985 5913849 4769353 4245560 5304287 7924317 10370170 10627837 8533628
39587H533628k519907r19996P34131M93930j487626l091979k552226m25051J143292
$$ 8533628 6013721 5093725 5827856 6321786 4834160 1742181 -810045 -1235096 -91804
39578i1804J040247M35929J068631K808048L672735K281260l67862j942166j270586
$$ -91804 948443 1384372 2453003 5261051 8933786 11215046 10847184 8905018 7634432
39569G634432O50585K001688J948886R89108L8698l44742j20003K53038M1948
$$ 7634432 8285017 10286705 12235591 13224699 13263397 12918655 12798652 13051690 13093638
39560A3093638r06878j468232k44005K201395K987900P9987m426704n813779k282747
$$ 13093638 12186760 10718528 10474523 12675918 15663818 15743805 11317101 5503322 3220575
39551C220575K356745L044237k42106k635454r70411K166414K459917L0313j122249
$$ 3220575 5577320 8621557 8379451 5743997 4773586 6940000 9399917 9430230 8307981
39542H307981P71140K806393J975964m91009j396642m36106j08619j353748k057687
$$ 8307981 9079121 11885514 13861478 13370469 11973827 11537721 11429102 10075354 8017667
39533H017667n41917J653029J860286q7627j805066j433447M34832J883179J901294
$$ 8017667 7475750 9128779 10989065 10901438 9096372 7662925 8097757 9980936 11882230
39524A1882230J255115J384781K513900L062382J477500j416215k901967j662487
$$ 11882230 13137345 14522126 17036026 20098408 21575908 20159693 17257726 15595239
39516A5595239M85668J103351L60583J37192M79409o78934l631328n082515k233109
$$ 15595239 16080907 17184258 17544841 17682033 18161442 17482508 13851180 8768665 6535556
39507F535556K609456M130915P19657l401412l703229q94405Q84095o280j102259
$$ 6535556 9145012 13275927 13995584 10594172 6890943 5996538 6880633 6874353 5772094
39498E772094l6172K067206K429392M32008j748823j894135j98248J144193N65119
$$ 5772094 5735922 7803128 10232520 10664528 8915705 7021570 6823322 7967515 8532634
39489H532634q83344p41783J373707K648331O95338k709921l641082j311130J227176
$$ 8532634 7649290 6907507 8281214 10929545 11624883 8914962 5273880 3962750 5189926
39480E189926J744500J202680P47737k60971j539097o71712K626266M179304R66612
$$ 5189926 6934426 8137106 8884843 8623872 7084775 6413063 9039329 13218633 14185245
39471A4185245l464596l566872J49277K615373K435747K727394L917179K357492
$$ 14185245 10720649 7153777 7303054 9918427 12354174 15081568 18998747 21356239
39463B1356239k163287m008647l01834L560932J761514k881432l373754P83102
$$ 21356239 19192952 15184305 14882471 18443403 20204917 17323485 13949731 14732833
39455A4732833L576097K028525k83045J21232J589544Q72792j858069l789189
$$ 14732833 18308930 20337455 20054410 20175642 21765186 22637978 20779909 16990720
39447A6990720l281591j223542L97094M26362l61192k04639J045678J441108K43933
$$ 16990720 13709129 12485587 12882681 13309043 12947851 12743212 13788890 15229998 15473931
39438A5473931k15284J619575K878935K16317l966540m045829K49236L057798
$$ 15473931 15258647 16878222 19757157 19973474 16006934 11961105 12210341 15268139
39430A5268139J295375j040372q483J875411M63339k698220k982408l32956J032918
$$ 15268139 16563514 15523142 15514659 17390070 17853409 15155189 12172781 11839825 12872743
39421A2872743k67999j058728O26456K518271K167309M33241p69552j339768j779653
$$ 12872743 12604744 11546016 12172472 14690743 16858052 17291293 16521741 15181973 13402320
39412A3402320j526298m75567j85308j428504k160809k49493K932573M067917
$$ 13402320 11876022 11400455 11215147 9786643 7625834 7376341 10308914 14376831
39404A4376831K353576m063j346577k031839k282211j329156M69156J200303M51500
$$ 14376831 16730407 16726344 15379767 13347928 11065717 9736561 10205717 11406020 11857520
39395A1857520M71061K420357L663298J510294j905412j946235J743701M298633
$$ 11857520 12328581 14748938 18412236 19922530 18017118 16070883 17814584 22113217
39387B2113217K205801k187573m136020k131910J520700L913350L605120Q82743
$$ 22113217 24319018 22131445 17995425 15863515 17384215 21297565 24902685 25785428
39379B5785428k366103l870890l176443j800074p87327K15319R15855q4016k328025
$$ 25785428 23419325 19548435 16371992 14571918 13784591 13999910 14915765 14831749 12503724
39370A2503724k774847k36535J961821O43994k091756j965934Q53101K267696
$$ 12503724 9728877 9492342 11454163 12098157 10006401 8040467 8893568 11161264
39362A1161264P16134r61304l31166J548676K528261J937172J80898j723565j986881
$$ 11161264 11877398 10916094 10584928 12133604 14661865 16599037 16779935 15056370 13069489
39353A3069489J00247K269131J900722J06096k3517J297506J025892j038988j668404
$$ 13069489 13169736 15438867 17339589 17445685 17422168 18719674 19745566 18706578 17038174
39344A7038174K0913R83601j53655o45048J171963K749935J938145M90804J98718
$$ 17038174 17059087 18042688 17889033 17243985 18415948 21165883 23104028 23594832 23793550
39335B3793550l62067k142357k747837p24121J175508P32770L78380K407502L987145
$$ 23793550 23431483 21289126 18541289 17817168 18992676 19725446 20103826 22511328 26498473
39326B6498473J809584j798200k769375k115186l018731l978380j430173K790434
$$ 26498473 28308057 26509857 23740482 21625296 18606565 14628185 13198012 15988446
39318A5988446L484491M59825j801775j966338k438367k733591J79052M560770
$$ 15988446 19472937 19932762 18130987 16164649 13726282 10992691 11171743 15732513
39310A5732513M685064K76197k381216o40975R16526k94073j69576L480715N485349
$$ 15732513 20417577 20693774 18312558 17671583 18588109 18294036 18124460 21605175 27090524
39301B7090524K065790j834753n92420K566824J488757k199523k455756M24612
$$ 27090524 29156314 27321561 26729141 29295965 30784722 28585199 26129443 26554055
39293B6554055R50943j440749j882831N87710J245403j670659l742206j925662
$$ 26554055 27504998 26064249 24181418 24769128 26014531 24343872 20601666 18676004
39285A8676004Q54477J312155O99094J065442J141223n98659k265882j465700
$$ 18676004 19530481 20842636 21541730 22607172 23748395 23149736 20883854 19418154
39277A9418154O84573J646877J531066J978785K534704J327203j262879k447123
$$ 19418154 20102727 21749604 23280670 25259455 27794159 29121362 27858483 25411360
39269B5411360p74011J956052L099569K268671J257201J331391J491497R3760
$$ 25411360 24637349 26593401 29692970 31961641 33218842 34550233 36041730 36135490
39261C6135490k186168k614986l51801J713782R23939r49075l05593K420136L084688
$$ 36135490 33949322 31334336 30982535 32696317 33620256 32671181 32365588 34785724 37870412
39252C7870412J80453k832320k712803o27280O82379R93896J485945J865021J271617
$$ 37870412 38050865 35218545 32505742 31878462 32560841 33554737 35040682 36905703 38177320
39243C8177320L26076k61214j441700l428126l335415J017324N984339N399432
$$ 38177320 38503396 38242182 36800482 33372356 30036941 31054265 37038604 42438036
39235D2438036n02423m168714q36381M616052M580695n41495l515053j070682
$$ 42438036 41935613 37766899 36930518 41546570 46127265 45585770 42070717 41000035
39227D1000035K042064R98266k159094k727092q27865k31214j641851k062622
$$ 41000035 43042099 44040365 41881271 39154179 38326314 38095100 36453249 34390627
39219C4390627n05153M72638j49517K57592K970979M789549K895377l43171r59382
$$ 34390627 33885474 34358112 34208595 34466187 37437166 42226715 45122092 44778921 43819539
39210D3819539O70727J329590N04955J58813J57073j392716l464361k490538J777681
$$ 43819539 44490266 45819856 46324811 46483624 46640697 45247981 41783620 39293082 41070763
39201D1070763N031995M423052K072563R38464P60388K51780O6613R48990J576569
$$ 41070763 46102758 50525810 52598373 53536837 54297225 54549005 54615618 55564608 57141177
39192E7141177R99195R80136L022156M947846L584043l68319l174650l100902
$$ 57141177 58140372 59120508 62142664 67090510 70674553 70306234 67131584 64030682
39184F4030682j885772j482921j724724j336913M05176L037334M880913M260625
$$ 64030682 62144910 60661989 58937265 57600352 58005528 61042862 65923775 70184400
39176G0184400J694322k28211j62868L88378K5943k17707N64671P97245m94968
$$ 70184400 71878722 71650511 71487643 71876021 71901964 71684257 72248928 73046173 72551205
39167G2551205o84801K477276N802374M405324l88403k156772J301441M961731
$$ 72551205 71866404 74343680 80146054 84551378 84162975 82006203 83307644 88269375
39159H8269375M175861M50568k355603l164533k474593j30876K606220K417881
$$ 88269375 92445236 92895804 90540201 87375668 84901075 84770199 87376419 89794300
39151H9794300j114755l137458m2657M519864M680374J045916q99246L15529P56413
$$ 89794300 88679545 85542087 85499430 90019294 94699668 95745584 94846338 95161867 95918280
39142I5918280j259076j951689J567005O402009Q073008O212345L306049N31108
$$ 95918280 94659204 92707515 94274520 100676529 108749537 114961882 118267931 118799039
39134A18799039k052194l111866j191588K426517M599801L899110J557662o52639
$$ 118799039 116746845 113634979 112443391 114869908 119469709 123368819 124926481 124273842
39126A24273842j720000j047797J167329L127262K770335M21209j165090N656
$$ 124273842 122553842 121506045 122673374 125800636 128570971 128992180 127827090 127832746
39118A27832746K810496M416405L477087J342032K18228N87702Q81316j67959
$$ 127832746 130643242 135059647 138536734 139878766 140096994 140684696 141566012 141398053
39110A41398053j557618j348684M76928K073679K707449L630601N223224N568454
$$ 141398053 139840435 138491751 138968679 141042358 143749807 147380408 152603632 158172086
39102A58172086L583434J469706J579729K588776J926659O65743J933602M867083
$$ 158172086 161755520 163225226 164804955 167393731 169320390 169986133 171919735 176786818
39094A76786818M883271J035797j583710P72774M829956N462112L224356K418924
$$ 176786818 181670089 182705886 181122176 181894950 186724906 192187018 195411374 197830298
39086A97830298L966404N044873M666803M657016N195349M168453J675650P19475
$$ 197830298 201796702 206841575 211508378 216165394 221360743 225529196 227204846 227924321
39078B27924321K132463L060536K243379K513527N407993P328264M819948O44429
$$ 227924321 230056784 233117320 235360699 237874226 243282219 250610483 255430431 256074860
39070B56074860K83947M219432P826182P891876N432440K755042J403362K570962
$$ 256074860 256358807 260578239 268404421 276296297 281728737 284483779 285887141 288458103
39062B88458103N918524Q162225O422828K913833K539837N718569P804894O363078
$$ 288458103 294376627 302538852 308961680 311875513 314415350 320133919 327938813 334301891
39054C34301891M426974M803993N641525M486969K865881L200033M220599L509413
$$ 334301891 338728865 343532858 349174383 353661352 356527233 359727266 363947865 367457278
39046C67457278K374782L833451P028327Q021578N768082L267583K552075K289226
$$ 367457278 369832060 373665511 380693838 388715416 394483498 397751081 400303156 402592382
39038D02592382J208714N30694J465579K837897K900775J818825R44227Q77202
$$ 402592382 403801096 404331790 405797369 408635266 411536041 413354866 414299093 415176295
39030D15176295J316120J789671J723332O96836p69627j504995j108180l19516
$$ 415176295 416492415 418282086 420005418 420702254 419932627 418427632 417319452 416999936
39022D16999936L7059l90860j701398l394146m276722m035637m091339n076565
$$ 416999936 417036995 416646135 414944737 411550591 407273869 403238232 399146893 394070328
39014C94070328m635744o93292L773197L141055l151008r205837j0250778p783535
$$ 394070328 389434584 388741292 392514489 395655544 392504536 383298699 373047921 365264386
39006C65264386n348234l339091j090447m52497l038428o292587o595719m680438
$$ 365264386 359916152 356577061 355486614 355034117 351995689 345703102 339107383 334426945
38998C34426945l878294m464521m203267l410339m442608o390283n581611k214520
$$ 334426945 330548651 326084130 321880863 318470524 314027916 307637633 302056022 299841502
38990B99841502j308449n086691q957289p883577l239771l39369j773295n879942
$$ 299841502 298533053 293446362 284489073 276605496 273365725 273026356 271253061 265373119
38982B65373119r567152j0259884p261286l439717l237393o765136q588350n070133
$$ 265373119 255805967 245546083 238284797 234845080 231607687 224842551 216254201 211184068
38974B11184068N1453R51231k161676m578932m621177m567210n189731m662013
$$ 211184068 211235521 212186752 210025076 205446144 200824967 196257757 191068026 186406013
38966A86406013k855619j806766j545542k57875Q80130j659079o902385q684121
$$ 186406013 183550394 181743628 180198086 179940211 180820341 179161262 172258877 163574756
38958A63574756m432575M22601L78686k363930k592640q12712j655073n522947
$$ 163574756 159142181 159564782 159943468 157579538 154986898 154174186 152519113 146996166
38950A46996166p529242m714090Q4842K180809j32322m824836p830714o081180
$$ 146996166 139466924 134752834 134837676 137018485 136886163 132061327 124230613 118149433
38942A18149433j217725R58692k381813o270581m286428J742663L720303j188909
$$ 118149433 116931708 117890400 115508587 109238006 104951578 106694241 110414544 109225635
38934A09225635o789621o957480l060473K00792J503616J964878J339705p97477
$$ 109225635 102436014 95478534 92418061 92618853 94122469 96087347 97427052 96629575
38926I6629575k598871k351811j476551j965499k732520j745516k3878o284j258648
$$ 96629575 94030704 91678893 90202342 88236843 85504323 83758807 83734929 83728645 82469997
38917H2469997j375890l06561k73976j753563k762161k145202p81975M84363J576389
$$ 82469997 81094107 80787546 80513570 78760007 75997846 73852644 73070669 73555032 75131421
38908G5131421J890420O90938j197105k187077k157864j937103j383811l64061
$$ 75131421 77021841 77712779 76515674 74328597 72170733 70233630 68849819 68485758
38900F8485758n63767l241465n959611n097041j308322J183300O86703m22280
$$ 68485758 67921991 64680526 58720915 53623874 52315552 53498852 54185555 53763275
38892E3763275m32746k85926j00053J703911M209031L456894j406868n446741
$$ 53763275 53330529 53044603 52944550 54648461 58857492 62314386 60907518 55460777
38884E5460777m452773p36974Q82602j61701j170569j381845j976537k422876
$$ 55460777 51008004 50271030 51153632 50991931 49821362 48439517 46462980 44040104
38876D4040104r86349J646270K767430J530522m27081j956543l195086l565602
$$ 44040104 43053755 44700025 47467455 48997977 48570896 46614353 43419267 39853665
38868C9853665j930030P47797J454862r90633l778381l225414N52376L341296
$$ 39853665 37923635 38671432 40126294 39135661 35357280 32131866 32684242 36025538
38860C6025538J755124k166940k982478Q90216M385000K716170j423382k095854
$$ 36025538 37780662 35613722 32631244 33521460 37906460 40622630 39199248 37103394
38852C7103394J98796m01596m345074m924484R6268L347888m61905n230389l141282
$$ 37103394 37302190 36900594 32555520 27631036 27727304 31075192 30613287 25382898 22241616
38843B2241616K541300L283562p27305k434253q03507j030106l003301r34772
$$ 22241616 24782916 28066478 27339173 24904920 24101413 23071307 20068006 19133234
38835A9133234M550937N236650q29920m897900j479972K990795J430617k655747
$$ 19133234 23684171 28920821 28090901 23193001 21713029 24703824 26134441 23478694
38827B3478694k463132P45616J559034K16728M24747J494184L98259j531555j263069
$$ 23478694 21015562 21761178 23320212 23536940 23961687 25455871 25854130 24322575 23059506
38818B3059506n66258k636319m807477k237000L022334M429717J362471o60228
$$ 23059506 22493248 19856929 15049452 12812452 15834786 20264503 21626974 20966746
38810B0966746K57255L74141j325419p33386L386800O143936M199915O72407q09766
$$ 20966746 21224001 21598142 20272723 19539337 22926137 29070073 33269988 33942395 33132629
38801C3132629j521588l515552m835482l052997j16770M26050j278486k339418
$$ 33132629 31611041 28095489 23260007 20207010 20090240 20516290 19237804 16898386
38793A6898386j592431j88048R16007J579345J571688Q55497m262o78668j248536
$$ 16898386 15305955 15117907 16033914 17613259 19184947 20040444 20036182 19357514 18108978
38784A8108978j243510k76851K68430j279901l394700k499048J459688L976778
$$ 18108978 16865468 16588617 16857047 15577146 12182446 9683398 11143086 15119864
38776A5119864K168485j251653k322593j176012l83802m83149j97368N41118O42002
$$ 15119864 17288349 16036696 13714103 12538091 12154289 11671140 11473772 12014890 12656892
38767A2656892m9269q33948j320553r25534J196551L989121M233677P59535k950225
$$ 12656892 12607623 11773675 10453122 9527588 10724139 14713260 18946937 19706472 16756247
38758A6756247l137592j147590j114973l331726l831693p89127K442601K210371
$$ 16756247 13618655 12471065 11356092 8024366 4192673 3403546 5846147 8056518
38750H056518l42000j334729L44304K189831K294592J831845K435420L143159
$$ 8056518 7714518 6379789 6724093 8913924 11208516 13040361 15475781 18618940
38742A8618940J999266l02499j041275J96224O99180q53744k098434j133901Q9745
$$ 18618940 20618206 20315707 19274432 19470656 20169836 19316092 17217658 16083757 16173502
38733A6173502n43087j139043P38728K941003K005251l63773O9114K137605P62704
$$ 16173502 15630415 14491372 15230100 18171103 20176354 19812581 19881695 22019300 22782004
38724B2782004l707760n148473j954578J30487j805008k792452N84425L407179
$$ 22782004 19074244 13925771 11971193 12101680 10296672 7504220 8088645 11495824
38716A1495824J028043k412643j306783J478548K86680k536656r37787L125689
$$ 11495824 12523867 10111224 8804441 10282989 10569669 8033013 7095226 10220915
38708A0220915K448850k506780l897142P1148K249833q96159l471608n73247L835969
$$ 10220915 12669765 10162985 6265843 6336991 8586824 7690665 4219057 3645810 7481779
38699G481779M221864J760877K40494n49925k067502k456870n8322K365496J897902
$$ 7481779 11703643 13464520 13705014 13155089 11087587 8630717 8572395 10937891 12835793
38690A2835793O06284J624076L244591J943293j309497k868771k544574k844176
$$ 12835793 13442077 15066153 18310744 20254037 18944540 16075769 13531195 10687019
38682A0687019l535480k044154J336140L234150K138919k50812k329739l597762
$$ 10687019 7151539 5107385 6443525 9677675 11816594 11565782 9236043 5638281
38674E638281k834160P20230M320348L898822n6532k526455q94699J626743J068074
$$ 5638281 2804121 3524351 7844699 11743521 11686989 9160534 8265835 9892578 10960652
38665A0960652j839644l409155k080373M47347J967024J804280O48978l74917
$$ 10960652 9121008 5711853 3631480 4078827 6045851 7850131 8499109 8124192
38657H124192o12702l76578l25807m09053p0185O35124J018651P96623L09148
$$ 8124192 7511490 7134912 6809105 6400052 6329867 6964991 7983642 8780265 9089413
38648I089413r1492j6454J056397K618500K559819l28177l590113l271030O64009
$$ 9089413 8997921 8981467 10037864 12656364 15216183 14888006 11297893 8026863 8690872
38639H690872L513415J749705k321851l799376j658217N21628r7310k098728k392656
$$ 8690872 12204287 13953992 11632141 7832765 6174548 6696176 6598866 4500138 2107482
38630B107482l59262K004686K919487K164926K03666k148138l147770j280905
$$ 2107482 1748220 3752906 6672393 8837319 9040985 6892847 3745077 2464172
38622B464172K155637L471232J081418j912691j636007J226070K521677M93700
$$ 2464172 4619809 8091041 9172459 7259768 5623761 6849831 9371508 9865208
38614I865208k275106k915877j505399L83750J757653J911971N30680r29005m36523
$$ 9865208 7590102 4674225 3168826 3552576 5310229 7222200 7752880 6823875 6387352
38605F387352J099314N01027k272797l104249k96178J899064q0589k777091j108652
$$ 6387352 7486666 7987693 5714896 2610647 2314469 4213533 4132944 1355853 247201
38596B47201K818958K676152j597474l243586P08123M968793M465388J483137
$$ 247201 3066159 5742311 4144837 901251 1609374 6578167 11043555 12526692
38588A2526692P66887K080741K018105J41365j106139q47198k89667R2432O36728
$$ 12526692 13293579 15374320 17392425 17533790 16427651 15580453 15290786 15383218 16019946
38579A6019946O20700p61046k260436k101944r89943j011627k163340k613315
$$ 16019946 16640646 15879600 13619164 11517220 10527277 9515650 7352310 4738995
38571D738995j933804j295909o70091J239838L988176N133001L778264J918047
$$ 4738995 2805191 1509282 839191 2079029 6067205 11200206 14978470 16896517
38563A6896517J195431N20632j632556m244890m797094k510119P40047K401638
$$ 16896517 18091948 18612580 16980024 12735134 7938040 5427921 6167968 8569606
38555H569606J480744p98826k209883j781929p51791o18891q24390J74797J889636
$$ 8569606 10050350 9251524 7041641 5259712 4507921 3889030 3064640 3239437 5129073
38546E129073K028250J40610j246950k62511J573624J851765Q22149M22407R59304
$$ 5129073 7157323 7297933 6050983 5788472 7362096 9213861 10036010 10458417 11417721
38537A1417721J042845K81617j71771K09321M79265j19949j088675j632297j604724
$$ 11417721 12460566 12742183 12570412 12779733 13258998 13139049 12050374 10418077 8813353
38528H813353j260849r46144r92149j073452j16841J912082K772212M67414l195909
$$ 8813353 7552504 6606360 5614211 4540759 4423918 6336000 9108212 9575626 6379717
38519F379717m006947q79737K430262K377304J93042m94763J080503K407077J815020
$$ 6379717 2372770 1493033 3923295 6300599 6493641 5998878 7079381 9486458 11301478
38510A1301478O01322P58503K195609K855421J025377k550456m759924l129746
$$ 11301478 11902800 12661303 14856912 17712333 18737710 16187254 11427330 8297584
38502H297584Q53600K803974Q13273j872019j334125J427718K145542k92607k385240
$$ 8297584 9151184 11955158 12768431 10896412 9562287 10990005 13135547 12842940 10457700
38493A0457700j343345J239866K301515J372482o207j030435j781523j823559
$$ 10457700 9114355 10354221 12655736 14028218 14022011 12991576 11210053 9386494
38485I386494o94036O43950N23436j148858k417775j426146J335190L164944J855317
$$ 9386494 8692458 9336408 9859844 8710986 6293211 4867065 6202255 9367199 11222516
38476A1222516j507179l210954j306774J632027J884101j50937q34437P21009
$$ 11222516 9715337 6504383 5197609 6829636 8713737 8562800 7728363 8449372
38468H449372J149852j490827m184809l601513j243606n34623r94152N18067L777379
$$ 8449372 9599224 8108397 3923588 322075 -921531 -1456154 -2450306 -1932239 1845140
38459A845140M812733J893706j896422l155842k101271o43212O50397J768494
$$ 1845140 6657873 8551579 6655157 3499315 1398044 754832 1405229 3173723
38451C173723J690629o4064j694939j172680P00257J290499j41893j592381j297995
$$ 3173723 4864352 4800288 3105349 1932669 2632926 3923425 3781532 2189151 891156
38442H91156P3289P82807L08736o02869j334878j728503j350689L23205K706177
$$ 891156 964445 1747252 2055988 1453119 118241 -1610262 -2960951 -2637746 68431
38433F8431M107931L596082K079009Q19586k13043j391687j843298p02403N79521
$$ 68431 4176362 7772444 9851453 10671039 10457996 9066309 7223011 6520608 7100129
38424G100129m34898l334920m778073k926935L52503K582265L400156K999188
$$ 7100129 6665231 3330311 -1447762 -4374697 -4022194 -1439929 1960227 4959415
38416D959415Q19302k145247k676180J19745K183794n835l552687l086410R90191
$$ 4959415 5778717 3633470 957290 1077035 3260829 3254994 -297693 -3384103 -2393912
38407b393912L230171J540832n62874o75860r33866k757934l273406l25358K868847
$$ -2393912 836259 2377091 1814217 1138357 204491 -2553443 -5826849 -6152207 -3283360
38398c283360K157619j072259k099696o1303J318051m1414j533014k25487K564671
$$ -3283360 -1125741 -2198000 -4297696 -4358999 -3040948 -3082362 -4615376 -4840863 -2276192
38389b276192L185257R10484j003747N9070K197180J600132j640026l196308q81216
$$ -2276192 909065 1819549 815802 874872 3072052 4672184 3032158 -164150 -1045366
38380a045366J818532J098186j158332p34423J650034J671032q29453j398478
$$ -1045366 773166 1871352 713020 -21403 1628631 3299663 2470210 1071732
38372A071732J040544J924604j102246l881979k530798O19572J763858J630915
$$ 1071732 2112276 4036880 2934634 -947345 -3478143 -2858571 -1094713 536202
38364E36202K308818K370648K34204j428794j57439R61561j437316l764143q85826
$$ 536202 2845020 5215668 5449872 4021078 3863639 4825200 3387884 -376259 -1262085
38355a262085L782003K339390m249488o350350o06084M673362K683186j839666
$$ -1262085 2519918 4859308 609820 -5740530 -6346614 -1673252 1009934 -829732
38347h29732j401641K375982K896487p8169j086835J273179K685491R39975j019176
$$ -829732 -2231373 144609 3041096 2962927 1876092 3149271 5834762 6774737 5755561
38338E755561r25659p41372k340874l735083k325462O64260J788911J50157j800993
$$ 5755561 4829902 4088530 1747656 -1987427 -4312889 -3648629 -1859718 -1709561 -3510554
38329c510554j868051o04350J75773R358j13080L76623J018113J666257K851052
$$ -3510554 -5378605 -5982955 -5807182 -5797824 -5910904 -5534281 -4516168 -2849911 1141
38320A141L992345K992006o42274l728347l008862R9677J399253R9877n19561
$$ 1141 3993486 6985492 6343218 2614871 -393991 -294314 1104939 1204816 685255
38311F85255J050376K143069Q12694p84529l27422P43392K03122r87982j081610
$$ 685255 1735631 3878700 4691394 3906865 3579443 4322835 4525957 3537975 2456365
38302B456365j328880l425223n176124l186584J221435L352113K082901R57708
$$ 2456365 1127485 -2297738 -7473862 -10660446 -9439011 -6086898 -4003997 -3046289
38294c046289J965464K718664J147106j042253j654027j431063j782136j810463
$$ -3046289 -1080825 1637839 2784945 1742692 88665 -1342398 -3124534 -4934997
38286d934997l53917J066731L38956j429599j188193J338925K965071J554998
$$ -4934997 -5288914 -4222183 -3883227 -5312826 -6501019 -5162094 -2197023 -642025
38278f42025r57603j264534Q70713K424292J243258j064860j399462M05915J337523
$$ -642025 -1599628 -2864162 -1993449 430843 1674101 609241 -790221 -384306 953217
38269I53217j38095j408321L16907L117769K706221q73517k775591n51834J999849
$$ 953217 815122 -593199 -276292 2841477 5547698 4674181 1898590 1346756 3346605
38260C346605O18133k896130l550143p27500J326535L03189j012114L93096L050181
$$ 3346605 3964738 1068608 -2481535 -3209035 -1882500 -1579311 -2591425 -2198329 851852
38251H51852L468595J282588o84330p09878q8142n27325j529195j357876L37411
$$ 851852 4320447 5603035 4918705 4208827 4120685 3593360 2064165 706289 1043700
38242A043700J965436J853974q5301k520512l809888k821847L96592L988880N044231
$$ 1043700 3009136 4863110 4777809 2257297 -1552591 -4374438 -3977846 11034 5055265
38233E055265K351676j643163l031431r58159J445552J275642o45238j771676
$$ 5055265 7406941 5763778 2732347 1774188 3219740 4495382 3850144 2078468
38225B078468j692889j767103j927506p00702J635015K802941K148114J734065
$$ 2078468 385579 -1381524 -3309030 -4009732 -2374717 428224 2576338 4310403
38217D310403K536330K335080m00004k952806j821487J742436L150188Q78463
$$ 4310403 6846733 9181813 8781809 5829003 4007516 5749952 8900140 9778603
38209I778603k024589k933724k622519k406538j722469k22071N88948j41837q46451
$$ 9778603 7754014 4820290 2197771 -208767 -1931236 -2153307 -1564359 -1706196 -2552647
38200b552647l61374j66604j401841k042647j32265K268571K069338M13112N88209
$$ -2552647 -2914021 -3080625 -4482466 -6525113 -6657378 -4388807 -2319469 -1906357 -1318148
38191a318148J777457J20718l866781m640832j59545M245975L624738M64042q6381
$$ -1318148 459309 580027 -3286754 -7927586 -8087131 -3841156 -216418 247624 161243
38182A61243J680721J740293k96253j086158O4409R5888k111720l611568k168204
$$ 161243 1841964 3582257 3286004 2199846 2264255 2360143 248423 -3363145 -5531349
38173e531349O38218K468165L064581K615851N02696k482360l515421j458041
$$ -5531349 -4893131 -2424966 639615 3255466 3758162 1275802 -2239619 -3697660
38165c697660J145224J746033J103675Q03151M6344k139897l605916j631956K296545
$$ -3697660 -2552436 -806403 297272 1100423 1146767 -993130 -4599046 -6231002 -3934457
38156c934457L890123J950861m68991r53073n00977o60381q88206k30753O39187
$$ -3934457 -44334 1906527 1437536 484463 -16514 -676895 -1565101 -1795854 -1156667
38147a156667O88289K14640n8005j11152K88879J929548M082142L866009j28377
$$ -1156667 -468378 -253738 -311743 -422895 -134016 1795532 5877674 9743683 9615306
38138I615306m804277n703029k652426L22290O68641J7541M23388Q24422n95282
$$ 9615306 4811029 -892000 -3544426 -3222136 -2553495 -2535954 -2112566 -1288144 -1883426
38129a883426k550438k154238M36342J941957R10803j37118J102870K882662K164444
$$ -1883426 -4433864 -6588102 -6151760 -4209803 -3299000 -3436118 -2333248 549414 2713858
38120B713858m12204j469103l44832j77518k607803m519981k314342K615684N490441
$$ 2713858 2301654 832551 487719 310201 -2297602 -6817583 -9131925 -6516241 -1025800
38111a025800M318117J655737K53043l30270j741159l473574l261831l00600L142269
$$ -1025800 3292317 4948054 5201097 4870827 3129668 -343906 -3605737 -3906337 -764068
38102g64068L649090J81381m281893n219973j344887L686639N288457K977061
$$ -764068 2885022 3066403 -1215490 -6435463 -7780350 -4093711 1194746 4171807
38094D171807L5717j065351q22263n68110o66649j198925k093133k005349M33682
$$ 4171807 4207524 3142173 2319910 1751800 1085151 -113774 -2206907 -4212256 -3778574
38085c778574L497709L385437l12894l269167k493864m53034k90765m08724J900539
$$ -3778574 -280865 3104572 2791678 -477489 -2971353 -3424387 -3715152 -4123876 -2223337
38076b223337M245053K270681k301606l119586R43438L728954J505854j359933
$$ -2223337 2021716 4292397 1990791 -1128795 -185357 3543597 5049451 3689518
38068C689518q7311K380905K65840n273685p303099l119956K336451L791030J992236
$$ 3689518 3602207 5983112 6248952 975267 -6327832 -9447788 -7111337 -3320307 -1328071
38059a328071R86700K099719L120815K177137J59176r40597q55511j115547k287850
$$ -1328071 -341371 1758348 4879163 7056300 7215476 6274879 5419368 4303821 2015971
38050B015971k557895m67022J956447J326483j949990l699540j959181L29005
$$ 2015971 -541924 -1008946 947501 2273984 323994 -3375546 -5334727 -5005722
38042e005722K69878o08262M45228K658918L462488K742098J920346O83598j664209
$$ -5005722 -4735844 -5344106 -4898878 -2239960 1222528 3964626 5884972 6568570 4904361
38033D904361l187239j656657J274017K211577J196246N28962k51166l087288
$$ 4904361 1717122 60465 1334482 3546059 4742305 5271267 5020101 1932813
38025A932813n880061m193028J133085M098437K518900Q62461K138216L142250
$$ 1932813 -3947248 -8140276 -7007191 -2908754 -389854 472607 2610823 5753073
38017E753073R63110j599010j350767m02582j704247l189945j656670J128830
$$ 5753073 6716183 5117173 3766406 3363824 1659577 -1530368 -3187038 -2058208
38009b058208J756242J474903L173853M660680J728860l471053m264931K23187
$$ -2058208 -301966 1172937 4346790 9007470 10736330 7265277 3000346 3223533
38001C223533L357666R80760k963542l222571n75134Q35631j66649j501647j650151
$$ 3223533 6581199 7561959 4598417 1375846 800712 1636343 1469694 -31953 -1682104
37992a682104r51197k60531j12719m51830m42514N26192J665834J955798J940968
$$ -1682104 -2633301 -2893832 -3006551 -3458381 -3900895 -3374703 -1708869 246929 2187897
37983B187897K461270K437858N04527k036151l040986l358935m866915n500152
$$ 2187897 4649167 7087025 7591552 5555401 2514415 -844520 -5711435 -11211587
37975a1211587j478229N208025P408931K721650k778922l423260j235251p53526
$$ -11211587 -12689816 -7481791 -72860 2648790 -130132 -3553392 -4788643 -5542169
37967e542169j639276j219146k70763q21663j221471R88459L560458K598112n09893
$$ -5542169 -7181445 -8400591 -8671354 -9493017 -10714488 -9726029 -6165571 -3567459 -4077352
37958d077352j065516J041823J518259m66737r53564J315660K299859k34024k597988
$$ -4077352 -5142868 -4101045 -2582786 -3049523 -4003087 -2687427 -387568 -621592 -3219580
37949c219580j418543P01711k07061k758420k635283M00547K406742J386231l34540
$$ -3219580 -4638123 -3936412 -4143473 -6901893 -9537176 -9136629 -6729887 -5343656 -5678196
37940e678196m3761J913729L272541K631387O35401o37674L66420K568935K899662
$$ -5678196 -5721957 -3808228 -535687 2095700 2731101 2093427 2459847 5028782 7928444
37931G928444J01440l224924l930372k535238j951225k693383k119092J174254
$$ 7928444 8029884 4804960 874588 -1660650 -3611875 -6305258 -8424350 -7250096
37923g250096M660480M877320J649214j933383k953244j185357J236574J987010
$$ -7250096 -2589616 2287704 3936918 2003535 -949709 -2135066 -898492 1088518
37915A088518P62969l88063N09122K620045L074070P83704j875144k112278k83408
$$ 1088518 1851487 1463424 1972546 4592591 7666661 8450365 6575221 4462943 4179535
37906D179535R40653J91600j387809k253403k131254j335845J16444J937838L001591
$$ 4179535 5120188 5311788 3923979 1670576 -460678 -1796523 -1680079 257759 3259350
37897C259350K239244p9722k335351k789457j042751J345910K087702P01995p28346
$$ 3259350 5498594 5418872 3083521 294064 -748687 597223 2684925 3386920 2658574
37888B658574m30571K17809j245937l854595l788314l08626K210292M82148k380811
$$ 2658574 2228003 2445812 1199875 -2654720 -6443034 -6751660 -4541368 -4059220 -6440031
37879f440031j398908K345387L014644r50875m016072j453189L962192O073029
$$ -6440031 -7838939 -5493552 -2478908 -3429783 -7445855 -8899044 -4936852 1136177
37871A136177L472744J30319p16078J15210M07384l12491j132242j502101j590843
$$ 1136177 4608921 4739240 4023162 4138372 4545756 4233265 3101023 1598922 8079
37862H079j672337j789528j728090j222350n03575m42651j551042k877804k561489
$$ 8079 -1664258 -3453786 -5181876 -6404226 -6907801 -7350452 -8901494 -11779298 -14340787
37853a4340787J51381L649235N133841L369394J31595j645550j198384m19698
$$ -14340787 -14189406 -10540171 -5406330 -2036936 -1905341 -3550891 -4749275 -5168973
37845e168973o33413m76021J560434L959741M018391K070485R34492J250289O48377
$$ -5168973 -5802386 -6278407 -4717973 -758232 3260159 5330644 6265136 7515425 8163802
37836H163802j761276l464750k627164r98354o65767p05601M01919J509049R08935
$$ 8163802 6402526 2937776 310612 -687742 -1353509 -2059110 -1657191 -148142 760793
37827G60793l37022l36515J22176o03094j227352M62051K788119J791249k274394
$$ 760793 423771 87256 209432 -393662 -1621014 -1158963 1629156 3420405 1146011
37818A146011m411410j941637J716538K150570k11009j619428k85858K115679
$$ 1146011 -3265399 -5207036 -3490498 -1339928 -1550937 -3170365 -3456223 -1340544
37810a340544L143486K083396K06300o39530q8705J16098j505948l559204l174057
$$ -1340544 1802942 3886338 4092638 3453108 3364403 3480501 1974553 -1584651 -4758708
37801d758708N3119L353682M185223K612189K48251j320894j093371L08601K80564
$$ -4758708 -4705589 -1351907 2833316 5445505 5693756 4372862 3279491 3588092 3868656
37792C868656k672139n661119m309713Q14614M229416K986667L23250M6991J040698
$$ 3868656 1196517 -4464602 -8774315 -7959701 -3730285 -743618 -420368 -373377 667321
37783F67321K97755j634152j965482n44487L04150l7543K40949K047666L914184
$$ 667321 965076 -669076 -2634558 -3179045 -2874895 -2912438 -2671489 -623823 3290361
37774C290361M068488K323598l2260j185476l39413Q00520n32700m083454n857615
$$ 3290361 7358849 9682447 9650187 8464711 8125298 8925818 8393118 4309664 -1547951
37765a547951l313848P49477J996594M69153l55894Q35851J931117J239467n37459
$$ -1547951 -4861799 -4112322 -2115728 -1646575 -2002469 -1166618 764499 2003966 1466507
37756A466507k154522k969665k335957l27114J206358Q18612J66889J609688L713262
$$ 1466507 -688015 -3657680 -5993637 -6320751 -5114393 -4295781 -4128892 -2519204 1194058
37747A194058K867444n80210k012797N26809L140918J875136j740139l625730
$$ 1194058 4061502 3481292 1468495 1995304 5136222 7011358 5271219 1645489
37739A645489k880960j479133k09153J618698L187228K148370j856923n697473
$$ 1645489 -1235471 -2714604 -2923757 -1305059 1882169 4030539 2173616 -3523857
37731c523857n761362j791341K751577M124297K135585J33942O43120K025098
$$ -3523857 -9285219 -11076560 -8324983 -4200686 -2065101 -1931159 -1288039 737059
37723G37059J188858j274292j654943R55925K771735Q83856k332216k783066k51137
$$ 737059 1925917 651625 -1003318 -47393 2724342 3608198 1275982 -1507084 -1758221
37714a758221K316383L257996K970301J600029q53543k800191k398515m33503
$$ -1758221 558162 3816158 6786459 8386488 7532945 4732754 2334239 1900736
37706A900736O40475K08037m02585q10186j714190k370930j083130J517733K766720
$$ 1900736 2541211 2749248 2346663 1536477 -177713 -2548643 -3631773 -2114040 652680
37697F52680K042852J396597J492618N90687j210020q83198J982469K773312j173252
$$ 652680 2695532 4092129 5584747 6175434 4965414 4082216 6064685 8837997 7664745
37688G664745m852679k226703L797397M619469j171314n243204j908120L496935
$$ 7664745 2812066 585363 4382760 9002229 7830915 2587711 679591 4176526
37680D176526L007968k162798m289039r60250K354881J356942j473128j889553
$$ 4176526 7184494 5021696 732657 -227593 2127288 3484230 2011102 121549
37672A21549K40165K473800L558539L028430J46697l762132m597988o24908L725465
$$ 121549 361714 2835514 6394053 9422483 9569180 5807048 1209060 584152 4309617
37663D309617L143123q83545k150352J047637L771829K365893m03771n17075J114441
$$ 4309617 7452740 6569195 4418843 5466480 9238309 11604202 11200431 10683356 11797797
37654A1797797J119504n87609j497079j195254j376933k003781j323461L56847
$$ 11797797 12917301 12329692 10832613 9637359 8260426 6256645 4933184 5290031
37646E290031N95033r25597j496089J01564J335439p741k140235k007036J88410
$$ 5290031 5885064 4959467 3463378 3564942 4900381 4892640 2752405 745369 933779
37637I33779J725548J468131P68832Q32811J334278J488515Q02738r94227l230034
$$ 933779 2659327 4127458 4896290 5729101 7063379 8551894 9354632 8360405 5130371
37628E130371l964538k177097J37597J42829j777622k510937q94655Q37667J055614
$$ 5130371 1165833 -1011264 -873667 -730838 -2508460 -5019397 -5914052 -5076385 -4020771
37619d020771J241024K790650L938065K435046n16899j852522r90985K07524Q93244
$$ -4020771 -2779747 10903 3948968 6384014 5867115 4014593 3023608 3231132 4124376
37610D124376J533509J353916r56304l794151l598970k24267K241113J558985
$$ 4124376 5657885 7011801 6055497 2261346 -1337624 -1561891 679222 2238207
37602B238207N52594J810094K837114K83921l729271m214739q55976J885664J788273
$$ 2238207 2790801 4600895 7438009 7721930 3992659 -222080 -1078056 807608 2595881
37593B595881J079638J127824q956k879495m086424j462348J784413J653704o45305
$$ 2595881 3675519 4803343 4794387 1914892 -2171532 -3633880 -1849467 -195763 -841068
37584h41068j148417M32645J014776j79328o74305M75710J051908k49062j572619
$$ -841068 -1989485 -1556840 -542064 -721392 -1395697 -919987 131921 -117141 -1689760
37575a689760j172239o5210K15754J36621O50450J145571P14513j56194q34811
$$ -1689760 -2861999 -2927209 -2711455 -2574834 -1924384 -778813 -64300 -220494 -1055305
37566a055305j832716l037757k396817J249258N286911N971823L291185N88440
$$ -1055305 -2888021 -5925778 -8322595 -7073337 -1786426 4185397 7476582 8065022
37558H065022k69419n71346j532537k278723j899780j063031m29132M37340J343940
$$ 8065022 7795603 7224257 5691720 3412997 1513217 450186 21054 458394 1802334
37549A802334P34389j703494l486014k291585Q95310L408099M270420L914286
$$ 1802334 2536723 833229 -2652785 -4944370 -4049060 -640961 3629459 7543745
37541G543745K023601j548927m564972m221546j161861J150463J215140P65044
$$ 7543745 9567346 8018419 3453447 -768099 -1929960 -779497 435643 1200687
37533A200687R41541N63747p03950r18470M61419O94449j727072l556857j333832
$$ 1200687 2142228 2705975 2002025 1083555 1544974 2239423 512351 -3044506 -4378338
37524d378338K734212L603451Q82786r92891J40303J415688J41431k268009l170756
$$ -4378338 -1644126 1959325 2842111 1849220 1989523 3405211 3546642 1278633 -1892123
37515a892123k215109k74958K139468L630426K097731j637967l315709r92107
$$ -1892123 -4107232 -4382190 -2242722 1387704 3485435 1847468 -1468241 -2460348
37507b460348J457221j24024l595916l609151K97360L299911K631477P88590O25907
$$ -2460348 -1003127 -1127151 -4723067 -8332218 -8034858 -4734947 -2103470 -1314880 -688973
37498f88973J238336M52782j464932k500262j521763R77603L310483L327821N80372
$$ -688973 549363 1002145 -462787 -2963049 -4484812 -3507209 -196726 3131095 3711467
37489C711467k116043j691956N25937M16815k192612k598010J157091M191502
$$ 3711467 1595424 -96532 429405 846220 -1346392 -3944402 -2787311 1404191
37481A404191J823528k984870l891129m10384K347302J897069P90542P95872J86222
$$ 1404191 3227719 242849 -3648280 -4058664 -1711362 185707 976249 1772121 1958343
37472A958343j737563k304866j24698J855855R36457q05778M1736K535481K849816
$$ 1958343 220780 -2084086 -2208784 -352929 583528 -222250 -180514 2354967 5204783
37463E204783K62899j938531j406324M70697J289867P92917K09632j13873j125497
$$ 5204783 5467682 3529151 2122827 2593524 3883391 4676308 4885940 4772067 3646570
37454C646570l292978n088039l964759M52477M712031M820190J360950r48603
$$ 3646570 353592 -4734447 -8699206 -8246729 -3534698 1285492 2646442 1697839
37446A697839K59964J722270j39903l292666l055637N85327K910499J492586r33879
$$ 1697839 1957803 3680073 3540170 247504 -2808133 -2222806 687693 2180279 1246400
37437A246400j444639q23001p88647q01703q6105o5409j794794k925175n61263
$$ 1246400 -198239 -1021240 -1809887 -2611590 -2697695 -2763104 -4557898 -7483073 -8044336
37428h044336L782774N334293K268737j859846k596371L56140L463582L617012
$$ -8044336 -4261562 1072731 3341468 1481622 -1114749 -758609 2704973 6321985
37420F321985J143369j125078j295477n33369j182359l090355l435035q61314
$$ 6321985 7465354 6340276 5044799 4511430 3329071 238716 -3196319 -4057633
37412d057633K041945K029887l92382j953447j193652K39793O16387J64596j86391
$$ -4057633 -2015688 14199 -378183 -2331630 -3525282 -3285489 -2669102 -2504506 -2690897
37403b690897j78199J50095O71856P05015j79131q17346K01904J660233N67015
$$ -2690897 -2869096 -2719001 -2047145 -1342130 -1521261 -2338607 -2136703 -476470 90545
37394I0545l176052n404375k823654K305053M894360L310507M65421q52564j034734
$$ 90545 -3085507 -8489882 -11313536 -9008483 -4114123 -803616 -338195 -1190759 -2225493
37385b225493j480285j714428l58063K056948L023988J033272k351310l940839
$$ -2225493 -3705778 -5420206 -5778269 -3721321 -697333 335939 -2015371 -5956210
37377e956210k194104J303957L550028K982535N93198j406106j624067l14754
$$ -5956210 -8150314 -6846357 -3296329 -313794 279404 -1126702 -2750769 -3065523
37369c065523J343284K404274K510541J418848j021491l852186m744918k255453
$$ -3065523 -1722239 682035 3192576 4611424 3589933 -262253 -5007171 -7262624
37361g262624J672593L214087J308032r78342q13306O36806O69275n61355q38403
$$ -7262624 -5590031 -2375944 -1067912 -2046254 -2859560 -2222754 -1553479 -2114834 -2953237
37352b953237J16463N97739L23094N59919R74428l1473j494971m50568K564865
$$ -2953237 -2836774 -2239035 -1915941 -1356022 -381594 -413067 -1908038 -2358606 206259
37343B06259K935836q58073l827351j786482J732722P97789l311923l780512J134293
$$ 206259 3142095 2284022 -1543329 -3329811 -1597089 -799300 -4111223 -7891735 -6757442
37334f757442N213936L349062j543750l342579q68320K009588K276114N51778
$$ -6757442 -1543506 1805556 261806 -3080773 -3949093 -1939505 336609 888387
37326H88387j242180k282267k589911k086991p64003O98423J149619J79672j066320
$$ 888387 -353793 -2636060 -5225971 -7312962 -8076965 -7378542 -6228923 -6049251 -7115571
37317g115571j075209j45786j37072j364964j480052R21154L252514K148737j305099
$$ -7115571 -8190780 -8336566 -8473638 -9838602 -11318654 -10397500 -7144986 -4996249 -6301348
37308f301348k710801m54633K605771L812680L620398K918227R75189k042656
$$ -6301348 -9012149 -9466782 -6861011 -3048331 572067 3490294 4465483 2422827
37300B422827l469416j563798J509256K475042J107133n30811j385629j657275
$$ 2422827 -1046589 -2610387 -1101131 1373911 2481044 1950233 564604 -1092671
37292a092671j114011L57065J392751O45861r08926j102534M84991K319971K970756
$$ -1092671 -2206682 -1849617 -456866 188995 -719931 -1822465 -1337474 982497 3953253
37283C953253J913438o70976l259363l411774q39717J212886j0917k584043k474289
$$ 3953253 5866691 5195715 1936352 -1475422 -2315139 -1102253 -1113170 -3697213 -6171502
37274f171502N85263K893235K073452m58560k266924k277221m35948K096348K484320
$$ -6171502 -5586239 -2693004 -619552 -1078112 -3345036 -5622257 -6058205 -3961857 -1477537
37265a477537q43680m728375m316393R6304L248707K681350J663136K623248K766407
$$ -1477537 -2321217 -7049592 -11365985 -11269681 -8020974 -5339624 -3676488 -1053240 1713167
37256A713167l05696l081751j158260L225397M064380M29341k825073k631472
$$ 1713167 1407471 -1674280 -2832540 392857 4457237 4886578 2061505 -569967
37248e69967r86035l52100l98210l90797q96236j651977j032566R16977J850866
$$ -569967 -1556002 -1908102 -2306312 -2697109 -3593345 -5245322 -6277888 -5360911 -3510045
37239c510045Q49296j55833n2496m58634k073950k382485K18991K730623J469259
$$ -3510045 -2660749 -2816582 -2869078 -3327712 -5401662 -7784147 -7565156 -4834533 -3365274
37230c365274k134473l396020j157938J000000L82829j421713j773578q88041
$$ -3365274 -5499747 -8895767 -10053705 -9053705 -8670876 -10092589 -11866167 -12754208
37222a2754208p64736j738945j959888r0838K592596L309550R54232k263194l091408
$$ -12754208 -13518944 -15257889 -17217777 -17308615 -14716019 -11406469 -10452237 -12715431 -15806839
37213a5806839j060464J182750J625408J269489J793643K672569K436843J410070
$$ -15806839 -16867303 -15684553 -14059145 -12789656 -10996013 -8323444 -5886601 -4476531
37205d476531R91283J111785O25713m46465j256105j953405k756660k108449J084466
$$ -4476531 -3485248 -2373463 -1747750 -2194215 -3450320 -5403725 -8160385 -10268834 -9184368
37196i184368L956842K428094k144375l395321J284560O439800N719718M6293
$$ -9184368 -5227526 -2799432 -4943807 -8339128 -7054568 -614768 5104950 5151243
37188E151243m677416n331570l223817K9351L781881O158474M882000Q86467k185916
$$ 5151243 473827 -4857743 -8081560 -8052209 -4270328 1888146 6770146 7656613 5470697
37179E470697k743653k577459k882307k225241J76103K172644J785521K97107
$$ 5470697 2727044 149585 -2732722 -4957963 -4781860 -2609216 -823695 -526588
37171e26588r4760J19690p97280k050864j165103J547700K526433j6342l147265
$$ -526588 -621348 -501658 -1298938 -3349802 -4514905 -2967205 -440772 -457114 -3604379
37162c604379l078894k17500J925925J819048J138007J028284K99826j370411
$$ -3604379 -6683273 -6900773 -4974848 -3155800 -2017793 -989509 -689683 -2060094
37154b060094j415737J683452M488006K451037k968806n298214j944963K119362
$$ -2060094 -3475831 -1792379 2695627 5146664 2177858 -3120356 -5065319 -2945957
37146b945957J792016q38536l70043L210003M502571R64012l306673l396893m333
$$ -2945957 -1153941 -1992477 -2362520 847483 5350054 6314066 3007393 -389500 -393833
37137c93833K124618N29401k329334k599860O9537J984161N554m041919n206857
$$ -393833 1730785 2260186 -69148 -2669008 -2599471 -615310 -609756 -4651675 -9858532
37128i858532j799498K419910L654517K985854L386700M247150K667660j046540
$$ -9858532 -11658030 -9238120 -5583603 -2597749 788951 5036101 7703761 6657221
37120F657221l324238k602562r50541k61963l11179p90974j714749j564389J101880
$$ 6657221 3332983 730421 -220120 -482083 -793262 -1584236 -3298985 -4863374 -3761494
37111c761494L858803K594708j784467l678815j156948J310426O35153j47664
$$ -3761494 97309 2692017 907550 -2771265 -3928213 -2617787 -1982634 -2130298
37103b130298J576811K482469n63681l781761k202080J626477J638513j617604
$$ -2130298 -553487 1928982 1365301 -2416460 -4618540 -2992063 -1353550 -2971154
37095b971154k339692L77126J564100l40624r86455J518511K948996N84139j806544
$$ -2971154 -5310846 -4933720 -3369620 -3710244 -4696699 -3178188 -229192 354947 -1451597
37086a451597m87768J861080P90484k677080m037452k040612O80487K051716K130840
$$ -1451597 -1939365 -78285 712199 -1964881 -6002333 -8042945 -7362458 -5310742 -3179902
37077c179902J412576L80567k00847n15120j782578l537496l095470K00170K870500
$$ -3179902 -1767326 -1386759 -1587606 -2102726 -3885304 -7422800 -10518270 -10318100 -7447600
37068g447600K229080P59001J979268M260836L258737q05363l160943j688316
$$ -7447600 -5218520 -4459519 -2480251 1780585 5039322 4233959 1073016 -615300
37060f15300M80103L78430q16923p38574N20513J509637J680689R20599j004888
$$ -615300 -135197 243233 -573690 -1312264 -791751 717886 2398575 3319174 2314286
37051B314286l009544k770018L0414K363313J630470p64309j647466o13325M2859
$$ 2314286 -695258 -3465276 -3434862 -1071549 558921 -205388 -1852854 -2466179 -2423320
37042b423320o82877j078323L53213K485950L076706J616657k71172q23352J81689
$$ -2423320 -3106197 -4184520 -3831307 -1345357 1731349 3348006 3076834 2253482 2435171
37033B435171J551077J926470Q58848r23880k028617j416638N97440K299010K013213
$$ 2435171 3986248 5912718 6771566 5847686 3819069 2402431 2999871 5298881 7312094
37024G312094j26783k229885k731728j915153r50351j75867P03058J210885L31260
$$ 7312094 7185311 4955426 2223698 308545 -641806 -817673 -114615 1096270 1427530
37015A427530j618753k581949j036461J896014L377355J822481j413613l348161
$$ 1427530 -191223 -2773172 -3809633 -1913619 1463736 3286217 1872604 -1475557
37007a475557k311850M42027K228589J935924Q86588N31591M76327j99295q20417
$$ -1475557 -3787407 -3345380 -1116791 819133 1705721 2237312 2713639 2514344 1693927
36998A693927j86261Q31732J56074j826989k046060P09781L397031K736773k30457
$$ 1693927 1507666 2339398 2495472 668483 -1377577 -667796 2729235 5466008 5235551
36989E235551j938077j300925k54282p8928j49865k50149j102035k036471j086107
$$ 5235551 3297474 1996549 1742267 1663339 1513474 1263325 161290 -1875181 -2961288
36980b961288J484787K619839J111279o0125J476750K994911O37843l818909m665277
$$ -2961288 -1476501 1143338 2254617 2194492 3671242 6666153 7303996 3485087 -1180190
36971a180190n40212L445356K984901l2333j484272r11693m38816l26472P58419
$$ -1180190 -1720402 1724954 4709855 4677522 3193250 2281557 1842741 1516269 2274688
36962B274688K289884K273314Q46827L63666J496679J925130k26781l653122n542537
$$ 2274688 4564572 6837886 7684713 8048379 9545058 11470188 11243407 7590285 2047748
36953B047748m603908j757064R67323J725147K44776j608096j603290L66221K527490
$$ 2047748 -2556160 -4313224 -3345901 -1620754 -1375978 -2984074 -4587364 -4221143 -1693653
36944a693653L629927L615903K307364l62158k702558k392161L770J098627n90376
$$ -1693653 1936274 5552177 7859541 7497383 4794825 2402664 2406434 3505061 2914685
36935B914685k421587j715376L30806J018275M15599N09826J425761J417763N2287
$$ 2914685 493098 -1222278 -891472 126803 542402 1052228 2477989 3895752 3948039
36926C948039j288437j919053k431729k678205j498198R96061K760648K251457
$$ 3948039 2659602 740549 -1691180 -4369385 -5867583 -4871522 -2110874 140583
36918A40583K86538j102838q52436L43178Q23070l00281j801326j607749o933
$$ 140583 427121 -675717 -1528153 -1184975 -361905 -662186 -2463512 -4071261 -4078194
36909d078194R3890k402801m093041j491125L397835N441309L529359J382499
$$ -4078194 -3984304 -6387105 -10480146 -11971271 -8573436 -3132127 397232 1779731
36901A779731J247667J172526l86678j565712q06895J55471l28989o86422O33529
$$ 1779731 3027398 4199924 3813246 2247534 1440639 1596110 1267121 580699 1214228
36892A214228J624768n8907k604957k524907j8899J900447K378784K886634L253354
$$ 1214228 2838996 2780089 175132 -2349775 -2368674 -468227 1910557 4797191 8050545
36883H050545J696671j264966k831531k194946j262432q41435J85994J457706
$$ 8050545 9747216 8482250 5650719 3455773 2193341 1351906 1537900 2995606
36875B995606J011655m64271L85045L657615M684541J032111l191801l460731
$$ 2995606 4007261 3542990 3928035 7585650 12270191 13302302 10110501 6649770
36867F649770j434598j180308k101825r36787J381329Q10407k519090l917295
$$ 6649770 5215172 4034864 1933039 996252 2377581 3187988 668898 -3248397
36859c248397j566477R66427R26376J53576P26581J378480Q84339R44552K466104
$$ -3248397 -4814874 -3848447 -2922071 -2768495 -2041914 -663434 220905 1165457 3631561
36850C631561K563812q05984m070896k475567K379927M183488P21177l311137
$$ 3631561 6195373 5389389 1318493 -1157074 1222853 5406341 6127518 2816381
36842B816381l000604Q32111L737441L169177L80925j739275j564849r1592L37820
$$ 2816381 -184223 647888 4385329 7554506 7935431 6196156 4631307 4539715 4877535
36833D877535r08365j764776n58354J254633J339797J58912k43259n7598r62608
$$ 4877535 3969170 2204394 1646040 2900673 4240470 4399382 4156123 4098525 3135917
36824C135917k098008p80912K350778L092762l9470l219384l091125j423041j161128
$$ 3135917 1037909 256997 2607775 5700537 5661067 2441683 -649442 -2072483 -3233611
36815c233611j256593P53223L500846L526783J002455n66780J7420L46563r04483
$$ -3233611 -4490204 -3736981 -236135 3290648 4293103 3726323 3743743 4090306 3185823
36806C185823j765637o26432J008079J094580P9002m27359k83898l10037l13140
$$ 3185823 1420186 793754 1801833 2896413 2975415 2548056 2264158 1954121 1640981
36797A640981N01159J642207J552753r7946j570106j174005M21885J008041n3416
$$ 1640981 2142140 3784347 5337100 5239154 3669048 2495043 2916928 3924969 3871553
36788C871553q23176J85721J206624m91830l991784n179494k431712J014444J864296
$$ 3871553 3048377 3234098 4440722 3948892 -42892 -5222386 -7654098 -6639654 -4775358
36779d775358J148666J475542K404549J761723j48185j153253j012610j147568
$$ -4775358 -3626692 -2151150 253399 2015122 1866937 713684 -298926 -1446494
36771a446494j287548N2908K120198K574676J497912J072344J277324j4566k290924
$$ -1446494 -2734042 -2681134 -560936 2013740 3511652 4583996 5861320 5846754 3555830
36762C555830k298492J82681J124692j243671l218341j564222J504047K501113
$$ 3555830 1257338 1440019 2564711 1321040 -1897301 -3461523 -1957476 543637
36754E43637J975555J918433J409453q47022k654100j671946p5941q93547k064218
$$ 543637 2519192 4437625 5847078 5000056 2345956 674010 598069 -295478 -2359696
36745b359696Q1023L231789J812098l143825m189700J010375N385648K887163
$$ -2359696 -2278673 953116 2765214 -378611 -4568311 -3557936 1827712 4714875
36737D714875k742974m072212l85320K986065K769174K74509k379669l994654
$$ 4714875 1971901 -2100311 -2485631 500434 3269608 3544117 1164448 -2830206
36729b830206l175541M01159L864526L736876O00695j732344j495812m64438k90515
$$ -2830206 -6005747 -5604588 -1740062 1996814 2597509 865165 -630647 -1095085 -1385600
36720a385600m64054l25761k32112k7179J043675K168453J343271j129470k193756
$$ -1385600 -1849654 -2175415 -2407527 -2434706 -1391031 777422 2120693 991223 -1202533
36711a202533m99314J234947K28184k193995k780368j014284R85316K029515K542451
$$ -1202533 -1701847 -466900 -238716 -2432711 -5213079 -6227363 -5242047 -3212532 -670081
36702f70081K269015K10288k846190m193725k495508M76690K214403K262764J867197
$$ -670081 1598934 1809222 -1036968 -5230693 -7726201 -7249511 -5035108 -2772344 -905147
36693i05147J898768J972960J141208q95983k983025l313777j780726p12824j780130
$$ -905147 993621 2966581 4107789 3211806 228781 -3084996 -4865722 -5578546 -7358676
36684g358676k962182r66054L545240O066882M307529J195228L29953J159380
$$ -7358676 -10320858 -11286912 -7741672 -1674790 2632739 3827967 4157920 5317300
36676E317300R42329o66225j735468j365512k59342R92550J791674P41802k424075
$$ 5317300 6259629 5593404 3857936 2492424 2233082 3225632 5017306 5759108 3335033
36667C335033m978394l978320l16234K606947L482533L430773K581133M9738k781432
$$ 3335033 -1643361 -5621681 -5937915 -3330968 151565 3582338 6163471 6213209 3431777
36658C431777k940406n02652J106069L15282p50719o46584p78314j633768j099174
$$ 3431777 491371 -11281 1094788 1410070 659351 12767 -765547 -2399315 -3498489
36649c498489J133518J725411o56110k027152N08054K914744Q7963n312082o125652
$$ -3498489 -2364971 -639560 -1295670 -3322822 -2814768 99976 187939 -5124143 -11249795
36640a1249795j488086K102977P86744j713654q62521K184922L630649K735723
$$ -11249795 -12737881 -10634904 -9848160 -11561814 -12424335 -10239413 -6608764 -3873041
36632c873041J399777O40342L11072N93617J397388J480600N7678j638035j824633
$$ -3873041 -2473264 -1832922 -1521850 -928233 469155 1949755 2007433 369398 -1455235
36623a455235m01398J273559J941500J090302q76377k515230k503529j327065
$$ -1455235 -1856633 -583074 1358426 2448728 1572351 -942879 -3446408 -4773473
36615d773473n94700o07339l17279K77550O5681m46246Q00368L495231M177535
$$ -4773473 -5368173 -5975512 -6292791 -6015241 -5949560 -6395806 -5595438 -2100207 2077328
36606B077328J426997j025544N98102M048700L845717p90978m728976m008747
$$ 2077328 3504325 2478781 3076883 7125583 10971300 10180322 5451346 1442599
36598A442599p04915O62278j025816l229884l747807k671715q49467J385962L328923
$$ 1442599 737684 1399962 374146 -2855738 -6603545 -9275260 -10124727 -8738765 -5409842
36589e409842L438627J281942q57729k63190K247061K798966j20103k981354k023939
$$ -5409842 -1971215 -689273 -1547002 -1810192 436869 3235835 3115732 134378 -1889561
36580a889561J151322J921901m54765k058778m97424K042485K975816K743446
$$ -1889561 -738239 1183662 728897 -1329881 -1827305 215180 3190996 5934442
36572E934442K174278O1220l744729n810636l334768J065747K509030N51143r93243
$$ 5934442 8108720 8169940 4425211 -1385425 -4720193 -3654446 -1145416 -594273 -1587516
36563a587516k30619P06420q4701j551097k191852k276624k160874q26623K104241
$$ -1587516 -1818135 -1111715 -1196416 -2747513 -4939365 -7215989 -9376863 -10203486 -8099245
36554h099245M530837L951055P63503j888764j568042Q53710K290943J071261
$$ -8099245 -3568408 382647 1146150 -742614 -2310656 -1456946 833997 1905258
36546A905258j045195j316495l1376J0796j553066j262920K505638N468790K834765
$$ 1905258 860063 -456432 -487808 -477012 -2030078 -3292998 -787360 4681430 7516195
36537G516195l070541n293391j872987J968084J887387l30788j449467j940470
$$ 7516195 4445654 -847737 -2720724 -752640 1134747 803959 -645508 -2585978
36529b585978l230905l540647o17024L587077M951567K728766k60631j907325
$$ -2585978 -5816883 -9357530 -9974554 -6387477 -1435910 1292856 1032225 -875100
36521h75100k100477p52108J918926L551609J682675k125576l469494j026417
$$ -875100 -2975577 -3727685 -1808759 1742850 3425525 1299949 -2169545 -3195962
36513c195962J731367J607482m38190j702727j333851N8482J956511L247991K146868
$$ -3195962 -1464595 142887 -295303 -1998030 -3331881 -3273399 -1316888 1931103 4077971
36504D077971j056640l015946j498505J015605O48786k101531l100116p54179
$$ 4077971 3021331 5385 -1493120 -477515 171271 -1930260 -5030376 -5784555
36496e784555J890647J945900O09923O85130K230632K717280O26309k668300m359091
$$ -5784555 -3893908 -1948008 -1338085 -652955 1577677 4294957 4921266 2252966 -2106125
36487b106125k833880P31575L169132K527681M91542J81816J547523J331428j543732
$$ -2106125 -4940005 -4208430 -1039298 1488383 1979925 2161741 3709264 5040692 3496960
36478C496960l551268j795861J024196M99816k362943k415776J533250M653636
$$ 3496960 -54308 -1850169 -825973 -326157 -2689100 -5104876 -3571626 1082010
36470A082010L298092n9758j340692o20135l30075o45699l30113j81907j709172
$$ 1082010 4380102 4320344 2979652 2359517 2029442 1383743 1053630 871723 -837449
36461h37449l444793k473792O94613K466851J565594N47729J210439J885702P31730
$$ -837449 -4282242 -6756034 -6061421 -3594570 -2028976 -1481247 -270808 1614894 2346624
36452B346624j159252j779144j157059n32423l31571m94176j120726j408964J14184
$$ 2346624 1187372 -591772 -1748831 -2281254 -2612825 -3107001 -4227727 -5636691 -5522507
36443e522507K691027K867206p79494m432381l525640R18152L722722K579264
$$ -5522507 -2831480 35726 -743768 -5176149 -8701789 -7783637 -4060915 -1481651
$$ [...]
##END NTUPLES=NMR SPECTRUM
##END=
