##TITLE=31Pdec_LR-675-R2-B
 , 24 sc
 6.6.2019
##JCAMPDX= 6.0         $$ Bruker NMR JCAMP-DX V2.0
##DATA TYPE= NMR SPECTRUM
##DATA CLASS= NTUPLES
##ORIGIN= UXNMR, Bruker Analytische Messtechnik GmbH
##OWNER= root
$$ XWIN-NMR		Version 3.5
$$ Thu Jun  6 14:52:45 2019 Russian Standard Time (UT+4h)  she@DPX200
##.OBSERVE FREQUENCY= 81.013821
##.OBSERVE NUCLEUS= ^31P
##.ACQUISITION MODE= SIMULTANEOUS
##.ACQUISITION SCHEME= undefined
##.AVERAGES= 24
##.DIGITISER RES= 17
##SPECTROMETER/DATA SYSTEM= spect
##.PULSE SEQUENCE= zgpg30
##.SOLVENT NAME= DMSO
##.SHIFT REFERENCE= (INTERNAL, DMSO, 0, 182.463)
##AUDIT TRAIL= $$ (NUMBER, WHEN, WHO, WHERE, WHAT)
$$ ##TITLE= Audit trail, XWIN-NMR		Version 3.5
$$ ##JCAMPDX= 5.01
$$ ##ORIGIN= Bruker BioSpin GmbH
$$ ##OWNER= she
$$ F:/spectra/data/she/nmr/P31/1/pdata/1/auditp.txt
$$ ##AUDIT TRAIL=  $$ (NUMBER, WHEN, WHO, WHERE, WHAT)
(   1,<2019-06-06 14:51:39.71 +0400>,<she>,<DPX200>,
      <created by zg, POWCHK disabled, PULCHK disabled
       configuration hash MD5:
       00 E9 B6 7A A2 85 ED C7 34 08 36 98 17 FE 4E 26
       data hash MD5: 32K
       01 92 C1 77 2E 57 6B FB D0 C3 45 14 8F E4 9F A0>)
(   2,<2019-06-06 14:51:46.92 +0400>,<she>,<DPX200>,
      <Start of raw data processing
       efp BC_mod = 2 LB = 1 FT_mod = 6 PKNL = 1 PHC0 = -2190.355 PHC1 = 53.59912 SI = 64K 
       data hash MD5: 64K
       BD B4 66 05 C1 AD C0 FD C8 13 02 82 79 40 8D F2>)
(   3,<2019-06-06 14:52:09.51 +0400>,<she>,<DPX200>,
      <pk PHC0 = -174.2495 PHC1 = 0 
       data hash MD5: 64K
       EF 7F 58 10 06 8D 17 32 F9 06 4E 46 38 88 A3 9E>)
$$ ##END=
$$ 
$$ hash MD5
$$ 89 1E 97 47 45 8D 6E 74 0D 49 F4 B1 8E 36 6D 69
##$RELAX= 
##$RELAX= 
##$RELAX= 
##$RELAX= 
##$RELAX= 
##$RELAX= 
##$RELAX= 
##$RELAX= 
$$ Bruker specific parameters
$$ --------------------------
##$DU= <F:/spectra>
##$EXPNO= 1
##$NAME= <P31>
##$PROCNO= 1
##$TYPE= <nmr>
##$USER= <she>
##$AMP= (0..31)
100 100 100 100 100 100 100 100 100 100 100 100 100 100 100 100 100 100 
100 100 100 100 100 100 100 100 100 100 100 100 100 100 
##$AQSEQ= 0
##$AQ_mod= 1
##$AUNM= <au_zg>
##$AUTOPOS= <>
##$BF1= 81.014009
##$BF2= 200.13
##$BF3= 200.13
##$BF4= 200.13
##$BF5= 200.13
##$BF6= 200.13
##$BF7= 200.13
##$BF8= 200.13
##$BYTORDA= 1
##$CFDGTYP= 0
##$CFRGTYP= 5
##$CHEMSTR= <none>
##$CNST= (0..31)
1 1 145 1 1 1 1 1 1 1 1 1 1 1 1 1 1 1 1 1 1 1 1 1 1 1 1 1 1 1 1 1 
##$CPDPRG= <waltz16>
##$CPDPRG1= <>
##$CPDPRG2= <waltz16>
##$CPDPRG3= <>
##$CPDPRG4= <mlev>
##$CPDPRG5= <mlev>
##$CPDPRG6= <mlev>
##$CPDPRG7= <mlev>
##$CPDPRG8= <mlev>
##$CPDPRGB= <>
##$CPDPRGT= <>
##$D= (0..31)
0 1 0 0 0 0 0 0 0 0 0 0.03 2e-05 3e-06 0 0 0 0 0 0 0 0 0 0 0 0 0 0 0 0 
0 0 
##$DATE= 1559818299
##$DBL= (0..7)
120 120 120 11 120 120 24 19 
##$DBP= (0..7)
150 150 150 150 150 150 150 150 
##$DBP07= 0
##$DBPNAM0= <>
##$DBPNAM1= <>
##$DBPNAM2= <>
##$DBPNAM3= <>
##$DBPNAM4= <>
##$DBPNAM5= <>
##$DBPNAM6= <>
##$DBPNAM7= <>
##$DBPOAL= (0..7)
0.5 0.5 0.5 0.5 0.5 0.5 0.5 0.5 
##$DBPOFFS= (0..7)
0 0 0 0 0 0 0 0 
$$ [...]
##$SUBNAM2= <"">
##$SUBNAM3= <"">
##$SUBNAM4= <"">
##$SUBNAM5= <"">
##$SUBNAM6= <"">
##$SUBNAM7= <"">
##$SUBNAM8= <"">
##$SUBNAM9= <"">
##$SW= 369.568048894756
##$SWIBOX= (0..15)
0 1 3 0 0 0 0 0 0 0 0 0 0 0 0 0 
##$SW_h= 29940.119760479
##$TD= 32768
##$TD0= 1
##$TE= 0
##$TE2= 300
##$TE3= 300
##$TEG= 300
##$TL= (0..7)
0 120 53 12 22 120 120 120 
##$TP= (0..7)
150 150 150 150 150 150 150 150 
##$TP07= 0
##$TPNAME0= <>
##$TPNAME1= <>
##$TPNAME2= <>
##$TPNAME3= <>
##$TPNAME4= <>
##$TPNAME5= <>
##$TPNAME6= <>
##$TPNAME7= <>
##$TPOAL= (0..7)
0.5 0.5 0.5 0.5 0.5 0.5 0.5 0.5 
##$TPOFFS= (0..7)
0 0 0 0 0 0 0 0 
##$TUNHIN= 0
##$TUNHOUT= 0
##$TUNXOUT= 0
##$USERA1= <user>
##$USERA2= <user>
##$USERA3= <user>
##$USERA4= <user>
##$USERA5= <user>
##$V9= 5
##$VALIST= <valist>
##$VCLIST= <CCCCCCCCCCCCCCC>
##$VD= 0
##$VDLIST= <DDDDDDDDDDDDDDD>
##$VPLIST= <PPPPPPPPPPPPPPP>
##$VTLIST= <TTTTTTTTTTTTTTT>
##$WBST= 1024
##$WBSW= 4
##$XGAIN= (0..3)
0 0 0 0 
##$XL= 0
##$YL= 0
##$YMAX_a= 18837
##$YMIN_a= -17052
##$ZGOPTNS= <>
##$ZL1= 120
##$ZL2= 120
##$ZL3= 120
##$ZL4= 120
##$ABSF1= 0
##$ABSF2= 0
##$ABSG= 0
##$ABSL= 0
##$ALPHA= 0
##$AQORDER= 0
##$ASSFAC= 0
##$ASSFACI= 0
##$ASSFACX= 0
##$ASSWID= 0
##$AUNMP= <proc_1d>
##$AZFE= 0.1
##$AZFW= 0.5
##$BCFW= 0
##$BC_mod= 2
##$BYTORDP= 0
##$COROFFS= 0
##$CY= -3
##$DATMOD= 1
##$DC= 0
##$DFILT= <>
##$DTYPP= 0
##$F1P= 0
##$F2P= 0
##$FCOR= 1
##$FTSIZE= 65536
##$FT_mod= 6
##$GAMMA= 0
##$GB= 0
##$INTBC= 1
##$INTSCL= 5.30512e-09
##$ISEN= 30
##$LB= 1
##$LEV0= 0
##$LPBIN= 0
##$MAXI= 10000
##$MC2= 0
##$MEAN= 0
##$ME_mod= 0
##$MI= 50
##$NCOEF= 0
##$NC_proc= -5
##$NLEV= 6
##$NOISF1= 182.463
##$NOISF2= 159.3651
##$NSP= 0
##$NTH_PI= 0
##$NZP= 0
##$OFFSET= 182.463
##$PC= 4
##$PHC0= -2364.604
##$PHC1= 53.59912
##$PH_mod= 1
##$PKNL= yes
##$PPARMOD= 0
##$PSCAL= 0
##$PSIGN= 0
##$REVERSE= no
##$SF= 81.0140089999434
##$SI= 65536
##$SIGF1= 159.3651
##$SIGF2= -187.1042
##$SINO= 113.3802
##$SIOLD= 16384
##$SREGLST= <1H.CDCl3>
##$SSB= 0
##$STSI= 65536
##$STSR= 0
##$SW_p= 29940.119760479
##$SYMM= 0
##$S_DEV= 0
##$TDeff= 32768
##$TDoff= 0
##$TI= <>
##$TILT= no
##$TM1= 0
##$TM2= 0
##$TOPLEV= 0
##$USERP1= <user>
##$USERP2= <user>
##$USERP3= <user>
##$USERP4= <user>
##$USERP5= <user>
##$WDW= 1
##$XDIM= 65536
##$YMAX_p= 422061864
##$YMIN_p= -12056605
$$ End of Bruker specific parameters
$$ ---------------------------------
##NTUPLES= NMR SPECTRUM
##VAR_NAME=  FREQUENCY,     SPECTRUM/REAL,   SPECTRUM/IMAG
##SYMBOL=    X,             R,               I
##VAR_TYPE=  INDEPENDENT,   DEPENDENT,       DEPENDENT
##VAR_FORM=  AFFN,          ASDF,            ASDF
##VAR_DIM=   65536,         65536,           65536
##UNITS=     HZ,            ARBITRARY UNITS, ARBITRARY UNITS
##FACTOR=    0.456856943014862, 1,           1
##FIRST=     14782.0589164792, 0,            0
##LAST=      -15158.0608439998, 0,           0
##MIN=       -15158.0608439998, -12056605,   0
##MAX=       14782.0589164792, 422061864,    0
$$ Real data points
##PAGE= N=1
##DATA TABLE= (X++(R..R)), XYDATA
$$ [...]
38655a151544K6279m2828p3576l9764O141L820m5795r4495j02109o5514j7141
38644a596526l833m2052q6628p1949P209Q6342J14557J14717J39794J97723K49740
38633h90906K68289K64320K55563K33908J83427J23907J08179J54640J99725J58128
38623A059180L2896p9058j05647p4279m1798q685M3893Q1290N4670j0885m0597
38612I10980j3327K2161K5468j617m8658j00246j15902p2428j7111j1578l7332
38601E40410l3658j0323k6481o7649n6711M497K4581k1537m9082j6544L330l4254
38589B56579n7267j2025K7789j2309p1345n5710M182J8570p143l970K6587L0741
38577A44679J5469K6515M4130J4828l5725l2933J7880L6498p883o9066j03895
$$ y = [-1151544, -1125265, -1168093, -1241669, -1281433, -1275292, -1271472, -1317267, -1411762, -1513871, -1579385, -1596526, -1600359, -1642411, -1729039, -1800988, -1793779, -1707437, -1592880, -1478163, -1338369, -1140646, -890906, -622617, -358297, -102734, 131174, 314601, 438508, 546687, 701327, 901052, 1059180, 1092076, 1013018, 907371, 833092, 791294, 782609, 826502, 907792, 962462, 951577, 910980, 897653, 919814, 945282, 943665, 895007, 794761, 678859, 606431, 589320, 577742, 540410, 506752, 496429, 469948, 402299, 345588, 350085, 374666, 353129, 304047, 287503, 290833, 256579, 199312, 187287, 215076, 202767, 131422, 75712, 79894, 98464, 91321, 87351, 113938, 144679, 160148, 186663, 230793, 245621, 209896, 176963, 194843, 231341, 223458, 154392, 50497]
38566E0497r3134j4063J08713J61655O7980p4320j05809l1030J0382k0518k0704
38555C9649M7629Q1272J7985n9847p2265n6357n7733l4689L9878R2171O0521K330
38543A00544o397N484k2170n9846m4681J494J3499j000J5419N8783O4822Q736
38531A34687o4996j02680q2382j5271N1235N8583M729m2944l4210L086J8133M800
38519f7230j8328m1795m4519J486O7843P5875Q591n1230m0692r57J0235J0240
38507i0481L1045M5093K6192J3187L5550M4496j677n1852m5478j4856j8099l7183
38495f4063l1635k4717m3172m2938P310M5239K2198O233N7968R4984K4914p1290
38483a8969n7766K4390K8752m4994o9128k4698j2960m1664j2412O8700Q0493J3522
$$ y = [50497, -42637, -56700, 52013, 213668, 281648, 207328, 101519, 70489, 80871, 60353, 39649, 87278, 168550, 186535, 126688, 54423, -1934, -59667, -94356, -54478, 37693, 98214, 100544, 94147, 99631, 77461, 17615, -27066, -25572, -12073, -13073, 2346, 61129, 125951, 134687, 69691, -32989, -115371, -130642, -79407, -20824, -16095, -59039, -93249, -90163, -72030, -67230, -85558, -127353, -171872, -170386, -102543, -26668, -18077, -69307, -109999, -110956, -100721, -90481, -59436, -14343, 11849, 25036, 60586, 105082, 103405, 51553, 6075, -8781, -26880, -64063, -95698, -120415, -163587, -206525, -199215, -153976, -131778, -125545, -67577, 27407, 52321, -18969, -76735, -52345, -23593, -68587, -137715, -162413, -175373, -217037, -229449, -160749, -80256, -66734]
38471f6734n826M1963K4557q1413j13029j266R3106N0944p220M7395J12408L7657
38459A32542j04254j37614o2719j0909l361M1632J11816J06820K2175m0195l7488
38448A8445j8126k430K9186M1739j9554j03282r8061j1298L1118j9038o4213k1794
38436b37308O0216R2542N9944N274l1075k5137J7224M4506J5466k8097j4279L6357
38424d367K8743n4448j11920o8714J9202N2377J7739j9900j5232J3867K0862j5898
38412a37689o3461n9781R758P8117P6950L0381J3705L6132L7217j417k2532N527
38400B907K7907j2108p8807q6359j2083P4231R0072K5670n3786q2397n8819k6601
38388a90173m486K4153N3565M7188Q829l133K8533M0463Q6k1729K9208P4085J8011
$$ y = [-66734, -72560, -30597, -6040, -87453, -200482, -201748, -108642, -57698, -64918, -17523, 94885, 132542, 28288, -109326, -172045, -182954, -186315, -144683, -32867, 73953, 96128, 55933, 18445, 319, -2111, 27075, 68814, 49260, -54022, -152083, -163381, -132263, -151301, -215514, -237308, -177092, -84550, -24606, -19332, -50407, -75544, -58320, -13814, 1652, -26445, -40724, -4367, 24376, -30072, -141992, -210706, -191504, -139127, -121388, -141288, -156520, -142653, -121791, -137689, -201150, -260931, -251173, -173056, -96106, -65725, -52020, -15888, 21329, 19912, -2620, 2907, 30814, 18706, -60101, -146460, -158543, -84312, 5760, 31430, -22356, -104753, -163572, -190173, -194659, -170506, -116941, -69753, -60924, -64057, -35524, 4939, 5025, -16704, 12504, 86589, 104600]
38375A04600p5425o4532M4168R8612L4306m0799k7512L0304M7112K1183n363k4637
38363A42017l9897l4369j2689r641k1476P68N7750Q3368N7861N2300J12043J81262
38351E69297J97183J72977J27428K5695j30047k36194k11054j18563p3372p9293
38341B44057o3200k1558j8800o0880p8183l5695K7348P3284J06458J30011J26747
38330D29589R3476M5460j3886q2335j25994j08174m7811k968j29k0342m3490o0472
38318F2924n3352j4257K1393R212l7307n7286k0823L9649P5944P1569M6123L6534
38306A80323O3342R6252P5493j0190r8072j30973j22373j07347p7901k0348K8036
38295a23758K6209K33Q88K0584J9610L918L741N460j5404k4166J9241O3577K7189
$$ y = [104600, 29175, -35357, 8811, 107423, 141729, 100930, 73418, 103722, 150834, 172017, 166654, 142017, 102120, 67751, 55062, 45421, 23945, 24713, 82463, 165831, 223692, 275992, 388035, 569297, 766480, 939457, 1066885, 1092580, 962533, 726339, 515285, 396722, 323350, 244057, 180857, 159299, 140499, 79619, 1436, -34259, -6911, 66373, 172831, 302842, 429589, 523065, 568525, 554639, 472304, 346310, 238136, 190325, 187357, 187228, 166886, 123396, 62924, 9572, -4685, 16708, 25920, -11387, -68673, -89496, -49847, 26097, 97666, 143789, 180323, 243665, 339917, 415410, 405220, 307148, 176175, 53802, -53545, -131446, -151794, -123758, -97549, -97316, -96428, -75844, -56234, -52316, -48575, -43115, -58519, -82685, -63444, 133, 27322]
38282B7322o1527r7861o7867n6388q0432n4812L8354Q7347K8606l9304j2120N7497
38270b31185O2890J9618J3083L3681J526p3173q8506j4062N8156M9322j0174m8301
38258b27125m1235p218K8426L6775O108k3353O9N0101L9253m8949j15273p8966
38246c81387P212M1899K4670L4709Q3888R0543J7323n3610l5410L4449N0887m136
38234h8963m3529j3143L0025J3147m0058n4077k4988k2614o8946r1122l0299O2575
38222c71992R7462P3731O4779Q6805O8648k0689r2518n0954O1663J10995M5309
38211G3239n5510j05538j01357o3696J4419J03620J08510m825j10684o5599Q3474
38200a23947J55319Q9186O854J59N979m0121o5796R786J15427J29928P2691N1409
$$ y = [27322, -34205, -132066, -199933, -256321, -336753, -391565, -353211, -265864, -237258, -276562, -288682, -231185, -168295, -148677, -135594, -101913, -100387, -173560, -262066, -276128, -217972, -168650, -178824, -227125, -268360, -275578, -247152, -210377, -204269, -227622, -227553, -177452, -138199, -187148, -302421, -381387, -374175, -332276, -307606, -272897, -189009, -98466, -81143, -134753, -170163, -135714, -84827, -88963, -132492, -145635, -115610, -102463, -142521, -196598, -221586, -244200, -313146, -404268, -434567, -371992, -274530, -200799, -136020, -49215, 19433, -1256, -93774, -144728, -83065, 27930, 73239, 17729, -87809, -189166, -252862, -238443, -134823, -26313, -31138, -141822, -207421, -123947, 31372, 120558, 127412, 127571, 133550, 93429, 27633, 37419, 152846, 282774, 355465, 406874]
38188D06874O8703L3038n7952j01633o8840m9106q2656q7957j5480N3324L9448
38177A37763q363j1139P608j5194n8480n9655k8184j6152j6884O740K6153j3050
38165d8837p1579m8265N9528J28748P3843m3680j06202p7282r033L7387L6464
38154f8908m607n5486q0960o7776k7332K3362O4026O7396K7588j5352j7586Q080
38142a47555J5451j21k407J3666J3352n333K538M5593O2176Q738o8916r5656n7079
38129b15553Q801O5603Q0932K2444q8614j56136j09331k720N0034K5149j235J5767
38117c04859L2569Q964k0409p542L1621M7870K9962L525j4183k1889j7447l148
38105b34966J0702K6749N5893P3368K6983p2862j23083n2318O1318P7529j7189
$$ y = [406874, 475577, 508615, 450663, 349030, 280190, 231084, 148428, 60471, 44991, 98315, 137763, 129400, 118261, 125869, 110675, 52195, -7460, -35644, -51796, -68680, -61940, -35787, -48837, -120416, -168681, -109153, 19595, 93438, 49758, -56444, -133726, -142759, -105372, -68908, -73515, -129001, -209961, -277737, -305069, -281707, -217681, -150285, -122697, -138049, -155635, -147555, -132104, -132225, -134632, -120966, -107614, -112947, -110409, -64816, -2640, 6098, -62818, -158474, -215553, -206752, -141149, -60217, -37773, -126387, -282523, -391854, -394574, -344540, -319391, -320626, -304859, -272290, -263326, -283735, -291277, -259656, -211786, -181824, -178299, -192482, -214371, -231818, -234966, -224264, -197515, -141622, -68254, -41271, -114133, -237216, -289534, -228216, -150687, -167876]
38094a67876r5419o8468J0061M9377M5985M7990N7429L7100j6482o4847p5966
38083b41116m2404K4355Q1700P1414o359o6590m0297K6890L8627j4896n6991m8048
38071b73715k6329k1307j1062J0178J342m7654p3840k8865M2149O4284L5955J1973
38059c16891J3337J3858J651l128P972J4920J422k7256n8362p5682n5693O099
38047d77753O6648P0462K0662j8698m422L2992L9720J4915K821K1084L8015K9113
38035a64441J6653K4493K4607k1445p9342o5339K8683R6698N0382n9153j10321
38024b58525o5764Q414M9853M9259J1272m5403n4067L5013J43443J24791k9202
38013c0916j48294j06135J7458P2219M0722N213j0884m4545q0812o5113j3200
$$ y = [-167876, -263295, -331763, -321702, -272325, -226340, -178350, -120921, -83821, -100303, -165150, -241116, -283520, -259165, -177465, -106051, -112410, -179000, -219297, -192407, -153780, -168676, -225667, -273715, -300044, -321351, -332413, -322235, -320893, -368547, -442387, -471252, -429103, -364819, -328864, -316891, -303554, -289696, -288045, -291173, -283201, -268281, -266859, -294115, -352477, -428159, -483852, -477753, -411105, -340643, -319981, -338679, -343101, -310109, -270389, -255474, -252653, -231569, -193554, -164441, -147788, -123295, -98688, -120133, -199475, -264814, -236131, -139433, -89051, -148204, -258525, -324289, -315875, -266022, -216763, -205491, -250894, -304961, -269948, -126505, -1714, -30916, -179210, -285345, -267887, -195668, -154946, -149733, -160617, -205162, -285974, -351087, -364287]
38002c64287L402k1568k5812L215J0993j2317p447M0293O0545J0487n6698p9239
37990d38433o7130n0900k3075J8582L6647J9656K2227P7836J24473Q6881o605
37979a99841o0625m0274N294K9686L3536K6337L967k5716l7001j8061J4724L3907
37967b34067J6357m1727j01670r9869k6217L8941J7002n4871o3925K2044J05456
37956d22546R1137R171m0266k3869L684mr321R528L6103L0486r54j8650j3796
37943c49297j2750k0700j2084J1236N535m1344p0083k8599M6120P8217N7026L0695
37931c06028J6297j2723n4005o5254l8578j8990k7730k8911J311L1590L3395K6441
37919d43185K9965K3158l530j1779J7415K9803k3444r0916q0650K793N6750K0051
$$ y = [-364287, -360885, -382453, -408265, -405050, -394057, -406374, -413821, -373528, -312983, -302496, -359194, -438433, -505563, -556463, -579538, -560956, -524309, -504653, -482426, -404590, -280117, -193236, -199841, -260466, -300740, -295446, -265760, -232224, -205887, -201920, -227636, -264637, -282698, -267974, -234067, -217710, -259437, -361107, -460976, -487193, -448252, -431250, -486121, -550046, -528002, -422546, -331409, -322238, -362504, -386373, -382689, -382693, -392014, -382486, -346383, -315897, -316851, -335501, -349297, -362047, -382747, -394831, -383595, -378060, -419404, -489487, -518086, -471966, -393749, -336723, -306028, -289731, -302454, -356459, -421713, -460291, -479281, -507011, -535922, -534611, -503021, -469626, -443185, -413220, -390062, -393592, -405371, -387956, -358153, -381597, -472513, -553163, -550370, -493620, -473569]
37907d73569n1150o7293j7035L5950M3279K6728L6978P1762O5299j6328r7623
37896d43002p3788L3987Q5317J2928p8999p1532l786R130l0207j8908N5683Q2087
37884d41090P747o7912m4239L2680N1925J600l5740j5785K2334L4224K3398O545
37872d24313k1122o2304q9339o5672Q891Q5767J06069N6829j2888m2310k3712
37861d84104q72m519j7233j4268r642l1667o6632o3207j553O6008O3889k1060
37849e84860j17764j40176o9682L8097J16527J38912J12366N2517j9550p5034
37839e48647r3380p5554l5828N036J6599k0238p3550p5888p973O3258O6857K1302
37827g58006l28K0958L2133m090n8085q2381o8934l8899o915K2926M2496L7792
$$ y = [-473569, -524719, -592012, -609047, -573097, -529818, -503090, -466112, -394350, -329051, -345379, -443002, -516790, -482803, -397486, -384558, -463557, -535089, -538875, -529745, -559952, -578860, -523177, -441090, -433343, -501255, -545494, -512814, -460889, -459289, -495029, -510814, -488480, -454256, -430858, -424313, -445435, -507739, -597078, -662750, -653859, -568092, -462023, -405194, -418082, -460392, -484104, -484976, -489495, -506728, -520996, -530638, -562305, -628937, -692144, -693697, -627689, -563800, -584860, -702624, -842800, -912482, -874385, -757858, -618946, -506580, -454063, -473613, -548647, -642027, -717581, -753409, -748373, -731774, -752012, -825562, -901450, -909423, -846165, -779308, -758006, -758334, -737376, -705243, -709333, -767418, -849799, -918733, -957632, -964547, -941621, -899125, -861333]
37815h61333J690m8192o6892k3927M1395M5625k8967r2799o2813K3440O7751M6427
37803i58595R215k3284o3607p6688j0897Q0113O7733n9905j51286r9946M281J8150
37791a264716m8532p6604k8004K5603L8670M1891N1864L0111l7363r2337p8345
37780a437762j9721J2423o987l1277j1289L0463K1731n4674j15427q2864r606
37769a704990j7922j16108j73995j12869j5903J2818k313O501P406o0809j36650
37758b314834j03151J4204O3900r345r7024j08739q7799r4476r7558n8342k3307
37747b916471m5148q4766p7247l6434j1564O894M9387P8622L8129l1928k8172
37736c058698O4633J49869J71001K03888L47178N75376P62693Q32815Q32524Q55119
$$ y = [-861333, -859643, -907835, -974727, -998654, -957259, -911634, -940601, -1033400, -1096213, -1072773, -1005022, -958595, -949380, -972664, -1036271, -1112959, -1123856, -1043743, -976010, -1035915, -1187201, -1287147, -1282866, -1264716, -1313248, -1389852, -1417856, -1392253, -1353583, -1311692, -1259828, -1229717, -1267080, -1359417, -1437762, -1457483, -1445060, -1452047, -1483324, -1494613, -1464150, -1442419, -1497093, -1612520, -1695384, -1704990, -1722912, -1839020, -2013015, -2125884, -2141787, -2128969, -2131282, -2124781, -2117375, -2178184, -2314834, -2417985, -2403781, -2339881, -2349226, -2446250, -2554989, -2642788, -2737264, -2834822, -2893164, -2916471, -2961619, -3046385, -3123632, -3160066, -3171630, -3164736, -3115349, -3036727, -2998598, -3030526, -3058698, -2994065, -2844196, -2673195, -2469307, -2122129, -1546753, -784060, 48755, 881279, 1736398]
37726A736398R30491J007030J015978R27110P53837N40361L51468K37011J77782
37717G677466R4007n5190k03628k58215k31487k29504l02619l76335l58536k59939
37707E496020j70153j54181k05755k66857k65643j77022p4527p0812j67899k25619
37697C717552j38374J1063N4238m4107j61169j92415j55939j15082q9876p5089
37687B810802p2844p1132m5541j0385j3435n5834p9925o6924p4556j28843j52705
37676B038678p9408K0425K4274n7818r1563j6352O7479M6565n3046j19811j07463
37665A671960o5657m9154n9736p2223o8995m4787j1512M59k4537n5337m7900j1559
37653A161022l505m7938r8933j03517o7539k9497K732M7174R1931Q9898K0490
$$ y = [1736398, 2666889, 3673919, 4689897, 5617007, 6370844, 6911205, 7262673, 7499684, 7677466, 7771473, 7716283, 7512655, 7254440, 7022953, 6793449, 6490830, 6114495, 5755959, 5496020, 5325867, 5171686, 4965931, 4699074, 4433431, 4256409, 4181882, 4111070, 3943171, 3717552, 3579178, 3590241, 3644479, 3600372, 3439203, 3246788, 3090849, 2975767, 2885891, 2810802, 2737958, 2666826, 2621285, 2610900, 2597465, 2541631, 2461706, 2394782, 2320226, 2191383, 2038678, 1959270, 1979695, 2003969, 1946151, 1854588, 1838236, 1905715, 1952280, 1899234, 1779423, 1671960, 1606303, 1557149, 1497413, 1425190, 1356195, 1311408, 1299896, 1300355, 1275818, 1220481, 1172581, 1161022, 1157517, 1109579, 1010646, 907129, 839590, 810093, 812825, 859999, 951930, 1041828, 1062318]
37642A062318p2833j22890j01918l6005K7449N5276M4284J7778N523J7528L3182
37631I29692J8349l9415j05126j14212l9330N8450P9991J0237m8324p178P6857
37620H19991P2379l5461j13604o6773L2866O1818J9229l998J5361J3843k5306
37609G90345l2336K2716O1332J6031n4509m9702J9355M9212p6n6093n1190j1642
37597G03443J387j8959l7964m1583m0823l7142k3969q534J475J8822M9843O1875
37585F27871K0801m5225o8301l3709k195k0175n2245l6886K3073O7231N8195J6054
37573E54489k1055l4813k3835N294L4257M1429K4502K797p417q973j2020j5887
37561E38768p467K3242O3848Q0430N3370J1259J955K2584J6078l9849q3262n2696
$$ y = [1062318, 989485, 866595, 764677, 728672, 756121, 811397, 855681, 873459, 878982, 896510, 929692, 948041, 908626, 803500, 689288, 649958, 708408, 788399, 798636, 750312, 743134, 819991, 892370, 856909, 743305, 676532, 709398, 771216, 790445, 786447, 801808, 815651, 790345, 758009, 780725, 842057, 858088, 803579, 753877, 773232, 822444, 822368, 766275, 715085, 703443, 704830, 685871, 647907, 606324, 565501, 528359, 504390, 495856, 497331, 516153, 565996, 627871, 648672, 603447, 535146, 501437, 499242, 479067, 426822, 389936, 413009, 480240, 538435, 554489, 533434, 498621, 474786, 480080, 514337, 555766, 580268, 583065, 575648, 566675, 554655, 538768, 531301, 554543, 618391, 698821, 752191, 763450, 765405, 787989, 804067, 764218, 680956, 628260]
37549F28260J2952K2713l3273o8999k7230M5982P2364L3945l0569p6628p4838
37538E04679k0841M8644Q1033O7586M5450L2093O157l2739m5567k2758r611k5962
37526F28164k5192J8343M7999J5250l1803k8547l805j5041k5206L7984J29710
37515G47856J28636L1121k9757J1971O2044L1092k7645k7479M668p439m9092m8537
37503H27439p860P260j3443j7976J702n160m4837n2708j062M5066K6131j9221
37491G45331j7221K6321L8830p532n8631o0617l1002k2464m5781o2020m0864N284
37479D69634M7409P0245O4613J9493n0998r3984o8852l786L7038L9129M5027P0368
37467F45336O8025N194p0962r0847n5457k1710j3063j10L1333M7596K1441k1064
$$ y = [628260, 641212, 663925, 630652, 561653, 534423, 580405, 652769, 686714, 656145, 579517, 504679, 483838, 532482, 613515, 681101, 726551, 758644, 764801, 732062, 686495, 663737, 654126, 628164, 602972, 621315, 669314, 684564, 652761, 624214, 620409, 605368, 580162, 618146, 747856, 876492, 907613, 877856, 889827, 951871, 982963, 955318, 927839, 932507, 925068, 875976, 827439, 819579, 826839, 813396, 795420, 797122, 791962, 747125, 694417, 693355, 738421, 764552, 745331, 728110, 754431, 793261, 785729, 727098, 666481, 635479, 613015, 567234, 505214, 464350, 469634, 517043, 587288, 651901, 671394, 620396, 526412, 457560, 453774, 490812, 529941, 574968, 645336, 713361, 718555, 647593, 556746, 501289, 479579, 466516, 466406, 497739, 545335, 566776, 545712]
37455E45712l5397j5950R428K6786M5511O1688M6615p093n1117l1677K8456M5323
37443F68285q130m9218j097P8591O5401m5932j19897p1860J3115J5573m2719n1557
37431D50555P565M4407J4399j7157Q098M9093L9658p154k9384j4108l570j5489
37419E26913j2792L4466R3344J00671M1149l0443n1664k1048J2000J4500j198
37408G05898j3925k2541k7624k2930k3435n8931j12020j11629l1864N2071O5400
37397C98470M2839N8429R0131N8655k0227m3364J1413M7760J5000j2183K2314
37386F69237M7436j1720r5772j00117l2767K2785M6159P0267P7435K6122m2572
37375F76493m4880P886K6437m749j1979K5083M1947K1437K4642N1323J1097r9177
$$ y = [545712, 510315, 494365, 503793, 530579, 576090, 637778, 684393, 677300, 626183, 594506, 622962, 668285, 660155, 610937, 609840, 688431, 753832, 707900, 588003, 516143, 529258, 544831, 502112, 450555, 458120, 502527, 516926, 499769, 507867, 556960, 596618, 589464, 560080, 545972, 542402, 526913, 514121, 548587, 641931, 742602, 783751, 753308, 701644, 680596, 692596, 707096, 705898, 691973, 669432, 641808, 618878, 595443, 536512, 424492, 312863, 280999, 333070, 398470, 441309, 499738, 589869, 648524, 628297, 584933, 596346, 644106, 659106, 646923, 669237, 716673, 704953, 609181, 509064, 476297, 499082, 545241, 615508, 692943, 719065, 676493, 631613, 639499, 665936, 661187, 649208, 674291, 716238, 737675, 762317, 813640, 824737, 725560]
37363G25560j33499j7098J01259N7133p4047r8360q872K5909m3437p1747K3240
37352D86041J17676Q4983r447l3652M094N034l9418n1700j2779K1944L4612N9598
37340F66986Q8825O9235Q650j2840L4959Q1663O1713p56m7823o2864n0851o605
37328H30292M9926O2001J3577k7984m749L6384R437p2987j01891j6052J13558
37317H91512J63502R0794k9612q6490m5172K1968K8661j2388j1459O0873J24233
37306A196422J09130N7755M2903M8490J8148k2608q86O5541Q0787K9371N916N3649
37294A684618Q5776K9025n0763m9068K2653P3605P5196P0969P3158M6005p807
37283B053367k7982J4149O4506M9672m3187j65231k60806l17816l83016n24999
$$ y = [725560, 592061, 574963, 676222, 733355, 659308, 560948, 552076, 577985, 534548, 462801, 486041, 603717, 688700, 679253, 645601, 649695, 654729, 615311, 563611, 550832, 572776, 607388, 666986, 755811, 825046, 833696, 820856, 855815, 937478, 999191, 998435, 950612, 887748, 836897, 830292, 880218, 942219, 955796, 927812, 923063, 959447, 968884, 895897, 794006, 777954, 891512, 1055014, 1145808, 1116196, 1029706, 984534, 1006502, 1035163, 1022775, 1011316, 1072189, 1196422, 1305552, 1363307, 1406210, 1454700, 1472848, 1450240, 1449354, 1514895, 1595682, 1625053, 1630969, 1684618, 1770394, 1799419, 1748656, 1699588, 1722241, 1795846, 1871042, 1942011, 2015169, 2061174, 2053367, 2025385, 2039534, 2104040, 2153712, 2110525, 1945294, 1684488, 1366672, 983656, 458657]
37273D58657p66457j065874j377845j690503j960059k048613j809265j243685
37265a1503644n23233J50363O56172R39846R85823Q56484O97694O30040O43381
37256f467074O40466N68697M63794L75011L06701K52979K41069K92413L56681
37247b969263L38059K06849N0896j6333K0735Q4437J15516J25620J35207J24778
37237a783499Q2765M8638N5619O7529L3056k1637k1971M1614R6065Q6925L6034
37226a278862j3194m6900n5971k0104M7420Q7024O6465L0230L3935O2747O3936
37215a023274L6312K9698N9640P7331M1336j9419m2306j2429K1519J3835j8644
37204h36401k2504J4251L9940J0223m4648n7559j7138K0052J3543p305Q280O3976
$$ y = [458657, -307800, -1373674, -2751519, -4442022, -6402081, -8450694, -10259959, -11503644, -12026877, -11876514, -11220342, -10280496, -9294673, -8438189, -7740495, -7110455, -6467074, -5826608, -5257911, -4794117, -4419106, -4112405, -3859426, -3618357, -3325944, -2969263, -2631204, -2424355, -2373459, -2389792, -2369057, -2284620, -2169104, -2043484, -1908277, -1783499, -1700734, -1652096, -1596477, -1528948, -1495892, -1517529, -1539500, -1497886, -1401821, -1314896, -1278862, -1292056, -1338956, -1394927, -1415031, -1367611, -1280587, -1214122, -1183892, -1149957, -1087210, -1023274, -986962, -957264, -897624, -820293, -778957, -798376, -840682, -853111, -831592, -817757, -836401, -858905, -844654, -804714, -794491, -839139, -896698, -913836, -893784, -880241, -887546, -879266, -815290]
37192h15290J19850J39365J10160M0121m0808q8602p8573k5903L5919Q2344R6723
37181d24694O8704J2778l3408n0559n8278p4205p6644l7490K5374O2799N4424
37170e31199K5235O025K285J440p920k2449j9319K1545P6783Q4782K0395n5423
37158c97820o1368k757L3316l936o0236m9183L6899J21076J34341Q4269K8806
37147a36593M264l643k2334m6899m8052j7929J4808K1773P761m705q118j2033
37135b51700k2171l1017k4487O490N0569P2812M8533K361j7711j2355l2651q7685
37123b99012j04737l3027N7296N6358k4716o2016K282P6865N8688j9306m6317
37112c37642L697M7770K4038k8286l9709m713L2812N1605O1725N6313R085o8149
$$ y = [-815290, -695440, -556075, -445915, -405794, -446602, -535204, -613777, -639680, -603761, -521417, -424694, -355990, -343212, -376620, -427179, -485457, -559662, -636306, -673796, -648422, -585623, -531199, -505964, -499939, -497654, -496214, -504134, -526583, -545902, -524357, -447574, -362792, -342397, -397820, -459188, -461945, -428629, -432565, -492801, -541984, -505085, -384009, -249668, -165399, -136593, -132329, -135972, -158306, -205205, -253257, -271186, -256378, -234605, -226844, -231549, -239667, -251700, -273871, -304888, -329375, -322885, -272316, -199504, -150971, -148610, -166321, -178676, -211327, -299012, -403749, -436776, -379480, -323122, -347838, -409854, -407572, -330707, -272019, -291325, -337642, -333945, -286175, -262137, -290423, -330132, -334845, -302033, -250428, -188703, -132390, -123305, -191454]
37100a91454j10822p5098K612N3886O2602N8465M6173K281n6316o8655j9763K5089
37088b71000J3718j9519k2053j2885l6730o7131l9190L4146O3333J0406n7064
37077d03969o3564j7446K3624L0565J5401K479J3111M8909P3496M4102k4320o4544
37065c22156m2902J372K1644K2878K7169K5668M311j7440j4863J430J0572K1480
37053b60837M9148P3852O4643K7079q842l1639m4411l8185r795J0502o864m1096
37041b16445m9391l3898l1218m0869k0336L9473Q6201P5363K7444q526j6146j1150
37029a99498o323m039n799n574J1885M5057O2609M0209n79j6998m167j48k5969
37016a09334m8106k0858M8838J03754J01525N5549P295j7842j4038K0066P0088
$$ y = [-191454, -302276, -377374, -374762, -320876, -258274, -199809, -153636, -151355, -207671, -276326, -296089, -271000, -257282, -276801, -298854, -311739, -348469, -415600, -454790, -420644, -357311, -346905, -403969, -467533, -484979, -461355, -430790, -415389, -412910, -399799, -350890, -277394, -233292, -257612, -322156, -365058, -363686, -342042, -319164, -291995, -266327, -262016, -279456, -294319, -292889, -282317, -260837, -211689, -137837, -73194, -46115, -54957, -86596, -131007, -169192, -178987, -168485, -175349, -216445, -265836, -299734, -330952, -371821, -392157, -352684, -266483, -191120, -163676, -172202, -188348, -199498, -205821, -209860, -215659, -221233, -209348, -164291, -101682, -61473, -62052, -79050, -83217, -83365, -109334, -157440, -178298, -129460, -25706, 75819, 131368, 138663, 120821, 106783, 126849, 196937]
37005A96937R2818N1998k9868q7821r0334o7829n5384m4482j5955J2475R418j6803
36993d4830k4939M947N1956Q2868P6479L1032k4091l6191J4592P2709O2194j2340
36981B54386o2138k5350N8487J07858R6638N7691J7657k3200n2689l8411K3813
36970D14742Q6282J00765P4507M7970L1410P73m4503o4402m0638j8079m4415r2250
36958D52162r2252l7676m45k9709q4536r6199n8534j9899j1764k3604l3603l0069
36946f6128j0177J6154K8491K1439J4732J9290J4435j5183m2523l1787Q827M3260
36934H30N8397N9082L2367l0379q5272p0847O39M2872N722o1810q3129m6752J598
36921a76682K4920J9351k889k2558k0061J715J3869Q91j1711Q221M9773O8017
$$ y = [196937, 289755, 341753, 311885, 224064, 133730, 65901, 10517, -33965, -49920, -37445, -28027, -44830, -69769, -64822, -12866, 70002, 146481, 177513, 153422, 117231, 131823, 204532, 266726, 254386, 192248, 166898, 225385, 333243, 429881, 487572, 505229, 482029, 429340, 390929, 414742, 501024, 601789, 676296, 724266, 755676, 756449, 711946, 647544, 606906, 588827, 544412, 452162, 359910, 322234, 321789, 292080, 207544, 111345, 52811, 32912, 21148, -2456, -36059, -66128, -76305, -60151, -31660, -10221, 4511, 23801, 38236, 23053, -19470, -51257, -42430, 830, 59227, 118309, 150676, 120297, 35025, -35822, -35183, 7689, 13411, -48399, -131528, -178280, -176682, -151762, -132411, -135300, -157858, -177919, -176204, -162335, -161444, -173155, -164934, -115161, -47144]
36909d7144L8759j4405m7557m0238j2585k749k3318m3301k6369J7115M0110K3621
36897a38061J219M690J5411k258l9978n4093l0242m357r730k9427k1403K1599
36885b86630O0509N9908K9236Q74j7614m3735p5502p8525l2058L6608Q3802R5673
36873a67454Q1736M5140r060n2328n6792l4975k1987k2871j2069J6983L7473K8171
36861a68033l076l6159n0917k6304L9191J07370J33807J19213R5072O8603K5620
36850C04387k0983l8747k8500j3235K1377J04848J96324K06907J34611R2134J53092
36839A112215K46061K60054J88697J02353L6266j4623l3105M611P3739J30912
36829B107180J77983K35083K80894K90191L02540L74492M83033N59597O07794
$$ y = [-47144, -8385, -22790, -70347, -110585, -123170, -125919, -149237, -192538, -218907, -201792, -161682, -138061, -136842, -132152, -116741, -118999, -158977, -213070, -243312, -247669, -257399, -286826, -308229, -286630, -226121, -166213, -136977, -136103, -153717, -197452, -272954, -351479, -383537, -346929, -263127, -167454, -85718, -40578, -49638, -101966, -158758, -193733, -215720, -238591, -250660, -233677, -196204, -168033, -171109, -207268, -258185, -284489, -245298, -137928, -4121, 115092, 210164, 278767, 304387, 283404, 244657, 216157, 202922, 224299, 329147, 525471, 732378, 866989, 959123, 1112215, 1358276, 1618330, 1807027, 1909380, 1945646, 1931023, 1897918, 1902529, 1976268, 2107180, 2285163, 2520246, 2801140, 3091331, 3393871, 3768363, 4251396, 4810993, 5418787]
36820E418787O97872Q41826R62669J005693J001631R93394R68150Q91314P50711
36811A3532047N41640K62146n0443l24760n18599o39194p00081p14810p33297
36802A0654649q05159q86520q65223p16302n55418m88902m83408m45630l66054
36793E042033l08068l00733l18389l35471l33799k84670j90536j17672j19737
36784B732958j54020j44607j03106j03290j50948j72895j40057j07878j11742
36775A544415j10390p2177l8941n1338p4958o0726k7559k1037l0713j7566O082
36764A045092j907k9027k4131K653k0849j05623j54652r0371K6600P2280K2577
36753G42642k9548j4450K8186K6754j6011m0321k2878j519j0179l2538l3510p892
$$ y = [5418787, 6116659, 6958485, 7921154, 8926847, 9928478, 10921872, 11890022, 12781336, 13532047, 14073687, 14335833, 14285390, 13960630, 13442031, 12802837, 12102756, 11387946, 10654649, 9849490, 8962970, 8097747, 7381445, 6826027, 6337125, 5853717, 5408087, 5042033, 4733965, 4433232, 4114843, 3779372, 3445573, 3160903, 2970367, 2852695, 2732958, 2578938, 2434331, 2331225, 2227935, 2076987, 1904092, 1764035, 1656157, 1544415, 1434025, 1361848, 1322907, 1271569, 1196611, 1135885, 1108326, 1087289, 1056576, 1039010, 1045092, 1043185, 1014158, 990027, 992680, 971831, 866208, 711556, 621185, 647785, 720065, 742642, 713094, 698644, 726830, 753584, 737573, 697252, 674374, 672855, 662676, 630138, 596628, 588736]
36741E88736K0913L3401K7419J0412n165o548L569L385j8080l5146j5143K7431
36729F35184L9189J457l8479l4443p842o883k3548q731L5454M5489l424n1916
36717E81507m7815k2838k4179k5150J8698O4228K9576o3056r7391l2438L6918
36706D18060K5586k7435m5305l0374k1801n711M3900Q3994N7942L795J2875R1025
36694F06551J48557J28486O4548N367m2960q4403j09725j21268j25670r8628j8864
36683C51991O4191P2008J2421k8514k2674l5293r5949j31557p9879J5126Q0507
36672B02378J08308J08918N3070n5864j23196p6636J2810K6544k4956l2184L0687
36661B29879P2197L6083k4442m9362n1586n6506m4424j441L4856K8932R59j2801
$$ y = [588736, 609649, 643050, 670469, 680881, 675716, 669168, 672737, 676122, 658042, 622896, 607753, 635184, 674373, 675830, 637351, 602908, 595066, 588183, 564635, 555904, 591358, 636847, 633423, 581507, 533692, 510854, 486675, 461525, 480223, 544451, 574027, 510971, 413580, 381142, 418060, 443646, 416211, 370906, 340532, 318731, 313020, 356920, 440914, 498856, 502651, 515526, 606551, 755108, 883594, 948142, 953509, 910549, 826146, 716421, 595153, 469483, 370855, 351991, 416182, 488190, 500611, 472097, 449423, 414130, 318181, 186624, 106745, 121871, 202378, 310686, 419604, 472674, 416810, 293614, 216978, 229788, 256332, 231376, 199192, 229879, 302076, 338159, 313717, 264355, 212769, 156263, 111839, 110398, 145254, 174186, 175145, 162344]
36649A62344j3166j6100j4975j165Q073l311j9038j6571m877r700l4271n2846
36637a5603l4229L0430J03831J13671K7074q4833j07911k5824N4102M3010j8183
36626H5535l5149K519K6340L426k5529j9365J4342N2860Q9836J15993J09450O7054
36614D87312J6486j9705m4854n8792m1636O646M0323K0491k2894k5403J8965M6433
36602D23372J7648k3545j8405J6760K0479j1690j8180K6239O0834K7023m0814
36591D79721o3855l0027J328n129k1768k1346k0782l6228m2449j4907K1073K5559
36579B71190O470J730J0772o165n5742q6350n7689j13K6572R742j6016k9138l6708
36566C8555l2041J0980P9173J02620M1034m0877m1746L9126R2369M1913n4991
$$ y = [162344, 149178, 133078, 118103, 116938, 125011, 121700, 102662, 86091, 81214, 71514, 37243, -15603, -49832, -19402, 84429, 198100, 225174, 140341, 32430, 6606, 60708, 103718, 85535, 50386, 52905, 79245, 82671, 57142, 37777, 52119, 104979, 194815, 310808, 420258, 487312, 503798, 484093, 439239, 380447, 338811, 345457, 385780, 406271, 383377, 357974, 376939, 423372, 441020, 417475, 399070, 415830, 436309, 424619, 406439, 432678, 493512, 520535, 479721, 415866, 385839, 387167, 382038, 360270, 338924, 318142, 281914, 239465, 224558, 245631, 271190, 277660, 279390, 290162, 283997, 228255, 141905, 84216, 84103, 110675, 120417, 104401, 75263, 38555, 6514, 17494, 96667, 199287, 240321, 199444, 157698, 196824, 289193, 331106, 276115]
36555B76115q4368j5560P5462J03019N5156j1758l3905J473M3464L2828k2938
36544D18988n5121k7373J3771J1351j7777j8372J2030K4639j274l6630n5521n7885
36532B10826m2018o725J9173K787l5629m5634k6949k4516m0440k6273K0586L5750
36520D0938k612k6387Q297L9746N254m3501k0553M9886P0049J9930k9684m0348
36508G1015l9474l3138Q318O2776O0002M044j1685M1005N9775k5662j20239r4395
36496a7658K0819Q6572O1730K9507L4085K4304j8806k5028L8199Q4798L3524o1799
36484B90247q9507l6631J5232J6645q271k7252l0721q030L6815N3804K053o8283
36472A46101o3753J9898Q9896R0925O5899O0852N4140J9961j5102k9159m9176
$$ y = [276115, 191747, 176187, 251649, 354668, 409824, 398066, 364161, 365634, 409098, 441926, 418988, 363867, 336494, 350265, 361616, 343839, 325467, 337497, 362136, 360862, 324232, 268711, 210826, 168808, 162083, 181256, 184043, 148414, 102780, 75831, 51315, 10875, -15398, 5188, 40938, 38326, 11939, 20236, 59982, 65236, 21735, 1182, 51068, 121117, 141047, 111363, 71015, 31541, -1597, 6721, 69497, 129499, 133543, 121858, 162863, 222638, 196976, 76737, -17658, 3161, 89733, 151463, 180970, 215055, 239359, 220553, 195525, 233724, 318522, 352046, 290247, 200740, 164109, 179341, 195986, 187715, 160463, 129742, 121712, 158527, 212331, 214384, 146101, 82348, 102246, 192142, 283067, 348966, 409818, 463958, 483919, 468817, 439658, 390482]
36461C90482q2968p5454L21P1225O2370J4414J2731M1613J4311o9378j05251l8500
36449B35916N5902P7186J5580o4936j07503r6319m7916N773M2652O1064N4417
36438B31816N930n9273o3648J8867R1477N1835n2325q7882l6209o227m5187p1087
36426b1913k8761J7528R869k418L1339N8955K3749j7772J4212P7168O5210k1688
36414B05478p6585m1800K6565N1938K2936j8651k3544K5819Q2050O2693m1855
36403B75044j25700r1339J8131P9929N5702J5043J1265J9972Q581o708M655M4327
36391C08902Q9451J06321O4680k2087q2404n9497R537L6691j821m5148m1380r619
36379C53626J751k0641m6892l9696N051M6389M1139J488k2589k0505k5986l5698
$$ y = [390482, 307514, 232060, 232381, 303606, 365976, 380390, 393121, 434734, 449045, 379667, 274416, 235916, 291818, 369004, 384584, 319648, 212145, 115826, 67910, 73683, 116335, 177399, 231816, 237746, 178473, 114825, 133692, 225169, 277004, 224679, 136797, 100588, 94361, 49174, -21913, -50674, -33146, -23277, -25695, 5644, 64599, 88348, 70576, 84788, 161956, 227166, 205478, 128893, 87093, 113658, 165596, 188532, 169881, 146337, 172156, 254206, 316899, 275044, 149344, 58005, 76136, 156065, 211767, 226810, 238075, 258047, 266628, 259920, 264575, 308902, 398353, 504674, 569354, 547267, 464863, 405366, 414903, 451594, 449773, 404625, 363245, 353626, 355377, 334736, 287844, 248148, 253199, 299588, 340727, 342215, 319626, 299121, 273135, 237437]
36367B37437k881N7074N1852l6355q5718j1164R0443Q7007J5825J255M1247M0447
36355D86469M884K0308O0565J2953r8905j16912j0128O0100m58q1727p7583n0878
36343B08688p6421q4989p082O4652J6444q6250r9835k6985J6279J63n409J9543
36331f1202K5638N675n31J825j9525l1738K1120R5517Q4969j9144j09560j11536
36319a18492n2164K0017Q3993J06683N5415k8551n6944j6737J4172r621m3957
36308d6186m1924j6065J3121N2957R0611Q2334K8222p250J0978L2805K063o0015
36296A41651r2142p0814j3856N3055R7516Q6844L1079j3198j5453j2742m2373
36285A49567p0910m3011K1851M3740l754n0316k7087L1946L4768l4636q5209m4333
$$ y = [237437, 234556, 291630, 343482, 307127, 221409, 210245, 300688, 387695, 403520, 404775, 446022, 486469, 491353, 511661, 572226, 585179, 486274, 369362, 359234, 419334, 418876, 337149, 259566, 208688, 132267, 47278, 40196, 104848, 121292, 35042, -64793, -91778, -75499, -75336, -80745, -61202, -35564, -29889, -30420, -28595, -48120, -79858, -58738, 36779, 121748, 102604, -6956, -118492, -170656, -150639, -66646, 40037, 95452, 66901, 9957, -6780, 7392, -2229, -46186, -88110, -104175, -91054, -38097, 52514, 134848, 163070, 155820, 166798, 199603, 201666, 141651, 49509, -21305, -35161, 17894, 115410, 202254, 233333, 220135, 204682, 191940, 149567, 78657, 35646, 57497, 101237, 97483, 47167, 20080, 52026, 86794, 52158, -33051, -77384]
36273g7384L8202O5216L3352J7844L0002l041q8530j12027p089J12561R8600j7638
36261I0068q0042l9864L432j0842j7752L5554Q6407N8298j9439o4181n2633j7076
36249b8070K3890O7356Q9326O4404J1526j9665l732L9834P1750O9276N0112N6933
36237D92940R5550J03170K2889r8668j48602r0040m832K3825O817l748J53o15
36225C98839M067L6867Q3013J02022P6621K0160m7919j07285j34745j23140r0736
36214B17764n4819j1806M0488P8302P0811J8895l5157l9753J4387P1401O3759
36203D34272J800k9109J0060M5836L528o8348p0916j3242R747k1184l1637r87
36191B69820J756m1336m9165J3182O1963L7188N536L5883P3712M0602k4601l2098
$$ y = [-77384, -39182, 26034, 59386, 77230, 107232, 104191, 15661, -96366, -103455, 9106, 107706, 90068, 10026, -29838, -26406, -37248, -55000, -19446, 66961, 125259, 105820, 41639, -10994, -28070, -4180, 63176, 152502, 216906, 228432, 208767, 205035, 244869, 316619, 385895, 436007, 492940, 588490, 691660, 714549, 615881, 467279, 377239, 372407, 396232, 403049, 399301, 399454, 398839, 402906, 439773, 522786, 624808, 701429, 721589, 673670, 566385, 431640, 308500, 217764, 162945, 151139, 191627, 269929, 340740, 359635, 324478, 284725, 299112, 370513, 434272, 436072, 406963, 417023, 462859, 466387, 398039, 327123, 313881, 323628, 302444, 270807, 269820, 271576, 230240, 181075, 194257, 256220, 293408, 298944, 334827, 408539, 449141, 424540, 392442]
36179C92442J6131N3339O1041N4846J4845o2490r7176k9720N2288K2390q0193
36168C97743r8245l313N7061r157j01026q8781o744J2675o3069j29107r0351K2559
36156i9755J01373R0510L7798J2115N827l3394r0182q3705l735M9260J5798k3259
36144b1349J7084P9105O5358J3121K4734P5585N2050m1188p9534k9284P064j6672
36132A46074j9747L2823N0904r996m9712O335P1930M8417r067J59M6011L4840
36120C48971k2839m6842l0485j9332p20N0715O5539l2079j56806j43281N525J09515
36108A27881P4504P760J8939N5196K4835l4638k7589L6667O6839L4586m840j5257
36096C64883j3668j0308O428K4553J7468K156K0420N3679L1780m6941q2426j4590
$$ y = [392442, 408573, 461912, 522953, 577799, 592644, 530154, 432978, 403258, 455546, 477936, 397743, 299498, 296185, 353246, 344089, 243063, 154282, 147538, 160213, 97144, -31963, -122314, -99755, 1618, 92128, 129926, 142041, 147868, 114474, 24292, -59413, -63148, -13888, 1910, -21349, -4265, 74840, 140198, 153319, 178053, 253638, 305688, 264500, 184966, 155682, 162746, 146074, 126327, 159150, 210054, 200058, 150346, 156681, 228611, 277028, 267961, 268120, 314131, 348971, 326132, 279290, 248805, 229473, 228753, 279468, 345007, 312928, 156122, 12841, 18366, 127881, 202385, 210145, 229084, 284280, 309115, 274477, 246888, 283555, 350394, 384980, 380140, 364883, 351215, 340907, 347335, 371888, 389356, 391512, 411932, 465611, 497391, 450450, 368024, 353434]
36084C53434O7801M3554n5694q2837K974O8010O195r3112p6303L9375Q6732o663
36072C53466j18984j14310j8732M9260M9712L8641N4126O8775N0032N166m0005
36061C77147o5482n8235k2795J0186J4232R10j900O032M807o300j0487n357q83
36048B41875M349J1824J736l7230o9183m9989J258K2971M982L371M6583Q5418
36036B67965O7893J5174j7631j8759j2788n574J1755J9768j1739o0691o0670O655
36024B01358O8827M8649l0279o7283j2455O9030P8050o84q9771j13129o6338L665
36012H9640N3454O5873M7648K5872K8429M8684M6382L166m2156m1032k156K3469
36000C47273J6806J0343K7636M2049J8265k9105m7208j0255M7670P0417M0723
$$ y = [353434, 421235, 464789, 409095, 326258, 329232, 397242, 403437, 310325, 234022, 273397, 360129, 353466, 234482, 120172, 101440, 150700, 200412, 239053, 293179, 361954, 411986, 417152, 377147, 311665, 253430, 230635, 240821, 255053, 255963, 254063, 260095, 264902, 258602, 248115, 242758, 241875, 246224, 258048, 259784, 222554, 153371, 103382, 104640, 127611, 132593, 135964, 182547, 267965, 335858, 351032, 333401, 314642, 301854, 296280, 308035, 327803, 316064, 255373, 194703, 201358, 270185, 318834, 288555, 221272, 208817, 277847, 355897, 355213, 265442, 152313, 85975, 89640, 143094, 208967, 256615, 282487, 310916, 359600, 405982, 409148, 366992, 325960, 323804, 347273, 364079, 374422, 402058, 444107, 462372, 433267, 386059, 375804, 423474, 493891, 534614]
35989E34614m807k1234n683Q804L051q133j0735j7253l7166m7470k5893L678K35
35976C72008k6134k1085L1497P8925P2313L0763K430o230j9776l2191r450M1798
35964E14868N8884N560o3355o1956J3399P5767O1134Q443j176M6790R4966J01645
35952H54969Q2153O0060L0488n172j4125K0281N8885N9286M5368P1913J27924
35941A392030J33948N4364l2585j5319J14266K37284K31388J05134q961j512R3474
35930B303511J51730J17395N8235N4958R8124J33210J50709J68209J64948J13811
35920C514840N6860O3998J21689J49383J31975J41540K04264K46934K27530K26584
35910E085597L30692M94811O08152O46127O65242O85821O79657O52365O33481
$$ y = [534614, 529807, 508573, 502890, 511694, 514745, 506612, 495877, 478624, 441458, 393988, 368095, 371773, 372008, 345874, 324789, 356286, 435211, 507524, 538287, 540717, 534487, 514711, 482520, 473070, 514868, 573752, 579312, 515957, 454001, 467400, 543167, 604301, 612744, 611568, 658358, 753324, 854969, 937122, 997182, 1027670, 1022498, 1008373, 1028654, 1087539, 1146825, 1192193, 1264106, 1392030, 1525978, 1580342, 1547757, 1532438, 1646704, 1883988, 2115376, 2220510, 2211549, 2210037, 2303511, 2455241, 2572636, 2630871, 2685829, 2783953, 2917163, 3067872, 3236081, 3401029, 3514840, 3571700, 3635698, 3757387, 3906770, 4038745, 4180285, 4384549, 4631483, 4859013, 5085597, 5416289, 5911100, 6519252, 7165379, 7830621, 8516442, 9196099, 9848464, 10481945]
35901A0481945N88367M45660K26836M4324o0736j75531l59320n31742n98090o00543
35891I461170o37210o89849o59942n52311m85606n03060n03850m15846l19493
35882D694003l12628l46036l10587k28272k17365k82458k85364j62693m4225p4581
35872B429794k08875k86015k49242j86445j74964j93338j96034j82395j59466
35863E93020j09905m0379n806l5270p3006m6421K9439O7231K1491n7673r3370
35852B49351p0128l3688k2100k5336j8204r756l1645p8968r7675n0844K9276Q2935
35840g6782R2721P9041N1995J3208j6270k5018m9726j18137j68763j14020J4927
35829c16824Q6174N3269J6050M7751P4949J5005o6646n4253L1489P3362M2908
$$ y = [10481945, 11070312, 11515972, 11742808, 11787132, 11726396, 11550865, 11191545, 10659803, 10061713, 9461170, 8823960, 8134111, 7474169, 6921858, 6436252, 5933192, 5429342, 5013496, 4694003, 4381375, 4035339, 3724752, 3496480, 3279115, 2996657, 2711293, 2548600, 2504375, 2429794, 2220919, 1934904, 1685662, 1499217, 1324253, 1130915, 934881, 752486, 593020, 483115, 442736, 436930, 401660, 328654, 282233, 311672, 378903, 400394, 342721, 249351, 179223, 145535, 123435, 98099, 79895, 70139, 38494, -40474, -138149, -188993, -159717, -76782, 15939, 94980, 146975, 160183, 143913, 118895, 69169, -48968, -217731, -331751, -316824, -230650, -177381, -161331, -113580, -38631, -23626, -90272, -144525, -113036, -39674, 3234]
35818C234J4671J7101M593k1244K795P1441R2355L5922j3740m824K198l5676n0170
35805A18656J1908O7341J3805j00637j42058q1327q559J6346J9185K6064K2462
35794c6814N888j172m20j3822l0334k1054o11k866n657L6010Q5724N4649m7981
35781B1540r6918k6253P0351P5205L947m6279m4367l6075m3203l7067m571K6614
35769a37076L4612K8952K5246K7728L7971N5391P0558P4550O7290M7892J6608
35758C49722n692P248L8403L6276m061j8570K8499P6222N3614o826j4692M1980
35746E82123Q2591N4133l077k2920M760L5829K2334m3095j08942j04185k5139
35735D74412M4056L8495K505J2202M8423L4202k6137n0105j5675J2342O222J0639
$$ y = [3234, 17905, 35006, 39599, 18355, 21150, 92591, 184946, 220868, 207128, 202304, 204502, 168826, 118656, 130564, 197905, 211710, 111073, -30985, -112312, -120871, -104525, -85340, -59276, -36814, -30926, -32098, -32518, -46340, -76674, -97728, -98339, -101205, -106862, -70852, 14872, 69521, 21540, -75378, -101631, -31280, 43925, 47872, 1593, -42774, -78849, -122052, -159119, -163690, -137076, -102464, -73512, -48266, -20538, 17433, 72824, 143382, 217932, 285222, 333114, 349722, 344030, 351278, 389681, 425957, 421896, 403326, 431825, 508047, 561661, 554835, 540143, 582123, 664714, 718847, 715770, 692850, 697610, 733439, 755773, 712678, 603736, 499551, 474412, 518468, 556963, 559468, 571670, 620093, 654295, 628158, 578053, 562378, 574720, 580942, 591581]
35723E91581K7165j1619r9212j13698n807Q6933L1970q3697p3964O7006J61374
35712E78032J10861J4026o355L3769M5381M484m0137m4898p157M6041P7127P1866
35700H83040O1940Q0013R7614O0224j6477n0903r741M7243N8490L2592m49m4418
35688A199168r9668j26585r9057n3835l8144m3949m0563l5143m7742n8971m2092
35677E13419k2694m2112p5705n6063K0713P6158N2444j8275o7698o9884m2892
35666B67411j1158O038j956k0127j9372l500j0413m1894l7063L6697J05837P5653
35654C46153k4919p0158j7707L2380o76n0860j9117N8659O8782O027k3801J6213
35642C20976M3246J4010M706O5158J09865N4471k9885j9887O3064R0887L2509
$$ y = [591581, 618746, 607127, 507915, 394217, 388410, 475343, 507313, 423616, 349652, 416658, 578032, 688893, 702919, 696564, 730333, 775714, 780198, 740061, 695163, 688006, 734047, 811174, 883040, 944980, 1024993, 1122607, 1182831, 1166354, 1115451, 1105710, 1152953, 1211443, 1244035, 1243586, 1199168, 1099500, 972915, 873858, 820023, 781879, 737930, 697367, 662224, 614482, 555511, 513419, 490725, 448613, 372908, 316845, 337558, 413716, 466160, 447885, 380187, 310303, 267411, 256253, 262291, 260335, 240208, 220836, 217336, 206923, 165029, 127966, 164663, 270500, 346153, 321234, 251076, 233369, 265749, 265073, 214213, 195096, 253755, 322537, 328564, 304763, 320976, 364222, 378232, 382938, 448096, 557961, 612432, 582547, 562660, 625724, 716611, 749120]
35631G49120j4735O063M1619M8696O1364R2796P9480q076q5087o5639J865O8q4436
35618H23098j37560p4225M3643Q0719j591r0695o3286M5009P5868l1712j44265
35607E25003j22143k1715N473m3202l4420N8028R9969K7093m1482m206N7592L1613
35595E37603l1231j4992N7775P1847J5320j8122J431N384l9379p8510o3363l579
35583D40184P6237J47400J51684N8514n3525o8434P413N2825J0974m1180l1884
35572G50208j906j6939n1850l4295M0143J00638R1960K9786k8410m3349k6045
35561H09941j5723k5123k4662M642L1543K0902p509j0368J1826K7630L4854N4030
35549I11983P6320P1378L6703o546m7702p0880l8872M6293J02581O3591j5689
$$ y = [749120, 734385, 740448, 782067, 830763, 892127, 984923, 1064403, 1056327, 971240, 905601, 907466, 907534, 823098, 685538, 611313, 654956, 735675, 734084, 643389, 580103, 625112, 700980, 669268, 525003, 402860, 381145, 386618, 343416, 308996, 367024, 466993, 494086, 452604, 448398, 505990, 537603, 506372, 491380, 549155, 621002, 636322, 618200, 619631, 625015, 585636, 507126, 443763, 440184, 516421, 663821, 815505, 874019, 820494, 752060, 759473, 812298, 823272, 782092, 750208, 748302, 731363, 679513, 645218, 685361, 785999, 877959, 907745, 879335, 835986, 809941, 794218, 769095, 744433, 749075, 780618, 801520, 794011, 783643, 795469, 823099, 857953, 911983, 988303, 1059681, 1096384, 1089838, 1042136, 971256, 932384, 978677, 1081258, 1144849, 1129160]
35538A129160l3167Q942K4979k663n627L7792O6211M7694K2842J3468p816k8805
35526A273010J6005J28127K09035J89914J16049N9841L0780J4558K1283M7462
35516B106064O0207N7554P4175J00353Q0610K3204J3356P4929J19908R0035M8644
35505B849039O6659J12893J30533J32970J46360J41802J04697R0512J30300J61022
35495D066787J32776J01595J24088J45517J01024N2727J03632K28155L09173L09129
35485E674603K94586L15554L57988L96730M15218L99202L79426M35978N85304
35476I254589P16009P23036O56202O48056P44936Q99365J074865J256430J402780
35467A7376268J493050J590937J776785K051963K381397K773558L244866L779353
$$ y = [1129160, 1095993, 1104935, 1129914, 1127251, 1121624, 1159416, 1225627, 1273321, 1296163, 1309631, 1301815, 1273010, 1289015, 1417142, 1626177, 1816091, 1932140, 1991981, 2022761, 2037319, 2058602, 2106064, 2166271, 2223825, 2298000, 2398353, 2478963, 2502167, 2515523, 2590452, 2710360, 2800395, 2849039, 2915698, 3028591, 3159124, 3292094, 3438454, 3580256, 3684953, 3775465, 3905765, 4066787, 4199563, 4301158, 4425246, 4570763, 4671787, 4724514, 4828146, 5056301, 5365474, 5674603, 5969189, 6284743, 6642731, 7039461, 7454679, 7853881, 8233307, 8669285, 9254589, 9970598, 10693634, 11349836, 11997892, 12742828, 13642193, 14717058, 15973488, 17376268, 18869318, 20460255, 22237040, 24289003, 26670400, 29443958, 32688824, 36468177]
35459C6468177M406861N237825O334001P645358R174662J1094700J3599352J6766786
35451A10727722K0671299K5451529L1108243L7333275M3434640M7834098M7413423
35444C63974229L8427618J9660017m916787k7595019m1965045m6701639m4737685
35437B56145689l9733994l3875795k8116595k3013494j8844401j5517710j2824467
35430H4219233j0655329q907713p435729o193610n235981m521110l899911l330814
35422C4039036k906454k628777k356625k029708j754699j599605j474265j295420
35414A7993483j120408j028654r90160r32422q42882p43360o46849n82298n79000
35405A0527450n97554n61283m70917l95281l48105k89291k47397k96623l91277
$$ y = [36468177, 40875038, 46112863, 52446864, 60092222, 69266884, 80361584, 93960936, 110727722, 131399021, 156850550, 187958793, 225292068, 268726708, 316560806, 363974229, 402401847, 422061864, 417145077, 389550058, 347585013, 300883374, 256145689, 216411695, 182535900, 154419305, 131405811, 112561410, 97043700, 84219233, 73563904, 64656191, 57220462, 51026852, 45790871, 41269761, 37369850, 34039036, 31132582, 28503805, 26147180, 24117472, 22362773, 20763168, 19288903, 17993483, 16873075, 15844421, 14854261, 13921839, 13078957, 12335597, 11688748, 11106450, 10527450, 9929896, 9368613, 8897696, 8502415, 8154310, 7865019, 7617622, 7320999, 6929722]
35396F929722l82274k48526j52618j90149k40412j75377p5843r4176k02665k40013
35386D927669j58061p1958p5859j32827j60731j35085q6381n7933p8770j33478
35376C836586j60293j20963o2842o4165j24256j60793j23558o2656n8089j10594
35366B788377j38445q3081J0575M3516j6891j00341j25414q8932m1371j5713j9611
35355B212669n7303j06097j06475l8670K2112p18o5252p0528j3637J4726j4134
35344A776693k9707M51R923m5325j03143r1964l3995O794J5179R146p708k6631
35332A479713j8693J5416L1370J4996J2104M4229N8305J0933n5915p9226o5055
35321A448177n9566p1858p5089n0958J32N5165N9213j9805j13027j10213k1179
$$ y = [6929722, 6547448, 6298922, 6146304, 5956155, 5715743, 5540366, 5464523, 5370347, 5167682, 4927669, 4769608, 4697650, 4621791, 4488964, 4328233, 4193148, 4106767, 4048834, 3970064, 3836586, 3676293, 3555330, 3492488, 3428323, 3304067, 3143274, 3019716, 2957060, 2898971, 2788377, 2649932, 2566851, 2577426, 2620942, 2604051, 2503710, 2378296, 2289364, 2247993, 2232280, 2212669, 2155366, 2049269, 1942794, 1904124, 1926236, 1925518, 1860266, 1789738, 1776101, 1790827, 1776693, 1746986, 1747437, 1757360, 1712035, 1608892, 1516928, 1482933, 1489727, 1504906, 1514052, 1506344, 1479713, 1461020, 1476436, 1507806, 1522802, 1534906, 1579135, 1637440, 1648373, 1592458, 1513232, 1448177, 1388611, 1316753, 1241664, 1190706, 1190838, 1246003, 1305216, 1285411, 1172384, 1062171, 1040992]
35310A040992K4194k3272n2863J4352Q3556M5522l6476l9238R574p898q6792j13362
35298H58289o3500k6143l4208k5915J3542J6918l0585n2563j3221K8773L3190
35287G04577L3240M3018K3602j7997j1435M6077N8600o715m5054J6750Q9060O3498
35275I97221p883m880N8559O5864j393l5834J8495Q6299Q8723M8073J8945k152
35263A330037l7526n7577k1156L9192L9412m4929j38419j54341r0790j4024K9313
35252H79192M4191L9158j152p0089j07913o6796J0289L0056k9271q6487o3751
35241E77427J7076O9447M4177k9625q6442q4004l2108K0405L0892L72l7633n6282
35229D33702m7753j0507M4964Q4011P7121M1970K2003K3439J3330j6857l2279
$$ y = [1040992, 1065186, 1041914, 989051, 1003403, 1086959, 1132481, 1096005, 1056767, 1066341, 1058443, 971651, 858289, 794789, 768646, 734438, 708523, 722065, 738983, 708398, 655835, 642614, 671387, 704577, 737817, 780835, 804437, 786440, 775005, 821082, 879682, 872967, 827913, 844663, 933723, 997221, 989338, 984458, 1043017, 1108881, 1107488, 1071654, 1090149, 1176448, 1265171, 1313244, 1332189, 1330037, 1292511, 1234934, 1213778, 1252970, 1292382, 1247453, 1109034, 954693, 863903, 849879, 879192, 923383, 962541, 961389, 891300, 783387, 716591, 726880, 756936, 727665, 641178, 577427, 594503, 663950, 708127, 678502, 592060, 508056, 475948, 496353, 527245, 527617, 489984, 433702, 385949, 375442, 420406, 504417, 581538, 623508, 645511, 668950, 682280, 665423, 633144]
35218F33144j2340J7436L0433L3191L0752O21o2015j03825o1730N5646J63356
35207G24669J79694J04167K0275J3514P3126R5782J7992q3324q1847K3499J05182
35196A192729Q2713J1754k8749m3543o0549m9749J6241Q0744O9953M713l4230
35185A242027k4975j3368k6444n0989q0340j10275j04530l9051L2088L3348j6711
35174H40780k9347J3585L2403j7300p1285n7459o32K5059J344k6053j6202K8019
35162G22912P1494P4218K5202l7772o3117m4134j4940R257M4025Q2171Q0089K1080
35150I70485m7050o2870j3442O5841J22914J16551N1961p366r631L869m9142j51423
35138I90697j82094q8505K2078K6286m8095p8670k4806M0158M8814P715m8331
$$ y = [633144, 620804, 638240, 668673, 701864, 732616, 733237, 671222, 567397, 505667, 561313, 724669, 904363, 1008530, 1028805, 1042319, 1115445, 1211227, 1229219, 1145895, 1064048, 1087547, 1192729, 1275442, 1287196, 1258447, 1214904, 1154355, 1104606, 1120847, 1201591, 1271544, 1276257, 1242027, 1217052, 1203684, 1177240, 1126251, 1045911, 935636, 831106, 792055, 824143, 857491, 840780, 811433, 825018, 857421, 840121, 768836, 711377, 710745, 735804, 737148, 711095, 694893, 722912, 794406, 868624, 893826, 856054, 792937, 748803, 733863, 743120, 787145, 869316, 949405, 970485, 923435, 860565, 847123, 912964, 1035878, 1152429, 1204390, 1197024, 1187393, 1191262, 1142120, 990697, 808603, 720098, 742176, 768462, 720367, 641697, 616891, 657049, 705863, 713578, 665247]
35127F65247r5779j10955q1303l8527l0914n5384o1670k7731J5375L9439N1638
35116B69436N7725L7556j8596p8952r8657o4388r44N1878O5111L9556L102j9261
35104B43566k6808k7634k1406j3229j9814l8117l4695M141M1616M4992L5252L7865
35092B25729K6782j8542m2264J3031Q6392O0128n8100j25004n8837N5828J01137
35081B66280O7816J1276m2652p9059o0667N638L2792l1119j04712q0007J6291
35070A877O5243L0895r064jK2074J4616m762o485j005q792k1107j9687q166l488
35056E2148j1376j9060p486K0198K2325l5822j11778j15822l8228K0747l658m1360
35044b69172q620M9439M5235J1258L7542Q9413N0885n8037q2550J8306R6958N5227
$$ y = [665247, 569468, 458513, 377210, 338683, 307769, 252385, 190715, 162984, 178359, 217798, 269436, 327161, 364717, 346121, 267169, 168512, 104124, 103180, 155058, 220169, 259725, 262827, 243566, 216758, 189124, 167718, 154489, 134675, 96558, 61863, 66004, 107620, 152612, 187864, 225729, 252511, 233969, 191705, 204736, 291128, 351256, 293156, 168152, 109315, 165143, 266280, 334096, 345372, 302720, 223661, 162994, 168632, 201424, 170305, 65593, -14414, 1877, 67120, 98015, 88951, 88950, 111024, 125640, 120878, 114393, 113388, 104596, 83489, 63802, 55636, 52148, 40772, 21712, 14226, 34424, 56749, 20927, -90851, -206673, -244901, -224154, -227812, -269172, -277792, -228353, -183118, -171860, -134318, -44905, 5980, -52057, -134607, -116301, -19343, 35884]
35032C5884p279K1718Q3541P7591M9616R6729J71050J45976L5630j3699N3968
35021G50725J33283J29681Q2890P8326J24415J66491J68660J44048J31192J55115
35011B064826J96364K09726J90212J85760K15406K26749J86615J59983K25928
35002C861569L57615M64268N15057N40508N52319N55045N95946O92743P46171
34993H881241O53826M91699M35477M94612M81294K84134K1260j50455k42651l52650
34983A0997787m80997n50692n46350n26596n27296n31500n14978m67590l94568
34974F457220l31793l20953l42389l27233k62639k14086k10501j94317j34701
34965D118608r4529j14550j26573p2351j9866n2928j23278j36153j17036j53259
$$ y = [35884, 28605, 50323, 133864, 211455, 261071, 357800, 528850, 674826, 710456, 696757, 750725, 884008, 1013689, 1096579, 1174905, 1299320, 1465811, 1634471, 1778519, 1909711, 2064826, 2261190, 2470916, 2661128, 2846888, 3062294, 3289043, 3475658, 3635641, 3861569, 4219184, 4683452, 5198509, 5739017, 6291336, 6846381, 7442327, 8135070, 8881241, 9535067, 10026766, 10462243, 10956855, 11438149, 11722283, 11743543, 11593088, 11350437, 10997787, 10516790, 9966098, 9419748, 8893152, 8365856, 7834356, 7319378, 6851788, 6457220, 6125427, 5804474, 5462085, 5134852, 4872213, 4658127, 4447626, 4253309, 4118608, 4024079, 3909529, 3782956, 3710605, 3690739, 3637811, 3514533, 3378380, 3261344, 3108085]
34955C108085k16544j98800j08621p7126j53689k34961k27881j60000r1031l0725
34945A608707R399r749p2743r4794m5817n026l5893q9490r4141o1899l6596r942
34933A062016L1978M3232j3909q5694r8037o8238n7438n2764n65O8066O2426j3501
34921H77572m7831P102N6259J1748p0027q0600k2188J6543Q871J1159M2817M7260
34909H58685j473m1012j8841J9856N304m5937o4613l9407j6887j1069L473J4300
34897F62379k1253p6252n6515N6092J46246J10497o314q4669q3137m6226r078
34886E91770K3326L2964N330k7868l0380k5227n1195q2916o8667k1025J1866L7326
34874C95304Q4942J08571L9480o9564q5189K926N4933K09n4015q460O1524L5335
$$ y = [3108085, 2891541, 2692741, 2584120, 2506994, 2353305, 2118344, 1890463, 1730463, 1639432, 1608707, 1618106, 1608357, 1535614, 1440820, 1395003, 1389977, 1354084, 1264594, 1170453, 1108554, 1071958, 1062016, 1093994, 1137226, 1123317, 1037623, 939586, 871348, 813910, 761146, 760581, 828647, 891073, 877572, 829741, 836843, 893102, 904850, 834823, 754223, 732035, 748578, 757449, 768608, 811425, 858685, 857212, 816200, 797359, 817215, 822519, 776582, 711969, 672562, 655675, 644606, 648079, 662379, 641126, 564874, 508359, 564451, 710697, 821194, 814880, 730211, 647074, 600848, 591770, 615096, 648060, 653390, 625522, 595142, 569915, 518720, 435804, 367137, 346112, 357978, 395304, 480246, 588817, 628297, 558733, 473544, 476470, 531403, 531612, 477597, 469137, 530661, 565996]
34862E65996n3612p6782j0270N1086N0438K3062K380k2252m4950l1859Q220J6699
34850D78156k3267m9548j0754N1835N4266j7789q4190o3853K6013Q7782O5906
34839E14557J7812K3975N7118J8189r6303j58836q4406M7634J11542R8286P4314
34828F23882M3664l4024j21349j23261l5222L5211J8655l3205m5585k1696m455
34817C02615j656K766P378N619Q559K3826L8214M3182M8363N0270K0703m7230
34805E02609j06929r9858j8455Q4972J40625J11840K5778m3436m5418q282P42
34794E44188l6927p6654p9513n2568j5808K5306N8639N8019K0319j9496k9684
34783C95821j4489N095J5686Q313j7250l6432k4062k633k0298o4581n4792M0242
$$ y = [565996, 512384, 435602, 425332, 476418, 526856, 549918, 552298, 530046, 485096, 453237, 461457, 478156, 454889, 405341, 394587, 446422, 500688, 482899, 398709, 334856, 360869, 448651, 514557, 532369, 556344, 613462, 631651, 535348, 376512, 292106, 339740, 451282, 549568, 623882, 667546, 633522, 512173, 388912, 353690, 388901, 407556, 374351, 328766, 307070, 302615, 300959, 303725, 311103, 316722, 325281, 349107, 387321, 430503, 478866, 529136, 549839, 502609, 395680, 295822, 277367, 362339, 502964, 614804, 640582, 597146, 551728, 543446, 544188, 507261, 430607, 351094, 298526, 282718, 308024, 366663, 424682, 445001, 425505, 395821, 381332, 386427, 402113, 410426, 393176, 356744, 332682, 330049, 309751, 245170, 190378, 230620]
34771B30620J28084R9318j9536r2680n4694R450m241o7221o4306L1099J08644
34760C04537P3941j8595m9044m964J8270k0121m8528j7834R609k5454o2698j8419
34748A40700O2549O5949j1352n6949j4528M7681N0836m629p2921j01456l7831
34737F8049J03833J89086R6577q7159j45320k9867P3511L4732l7794o042O9937
34726C29543O4155J3028L0023Q2406M8304n2068p5126J1255R1697J05469J10810
34715G59496J26954Q5064j5879o3877j2623L3542j1318q6272j04515q4343o9595
34704E56634l1803M3034O9312j6003j22724j22817l7785J2596O59j691K3416J7467
34692C90295k2501j9191N1576J11425R9828N2565K0209q793n3949q0610n1150
$$ y = [230620, 358704, 458022, 438486, 345806, 291112, 300562, 296321, 229100, 164794, 195893, 304537, 378478, 359883, 310839, 305875, 324145, 304024, 255496, 237662, 247271, 221817, 159119, 140700, 203249, 269198, 257846, 200897, 186369, 234050, 284886, 280257, 207336, 105880, 68049, 171882, 360968, 457545, 370386, 225066, 195199, 268710, 303442, 265648, 259606, 329543, 393698, 406726, 436749, 519155, 567459, 515391, 440265, 451520, 543217, 648686, 759496, 886450, 971514, 955635, 891758, 879135, 912677, 901359, 815087, 710572, 626229, 556634, 524831, 567865, 637177, 621174, 498450, 375633, 337848, 350444, 351103, 349412, 372828, 390295, 367794, 348603, 400179, 511604, 611432, 663997, 684206, 675413, 621464, 540854, 489704]
34681D89704O184L1909J1011k3983m1156k9637O186M6067O2238M3346k365o2850
34669E36654j11341r2827J9586J48872J66301N2248n9835m8535M3217Q4140L6817
34658G75297j7415j6189P446O95k4020j5556L7988Q8718P8728J672q2441j03265
34646G31658n8637j6224k3392n0041m9625l4496l9252m6139j6940K4575K2465
34635D43952j1528j7905p202n1117j34621j35719j1824J03326P8503k9128p5325
34624A51412m2732k2682l0738O867Q6652J00740J5027n8036k9734L3652L3635
34613B44063L81K3834Q5838Q2932j240o0957k6583L2909J2683p8525j27701n8852
34601A28782P6574J56194J15402Q882n6299l9696j267j1263n4169n4572J1362
$$ y = [489704, 495888, 527797, 538808, 514825, 473669, 444032, 450218, 496285, 558523, 601869, 599504, 536654, 425313, 332486, 352072, 500944, 667245, 719493, 659658, 611123, 654340, 738480, 775297, 757882, 741693, 749139, 749834, 725814, 710258, 748246, 836964, 915692, 917364, 834923, 731658, 673021, 656797, 633405, 583364, 533739, 499243, 459991, 413852, 396912, 421487, 443952, 432424, 414519, 407317, 356200, 221579, 85860, 74036, 177362, 255865, 226737, 151412, 108680, 85998, 55260, 62127, 148779, 249519, 264546, 206510, 176776, 210428, 244063, 244444, 268278, 354116, 437048, 435808, 374851, 348268, 381177, 393860, 315335, 187634, 128782, 205356, 361550, 476952, 485834, 429535, 389839, 388572, 377309, 323140, 268568, 279930]
34590B79930P4646O2962j063l1360N45K6123j6134q1497p7407k95N7153M2975
34578C36578J2676K4015M2960J9469j1949k2Q396n9460j42774j02764M9221J28508
34566C04854L9621p5579m8617P0175J05729K3238m6327j9152M0343M4998M09m0099
34554C99593n5193n0019k6350M773J5622n158l1049k2323L6764J18211J57517
34543E42388J06461O57n9495k7698K8849L2453Q397K7725P7913Q0854K4435j6482
34531H26457J959L4786K7694j2302m8599o5648o9644p6613j01760j24304q2280
34520C09746M2205J55739J46604L3178o0177o7063l1759l094K3150M3327K8346
34509F20202q157j5969l025k5352o4099l1894O1992Q6030q370q7875l7879N7720
$$ y = [279930, 354576, 417538, 416475, 385115, 385660, 411783, 395649, 314152, 236745, 236450, 293603, 336578, 349254, 373269, 416229, 435698, 423749, 423727, 432123, 372663, 229889, 127125, 176346, 304854, 344475, 268896, 220279, 290454, 396183, 419421, 373094, 353942, 394285, 439283, 439692, 399593, 344400, 294381, 268031, 272804, 288426, 283268, 252219, 229896, 266660, 384871, 542388, 648849, 649506, 590011, 562313, 591162, 623615, 632012, 659737, 737650, 818504, 842939, 826457, 828416, 863202, 890896, 878594, 829995, 764347, 694703, 618090, 516330, 392026, 309746, 351951, 507690, 654294, 687472, 627295, 560232, 528473, 525379, 548529, 591856, 620202, 612045, 596076, 593051, 567699, 503600, 471706, 533698, 619728, 611358, 523483, 485604, 543324]
34497E43324N6697k1528n4240j9790M521K514K6303O1300K9335o3999j13666p2533
34485C78238j3553j143j342L1585O2672L3597l8777p9824n1217J0536M0741J3631
34473C85144l3158m1341l717K5489O395k9613k7018J7823O2347P4322M9337r12
34461D85098m5563n1408l1560l4327n5818k9388N3088R2131K7917m5923k0251
34450C43996M9545L2257o0562r4070k8508L4017K7758K869J787o927l2217k3821
34438B46124K2211L8070J0233J2895O3940P1756m403o1630j0915P7812R0047L8357
34426E94497J1098J8537J830m8843q4743p9320m2608J2508N6508M1737k3425n4578
34414D03198j1022L0783Q03m1705r447N5103M4436l6100q2784o1994l8246m1335
$$ y = [543324, 600021, 578493, 524253, 504463, 508984, 511498, 537801, 599101, 628436, 564437, 450771, 378238, 364685, 363542, 362200, 393785, 456457, 490054, 451277, 371453, 320236, 330772, 371513, 385144, 351986, 310645, 306928, 332417, 338812, 309199, 282181, 300004, 362351, 436673, 486010, 485098, 439535, 388127, 356567, 322240, 266422, 237034, 290122, 382253, 410170, 364247, 343996, 393541, 425798, 365236, 271166, 242658, 276675, 304433, 307302, 309089, 302162, 269945, 246124, 268335, 306405, 316638, 329533, 393473, 465229, 460826, 399196, 388281, 466093, 556140, 594497, 605595, 624132, 625962, 577119, 492376, 413056, 370448, 382956, 439464, 481201, 457776, 403198, 392176, 422959, 423762, 382057, 372610, 427713, 472149, 436049, 353265, 291271, 253025, 211690]
34402B11690k7217J9159N1218M8588M2716M0245J1228l2672l7830j923J8173L559
34390C46934r936j9072n4988q3727k3685J00406J42863M0451q0171q0741P78L9763
34378C18875J9741J8734N3557O3127K8784k348j6558n4917j16862j30214n2300
34367A29619O3152J34311J36343Q9571J3479o6313j01527o0793K3741Q1960P6714
34356E20257L2930L124J6798N5020O5617J6962n4798p4737k2664L0196J1053n3189
34344E46569p6465m1839j7312l1279j7716O1273J15810M6030q5388j16178j4817
34333C68688P4115M4635k9542l3006J7389L3197J1700J7054M7410L8239j5989
34322E73890n0335m0803l0668l7171k4409J4640L7616L5774M9582P4278M3624
$$ y = [211690, 184473, 203632, 254850, 303438, 346154, 386399, 397627, 364955, 327125, 325202, 343375, 346934, 336998, 317926, 262938, 179211, 155526, 255932, 398795, 439246, 359075, 278334, 279112, 318875, 338616, 357350, 410907, 474034, 502818, 500470, 483912, 428995, 312133, 181919, 129619, 192771, 327082, 463425, 552996, 566475, 500162, 398635, 337842, 361583, 443543, 520257, 553187, 556311, 573109, 628129, 693746, 710708, 655910, 581173, 558509, 588705, 599758, 546569, 470104, 428265, 410953, 379674, 361958, 423231, 539041, 585071, 499683, 383505, 368688, 442803, 487438, 457896, 424890, 442279, 475476, 487176, 504230, 551640, 589879, 573890, 523555, 482752, 452084, 414913, 390504, 405144, 442760, 478534, 528116, 602394, 646018]
34311F46018m6893r1647j7441R7576J25802N9593j201L400L9184N7176N4410M7469
34299I73446L6363J1760k4248n1564m3342J872M0465K8899j0197j5753J1125L219
34287I62045n1100o6301L223O5250J6566r3002j28268o2781O736K1728J9245K3456
34275G16797j14m9080n1234J8921P8536N2778j8905n3658l6443K308N2382R0481
34263H02769M6181r9117k24568j95435n5045K7930P90j7969M6699R9562M4095
34252D75892m3025k9936N6675P7226R68o2923n2582k8277l1647q537O5157J01763
34240E20754L5287n8578p5215l5699k1199k1952K1322P3537M5941l6390n1724
34229C96084K4204P9094M7545M6M28J657m4925q6816o2621q832J1527J1199K6432
$$ y = [646018, 599125, 507478, 490037, 587613, 713415, 773008, 771807, 775207, 814391, 871567, 925977, 973446, 1009809, 1021569, 997321, 945757, 902415, 904287, 944752, 973651, 963454, 947701, 958826, 962045, 910945, 844644, 847867, 913117, 929683, 836681, 708413, 645632, 652368, 674096, 693341, 716797, 716683, 667603, 616369, 635290, 713826, 766604, 747699, 694041, 657598, 659906, 712288, 802769, 848950, 749833, 525265, 329830, 274785, 302715, 303505, 285536, 332235, 431797, 475892, 432867, 402931, 459606, 536832, 537800, 474877, 422295, 394018, 362371, 353834, 418991, 520754, 556041, 497463, 422248, 386549, 365350, 343398, 364720, 438257, 484198, 447808, 396084, 420288, 499382, 546927, 546973, 547401, 549058, 504133, 417317, 354696, 345864, 357391, 368590, 395022]
34216C95022L4677J0697m221K0223K5585l4262q0910j9984Q9635J08140K6526
34205E71128l1230r081J5560j6581n6669m7151p232K2972L9358L9464O689m1793
34193D85434o0951n0745n1472n7857k3565L8530N9549L5720L6574O5009L4985
34182E11211o0207r1018J1773J24304J04401j09m3739n476J9968J23j0165J461
34170E62527j3042m9894m4920R867M7125L7389K3828K7950J8118o377J449L7147
34158F51167K6968m5507q8474l8703L4677L8697j689m96M1502M7497Q88l0265
34146F36262j0682J0405p433k5190Q026O9249R5218O9809K8393m796l2811m8193
34134G88257l1629M837J9450M74j7312j3123j1120k3366j3006L8945P6844M6247
$$ y = [395022, 429699, 440396, 436175, 456398, 481983, 447721, 366811, 346827, 436462, 544602, 571128, 539898, 530817, 546377, 529796, 473127, 425976, 418744, 441716, 481074, 520538, 527227, 485434, 424483, 373738, 322266, 264409, 240844, 279374, 338923, 374643, 411217, 476226, 511211, 451004, 359986, 371759, 496063, 600464, 600355, 556616, 551140, 571108, 571231, 561066, 562527, 549485, 499591, 454671, 464538, 511663, 549052, 572880, 600830, 618948, 612571, 614020, 651167, 678135, 632628, 544154, 505451, 540128, 578825, 577136, 576640, 618142, 665639, 666527, 636262, 625580, 635985, 628552, 603362, 611388, 680637, 775855, 845664, 874057, 869261, 836450, 788257, 756628, 761465, 780915, 781389, 764077, 750954, 739834, 716468, 703462, 742407, 819251, 865498]
34122H65498q577l661M8868N8138O374k0854J9571N7087L2306k652K0800P4094
34110A146992R6308J03946J41994J81098J67196J32984J49792J94307J79716J12055
34100B606388R5771J67786K39029K37479K10711K35477L04080L55877L64124L45573
34090E162295L32034L66889M79202O29375P31855P60898P78211Q26820Q62846
34081A0930425Q34726P66246P04548O34831N04208K94793K8149k63857n31711
34072A3902358p19014q27669r24326j033018j078453j000516q68122p93442p74406
34063E883392p19963o09208n19671m92000m64863l75987k54308j72585j57792
34054B117015j80667j98555j85643j47759j18391j17371j20700j04372r7703j35109
$$ y = [865498, 856921, 853260, 902128, 960266, 966640, 945786, 965357, 1022444, 1054750, 1052098, 1072898, 1146992, 1243300, 1347246, 1489240, 1670338, 1837534, 1970518, 2120310, 2314617, 2494333, 2606388, 2702159, 2869945, 3108974, 3346453, 3557164, 3792641, 4096721, 4452598, 4816722, 5162295, 5494329, 5861218, 6340420, 6969795, 7701650, 8462548, 9240759, 10067579, 10930425, 11765151, 12531397, 13235945, 13870776, 14374984, 14669777, 14697926, 14434069, 13902358, 13183344, 12355675, 11431349, 10398331, 9319878, 8319362, 7451240, 6657798, 5883392, 5163429, 4554221, 4034550, 3542550, 3077687, 2701700, 2447392, 2274807, 2117015, 1936348, 1737793, 1552150, 1404391, 1286000, 1168629, 1047929, 943557, 845854, 710745]
34044G10745j69744j17884J67N4536j7746j13399j05670j9575K2962r862l2273
34033B02257N706M3594K3221j1848N975M9970M0184k2641n0315j111N8351N7821
34021D01164K5915L7810J06566J84018K37512K66402K70044K67236L26168M95132
34011B617967P09174Q43541Q51857P59312N32438J00470m48516q41801r00151
34002D224291p41479n98289n27820m37184l11788k40104k37311k18791j63118
33993G48407j44569j69392j30414J1590J31339J09586J452n5527k7868P559o967
33982D75196n4165q6702p1821j5495K6004j622o3352n9329L0893R9144N3582n3363
33970B78970j03336o3578K237K8690k938o7733r9726m1557O2860Q9431J760p8380
$$ y = [710745, 541001, 423117, 423284, 477820, 460074, 346675, 241005, 221430, 244392, 234530, 202257, 207963, 251557, 274778, 262930, 268905, 318875, 359059, 336418, 286103, 284992, 343343, 401164, 427079, 464889, 571455, 755473, 992985, 1259387, 1529431, 1796667, 2122835, 2617967, 3327141, 4170682, 5022539, 5781851, 6314289, 6414759, 5966243, 5124442, 4224291, 3482812, 2884523, 2356703, 1919519, 1607731, 1367627, 1130316, 911525, 748407, 603838, 434446, 304032, 315622, 446961, 556547, 557999, 502472, 474604, 482163, 475196, 421031, 334329, 262508, 247013, 273017, 271395, 208043, 148714, 179607, 278751, 332333, 278970, 175634, 112056, 114293, 142983, 140045, 72312, -27414, -68971, -6111, 83320, 85080, 6700]
33958F700m1731M6507N3741j8197n6348j8559K9860L9440K1621j7231p6358j00934
33946a31489l2094P8742J09906L4621n0256o8497l8778N394O4842J20047J24664
33935B17102Q2456M6138K4382j5883m5520J0200J22900J55934O0736m1342l9623
33924E77480J8562L9697L0664L5758K7579k5308o2365k1916L6377J9314m4611
33913F31231o1983m0656o2982j17335r9076J1615J00258P7242j4466q3103r4084
33902B46661o0628m592L7919L1094j1291l6877k6721p981N204K3237L3265R385
33890B38675k3133q113M3714N4349k116n7205n6358l3515l4873l8222l994M5956
33878A25165N7423J8232l7001o4909l2235N5489J19183O5363p7114j49263n6237
$$ y = [6700, -35031, 11476, 65217, 47020, -9328, -27887, 1973, 41413, 63034, 45803, -30555, -131489, -163583, -84841, 25065, 59686, 9430, -59067, -97845, -92451, -27609, 92438, 217102, 299558, 345696, 370078, 354195, 308675, 318875, 441775, 597709, 658445, 617103, 577480, 596042, 635739, 666403, 702161, 729740, 704432, 642067, 620151, 656528, 675842, 631231, 569248, 528592, 465610, 348275, 249199, 260814, 361072, 438314, 423848, 340745, 246661, 186033, 181441, 219360, 250454, 239163, 202286, 175565, 167584, 172788, 196025, 229290, 238675, 215542, 207429, 251143, 305492, 303376, 246171, 189813, 156298, 121425, 83203, 79209, 125165, 182588, 200820, 163819, 98910, 66675, 122164, 241347, 306710, 229596, 80333, 24096]
33867B4096R1896J17520P398r2819r2867n3488n2841o5042l0440K5261K2473m6776
33855a45629r6957o2145J9657O2819M4102J6123J8784K4791n491n3619o8451l9890
33843b85906q87K9974N4880N5388J0827l8164j9871N4167Q4229K7806l3824k9943
33831i1324j3394n3308r4287m2747N7215P5077M129k8847J9399L6924l9530r6226
33819b66919k3339R1800R0554j1410n7782l28M3994l57n1831k1221M3019M5732
33807a18088l973l1128k8229m5483p5985n7127J1709N0266K0771j2982J0494N7306
33795b22449O0838K2916p433j7472k9982m3270l4384j1384n694j6545j4868m55
33783c20182l149k4417k9506o343J6562K2381K9436M9255O6083P0779O9243M6990
$$ y = [24096, 115992, 233512, 240910, 148091, 55224, 1736, -51105, -116147, -146587, -121326, -98853, -145629, -242586, -304731, -285074, -222255, -178153, -162030, -143246, -118455, -123946, -177565, -246016, -285906, -286793, -256819, -201939, -146551, -135724, -173888, -193759, -139592, -55363, -27557, -61381, -91324, -104718, -158026, -252313, -295060, -237845, -162768, -158639, -187486, -168087, -131163, -170693, -266919, -290258, -198458, -107904, -119314, -177096, -177424, -133430, -133787, -185618, -206839, -163820, -118088, -122061, -153189, -181418, -226901, -302886, -360013, -348304, -298038, -277267, -290249, -279755, -222449, -161611, -138695, -146128, -163600, -193582, -236852, -271236, -282620, -288314, -304859, -319727, -320182, -323331, -347748, -377254, -383597, -367035, -344654, -315218, -265963, -199880, -129101, -59858, -12868]
33771a2868j9176r7733j14264n6891o729k1316m9374j7158N4894Q9607O7135L1397
33759a52476J0596j155l920K739o269m2118o0709k6045J3310r014n6753l2767
33747c64581O3735J23420Q6007J6226r848m723j3128l4192m8237n5018m1886J8583
33735b63642R4787R4260o717j02821r7201l2551o608k1886j7927j631k6973o7749
33723d56659l5679O4547J13805M7935m8601o9786k9043r025k9664m0656j5148
33712e07974J9104L5502L8815L2242k89n6675q9627n0789L9118R3082N1604m0889
33700d36776q5154n0183m348q672k9835m112N0573N3209j8244q6819p2025J7975
33688f74411J02658J06506J8482r2494j25897n2156M1640N4412K880j6590J3657
$$ y = [-12868, -32044, -129777, -244041, -300932, -307661, -328977, -378351, -395509, -340615, -251008, -183873, -152476, -141880, -143035, -146955, -144216, -150485, -192603, -253312, -279357, -266047, -275061, -331814, -364581, -300846, -177426, -91419, -75193, -85041, -89764, -102892, -137084, -185321, -240339, -282225, -263642, -168855, -74595, -81312, -184133, -281334, -313885, -320493, -342379, -360306, -361937, -388910, -456659, -492338, -427791, -313986, -266051, -314652, -384438, -413481, -422506, -452170, -492826, -507974, -488870, -453368, -414553, -382311, -382600, -439275, -528902, -579691, -540573, -447491, -395887, -436776, -521930, -572113, -576461, -585133, -614968, -619080, -568507, -515298, -533542, -620361, -692386, -674411, -571753, -465247, -446765, -539259, -665156, -717312, -675672, -621260, -618380, -634970, -621313]
33677f21313Q968o3199j10994n8882K9311M9994J2212n757l30l1895r3641j05164
33665i90690m4293J4552J6461n701q882o612j8807k4518j2091j7640o2105r9450
33653a259776q2533m0346l3363o4415r0902r8669j03254r7375o2975k9138n1973
33642b014719j27424j81691j67664j23685j12954j44530j83956k12906k45479
33633c515008k98945l72517m49642n10452n52367o03733o98009q24852r28331
33624h753856r65661r37097q28224n52755j9012P22909J442576J886434J974124
33615f030562J815533J551557J237378Q96658O07835M46684L70496K63087J09129
33606A267795K1608N4675R9127M9726k1777R419R3148O7400p0458j39687n7720
$$ y = [-621313, -612345, -675544, -786538, -845420, -816109, -766115, -753903, -759660, -759990, -791885, -885526, -990690, -1034983, -1020431, -1003970, -1009671, -1018553, -1025165, -1043972, -1068490, -1080581, -1098221, -1160326, -1259776, -1342309, -1382655, -1416018, -1480433, -1571335, -1670004, -1773258, -1870633, -1933608, -1962746, -2014719, -2142143, -2323834, -2491498, -2615183, -2728137, -2872667, -3056623, -3269529, -3515008, -3813953, -4186470, -4636112, -5146564, -5698931, -6302664, -7000673, -7825525, -8753856, -9719517, -10656614, -11484838, -12037593, -12056605, -11333696, -9891120, -8004686, -6030562, -4215029, -2663472, -1426094, -529436, 78399, 525083, 895579, 1158666, 1267795, 1289403, 1344078, 1443205, 1492931, 1471154, 1480573, 1573721, 1641121, 1570663, 1430976, 1373256]
33595A373256L4161Q764m8985r993O9134N0646m0081n8357J4823N3704Q379k8771
33583A426680k963J6046k2251n8260m1601j9797l4143l7827p64P195o3446j26242
33571A042627p6752L7554Q2013K8820k6205j8231K1230M6510M9972K8073k2810
33560A192801o8511o3641k0208J1503K3634M2852N0082n691j01703j35508n9303
33549H66307M6490P4548J7104m5589m6825P678N8154M9682r529n0866l2465l703
33537I30986l2127q7158p6146L416M2233j9064r5848q4031o541L7602K0375Q27
33525F34524J8192M3927M0164J0011k0032l2066k3546m206J0378J2289L408j6430
33513F76613m4294n7637l5369j41J943k5213k5043J9036M4879N121n1437m4873
$$ y = [1373256, 1407417, 1416181, 1367196, 1357203, 1426337, 1476983, 1436902, 1378545, 1393368, 1447072, 1455451, 1426680, 1423717, 1439763, 1417512, 1359252, 1317651, 1297854, 1263711, 1225884, 1225120, 1232315, 1168869, 1042627, 965875, 1003429, 1085442, 1114262, 1088057, 1069826, 1091056, 1137566, 1187538, 1215611, 1192801, 1124290, 1060649, 1040441, 1051944, 1075578, 1118430, 1168512, 1162821, 1061118, 925610, 866307, 912797, 987345, 1004449, 958860, 912035, 919713, 977867, 1027549, 1018020, 967154, 934689, 930986, 898859, 811701, 735555, 738971, 781204, 762140, 666292, 582261, 575720, 613322, 633697, 634524, 652716, 696643, 736807, 746818, 726786, 694720, 671174, 666968, 677346, 689635, 693043, 676613, 632319, 574682, 539313, 539172, 541115, 515902, 490859, 509895, 554774, 559895, 508458, 463585]
33501D63585K5606Q9987R9461O0878K939m4155n4194l1573j3411j4754o262K0852
33489E98959K0881k3991m7795k204M3750M627o6863n0056M0723O5289j6571p3799
33477D92950j2662P3776N3521m5433r0827m0131K7238M4079K8748K5882M1293
33466E98434M6493J2998n6822j16817j16434o5774k2896k902L9747J10292J33246
33455E59565O9581k941q058J225n9252j35057r8217L7610J13396N6406k1889j0860
33443E01509L9231K3776m3464o4935j4420L6106K5395k9586o6604l6786N2358
33432D22580J24677R9343n998q2846p2531l3862k4710j454P7499J27268M4877
33421F74843j00800j35332l2735M5552k219p5808m7078M7275Q6189M8164O053
$$ y = [463585, 489191, 579178, 678639, 739517, 742456, 698301, 644107, 612534, 599123, 584369, 578107, 598959, 619840, 595849, 548054, 545850, 589600, 594227, 527364, 477308, 518031, 583320, 566749, 492950, 480288, 554064, 607585, 562152, 471325, 431194, 458432, 502511, 531259, 557141, 598434, 644927, 657925, 601103, 484286, 367852, 302078, 279182, 276280, 316027, 426319, 559565, 629146, 626205, 618147, 619372, 560120, 425063, 326846, 364456, 477852, 534258, 512369, 501509, 540740, 564516, 521052, 456117, 441697, 477803, 503198, 473612, 407008, 370222, 422580, 547257, 646600, 640602, 557756, 485225, 451363, 426653, 425199, 502698, 629966, 674843, 574043, 438711, 405976, 451528, 449309, 373501, 326423, 373698, 459887, 508051, 514104]
33410E14104l611r60J0821M2336O3852L9987j540j5422k6130p8946j27788q2059
33398C34644L6503R9407N5644o21J3723N2644L8966j3236m9586p0191q8244o0165
33386C49488M3622J43635J33683L7830j7687J3746M6441R708m6711l9991K1897
33375F95661O1546M0031q017l2277k1532l93Q894J3038L1492N4786M3772j0472
33363H76529n5302m3239n294n777m1452n1069k0320j850j7546j9831J6215L7250
33351F68314J920l6038m897O7526R0051L9886j6657k9851k2360k8436l8706l0749
33339F60003j0313P367K7614N9134Q4300P2387J8849m2362o6942m0535M688J8452
33327G92642j3841n2565n1307j3560J6657J3174q903k8038m6165p0893q7493o8755
$$ y = [514104, 510493, 509533, 520354, 562690, 626542, 666529, 664989, 649567, 623437, 544491, 416703, 334644, 371147, 470554, 526198, 525577, 539300, 591944, 630910, 617674, 568088, 497897, 409653, 349488, 393110, 536745, 670428, 708258, 690571, 704317, 750758, 760466, 713755, 673764, 695661, 757207, 797238, 789221, 756944, 735412, 735019, 743913, 756951, 788443, 843229, 887001, 876529, 821227, 777988, 772694, 766917, 725465, 674396, 654076, 652226, 634680, 614849, 631064, 668314, 670234, 634196, 629299, 696825, 786876, 826762, 810105, 780254, 757894, 729458, 690752, 660003, 649690, 657057, 684671, 743805, 828105, 900492, 919341, 876979, 810037, 769502, 774190, 792642, 778801, 726236, 674929, 661369, 678026, 691200, 682297, 654259, 608094, 537201, 449708, 380953]
33315C80953j0194N5310Q1682N0317j0820n1605m6803j4943J0899J9815K3459
33304D88070L2805M7849O1288N8474K3044l9878r1401q8168k5677N6432J08027
33293F30865J01061M2641k6894n7834l2651J8171N2440N9226N3598M4277K7694
33282I12594L789k2707m7570n7595l3881J3359L6646J0390k4243j4814K2858L3041
33270H31867J2740J1530M0292N0584K0009j0788j4249k3065o0062p9695l4082
33259G45081M4484Q2088N5097l149n6888q1367n3129J8375P2869O5927L1258K4150
33247I44796L1879O828l5247l2074J6304M1046J7931M403L7336P0539N4519J3898
33235A172158k474K996K98j0175j0719l985M961L1440P4337R0405N2417L546L427
$$ y = [380953, 370759, 426069, 507751, 558068, 547248, 495643, 448840, 433897, 444796, 464611, 488070, 520875, 568724, 630012, 688486, 711530, 671652, 580251, 492083, 466406, 522838, 630865, 731926, 774567, 747673, 689839, 657188, 675359, 727799, 787025, 840623, 884900, 912594, 916383, 893676, 846106, 788511, 754630, 767989, 804635, 815025, 790782, 775968, 798826, 831867, 844607, 856137, 896429, 947013, 967022, 956234, 941985, 918920, 858858, 779163, 745081, 789565, 871653, 926750, 923601, 866713, 785346, 732217, 750592, 823461, 889388, 920646, 944796, 976675, 983503, 948256, 916182, 932486, 973532, 991463, 995866, 1033202, 1103741, 1158260, 1172158, 1169684, 1172680, 1172978, 1162803, 1152084, 1148099, 1153060, 1184500, 1258837, 1349242, 1401659, 1405205, 1408632]
33222A408632M3267O5154M7346J9953R751J7875M0571O6136O5463L3446K0802
33211A838396O5411J09609O3855m5842q2020K0916J54009J69194O3665l4821l5161
33200B287211L1402Q5388R7361R2487R4981J00181R4976Q3633Q2941R8500J19524
33189C268585J38019J56071J67812J57048J28678J17845J43490J77490J91029
33180D646067K05157K54111L22533L67124L77096L60174L01421K09752J70797
33171G214232K46242L34179K61533L5143j42907j66049j81423l57618o28593q12120
33161E802619q80943r41907j005539r69597q26040p00803o51125n83568m34261
33152a191164k89355k42123k45765k07010j37988j08901j10457p1894J2657P1208
$$ y = [1408632, 1451899, 1517053, 1564399, 1584352, 1594103, 1611978, 1652549, 1718685, 1784148, 1817594, 1838396, 1903807, 2013416, 2077271, 2031429, 1949409, 1970325, 2124334, 2293528, 2357193, 2322372, 2287211, 2318613, 2404001, 2501362, 2593849, 2688830, 2789011, 2883987, 2967620, 3050561, 3149061, 3268585, 3406604, 3562675, 3730487, 3887535, 4016213, 4134058, 4277548, 4455038, 4646067, 4851224, 5105335, 5427868, 5794992, 6172088, 6532262, 6833683, 7043435, 7214232, 7460474, 7794653, 8056186, 8091329, 7948422, 7782373, 7600950, 7243332, 6614739, 5802619, 4921676, 3979769, 2974230, 2004633, 1178593, 477790, -173335, -756903, -1191164, -1480519, -1722642, -1968407, -2175417, -2313405, -2422306, -2532763, -2604657, -2592000, -2520792]
33142b520792O1793J9628p626j5602k3211l3268k6504J4649P3593R6728N1688
33131b308924j3604j5891N1261J05580R4064N8501N1140N4068L4363J6682L4549
33120a838211O0384N6127M9647Q1452J12593P6333n15k4540K0139N0343J9280
33109a336968j7640k644L8791N5543M9583M7779M4580K4186M098P989K1531K0352
33097a042820K0266N2444J01733J18551R1093N8993M4696J6488n1886j19405j21062
33086h30909o0869j1588j3293k1862J3016O3560O7504K5958m791n516q099j6092
33074h02981J2035P8022J15020Q1691K2298r280k3500m3012m0185O554M7081K5483
33062e30774l0023n8210o4356q3951q5375j1857R7091J33289P1553m891l8932
$$ y = [-2520792, -2458999, -2439371, -2446997, -2462599, -2485810, -2519078, -2545582, -2530933, -2457340, -2360612, -2308924, -2322528, -2338419, -2287158, -2181578, -2087514, -2029013, -1977873, -1923805, -1889442, -1872760, -1838211, -1777827, -1721700, -1672053, -1590601, -1478008, -1401675, -1402190, -1426730, -1406591, -1356248, -1336968, -1354608, -1357252, -1318461, -1262918, -1213335, -1165556, -1120976, -1096790, -1092692, -1084703, -1063172, -1042820, -1022554, -970110, -868377, -749826, -658733, -599740, -555044, -538556, -590442, -709847, -830909, -891778, -903366, -916659, -938521, -925505, -861945, -794441, -768483, -773274, -778790, -786889, -802981, -790946, -712924, -597904, -516213, -493915, -503195, -526695, -569707, -609892, -603338, -556257, -530774, -560797, -619007, -683363, -767314, -852689, -864546, -767455, -634166, -562613, -567504, -606436]
33051f06436n8055p8157n4976K1858P6464N0681n160o830M6792Q6851O8450M161
33039d54357o7528j07398r0723k6828N0512J18127J62389J53153P3830k1913n1647
33028b62383j6520q50l9112o4521k7173J9891R785l5317n6527n0694l9477m833
33016e67731O1175Q9630J4493j03378j26449j7448J09602J27603K9817q4327j12722
33005e79735l4269P6728J20157P6177K1968J8783K6090k0330q9244r3547k7562
32994e04784K5649K6207K6164O2037Q3786M0789k6799m7538k7841k9446n5879
32983d27655l9864L8378Q8300J9238j18510j71303o9444Q1456J29985N6448k9067
32972d42038l8906M756L2853K0903k485k956K2102L8338J1076l8638m3899J1271
$$ y = [-606436, -664491, -742648, -797624, -775766, -699302, -648621, -653781, -660611, -613819, -526968, -458518, -454357, -521885, -629283, -720006, -746834, -696322, -578195, -415806, -262653, -188823, -210736, -262383, -278903, -279753, -318865, -383386, -410559, -390668, -380883, -416200, -472727, -523421, -562898, -567731, -506556, -416926, -402433, -505811, -632260, -649708, -540106, -412503, -382686, -467013, -579735, -614004, -537276, -417119, -340942, -318974, -300191, -274101, -294431, -383675, -477222, -504784, -479135, -452928, -426764, -364727, -280941, -240152, -266951, -314489, -342330, -371776, -427655, -467519, -429141, -340841, -321603, -440113, -611416, -680860, -599404, -469419, -412971, -442038, -480944, -476188, -443335, -422432, -424917, -427873, -405771, -367433, -356357, -394995, -438894, -427623]
32960d27623N1716K4184o430L3830P7326R062j17307j27621l796P4036J7831k8761
32948d23553N3842J49149J03562j3630l6972K0250K1859l5317l3889L1940M5004
32937a17755j6376m2005Q282M3771J7274m948P884j1195q1200j09006m4214K4815
32925c24673R014m8768n6857q845L5518M0391J1375k4805k7937J4774M8399J8438
32913c13976l0244j4353M1385L6467l0522n6236j2413J7578N530J9316N6774J6407
32901b64287r7052j20490J1432J30093Q1666m2916p3409j7023J2653M840J5908
32890c58585J9995k8408n9207J0966J04504Q6396r404l5540K3700M4303j6677
32879b17957o7369n0544q040L0434P3846Q1767J422r8786q8077J7116O1309k806
$$ y = [-427623, -375907, -351723, -358153, -324323, -246997, -237935, -355242, -482863, -486659, -412623, -394792, -423553, -369711, -220562, -117000, -130630, -167602, -147352, -125493, -160810, -194699, -162759, -117755, -134131, -176136, -167854, -124083, -106809, -111757, -103873, -115068, -196268, -305274, -349488, -324673, -315659, -364427, -421284, -430129, -394611, -354220, -342845, -367650, -395587, -380813, -332414, -313976, -344220, -358573, -317188, -280721, -311243, -367479, -379892, -362314, -356784, -337468, -280694, -264287, -361339, -481829, -470397, -340304, -258638, -301554, -374963, -391986, -379333, -374493, -358585, -338590, -366998, -426205, -415239, -310735, -224339, -233743, -269283, -245583, -201280, -217957, -285326, -335870, -343910, -313476, -239630, -157863, -156441, -255227, -343304, -326188, -264879, -267685]
32867b67685m1769K7807R6932M3186p8601j30606q3356j2073L1135M9731N1203
32856c14096L8156K5897K0755N335k5835m6412l3571O881N5761Q5729O1365j7058
32844a37093q4156q0042k8945J4121N4745J10656J21262K9632p9586p4070Q850
32833a44626Q519q7996j14766j2002O2950K235p2866l5956K0125l5972j13027
32822e23382l5863J41414J91143N5448q0027p3499K109K7460J2388J9728L5487
32811b27594J4108k0715j1328L6179O1107L7432Q40r218K711N556j1424k4262
32799a46608j1578O556o895m4169n5435k6008k740j5341k4072P976M1572K6507
32787b50235n84L1976J00652J02172Q622q0430p3402k224M3848M1798L1322K5261
$$ y = [-267685, -309454, -281647, -184715, -141529, -220130, -350736, -434092, -446165, -415030, -365299, -314096, -275940, -250043, -229288, -223953, -249788, -296200, -329771, -322890, -267129, -181400, -120035, -137093, -221249, -301291, -330236, -316115, -261370, -150714, -29452, 180, -79406, -153476, -144626, -136107, -224103, -338869, -350871, -287921, -285686, -358552, -394508, -374383, -410355, -523382, -559245, -417831, -226688, -171240, -251267, -324766, -322657, -295197, -282809, -263081, -227594, -213486, -234201, -245529, -209350, -148243, -110811, -109971, -119189, -116478, -110922, -122346, -146608, -158186, -151630, -158525, -202694, -258129, -284137, -286877, -302218, -326290, -318314, -276742, -250235, -250819, -218843, -118191, -16019, -7397, -87827, -161229, -163453, -119605, -77807, -46485, -21224]
32775b1224l564n1121o5042k2597K2067P216m8603p3283m2563m648k067k0764
32763c26193l1216k8109o398M4873R1274O1614l8259q9166j4927Q7989P9339j8312
32751a87491o7189l4060j4837m4851m3344K3572P7229P4366P5857J03668P5170
32740C8090l4954j09113o9217j1996l7331o6769J4130J34664J34584J6784o7661
32729e8789n2879j7004k3331m6991n7317n0910j0382O1260Q9653K5765m3128p256
32717a91309Q1005Q4004N474k8689L916L958l8280j5365P6495R1845j8591j08177
32705e3714p4561j9535n0920r2513l9829L6283J2742o3883n7313K6205O2498K7543
32693b86997J8675O4293P2880J76o5863l9714L6387O0192N486n9159o1706o629
$$ y = [-21224, -24788, -75909, -140951, -163548, -141481, -134265, -182868, -256151, -298714, -303362, -305429, -326193, -357409, -385518, -391916, -347043, -255769, -194155, -232414, -321580, -336507, -248518, -169179, -187491, -254680, -288740, -303577, -348428, -391772, -368200, -290971, -216605, -140748, -37080, 38090, 3136, -105977, -175194, -187190, -224521, -291290, -277160, -142496, -7912, 8872, -58789, -111668, -128672, -152003, -198994, -256311, -307221, -317603, -256343, -166690, -140925, -184053, -191309, -110304, -26300, -20826, -49515, -45599, -41641, -79921, -95286, -18791, 73054, 54463, -53714, -128275, -147810, -198730, -291243, -331072, -294789, -282047, -345930, -403243, -377038, -314540, -286997, -268322, -204029, -131149, -130973, -196836, -236550, -200163, -139971, -134485, -193644, -255350, -261979]
32681b61979L3113M054n2091m4842L4812R0377O0472J2727K9695O5574J8422q9583
32669i9249j23857l7155N3444L2874n4473q0499j4613M8075K9206k9819l4399
32658c10465L1934Q9958P6853K6946R132K0807K988m9994o6338k752Q3974J08224
32646B1267N8185q820m1885l2153L359M0409O1123O5683N9029K8257l6508j01909
32634A16037j15458p3477k1367J1120K1780n368p4819j15631m4498Q6215J15248
32623a00218n372j24363r6086K9518J04629P8767L317p3236j10587n5090P2658
32612b76063J36009M7928q1531q9113P113N7224J7544j7339L27J4261q13O935
32600a77518N4252Q7233P6281M0357j6847p7275m5235J25774K63862J42376j64913
$$ y = [-261979, -228866, -224812, -276903, -321745, -286933, -196556, -136084, -123357, -93662, -28088, -9666, -99249, -223106, -260261, -206817, -173943, -228416, -308915, -323528, -275453, -246247, -276066, -310465, -278531, -188573, -111720, -84774, -75642, -54835, -51847, -101841, -168179, -170931, -86957, 21267, 79452, 70632, 28747, -3406, -47, 40362, 101485, 167168, 226197, 254454, 217946, 116037, 579, -72898, -94265, -83145, -61365, -66733, -141552, -257183, -301681, -215466, -100218, -105590, -229953, -326039, -296521, -191892, -113125, -109808, -183044, -293631, -348721, -276063, -140054, -92126, -173657, -262770, -255657, -198433, -180889, -198228, -197901, -183640, -184453, -177518, -123266, -36033, 40248, 80605, 63758, -13517, -58752, 67022, 330884, 473260, 308347]
32589C08347l17822j69421L7419N0166m5376l7684M9327M9833k2670j5784O2755
32578e0910N0509o9360j18852j8912Q5059O7919O293J1805M0908L87p3010p7121
32566a45285j6588J8513L651o707O526N918j4043j1715J9522L5159K1510J8584
32554f4955L5777J7728o0174j21868q1784K5917Q0282L1770l7899l3419L0764
32543a77861O5530L3068j4697k0164M603O633l1991p5299q1908m8301k323K7243
32531c15467K6989J803k2434j0752M2246Q9811Q0070L0158J2948N1112P4953L0330
32519I1767k3450k556N0824J9063r1203j31509l7650N8470L0979m4083k3812O1381
32507d1779O5750k1411o2619q676K9138j5269m8425J3136R5008Q7210J0249m6718
$$ y = [308347, -9475, -178896, -141477, -91311, -136687, -174371, -125044, -75211, -97881, -113665, -50910, -401, -69761, -188613, -207525, -122466, -54547, -48254, -36449, 4459, 4846, -68164, -145285, -161873, -143360, -139709, -146416, -139890, -133972, -148015, -159730, -140208, -105049, -83539, -64955, -29178, -11450, -71624, -193492, -275276, -249359, -169077, -137307, -175206, -208625, -177861, -112331, -79263, -93960, -114124, -109521, -102888, -134879, -210178, -292086, -340387, -342710, -315467, -288478, -286675, -309109, -319861, -277615, -187804, -107734, -77576, -64628, -13516, 61437, 91767, 68317, 65761, 116585, 135648, 44445, -87064, -124714, -66244, -35265, -79348, -103160, -41779, 23971, 2560, -60059, -68735, -39597, -54866, -103291, -90155, 4853, 92063, 102312, 55594]
32495E5594p0950r8928j07291m7867M2293P2701K8170k1696l2787k8706l7276
32484b46743n3089o3191n6385j4686N6568J07802J04433Q0943P7319N5436l9161
32473I246j52138j57530l3783Q8586R2778J6550k3479M912K6798j7783q8126r7219
32461c31188k4187N7258O7062J1829l5015l0212L751L6067O5400Q6515P7367M6140
32449C0787L4167M0989J1226o3344j03234o1792q969j5821l1398K2757J01725
32438d2907J04993M7229K3855L5511l872r0671j18674o1122j4104k2218j1834
32427a53814M6132N7413k7961j04677p2734N981K5592J0231M2413R6606Q2001
32416G183K444n5589o3372o0088m8130M008O6447O8016J1912k7689k3871j5505
$$ y = [55594, -15356, -114284, -221575, -269442, -227149, -154448, -126278, -147974, -180761, -209467, -246743, -299832, -363023, -419408, -434094, -377526, -269724, -165291, -84348, -7029, 48407, 9246, -142892, -300422, -334205, -245619, -152841, -136291, -159770, -154858, -128060, -145843, -233969, -331188, -355375, -298117, -231055, -219226, -254241, -284453, -280702, -244635, -179235, -92720, -15353, 30787, 64954, 105943, 117169, 53825, -49409, -111201, -120170, -135991, -167389, -144632, -42907, 62086, 109315, 133170, 168681, 164809, 74138, -44536, -105658, -119762, -141980, -153814, -107682, -50269, -78230, -182907, -255641, -249660, -224068, -213837, -171424, -74818, 7183, 9627, -45962, -109334, -169422, -217552, -213544, -147097, -79081, -67169, -94858, -118729, -134234]
32404a34234j0597K3236O2973L6101m8753q3343j9900M5113J3083o7707p5863
32393b59891Q680Q7442Q3217K5491j0353K605L2131M5046M6016N0671M0036k0448
32381A30643j05807j23848k9928Q4528Q8325j6015r4456o6666k718L952k2101
32370a54091J327O5132P5962M561o0395l5268M3857P6346L1581k6877m2882l5918
32358e6665m5939n6355k1080N0251R0467O4862J3934j0946q943k512N303J1778
32346C4155l490l4488k9159L2990Q3667N1705k6812n9997l5398j5732j4995J6842
32334g12P6274Q2051O103o7398o7615l7337m2168n4850j4379N2597O3465R857
32322E888k9056k584N0631O8098L9184M84j2645J389J1916p049l5340k4908K6983
$$ y = [-134234, -144831, -121595, -58622, -22521, -71274, -154617, -174517, -129404, -116321, -184028, -259891, -251211, -163769, -80552, -55061, -65414, -62809, -30678, 14368, 60384, 111055, 151091, 130643, 24836, -99012, -128940, -44412, 43913, 27898, -66558, -133224, -135942, -131990, -154091, -152764, -87632, -11670, -7109, -67504, -102772, -58915, 17431, 49012, 22135, -20747, -56665, -102604, -158959, -180039, -129788, -39321, 25541, 39475, 28529, 19586, 17074, 22377, 34155, 30665, -3823, -32982, 8, 83675, 135380, 108568, 48571, 13173, -2559, -17554, -712, 75562, 157613, 163716, 96318, 28703, -8634, -50802, -105652, -120031, -67434, -3969, 5888, -23168, -25752, 24879, 92977, 132161, 132645, 120000, 121389, 133305, 126256, 90916, 66008, 92991]
32309I2991N7584K0857m2551n6563p554M9282O5100M1880J2715O647K2711K3078
32297B86177k3580p9175o1617L8956J22415J03472K4449j5203L788K5068K1155
32286D45905J1614p25k8527m5956j5161L8939N6464L9583M3364P4048Q1090N2791
32274G53429L2148K9927J3365o670K2111Q0654P5793q086o2349j9284L9304J8696
32262I69038l6337k6887L1131L3638n5776j76462k70408l21096l15851k59488
$$ y = [92991, 150575, 171432, 128881, 72318, 64764, 114046, 179146, 221026, 233741, 240388, 263099, 286177, 262597, 183422, 121805, 160761, 283176, 386648, 411097, 395894, 399682, 424750, 445905, 457519, 456794, 428267, 382311, 367150, 406089, 462553, 502136, 545500, 619548, 700638, 753429, 785577, 815504, 828869, 822199, 844310, 924964, 1000757, 992671, 930322, 911038, 950342, 969038, 932701, 905814, 936945, 970583, 914807, 738345, 467937, 146841, -169010, -428498]
$$ [...]
##END NTUPLES=NMR SPECTRUM
##END=
